##TITLE=1H_DE-80H_X3
 200.13MHz, d2o
 8 sc
 
 19ns.26.2.2025
##JCAMPDX= 6.0         $$ Bruker NMR JCAMP-DX V2.0
##DATA TYPE= NMR SPECTRUM
##DATA CLASS= NTUPLES
##ORIGIN= UXNMR, Bruker Analytische Messtechnik GmbH
##OWNER= pz
$$ XWIN-NMR		Version 3.5
$$ Wed Jul  2 10:07:17 2025 Russian Standard Time (UT+4h)  Yarkov@DPX200
##.OBSERVE FREQUENCY= 200.1313
##.OBSERVE NUCLEUS= ^1H
##.ACQUISITION MODE= SIMULTANEOUS
##.ACQUISITION SCHEME= undefined
##.AVERAGES= 8
##.DIGITISER RES= 18
##SPECTROMETER/DATA SYSTEM= spect
##.PULSE SEQUENCE= zg30
##.SOLVENT NAME= CDCl3
##.SHIFT REFERENCE= (INTERNAL, CDCl3, 0, 15.5243)
##AUDIT TRAIL= $$ (NUMBER, WHEN, WHO, WHERE, WHAT)
$$ ##TITLE= Audit trail, XWIN-NMR		Version 3.5
$$ ##JCAMPDX= 5.01
$$ ##ORIGIN= Bruker BioSpin GmbH
$$ ##OWNER= Yarkov
$$ C:/Bruker/XWIN-NMR/data/yarkov2/nmr/H-C/1/pdata/1/auditp.txt
$$ ##AUDIT TRAIL=  $$ (NUMBER, WHEN, WHO, WHERE, WHAT)
(   1,<2025-07-02 10:06:16.28 +0400>,<Yarkov>,<DPX200>,
      <created by zg, POWCHK disabled, PULCHK disabled
       configuration hash MD5:
       00 E9 B6 7A A2 85 ED C7 34 08 36 98 17 FE 4E 26
       data hash MD5: 16K
       12 1A 4C 4C 3F 73 64 E8 CF 27 85 D3 40 DA C5 08>)
(   2,<2025-07-02 10:06:23.39 +0400>,<Yarkov>,<DPX200>,
      <Start of raw data processing
       efp BC_mod = 2 LB = 0.25 FT_mod = 6 PKNL = 1 PHC0 = -1358.546 PHC1 = 12.3666 SI = 16K 
       data hash MD5: 16K
       D9 0C D3 A9 0F CA E1 FD 3A 55 81 C4 89 BD 6D D0>)
(   3,<2025-07-02 10:06:30.68 +0400>,<Yarkov>,<DPX200>,
      <abs ABSG = 5 
       data hash MD5: 16K
       63 00 88 FD 55 48 2C FA C1 B5 22 4F 83 75 7A 33>)
$$ ##END=
$$ 
$$ hash MD5
$$ 53 BB 83 10 F3 90 B4 E0 FB F5 27 0A 44 9F 91 D7
##$RELAX= 
##$RELAX= 
##$RELAX= 
##$RELAX= 
##$RELAX= 
##$RELAX= 
$$ Bruker specific parameters
$$ --------------------------
##$DU= <C:/Bruker/XWIN-NMR>
##$EXPNO= 1
##$NAME= <H-C>
##$PROCNO= 1
##$TYPE= <nmr>
##$USER= <yarkov2>
##$AMP= (0..31)
100 100 100 100 100 100 100 100 100 100 100 100 100 100 100 100 100 100 
100 100 100 100 100 100 100 100 100 100 100 100 100 100 
##$AQSEQ= 0
##$AQ_mod= 1
##$AUNM= <au_zg>
##$AUTOPOS= <>
##$BF1= 200.13
##$BF2= 200.13
##$BF3= 200.13
##$BF4= 200.13
##$BF5= 200.13
##$BF6= 200.13
##$BF7= 200.13
##$BF8= 200.13
##$BYTORDA= 1
##$CFDGTYP= 0
##$CFRGTYP= 5
##$CHEMSTR= <none>
##$CNST= (0..31)
1 1 145 1 1 1 1 1 1 1 1 1 1 1 1 1 1 1 1 1 1 1 1 1 1 1 1 1 1 1 1 1 
##$CPDPRG= <>
##$CPDPRG1= <>
##$CPDPRG2= <>
##$CPDPRG3= <>
##$CPDPRG4= <mlev>
##$CPDPRG5= <mlev>
##$CPDPRG6= <mlev>
##$CPDPRG7= <mlev>
##$CPDPRG8= <mlev>
##$CPDPRGB= <>
##$CPDPRGT= <>
##$D= (0..31)
0 0.7 0 0 0 0 0 0 0 0 0 0.03 0 0 0 0 0 0 0 0 0 0 0 0 0 0 0 0 0 0 0 0 
##$DATE= 1751436375
##$DBL= (0..7)
120 120 120 120 120 120 120 120 
##$DBP= (0..7)
150 150 150 150 150 150 150 150 
##$DBP07= 0
##$DBPNAM0= <>
##$DBPNAM1= <>
##$DBPNAM2= <>
##$DBPNAM3= <>
##$DBPNAM4= <>
##$DBPNAM5= <>
##$DBPNAM6= <>
##$DBPNAM7= <>
##$DBPOAL= (0..7)
0.5 0.5 0.5 0.5 0.5 0.5 0.5 0.5 
##$DBPOFFS= (0..7)
0 0 0 0 0 0 0 0 
##$DE= 6
$$ [...]
##$SUBNAM3= <"">
##$SUBNAM4= <"">
##$SUBNAM5= <"">
##$SUBNAM6= <"">
##$SUBNAM7= <"">
##$SUBNAM8= <"">
##$SUBNAM9= <"">
##$SW= 18.0517328524113
##$SWIBOX= (0..15)
0 0 2 0 0 0 0 0 0 0 0 0 0 0 0 0 
##$SW_h= 3612.71676300578
##$TD= 16384
##$TD0= 1
##$TE= 0
##$TE2= 300
##$TE3= 300
##$TEG= 300
##$TL= (0..7)
0 120 120 120 120 120 120 120 
##$TP= (0..7)
150 150 150 150 150 150 150 150 
##$TP07= 0
##$TPNAME0= <>
##$TPNAME1= <>
##$TPNAME2= <>
##$TPNAME3= <>
##$TPNAME4= <>
##$TPNAME5= <>
##$TPNAME6= <>
##$TPNAME7= <>
##$TPOAL= (0..7)
0.5 0.5 0.5 0.5 0.5 0.5 0.5 0.5 
##$TPOFFS= (0..7)
0 0 0 0 0 0 0 0 
##$TUNHIN= 0
##$TUNHOUT= 0
##$TUNXOUT= 0
##$USERA1= <user>
##$USERA2= <user>
##$USERA3= <user>
##$USERA4= <user>
##$USERA5= <user>
##$V9= 5
##$VALIST= <valist>
##$VCLIST= <CCCCCCCCCCCCCCC>
##$VD= 0
##$VDLIST= <DDDDDDDDDDDDDDD>
##$VPLIST= <PPPPPPPPPPPPPPP>
##$VTLIST= <TTTTTTTTTTTTTTT>
##$WBST= 1024
##$WBSW= 4
##$XGAIN= (0..3)
0 0 0 0 
##$XL= 0
##$YL= 0
##$YMAX_a= 216232
##$YMIN_a= -216250
##$ZGOPTNS= <>
##$ZL1= 120
##$ZL2= 120
##$ZL3= 120
##$ZL4= 120
##$ABSF1= 15.49128
##$ABSF2= -2.56057
##$ABSG= 5
##$ABSL= 3
##$ALPHA= 0
##$AQORDER= 0
##$ASSFAC= 0
##$ASSFACI= 0
##$ASSFACX= 0
##$ASSWID= 0
##$AUNMP= <proc_1d>
##$AZFE= 0.1
##$AZFW= 0.1
##$BCFW= 0
##$BC_mod= 2
##$BYTORDP= 0
##$COROFFS= 0
##$CY= -3
##$DATMOD= 1
##$DC= 0
##$DFILT= <>
##$DTYPP= 0
##$F1P= 0
##$F2P= 0
##$FCOR= 1
##$FTSIZE= 16384
##$FT_mod= 6
##$GAMMA= 0
##$GB= 0
##$INTBC= 1
##$INTSCL= 3.241238e-09
##$ISEN= 128
##$LB= 0.25
##$LEV0= 0
##$LPBIN= 0
##$MAXI= 10000
##$MC2= 0
##$MEAN= 0
##$ME_mod= 0
##$MI= 1.114404
##$NCOEF= 0
##$NC_proc= -7
##$NLEV= 6
##$NOISF1= 3.799351
##$NOISF2= 2.8
##$NSP= 0
##$NTH_PI= 0
##$NZP= 0
##$OFFSET= 15.52433
##$PC= 1
##$PHC0= -1358.546
##$PHC1= 12.3666
##$PH_mod= 1
##$PKNL= yes
##$PPARMOD= 0
##$PSCAL= 0
##$PSIGN= 0
##$REVERSE= no
##$SF= 200.129999475627
##$SI= 16384
##$SIGF1= 3
##$SIGF2= 2
##$SINO= 0.751879
##$SIOLD= 32768
##$SREGLST= <19F.Aceton>
##$SSB= 0
##$STSI= 16384
##$STSR= 0
##$SW_p= 3612.71676300578
##$SYMM= 0
##$S_DEV= 0
##$TDeff= 16384
##$TDoff= 0
##$TI= <>
##$TILT= no
##$TM1= 0
##$TM2= 0
##$TOPLEV= 0
##$USERP1= <user>
##$USERP2= <user>
##$USERP3= <user>
##$USERP4= <user>
##$USERP5= <user>
##$WDW= 1
##$XDIM= 16384
##$YMAX_p= 445771170
##$YMIN_p= -734735
$$ End of Bruker specific parameters
$$ ---------------------------------
##NTUPLES= NMR SPECTRUM
##VAR_NAME=  FREQUENCY,     SPECTRUM/REAL,   SPECTRUM/IMAG
##SYMBOL=    X,             R,               I
##VAR_TYPE=  INDEPENDENT,   DEPENDENT,       DEPENDENT
##VAR_FORM=  AFFN,          ASDF,            ASDF
##VAR_DIM=   16384,         16384,           16384
##UNITS=     HZ,            ARBITRARY UNITS, ARBITRARY UNITS
##FACTOR=    0.220516191357247, 1,           1
##FIRST=     3106.88418260958, 0,            0
##LAST=      -505.832580396198, 0,           0
##MIN=       -505.832580396198, -734735,     0
##MAX=       3106.88418260958, 445771170,    0
$$ Real data points
##PAGE= N=1
##DATA TABLE= (X++(R..R)), XYDATA
$$ [...]
$$ plain form
6046 2740070 2750550 2654422 2632282 2767324 2936535 2948627 2915874 2957749 3137406 3250875 3484979
6035 3484979 3581853 3865162 4035075 4171410 4317787 4292029 4096564 3922626 3619938 3391276
6025 3391276 3302355 3211036 3089230 2800253 2600619 2435738 2339901 2243645 2150427 2147111 2145776
6014 2145776 2080134 2121306 2007550 2013461 1927775 1934093 2057365 2136134 2262543 2324778 2282008
6003 2282008 2279190 2345132 2328956 2348331 2244276 2098515 2038517 1982537 1857977 1569771 1424335
5992 1424335 1394401 1391330 1247620 1266041 1293125 1359573 1286183 1186920 1170716 1002861 1077762
5981 1077762 1197249 1147000 1144065 1219615 1092832 1113345 1059034 949719 1011912 1081979 1039709
5970 1039709 946902 969309 1071093 992167 968570 1064555 997613 880223 939610 1033005 1049454
$$ packed form
6046B740070J0480r6128k2140J35042J69211J2092l2753M1875J79657J13469K34104
6035C484979R6874K83309J69913J36335J46377k5758j95465j73938l02688k28662
6025C391276q8921r1319j21806k88977j99634j64881r5837r6256r3218l316j335
6014B145776o5642M1172j13756N911q5686O318J23272P8769J26409O2235m2770
6003B282008k818O5942j6176J9375j04055j45761n9998n5980j24560k88206j45436
5992A424335k9934l071j43710J8421K7084O6448p3390r9263j6204j67855P4901
5981A077762J19487n0249k935P5550j26783K0513n4311j09315O2193P0067m2270
5970A039709r2807K2407J01784p8926k3597R5985o6942j17390N9387R3395J6449
$$ plain form
5959 1049454 1126283 1124993 1058104 928158 917184 992324 1076321 1200182 1158481 1188142 1338727
5948 1338727 1257192 1214279 1123897 1124757 1109503 1231077 1380965 1278086 1244178 1177463 1360141
5937 1360141 1422228 1426598 1555792 1486295 1413321 1315695 1338707 1477063 1452713 1398556 1456100
5926 1456100 1387810 1439258 1342013 1275754 1430307 1576679 1566929 1552967 1489651 1528364 1594696
5915 1594696 1612140 1688114 1647387 1718229 1825802 1628386 1665109 1803120 1735540 1793371 1917632
5904 1917632 1821103 1834634 1730618 1608892 1637385 1498790 1391109 1418630 1448416 1370759 1434100
5893 1434100 1472972 1495918 1390759 1380310 1352981 1315072 1313859 1421310 1365136 1442564 1352923
5882 1352923 1253917 1413644 1404611 1439706 1454949 1322260 1167869 951085 1042153 1166682 1090710
$$ packed form
5959A049454P6829j290o6889j29946j0974P5140Q3997J23861m1701K9661J50585
5948A338727q1535m2913r0382Q60j5254J21574J49888j02879l3908o6715J82678
5937A360141O2087M370J29194o9497p2974r7626K3012J38356k4350n4157N7544
5926A456100o8290N1448r7245o6259J54553J46372r750j3962o3316L8713O6332
5915A594696J7444P5974m0727P0842J07573j97416L6723J38011o7580N7831J24261
5904A917632r6529J3531j04016j21726K8493j38595j07681K7521K9786p7657O3341
5893A434100L8872K2946j05159j0449k7329l7909j213J07451n6174P7428q9641
5882A352923r9006J59727r033L5095J5243j32689j54391k16784R1068J24529p5972
$$ plain form
5871 1090710 1011674 969572 1014950 1060616 1025440 975430 944092 857067 963020 955326 816341
5860 816341 905844 1002817 834710 765299 785509 771505 831207 889100 899653 924617 1010415
5849 1010415 953355 923465 914244 801024 964288 1011633 771947 896016 978316 871948 745850
5838 745850 702575 701807 797091 821732 882580 852005 838359 836106 779637 756388 744301 798827
5826 798827 851579 804106 706872 853692 854714 894333 943136 880357 653160 666041 861485
5815 861485 932591 864970 964903 1009012 912512 909541 891218 872689 931134 864533 787209 899592
5803 899592 911967 968064 966794 891163 940671 941818 912528 933366 865825 926495 920508 1014786
5791 1014786 948307 802119 809964 885853 986635 992974 913780 808628 973349 996121 874409
$$ packed form
5871A090710p9036m2102M5378M5666l5176n0010l1338q7025J05953p694j38985
5860H16341Q9503R6973j68107o9411K0210j4004N9702N7893J0553K4964Q5798
5849A010415n7060k9890r221j13220J63264M7345k39686J24069Q2300j06368j26098
5838G45850m3275p68R5284K4641O0848l0575j3646k253n6469k3249j2087N4526
5826G98827N2752m7473r7234J46820J022L9619M8803o2779k27197J2881J95444
5815H61485P1106o7621R9933M4109r6500k971j8323j8529N8445o6601p7324J12383
5803H99592J2375N6097j270p5631M9508J147k9290K0838o7541O0670n987R4278
5791A014786o6479j46188P845P5889J00782O339p9194j05152J64721K2772j21712
$$ plain form
5780 874409 899601 918169 952176 920040 936290 827627 837575 994659 924471 1023580 890021
5769 890021 931831 959720 975113 1035233 825140 893070 849792 799126 829491 795775 684539
5758 684539 789575 1022090 957807 912186 895079 1049357 1118616 1102195 1085805 1082481 1051952
5747 1051952 947180 1059582 1020668 996145 1028686 1074975 988170 980615 986130 999345 937610
5736 937610 884866 1066316 1132655 1221970 1152965 1233444 1147261 1062685 1107197 1128342 1240500
5725 1240500 1373687 1150856 1195793 1184626 1252507 1376532 1182697 1116937 1072344 1184514
5715 1184514 1152550 1033317 996306 1139391 1252283 1237296 1157133 1210580 1256678 1276297 1360030
5704 1360030 1379853 1290001 1376890 1503006 1444821 1447766 1541970 1663307 1766347 1898078 2062678
$$ packed form
5780H74409K5192J8568L4007l2136J6250j08663R948J57084p0188R9109j33559
5769H90021M1810K7889J5393O0120k10093O7930m3278n0666L0365l3716j11236
5758F84539J05036K32515o4283m5621j7107J54278O9259j6421j6390l324l0529
5747A051952j04772J12402l8914k4523L2541M6289q6805p555N515J3215o1735
5736I37610n2744J81450O6339Q9315o9005Q0479q6183q4576M4512K1145J12158
5725A240500J33187k22831M4937j1167O7881J24025j93835o5760m4593J12170
5715A184514l1964j19233l7011J43085J12892j4987q0163N3447M6098J9619Q3733
5704A360030J9823q9852Q6889J26116n8185K945R4204J21337J03040J31731J64600
$$ plain form
5693 2062678 2281253 2391318 2303484 2308724 2232012 2109857 2110158 1871034 1790228 1720032 1682963
5682 1682963 1645058 1672643 1752866 1731885 1826025 1890055 1743743 1800545 1756427 1842220 2022453
5671 2022453 2153104 2264054 2260828 2438832 2467370 2455594 2324404 2182249 2217343 2151976 2096665
5660 2096665 2106176 2076971 2137774 2107264 1954610 1942148 2035172 1929970 1835076 1835618 1951933
5649 1951933 1914838 1832215 1808774 1786303 1776006 1863231 1844909 1847853 1796074 1850033 1908599 1999508
5637 1999508 2009974 2031074 1965286 2146577 2180751 2188240 2092273 2087506 2064195 2022553 2151480
5626 2151480 2117454 2135638 2135106 2054092 2016220 1986170 1823875 1848016 1910149 1987511 2007674 2015046
5614 2015046 2079400 2130552 2064202 2182426 2207513 2144974 2179292 2211695 2217171 2141315 2199802
$$ packed form
5693B062678K18575J10065q7834N240p6712j22155L01k39124q0806p0196l7069
5682A682963l7905K7585Q0223k0981R4140O4030j46312N6802m4118Q5793J80233
5671B022453J30651J10950l226J78004K8538j1776j31190j42155L5094o5367n5311
5660B096665R511k9205O0803l0510j52654j2462R3024j05202r4894N42J16315
5649A951933l7095q2623k3441k2471j0297Q7225j8322K944n1779N3959N8566R0909
5637A999508J0466K1100o5788J81291L4174P489r5967m767k3311m1642J28927
5626B151480l4026J8184n32q1014l7872l0050j62295K4141O2133P7362K0163P372
5614B015046O4354N1152o6350J18224K5087o2539L4318L2403N476p5856N8487
$$ plain form
5603 2199802 2266125 2262493 2223692 2078948 2080628 2135541 2031042 2067724 2212685 2220016 2132367
5592 2132367 2161015 2196376 2179183 2401103 2459387 2374744 2403799 2465584 2384403 2195446 2160763
5581 2160763 2204999 2130966 2075855 2221410 2263622 2196626 2367743 2376797 2428312 2560276 2482571
5570 2482571 2480018 2528953 2450347 2450903 2488720 2650467 2606482 2573975 2751735 2717761 2837965
5559 2837965 2946123 2813565 2942861 2801216 2771105 2774580 2710712 2670513 2732420 2778917 2818373
5548 2818373 2741210 2779116 2879542 2919450 3070819 3048529 3071881 3175355 3271257 3154429 3046775
5537 3046775 3029564 3190315 3323520 3244084 3291497 3330762 3406854 3473215 3316408 3303739 3216220
5526 3216220 3206703 3175833 3018774 3071824 3228799 3246534 3216867 3293511 3345223 3445600 3508345
$$ packed form
5603B199802O6323l632l8801j44744J680N4913j04499L6682J44961P331q7649
5592B132367K8648L5361j7193K21920N8284q4643K9055O1785q1181j88957l4683
5581B160763M4236p4033n5111J45555M2212o6996J71117R054N1515J31964p7705
5570B482571k553M8935p8606N56L7817J61747m3985l2507J77760l3974J20204
5559B837965J08158j32558J29296j41645l0111L475o3868m0199O1907M6497L9456
5548B818373p7163L7906J00426L9908J51369k2290K3352J03474R5902j16828j07654
5537C046775j7211J60751J33205p9436M7413L9265P6092O6361j56807j2669q7519
5526C216220r517l0870j57059N3050J56975J7735k9667P6644N1712J00377O2745
$$ plain form
5515 3508345 3520300 3535616 3353004 3426969 3453348 3305625 3347791 3393810 3241370 3425384 3558057
5504 3558057 3510439 3678330 3591447 3410087 3335096 3348270 3312600 3308578 3384820 3290197 3215803
5493 3215803 3261575 3391659 3498689 3345942 3358642 3386194 3549832 3556452 3529727 3508609 3562016
5482 3562016 3531423 3478551 3628523 3491212 3610465 3775759 3771724 3807549 3821197 3693098 3695692
5471 3695692 3676426 3804114 3851723 3754489 3749304 3857098 3923232 3944572 3916103 3789094 3892491
5460 3892491 4109130 4238928 4223811 4273832 4393389 4471657 4592218 4615068 4532859 4658986
5450 4658986 4832575 4867319 5121144 5367554 5493458 5552060 5615806 5648391 5501713 5372087
5440 5372087 5527425 5706430 5793626 5789005 5957378 6033820 6108109 6153518 6119260 6132165 6088211
$$ packed form
5515C508345J1955J5316j82612P3965K6379j47723M2166M6019j52440J84014J32673
5504C558057m7618J67891q6883j81360p4991J3174l5670m022P6242r4623p4394
5493C215803M5772J30084J07030j52747J2700K7552J63638O620k6725k1118N3407
5482C562016l0593n2872J49972j37311J19253J65294m035L5825J3648j28099K594
5471C695692j9266J27688M7609r7234n185J07794O6134K1340k8469j27009J03397
5460C892491K16639J29798j5117N0021J19557P8268J20561K2850q2209J26127
5450D658986J73589L4744K53825K46410J25904N8602O3746L2585j46678j29626
5440E372087J55338J79005Q7196m621J68373P6442P4289M5409l4258J2905m3954
$$ plain form
5429 6088211 6273896 6472689 6460783 6669518 6871853 6975901 7015762 7166640 7350765 7516266
5419 7516266 7822177 8056387 8121906 8172600 8163427 8134634 8199457 8071426 8162616 8133004 8229467
5408 8229467 8293882 8370438 8528728 8524511 8345954 8184688 8228928 8284085 8447606 8460881 8129855
5397 8129855 8124126 8191304 8294860 8345510 8456032 8573483 8650318 8728344 8788953 8889806 8903699
5386 8903699 8982846 8981165 9005642 9072931 9035997 9111190 9362011 9343938 9313086 9394516 9388162 9337361
5374 9337361 9537677 9659121 9636117 9693595 9693366 9799210 9835810 9968363 9947858 10074181 10308912
5363 10308912 10476217 10615197 10596757 10860837 10941972 11161003 11279161 11389160 11753713 11828585
5353 11828585 12011830 12181089 12388031 12574916 12700545 12983020 13242005 13434194 13516095 13786130
$$ packed form
5429F088211J85685J98793j1906K08735K02335J04048L9861J50878J84125J65501
5419G516266L05911K34210O5519N0694r173k8793O4823j28031R1190k9612R6463
5408H229467O4415P6556J58290m217j78557j61266M4240N5157J63521J3275l31026
5397H129855n729O7178J03556N0650J10522J17451P6835P8026O0609J00853J3893
5386H903699P9147j681K4477O7289l6934P5193K50821j8073l0852Q1430o354n0801
5374I337361K00316J21444k3004N7478k29J05844L6600J32553k0505J26323K34731
5363A0308912J67305J38980j8440K64080Q1135K19031J18158J09999L64553P4872
5353A1828585J83245J69259K06942J86885J25629K82475K58985J92189Q1901K70035
$$ plain form
5343 13786130 14017009 14229925 14522359 14869826 15026365 15244273 15465586 15643363 16005530
5334 16005530 16351262 16716198 17092605 17312897 17626283 17899884 18143260 18433403 18778350
5325 18778350 19125057 19349588 19747945 20094721 20535752 20813337 21262605 21674327 21849541
5316 21849541 22231319 22797616 23220452 23562105 24009878 24376755 24714433 25024842 25485795
5307 25485795 25860612 26286030 26588901 27066601 27599044 27977330 28380206 28746408 29205940
5298 29205940 29495616 29956723 30436679 30885829 31050542 31594774 32120385 32490269 32810046
5289 32810046 33031682 33419404 33645834 33998834 34445082 34762171 35031487 35369271 35710319
5280 35710319 35965733 36131877 36189388 36553206 36923102 37156533 37387541 37611215 37794101 37820055
$$ packed form
5343A3786130K30879K12916K92434L47467J56539K17908K21313J77777L62167
5334A6005530L45732L64936L76407K20292L13386K73601K43376K90143L44947
5325A8778350L46707K24531L98357L46776M41031K77585M49268M11722J75214
5316B1849541L81778N66297M22836L41653M47773L66877L37678L10409M60953
5307B5485795L74817M25418L02871M77700N32443L78286M02876L66202M59532
5298B9205940K89676M61107M79956M49150J64713N44232N25611L69884L19777
5289C2810046K21636L87722K26430L53000M46248L17089K69316L37784L41048
5280C5710319K55414J66144N7511L63818L69896K33431K31008K23674J82886K5954
$$ plain form
5270 37820055 37918462 38066436 38293991 38374476 38434289 38412017 38472715 38445792 38539267 38551876 38470334
5259 38470334 38429261 38315352 38416977 38345276 38192784 38083141 37963153 37803940 37593794 37386422
5249 37386422 37156583 37017888 36850502 36515613 36253125 36125005 35916002 35645150 35363452
5240 35363452 35107257 34711945 34238458 34007128 33682396 33423911 32999707 32608432 32417598
5231 32417598 32123536 31757535 31296448 31076578 30685183 30139072 29700258 29361767 29104609
5222 29104609 28744706 28190905 27883618 27598892 27196173 26811424 26390303 26064444 25724070
5213 25724070 25232017 24888424 24500831 24204590 23930379 23437951 22968014 22529630 22237243
5204 22237243 21930325 21721230 21358297 20998656 20598695 20258567 19950788 19642222 19461604
$$ packed form
5270C7820055R8407J47974K27555Q0485N9813k2272O0698k6923R3475J2609q1542
5259C8470334m1073j13909J01625p1701j52492j09643j19988j59213k10146k07372
5249C7386422k29839j38695j67386l34889k62488j28120k09003k70852k81698
5240C5363452k56195l95312m73487k31330l24732k58485m24204l91275j90834
5231C2417598k94062l66001m61087k19870l91395n46111m38814l38491k57158
5222B9104609l59903n53801l07287k84726m02719l84749m21121l25859l40374
5213B5724070m92053l43593l87593k96241k74211m92428m69937m38384k92387
5204B2237243l06918k09095l62933l59641l99961l40128l07779l08566j80618
$$ plain form
5195 19461604 19085259 18849657 18506310 18174677 17855182 17547413 17392813 17066736 16746874
5186 16746874 16535266 16171029 15965518 15804158 15575657 15206947 14964619 14843768 14462781
5177 14462781 14302213 14176221 13931030 13660234 13400785 13187516 12958151 12786420 12703362 12540998
5167 12540998 12201810 12095916 11901602 11701554 11488310 11426038 11294179 11209743 11059895 10828315
5157 10828315 10595241 10609483 10550922 10319560 10079898 9925825 9831005 9676352 9634666 9409836
5147 9409836 9250619 9053793 8990921 8954344 8936388 8720379 8558221 8419233 8402571 8280647
5137 8280647 8050336 7932346 7878582 7919398 7868454 7659093 7567897 7551102 7364960 7355447 7339974
5126 7339974 7164568 7155468 7119227 7144057 7031883 6926344 6759400 6657961 6686058 6664587 6440666
$$ packed form
5195A9461604l76345k35602l43347l31633l19495l07769j54600l26077l19862
5186A6746874k11608l64237k05511j61360k28501l68710k42328j20851l80987
5177A4462781j60568j25992k45191k70796k59449k13269k29365j71731q3058j62364
5167A2540998l39188j05894j94314k00048k13244o2272j31859q4436j49848k31580
5157A0828315k33074J4242n8561k31362k39662j54073r4820j54653m1686k24830
5147I409836j59217j96826o2872l6577j7956k16009j62158j38988j6662j21924
5137H280647k30311j17990n3764M0816n0944k09361r1196j6795j86142r513j5473
5126G339974j75406r100l6241K4830j12174j05539j66944j01439K8097k1471k23921
$$ plain form
5115 6440666 6352393 6259269 6190794 6064928 6068147 6080959 6028625 5959264 5760324 5793392 5743365
5104 5743365 5615622 5649124 5563747 5593278 5522318 5528279 5506713 5472799 5409111 5385418 5352041
5093 5352041 5181787 5058481 5048214 5094327 4937251 4866830 4772486 4702155 4816793 4820007 4654402
5082 4654402 4545748 4536703 4556221 4595719 4596372 4297965 4325389 4223400 4245787 4211717 4120674
5071 4120674 4088821 4092511 4023445 3935772 3941971 3895679 3906590 3903140 3937118 4003729 3858494 3791957
5059 3791957 3816744 3831427 3913358 3893491 3856343 3821505 3711577 3690031 3768555 3799018 3798508 3748724
5047 3748724 3689031 3634575 3643949 3592237 3480807 3343672 3372173 3427721 3372126 3338049 3275930
5036 3275930 3216658 3156495 3273436 3313344 3353445 3292188 3274541 3475928 3486499 3403945 3291483
$$ packed form
5115F440666q8273r3124o8475j25866L219J2812n2334o9361j98940L3068n0027
5104E743365j27743L3502q5377K9531p0960N961k1566l3914o3688k3693l3377
5093E352041j70254j23306j0267M6113j57076p0421r4344p0331J14638L214j65605
5082D654402j08654r045J9518L9498O53k98407K7424j01989K2387l4070r1043
5071D120674l1853L690o9066q7673O199m6292J0911l450L3978O6611j45235o6537
5059C791957K4787J4683Q1931j9867l7148l4838j09928k1546P8524L0463n10m9784
5047C748724n9693n4456R374n1712j11430j37135K8501N5548n5595l4077o2119
5036C275930n9272o0163J16941L9908M0101o1257j7647K01387J0571q2554j12462
$$ plain form
5025 3291483 3198765 3217722 3206362 3158953 3120113 3099740 3046161 3007715 2997398 2993065 3032893 2998939
5013 2998939 3007607 2996707 3022346 3043603 3097449 3040135 3125234 3213294 3050991 3153842 3184377
5002 3184377 3195475 3282041 3272116 3275132 3210716 3361655 3555814 3630794 3639449 3550604 3730498
4991 3730498 3807135 3735417 3626223 3509916 3396736 3551961 3573055 3529265 3512285 3525876 3539996
4980 3539996 3537507 3502834 3494585 3470811 3421217 3596075 3721672 3872331 3920369 3903960 4019442
4969 4019442 4117765 4219660 4290198 4370105 4556002 4636097 4747570 4731010 4766150 4730848 4686545
4958 4686545 4710648 4850479 4801571 4660337 4628700 4588434 4552046 4687585 4737031 4680717 4744291
4947 4744291 4632689 4496020 4577219 4649811 4776663 4717800 4758818 4755236 4806948 5007251 4994191
$$ packed form
5025C291483r2718J8957j1360m7409l8840k0373n3579l8446j0317m333L9828l3954
5013B998939Q668j0900K5639K1257N3846n7314Q5099Q8060j62303J02851L0535
5002C184377J1098Q6566r925L016o4416J50939J94159P4980Q655q8845J79894
4991C730498P6637p1718j09194j16307j13180J55225K1094m3790j6980J3591J4120
4980C539996k489l4673q249k3774m9594J74858J25597J50659M8038j6409J15482
4969D019442R8323J01895P0538P9907J85897Q0095J11473j6560L5140l5302m4303
4958D686545K4103J39831m8908j41234l1637m0266l6388J35539M9446n6314O3574
4947D744291j11602j36669Q1199P2592J26852n8863M1018l582N1712K00303j3060
$$ plain form
4936 4994191 4970845 4838715 4978823 5064772 4838312 4951180 5012455 4950827 5044714 5084345 5104404
4925 5104404 5108461 5102651 4996873 5097903 5157635 5157202 5084326 5018257 5020389 4864707 4824750 4670816
4913 4670816 4506385 4463779 4357359 4223582 4214110 4045024 3922345 3944516 3846764 3848721 3775077
4902 3775077 3778729 3798209 3706396 3683417 3763073 3838569 3776128 3580355 3607985 3833795 3837411
4891 3837411 3667939 3665288 3630498 3470996 3415693 3368508 3325016 3218655 3006623 3083200 3157034
4880 3157034 3221319 3075031 3034969 2828212 2627501 2675203 2614818 2659444 2623301 2611219 2481531
4869 2481531 2400807 2451980 2361005 2349243 2341025 2106207 2065014 1997662 1990223 1967278 1960606 1919553
4857 1919553 1947458 1860326 1817038 1885576 1775572 1821204 2017934 2005531 1840339 1754165 1733375
$$ packed form
4936D994191k3346j32130J40108Q5949k26460J12868O1275o1628R3887L9631K0059
4925E104404M057n810j05778J01030N9732m33p2876o6069K132j55682l9957j53934
4913D670816j64431m2606j06420j33777r472j69086j22679K2171r7752J957p3644
4902C775077L652J9480r1813k2979P9656P5496o2441j95773K7630K25810L616
4891C837411j69472k651l4790j59502n5303m7185m3492j06361k12032P6577P3834
4880C157034O4285j46288m0062k06757k00711M7702o0385M4626l6143j2082j29688
4869B481531q0724N1173r0975j1762q218k34818m1193o7352p439k2945o672m1053
4857A919553K7905q7132m3288O8538j10004M5632J96730j2403j65192q6174k0790
$$ plain form
4846 1733375 1723968 1813314 1741436 1706633 1687631 1598491 1685567 1800390 1836663 1728642 1651065
4835 1651065 1685796 1610087 1578758 1602178 1640346 1639086 1600286 1587295 1617084 1557580 1444930
4824 1444930 1528230 1678293 1588774 1386395 1454265 1461079 1526545 1584220 1556484 1400664 1279347
4813 1279347 1238048 1341938 1385686 1462042 1427049 1350978 1316995 1316546 1270491 1350089 1414724 1431854
4801 1431854 1354108 1252903 1256006 1382680 1473429 1349727 1361489 1310826 1326438 1353352 1272758
4790 1272758 1311430 1264109 1188734 1268350 1290807 1431755 1365944 1272800 1236553 1167055 1146684
4779 1146684 1228925 1272445 1123319 1247391 1281377 1255408 1118751 1162603 1138088 1010356 1109569
4768 1109569 1064704 1074723 1102940 1097477 1000256 925846 882050 1043238 997067 916662 986810
$$ packed form
4846A733375r407Q9346p1878l4803j9002q9140Q7076J14823L6273j08021p7577
4835A651065L4731p5709l1329K3420L8168j260l8800j2991K9789n9504j12650
4824A444930Q3300J50063q9519k02379O7870O814O5466N7675k7736j55820j21317
4813A279347m1299J03890M3748P6356l4993p6071l3983m49m6055P9598O4635J7130
4801A431854p7746j01205L103J26674R0749j23702J1762n0663J5612K6914q0594
4790A272758L8672m7321p5375P9616K2457J40948o5811r3144l6247o9498k0371
4779A146684Q2241M3520j49126J24072L3986k5969j36657M3852k4515j27732R9213
4768A109569m4865J0019K8217n463r7221p4410m3796J61188m6171q0405P0148
$$ plain form
4757 986810 1109470 1118367 1113329 961486 916792 1068476 1079557 1086707 953084 966769 954909
4746 954909 812768 842861 852503 773582 858197 931396 931264 955377 1098888 1017668 978167 1061325
4734 1061325 1018171 1082487 961618 1007452 1034452 862761 912359 927323 1068689 1098916 1044859
4723 1044859 1027734 1034841 1083072 1004011 1059298 972724 1071013 1085111 1069573 1130433 969899
4712 969899 863060 909278 1037221 956453 999461 1010215 938184 845292 920411 986376 951758
4701 951758 1000698 1011718 952857 978993 981216 961629 918961 893246 1033918 1094361 1118706 1024180
4689 1024180 983256 1059123 1112957 1142563 1250246 1286087 1178002 1067072 1103333 1238612 1216049
4678 1216049 1204185 1355336 1295897 1259752 1333830 1371490 1381813 1331831 1281121 1269917 1151789
$$ packed form
4757I86810J22660Q897n038j51843m4694J51684J1081P150j33623J3685j1860
4746I54909j42141L0093R642p8921Q4615P3199j32K4113J43511q1220l9501Q3158
4734A061325m3154O4316j20869M5834K7000j71691M9598J4964J41366L0227n4057
4723A044859j7125P107M8231p9061N5287q6574R8289J4098j5538O0860j60534
4712I69899j06839M6218J27943q0768M3008J0754p2031r2892P5119O5965l4618
4701I51758M8940J1020n8861K6136K223j9587m2668k5715J40672O0443K4345r4526
4689A024180m0924P5867N3834K9606J07683L5841j08085j10930L6261J35279k2563
4678A216049j1864J51151n9439l6145P4078L7660J0323m9982n0710j1204j18128
$$ plain form
4667 1151789 1119909 1108953 1157393 1355136 1207991 1072034 988477 973525 1083140 1090946 1055381
4656 1055381 1103452 1120160 1092633 1070138 1107101 939685 980067 1035337 986547 1000264 999192
4645 999192 1063679 1058480 1164621 984279 890546 897325 845346 823997 953314 920344 994010
4634 994010 1075336 1115939 1260897 1243889 1255889 1214937 1104767 1067731 1087223 1023594 1020797
4623 1020797 1075727 1068215 1126251 1051276 1079750 1140256 1122581 1081841 1141743 1169603 1185246 1131299
4611 1131299 1010671 830148 865044 989788 1042887 1099293 891576 894877 891115 894751 826574
4600 826574 984124 1059992 1110053 1062430 1033435 1034450 983501 966311 976826 959626 892121 904150
4588 904150 1030778 975751 946069 1009348 1024569 933982 935197 1017316 962430 1045892 1235503
$$ packed form
4667A151789l1880j0956M8440J97743j47145j35957q3557j4952J09615P806l5565
4656A055381M8071J6708k7527k2495L6963j67416M0382N5270m8790J3717j072
4645I99192O4487n199J06141j80342r3733O779n1979k1349J29317l2970P3666
4634I94010Q1326M0603J44958j7008J2000m0952j10170l7036J9492o3629k797
4623A020797N4930p512N8036p4975K8474O0506j7675m0740N9902K7860J5643n3947
4611A131299j20628j80523L4896J24744N3099N6406k07717L301l762L636o8177
4600H26574J57550P5868N0061m7623k8995J015n0949j7190J0515j7200o7505J2029
4588I04150J26628n5027k9682O3279J5221r0587J215Q2119n4886Q3462J89611
$$ plain form
4577 1235503 1174569 1064622 973090 936398 1037353 1125561 1146546 1145031 1218967 1074104 986435
4566 986435 1012313 1022087 1005008 1103918 1037662 973302 1123984 1059437 1051497 1106281 1002787 1044303
4554 1044303 1134663 1181988 1142579 1100280 1132556 1237186 1160037 1194097 1191751 1188433 1116151 1053951
4542 1053951 1257779 1123437 1012236 1192768 1224670 1241210 1154162 1211526 1236744 1136360
4532 1136360 1157520 1094132 1197812 1300646 1303865 1253968 1226661 1220892 1333367 1327073 1382668
4521 1382668 1270774 1196233 1276560 1262107 1386044 1394530 1493916 1495066 1458464 1436892 1396810
4510 1396810 1373843 1422617 1523911 1492712 1555543 1459276 1327297 1322992 1516752 1673454 1619687
4499 1619687 1557600 1583737 1532642 1632631 1589905 1547178 1650138 1708790 1654573 1644088 1753133
$$ packed form
4577A235503o0934j09947r1532l6692J00955Q8208K0985j515P3936j44863q7669
4566I86435K5878R774j7079R8910o6256o4360J50682o4547p940N4784j03494M1516
4554A044303R0360M7325l9409m2299L2276J04630p7149L4060k346l318p2282o2200
4542A053951K03828j34342j11201J80532L1902J6540q7048N7364K5218j00384
4532A136360K1160o3388J03680J02834L219m9897k7307n769J12475o294N5595
4521A382668j11894p4541Q0327j4453J23937Q486R9386J150l6602k1572m0082
4510A396810k2967M8774J01294l1199O2831r6267j31979m305J93760J56702n3767
4499A619687o2087K6137n1095R9989m2726m2727J02960N8652n4217j0485J09045
$$ plain form
4488 1753133 1711162 1794571 1859119 1781324 1744428 1628328 1733269 1759189 1834851 1886965 1816551
4477 1816551 1854771 1906035 1950674 1961206 1910150 1924705 2006333 1951819 1886431 1911866 2018359
4466 2018359 1974763 2060487 2034691 2082166 2003782 2200607 2112440 2172771 2131850 2164841 2168199
4455 2168199 2202550 2214854 2177535 2207916 2333758 2395746 2445479 2548150 2493523 2400237 2478229
4444 2478229 2591479 2597882 2628524 2673792 2923444 2984471 3088756 3068337 3134048 3175775 3352458
4433 3352458 3484876 3485858 3511730 3632298 3554735 3658790 3887495 4193653 4311222 4463990
4423 4463990 4744159 5008116 4998082 5105793 5372275 5621881 5881924 6093735 6411154 6683101
4413 6683101 7004688 7489140 7742987 8123520 8603726 9059482 9801508 10502511 11075372 11750037
$$ packed form
4488A753133m1971Q3409O4548p7795l6896j16100J04941K5920P5662N2114p0414
4477A816551L8220N1264M4639J0532n1056J4555Q1628n4514o5388K5435J06493
4466B018359m3596Q5724k5796M7475p8384J96825q8167O0331m0921L2991L358
4455B168199L4351J2304l7319L0381J25842O1988M9733J02671n4627r3286P7992
4444B478229J13250O403L0642M5268K49652O1027J04285k0419O5711M1727J76683
4433C352458J32418R82K5872J20568p7563J04055K28705L06158J17569J52768
4423D463990K80169K63957j0034J07711K66482K49606K60043K11811L17419K71947
4413F683101L21587M84452K53847L80533M80206M55756P42026P01003N72861O74665
$$ plain form
4403 11750037 12532815 13117623 13490699 13839209 14113974 14380679 14882451 15272492 15996169
4394 15996169 16941151 18025351 19307092 20726661 22068799 22953836 23736985 24258915 24386376
4385 24386376 24289107 24025796 23758386 23763155 24080558 24503272 25341531 26585080 27850067 29113343
4375 29113343 30293672 31087793 31441857 31045129 30332415 29216963 27923486 27152951 26579612
4366 26579612 26209225 26150862 26309864 26830271 27355271 27799659 28091604 28175750 27744005 26901159
4356 26901159 25933143 24778481 23708676 22979897 22201309 21494455 20880209 20188606 19723165
4347 19723165 19583708 19503363 19040395 18567009 17811616 17124793 16414909 15660387 15030586 14448625
4337 14448625 13901063 13602167 13184153 12825971 12505581 12252790 12081976 11817487 11653991
$$ packed form
4403A1750037P82778N84808L73076L48510K74765K66705N01772L90041P23677
4394A5996169R44982J084200J281741J419569J342138Q85037P83149N21930J27461
4385B4386376r7269k63311k67410M769L17403M22714Q38259J243549J264987J263276
4375B9113343J180329P94121L54064l96728p12714j115452j293477p70535n73339
4366B6579612l70387n8363J59002N20407N25000M44388K91945Q4146m31745q42846
4356B6901159r68016j154662j069805p28779p78588p06854o14246o91603m65441
4347A9723165j39457q0345m62968m73386p55393o86823p09884p54522o29801n81961
4337A4448625n47562k98896m18014l58182l20390k52791j70814k64489j63496
$$ plain form
4328 11653991 11445380 11094193 10846360 10569718 10289879 10118634 10027248 9957909 9826261 9753960
4318 9753960 9787241 9693947 9503963 9413023 9333189 9365621 9219528 9068406 9009344 9026527 8847871
4307 8847871 8890807 8893561 8842643 9005463 8913544 8795020 8705892 8649665 8628798 8665928 8634286
4296 8634286 8520984 8565905 8590871 8456615 8420287 8401149 8375963 8378368 8571326 8672944 8522330
4285 8522330 8523048 8562070 8634169 8592589 8623114 8668558 8686876 8808578 9192687 9453612 9694167
4274 9694167 9694701 9583076 9506976 9298345 9242531 9214288 9367864 9464148 9440554 9515048 9672900
4263 9672900 9849758 9939597 9921366 9987800 10177373 10344257 10558363 10854476 11026092 11100324
4253 11100324 11370343 11592599 11727619 11903282 12152063 12289371 12458702 12695108 12951839
$$ packed form
4328A1653991k08611l51187k47833k76642k79839j71245r1386o9339j31648p2301
4318I753960L3281r3294j89984r0940p9834L2432j46093j51122n9062J7183j78656
4307H847871M2936K754n0918J62820r1919j18524q9128n6227k0867L7130l1642
4296H634286j13302M4921K4966j34256l6328j9138k5186K405J92958J01618j50614
4285H522330P18L9022P2099m1580L0525M5444J8318J21702L84109K60925K40555
4274I694167N34j11625p6100k08631n5814k8243J53576R6284k3594P4494J57852
4263I672900J76858Q9839j8231O6434J89573J66884K14106K96113J71616P4232
4253A1100324K70019K22256J35020J75663K48781J37308J69331K36406K56731
$$ plain form
4244 12951839 13266322 13528933 13820624 14150695 14584076 14929704 15186072 15514500 16030039
4235 16030039 16634447 17001602 17366592 17891079 18241417 18458809 18941229 19445404 19913341
4226 19913341 20517824 21076637 21683412 22238748 22800451 23358511 23930308 24572162 25081749
4217 25081749 25762957 26570336 27234961 28099040 29038547 29832390 30802776 31674229 32454454
4208 32454454 33199558 34160649 35162979 36010364 37238890 38221176 38983745 39998155 41123982
4199 41123982 42153538 43293506 44236790 45215880 46154199 47162701 48260692 49075011 50047064
4190 50047064 50949760 51823608 52906022 53822366 54726378 55537063 56477808 57542295 58460893
4181 58460893 59366092 60127656 60946652 61765317 62458168 63219951 63951643 64543170 65044652
$$ packed form
4244A2951839L14483K62611K91691L30071M33381L45628K56368L28428N15539
4235A6030039O04408L67155L64990N24487L50338K17392M82420N04175M67937
4226A9913341O04483N58813O06775N55336N61703N58060N71797O41854N09587
4217B5081749O81208Q07379O64625Q64079R39507P93843R70386Q71453P80225
4208C2454454P45104R61091J002330Q47385J228526R82286P62569J014410J125827
4199D1123982J029556J139968R43284R79090R38319J008502J097991Q14319R72053
4190E0047064R02696Q73848J082414R16344R04012Q10685R40745J064487R18598
4181E8460893R05199P61564Q18996Q18665O92851P61783P31692N91527N01482
$$ plain form
4172 65044652 65770890 66151606 66398629 66677900 66940116 67115336 67137181 67037813 67082830 66985168
4162 66985168 66586453 66221217 65785762 65374547 64831027 64056808 63420977 62640960 61980979
4153 61980979 61344889 60528499 59710037 58936172 58244807 57183356 56189528 55269016 54365613
4144 54365613 53436761 52654178 51889217 50935972 49899194 48913993 48021592 47160828 46145106
4135 46145106 45189449 44231719 43364953 42378526 41373786 40380348 39333734 38397576 37572388
4126 37572388 36530112 35622324 34757479 33910926 33167486 32315810 31379315 30551499 29799305
4117 29799305 29119487 28568522 27917172 27184609 26546543 25845228 25295774 24745375 24187731
4108 24187731 23489177 22983294 22486809 22117168 21539698 21031919 20645173 20231064 19952022
$$ packed form
4172F5044652P26238L80716K47023K79271K62216J75220K1845r9368M5017r7662
4162F6985168l98715l65236m35455m11215n43520p74219o35831p80017o59981
4153F1980979o36090q16390q18462p73865o91365j061451r93828r20512r03403
4144E4365613r28852p82583p64961r53245j036778r85201q92401q60764j015722
4135D6145106r55657r57730q66766r86427j004740r93438j046614r36158q25188
4126C7572388j042276r07788q64845q46553p43440q51676r36495q27816p52194
4117B9799305o79818n50965o51350p32563o38066p01315n49454n50399n57644
4108B4187731o98554n05883m96485l69641n77470n07779l86746m14109k79042
$$ plain form
4099 19952022 19623066 19390375 19081760 18717768 18246465 18088838 17961726 17795028 17726370 17532988
4089 17532988 17212636 16943640 16792965 16635903 16407111 16335859 16075407 15932699 15818815 15818352
4079 15818352 15495025 15421206 15338628 15352562 15268043 15153484 15210961 15281771 15176904 15152642 15105004
4068 15105004 15142198 15285483 15289373 15424662 15620999 15795341 15848937 15997075 16167673 16393424
4058 16393424 16440689 16581947 16754030 16899002 16935559 17076554 17010889 16942027 17111607 17198971
4048 17198971 17148659 17069826 17061296 16910366 17081929 17230801 17135908 17221127 17260128 17255977 17194038
4037 17194038 17168063 17262371 17498844 17472349 17447525 17568533 17770006 18102153 18421137 18945019
4027 18945019 19592738 20219510 21028494 22046474 23264865 24493849 25865703 27528893 29540053
$$ packed form
4099A9952022l28956k32691l08615l63992m71303j57627j27112j66698o8658j93382
4089A7532988l20352k68996j50675j57062k28792p1252k60452j42708j13884m63
4079A5818352l23327p3819q2578J3934q4519j14559N7477P0810j04867k4262m7638
4068A5105004L7194J43285L890J35289J96337J74342N3596J48138J70598K25751
4058A6393424M7265J41258J72083J44972L6557J40995o5665o8862J69580Q7364
4048A7198971n0312p8833q530j50930J71563J48872r4893Q5219L9001m151o1939
4037A7194038k5975R4308K36473k6495k4824J21008K01473L32147L18984N23882
4027A8945019O47719O26772Q08984J017980J218391J228984J371854J663190K011160
$$ plain form
4018 29540053 31666566 33990697 36738274 39968488 43537782 47488164 51653212 55974133
4010 55974133 60280164 64367874 68059672 71118017 73553073 75285423 76251572 76575529
4002 76575529 76442980 76004776 75512347 74868425 74485591 74445164 74795327 75303762 75803071 76115547
3992 76115547 76104100 75455754 74172191 72395441 69998837 66937022 63493670 59614679 55631784
3983 55631784 51725588 47948201 44263011 40903370 38100084 35513441 33203492 31177767
3975 31177767 29352842 27640822 26026214 24790750 23533996 22447262 21430800 20515086
3967 20515086 19789924 18925045 18049169 17503552 16896977 16431905 15974244 15492848 15191846
3958 15191846 14850671 14655299 14176534 13910677 13672015 13393284 13249306 12973560 12730460
$$ packed form
4018B9540053K126513K324131K747577L230214L569294L950382M165048M320921
4010E5974133M306031M087710L691798L058345K435056J732350R66149L23957
4002G6575529j32549m38204m92429o43922l82834m0427L50163N08435M99309L12476
3992G6115547j1447o48346j283563j776750k396604l061815l443352l878991l982895
3983E5631784l906196l777387l685190l359641k803286k586643k309949k025725
3975C1177767j824925j712020j614608j235464j256754j086734j016462r15714
3967B0515086p25162q64879q75876n45617o06575m65072m57661m81396l01002
3958A5191846l41175j95372m78765k65857k38662k78731j43978k75746k43100
$$ plain form
3949 12730460 12677510 12399697 11996684 11743387 11618606 11428925 11324358 11274025 11204434 11064304
3939 11064304 11060876 10942529 10887714 10951299 10816398 10877001 10800042 10782145 10925490 10806128 10924667
3928 10924667 11011041 10931523 11017730 11149396 11095456 11163053 11290561 11296740 11353600 11386577 11190910
3917 11190910 11150250 11202090 11296708 11376111 11391494 11419760 11596673 11769377 11712930 11880476 12025128
3906 12025128 11970528 11968789 12137301 12340871 12414573 12455056 12506933 12579980 12687764 12825477 13045030
3895 13045030 13218730 13208130 13449778 13607022 13715772 13698278 13974316 14062888 13967385 14077482
3885 14077482 14074359 13941377 14103600 14371567 14438881 14535729 14719583 14779295 14887042 15198421
3875 15198421 15357576 15733721 16099810 16524415 17064802 17755383 18352692 19109133 19872528
$$ packed form
3949A2730460n2950k77813m03013k53297j24781j89681j04567n0333o9591j40130
3939A1064304l428j18347n4815O3585j34901O0603p6959j7897J43345j19362J18539
3928A0924667Q6374p9518Q6207J31666n3940O7597J27508O179N6860L2977j95667
3917A1190910m0660N1840R4618P9403J5383K8266J76913J72704n6447J67546J44652
3906A2025128n4600j739J68512K03570P3702M0483N1877P3047J07784J37713K19553
3895A3045030J73700j0600K41648J57244J08750j7494K76038Q8572r5503J10097
3885A4077482l123j32982J62223K67967O7314R6848J83854N9712J07747L11379
3875A5198421J59155L76145L66089M24605N40387O90581N97309P56441P63395
$$ plain form
3866 19872528 20754917 21657442 22666144 23881254 24923888 25986044 27082108 28204633
3858 28204633 29222173 30275774 31161311 31798838 32732738 33290802 33556991 33439408 33162518
3849 33162518 32815331 32317330 31625667 31037872 30540451 30035547 29472303 28997913 28564982
3840 28564982 28417383 28211674 27940982 27761698 27676926 27578400 27739799 27681884 27589531 27759194
3830 27759194 27935192 28293282 28847446 29200561 29684988 30438371 31101212 32035410 33005601
3821 33005601 34278706 35770658 37280163 39016726 41055262 43581291 46329195 49365525
3813 49365525 52876439 56931532 61589818 67062585 73311728 79974277 87507154 95369993
3805 95369993 103292782 110996750 118260665 124871306 130776768 135861218 140111028 143190965
$$ packed form
3866A9872528Q82389R02525J008702J215110J042634J062156J096064J122525
3858B8204633J017540J053601Q85537O37527R33900N58064K66189j17583k76890
3849C3162518l47187m98001o91663n87795m97421n04904n63244m74390m32931
3840B8564982j47599k05709k70692j79284q4772r8526J61399n7915r2353J69663
3830B7759194J75998L58090N54164L53115M84427P53383O62841R34198R70191
3821C3005601J273105J491952J509505J736563K038536K526029K747904L036330
3813D9365525L510914M055093M658286N472767O249143O662549P532877P862839
3805I5369993P922789P703968P263915O610641N905462N084450M249810L079937
$$ plain form
3797 143190965 145527917 146940016 147528962 147145284 146286192 144853987 142868397 140516985
3789 140516985 138125541 135420410 132579291 129430681 125860191 121998383 117523564 112612083
3781 112612083 107331010 101909950 96193851 90288785 84530077 78975704 73645624 68633198
3773 68633198 63916475 59752652 55832531 52358723 49242487 46488902 43792601 41555680
3765 41555680 39569327 37703220 35857617 34375744 32880106 31497131 30530521 29377598
3757 29377598 28387302 27505850 26765468 26134680 25553275 25003153 24587169 24240907 23984160
3748 23984160 23766881 23603406 23484766 23409681 23480705 23687861 23946205 24183159 24460673 24771473
3738 24771473 25230053 25587519 25897601 26207102 26447330 26459813 26528682 26531899 26347489 26054785
$$ packed form
3797A43190965K336952J412099N88946l83678q59092j432205j985590k351412
3789A40516985k391444k705131k841119l148610l570490l861808m474819m911481
3781A12612083n281073n421060n716099n905066n758708n554373n330080n012426
3773F8633198m716723m163823l920121l473808l116236k753585k696301k236921
3765D1555680j986353j866107j845603j481873j495638j382975r66610j152923
3757B9377598r90296q81452p40382o30788n81405n50122m15984l46262k56747
3748B3984160k17279j63475j18640p5085P1024K07156K58344K36954K77514L10800
3738B4771473M58580L57466L10082L09501K40228J2483O8869L217j84410k92704
$$ plain form
3728 26054785 25671405 25206002 24670017 24119666 23303911 22540066 21706848 20831883 19993890
3719 19993890 19322664 18473588 17766658 17105089 16629235 16059978 15521337 15100054 14588255
3710 14588255 14037300 13513215 13268717 13102831 12691270 12382508 12095837 11828420 11635137
3701 11635137 11356629 11173340 11038969 10943677 10959860 10755607 10561818 10403343 10370772 10271587
3691 10271587 10100129 9981323 9794432 9815921 9802667 9771398 9676958 9647431 9654808 9520907 9394310
3680 9394310 9311319 9428178 9548622 9421184 9395047 9385447 9200278 9111074 9016717 8731710 8679879
3669 8679879 8692234 8704967 8761599 8699799 8502747 8542543 8530531 8604242 8412785 8262131 8373908
3658 8373908 8429591 8359038 8337160 8348449 8377720 8382571 8499666 8419913 8399127 8500031 8627747
$$ packed form
3728B6054785l83380m65403n35985n50351q15755p63845q33218q74965q37993
3719A9993890o71226q49076p06930o61569m75854n69257n38641m21283n11799
3710A4588255n50955n24085k44498j65886m11561l08762k86671k67417j93283
3701A1635137k78508j83289j34371r5292J6183k04253j93789j58475l2571r9185
3691A0271587j71458j18806j86891K1489j3254l1269r4440k9527P377j33901j26597
3680I394310q2991J16859J20444j27438k6137r600j85169q9204r4357k85007n1831
3669H679879J2355J2733N6632o1800j97052L9796j2012P3711j91457j50654J11777
3658H373908N5683p0553k1878J1289K9271M851J17095p9753k0786J00904J27716
$$ plain form
3647 8627747 8514369 8431926 8580836 8638545 8657019 8736906 8729714 8769445 8917138 9034664 9100106
3636 9100106 9146624 9176308 9387955 9558542 9702157 10087520 10314568 10551034 10912037 11271615
3626 11271615 11680908 12232105 12728708 13260408 13752696 14137052 14578511 15009843 15274237
3617 15274237 15362291 15499118 15550370 15690278 15634180 15681103 16000652 16169737 16208124 16332118
3607 16332118 16459800 16479903 16682757 16833545 16918635 16941986 16932604 16808280 16796774 16801699 16753612
3596 16753612 16771030 16905067 17084229 17263259 17470140 17732144 18147146 18667973 19253211 19878011
3586 19878011 20578580 21267578 22146309 23024076 24034537 25173503 26515999 27950636 29490466
3577 29490466 31451528 33549632 35903506 38318970 41246162 44520950 48266233 52258521
$$ packed form
3647H627747j13378q2443J48910N7709J8474P9887p192L9731J47693J17526O5442
3636I100106M6518K9684K11647J70587J43615L85363K27048K36466L61003L59578
3626A1271615M09293N51197M96603N31700M92288L84356M41459M31332K64394
3617A5274237Q8054J36827N1252J39908n6098M6923L19549J69085L8387J23994
3607A6332118J27682K0103K02854J50788Q5090K3351r382j24324j1506M925m8087
3596A6753612J7418J34037J79162J79030K06881K62004M15002N20827N85238O24800
3586A9878011P00569O88998Q78731Q77767J010461J138966J342496J434637J539830
3577B9490466J961062K098104K353874K415464K927192L274788L745283L992288
$$ plain form
3569 52258521 56754301 61954866 67749128 73767191 80158204 86792021 93553905 100002119
3561 100002119 106111540 111802762 117111961 121770660 126196235 130381723 134176446 137743075
3553 137743075 141038193 143817214 146293736 148246424 149655925 150454559 150370406 149552338 147906812
3544 147906812 145751651 143093967 140006589 136562479 132641354 128491899 124205689 119429410
3536 119429410 114540180 109275161 103886585 98214630 92711185 87311574 82005269 77003642
3528 77003642 72310486 68105970 64142609 60809205 57881984 55255806 52903499 50927798
3520 50927798 49209463 47595584 46181890 44877455 43742796 42717153 41815033 40687018
3512 40687018 39831918 39086503 38385999 37763977 37162461 36697130 36321277 36078415 35842389
$$ packed form
3569E2258521M495780N200565N794262O018063O391013O633817O761884O448214
3561A00002119O109421N691222N309199M658699M425575M185488L794723L566629
3553A37743075L295118K779021K476522J952688J409501P98634q4153q18068j645526
3544A47906812k155161k657684l087378l444110l921125m149455m286210m776279
3536A19429410m889230n265019n388576n671955n503445n399611n306305n001627
3528G7003642m693156m204516l963361l333404k927221k626178k352307j975701
3520E0927798j718335j613879j413694j304435j134659j025643r02120j128015
3512D0687018q55100p45415p00504o22022o01516m65331l75853k42862k36026
$$ plain form
3503 35842389 35645774 35468602 35336786 35396413 35459794 35705048 35852644 36098841 36504084 37111772
3493 37111772 37661200 38251896 39186340 39942610 40784880 41497377 41865473 41913431 41819102 41798092
3483 41798092 42197595 42633986 42837887 42144189 40458476 38675551 37166882 36037659 35147930
3474 35147930 34432861 33745189 33403696 33128100 32818646 32654487 32764889 33102275 33671168
3465 33671168 34096737 34813127 35702579 36748244 37951827 39194609 40026017 40646007 40817132
3456 40817132 41062919 41826151 42521458 43150479 43042275 42040772 40746324 39653340 38887523
3447 38887523 38438748 38213289 38308371 38514853 38835941 39375658 40133960 40943532 41917574 43075088
3437 43075088 44171711 45318990 46551031 47683559 48434454 48660078 48352266 47423828 46106683
$$ packed form
3503C5842389j96615j77172j31816N9627O3381K45254J47596K46197M05243O07688
3493C7111772N49428N90696R34444P56270Q42270P12497L68096M7958r4329k1010
3483D1798092L99503M36391K03901o93698j685713j782925j508669j129223q89729
3474C5147930p15069o87672l41493k75596l09454j64159J10402L37386N68893
3465C3671168M25569P16390Q89452J045665J203583J242782Q31408O19990J71125
3456D0817132K45787P63232O95307O29021j08204j001503j294448j092984p65817
3447C8887523m48775k25459R5082K06482L21088N39717P58302Q09572R74042J157514
3437D3075088J096623J147279J232041J132528P50895K25624l07812r28438j317145
$$ plain form
3428 46106683 44555994 43089496 41834444 40860762 40120047 39667831 39110545 38558627 38380191
3419 38380191 38586410 39029873 39493308 40233955 41421341 42859299 44614307 46460343 48576776
3410 48576776 50961455 53566920 56739401 60316586 64515471 69482457 74830855 80826303
3402 80826303 87295531 93675810 100031905 105905633 111047131 115377645 118270617 119741413
3394 119741413 119789671 118130751 114863494 110301439 104829426 98805878 92442571 86211663
3386 86211663 80210241 74636581 69539474 64835688 60714221 57036453 53699563 50922221
3378 50922221 48532662 46304156 44201079 42232421 40591516 39025852 37640552 36310782
3370 36310782 35194208 34260617 33182029 32260889 31519312 31056275 30601779 30396309 30583869
$$ packed form
3428D6106683j550689j466498j255052r73682p40715m52216n57286n51918j78436
3419C8380191K06219M43463M63435P40647J187386J437958J755008J846036K116433
3410D8576776K384679K605465L172481L577185M198885M966986N348398N995448
3402H0826303O469228O380279O356095N873728N141498M330514K892972J470796
3394A19741413M8258j658920l267257m562055n472013o023548o363307o230908
3386H6211663o001422n573660n097107m703786m121467l677768l336890k777342
3378E0922221k389559k228506k103077j968658j640905j565664j385300j329770
3370C6310782j116574r33591j078588r21140p41577m63037m54496k05470J87560
$$ plain form
3361 30583869 30904300 31222044 31153349 30417132 29073752 27650017 26616260 25691256 25080943
3352 25080943 24522757 24178551 24321582 24504713 24567789 24366941 23909719 23055426 22159321 21607800
3342 21607800 21099508 20764862 20728118 20719793 20763618 20799244 21200867 21671515 22414745 23400466
3332 23400466 23976617 24262515 23573261 22305112 21345517 20605760 19954942 19579967 19331742
3323 19331742 19206236 19268293 19444342 19440196 19060269 18163557 16952172 15929299 15005310 14367657
3313 14367657 13775930 13356698 12871767 12533814 12275947 12031922 11723209 11526578 11245945
3304 11245945 11015365 10902243 10653984 10468079 10133402 9982654 9809844 9695700 9594734
3295 9594734 9437804 9393024 9270862 9095561 8798732 8621512 8561018 8449299 8400483 8243406
$$ packed form
3361C0583869L20431L17744o8695p36217j343380j423735j033757r25004o10313
3352B5080943n58186l44206J43031J83131O3076k00848m57222q54293q96105n51521
3342B1607800n08292l34646l6744q325M3825L5626M01623M70648P43230R85721
3332B3400466N76151K85898o89254j268149r59595p39757o50818l74975k48225
3323A9331742j25506O2057J76049m146l79927q96712j211385j022873r23989o37653
3313A4367657n91727m19232m84931l37953k57867k44025l08713j96631k80633
3304A1245945k30580j13122k48259j85905l34677j50748j72810j14144j00966
3295I594734j56930m4780j22162j75301k96829j77220o0494j11719m8816j57077
$$ plain form
3285 8243406 8229173 8196396 8214567 8246853 8139910 8092569 8045595 8017824 8031123 8023189 7895191
3274 7895191 7771400 7852367 7867342 7811796 7821127 7797494 7782814 7822236 7766125 7676233 7671056 7706502
3262 7706502 7659517 7569001 7547069 7343307 7193324 7171750 7233914 7180634 7143555 7030479 7007818
3251 7007818 6996156 6900118 6728828 6789867 6856614 6783815 6746982 6696195 6741218 6942099 6996426
3240 6996426 6920735 7046410 7104427 6966888 6898711 6904800 6927347 7034071 7024825 6957354 6974056
3229 6974056 6844354 6740728 6756190 6722959 6632759 6588354 6658399 6686616 6682759 6706532 6728167
3218 6728167 6648673 6677901 6700346 6578249 6682421 6857226 6952117 6996192 6947674 7055319 7099087
3207 7099087 7164425 7396367 7505966 7562329 7845097 8002730 8083049 8296395 8413369 8469640
$$ packed form
3285H243406j4233l2777J8171L2286j06943m7341m6974k7771J3299p934j27998
3274G895191j23791Q0967J4975n5546R331k3633j4680L9422n6111q9892n177L5446
3262G706502m6985r0516k1932k03762j49983k1574O2164n3280l7079j13076k2661
3251G007818j1662r6038j71290O1039O6747p2799l6833n0787M5023K00881N4327
3240F996426p5691J25675N8017j37539o8177O089K2547J06724r246o7471J6702
3229F974056j29702j03626J5462l3231r0200m4405P0045K8217l857K3773K1635
3218F728167p9494K9228K2445j22097J04172J74805R4891M4075m8518J07645M3768
3207G099087O5338K31942J09599N6363K82768J57633Q0319K13346J16974N6271
$$ plain form
3197 8469640 8681623 8691277 8848432 8998657 9108817 9323491 9659326 9897540 10048979 10355017
3187 10355017 10667834 10939946 11165006 11392656 11699642 11959042 12167073 12532722 12959676
3178 12959676 13412087 13870802 14293282 14925016 15450753 15962570 16596046 17391287 18218342
3169 18218342 19129312 20146941 20976207 21837618 22909706 24092613 25165026 26496099 28010917
3160 28010917 29552739 31126984 32803853 34652085 36825424 38982883 41490809 44182793
3152 44182793 47167265 50572977 54218137 58725595 63880158 69749868 76593809 84457962
3144 84457962 93299964 103126366 113927607 126136188 139347601 154035675 171020404
3137 171020404 191019337 215494143 246083342 284195130 329265034 377973485 421019606
$$ packed form
3197H469640K11983R654J57155J50225J10160K14674L35835K38214J51439L06038
3187A0355017L12817K72112K25060K27650L06986K59400K08031L65649M26954
3178A2959676M52411M58715M22480O31734N25737N11817O33476P95241Q27055
3169A8218342R10970J017629Q29266Q61411J072088J182907J072413J331073J514818
3160B8010917J541822J574245J676869J848232K173339K157459K507926K691984
3152D4182793K984472L405712L645160M507458N154563N869710O843941P864153
3144H4457962Q842002R826402J0801241J2208581J3211413J4688074J6984729
3137A71020404J9998933K4474806L0589199L8111788M5069904M8708451M3046121
$$ plain form
3130 421019606 445771170 443344878 413825174 369023128 322847253 282348589 249158062
3123 249158062 222046302 200012790 182244175 167599123 155306034 144768952 135584116
3116 135584116 127505840 120590589 114457523 109276188 104740716 100716999 97015465 93774275
3108 93774275 91137655 88984601 87392035 86240859 85631356 85210191 85187547 84965981 84333740
3099 84333740 83081181 81285460 78715579 75930191 72984320 69682597 66252415 62900186
3091 62900186 59983335 57147043 54632160 52358173 50145822 48270353 46448732 45039776
3083 45039776 43618729 42317864 41096361 39959111 39120777 38059552 37372557 36720427 36228256
3074 36228256 35687951 35256133 35026851 34792815 34694557 34618668 34566841 34590911 34702516 34870298
$$ packed form
3130D21019606K4751564k426292k9519704m4802046m6175875m0498664l3190527
3123B49158062k7111760k2033512j7768615j4645052j2293089j0537082r184836
3116A35584116q078276o915251o133066n181335m535472m023717l701534l241190
3108I3774275k636620k153054j592566j151176o09503m21165k2644k21566o32241
3099H4333740j252559j795721k569881k785388k945871l301723l430182l352229
3091F2900186k916851k836292k514883k273987k212351j875469j821621j408956
3083D5039776j421047j300865j221503j137250q38334j061225o86995o52130m92171
3074C6228256n40305m31818k29282k34036r8258p5889n1827K4070J11605J67782
$$ plain form
3064 34870298 35085481 35225215 35114487 34689234 34013371 32872395 31412896 29853584 28534178
3055 28534178 27325499 26139736 25249943 24286318 23371462 22748144 21960470 21177493 20629365
3046 20629365 20106756 19764585 19421219 18828675 18322459 17959889 17606195 17087993 16671226
3037 16671226 16192853 15738876 15351908 15009012 14518671 14012883 13511826 12998625 12715540
3028 12715540 12417677 12013265 11784031 11427809 11237499 10985384 10701163 10519475 10443913 10457728
3018 10457728 10100041 9899696 9733220 9634129 9535469 9331833 9143568 9021297 8742335 8600781
3008 8600781 8402707 8279191 8185298 8024806 7648750 7617350 7478171 7320949 7218273 7039289
2998 7039289 6852352 6837204 6702672 6692270 6651458 6401182 6320867 6218554 6126778 6030595 5995065
$$ packed form
3064C4870298K15183J39734j10728m25253o75863j140976j459499j559312j319406
3055B8534178j208679j185763q89793r63625r14856o23318p87674p82977n48128
3046B0629365n22609l42171l43366n92544n06216l62570l53694n18202m16767
3037A6671226m78373m53977l86968l42896m90341n05788n01057n13201k83085
3028A2715540k97863m04412k29234l56222j90310k52115k84221j81688p5562J3815
3018A0457728l57687k00345j66476r9091r8660k03636j88265j22271k78962j41554
3008H600781j98074j23516r3893j60492l76056l1400j39179j57222j02676j78984
2998G039289j86937j5148j34532j0402m0812k50276q0315j02313r1776r6183l5530
$$ plain form
2987 5995065 5995594 5996936 5807594 5743937 5648411 5624356 5627949 5534528 5586128 5381200 5281867 5195050
2975 5195050 5025256 5106636 4966536 4861467 4845273 4745679 4717169 4573210 4423438 4356009
2965 4356009 4299823 4143120 4115989 4142165 4065566 4102712 4068552 4024514 3992492 3850240 3737423
2954 3737423 3732854 3642595 3609053 3617782 3684478 3626840 3630552 3490808 3541899 3407995 3433647 3445488
2942 3445488 3405524 3370098 3342055 3292751 3308091 3195739 3072893 3137967 3241724 2996113 2761213
2931 2761213 2836099 2863651 2900533 2821409 2785528 2744498 2786319 2725736 2743036 2725769 2693633
2920 2693633 2607616 2652584 2628880 2572835 2467594 2477200 2413611 2400525 2445137 2450956 2329653
2909 2329653 2242232 2361346 2384982 2355806 2331678 2371792 2338011 2124842 1966782 2017730 2223064
$$ packed form
2987E995065N29J342j89342o3657r5526k4055L593r3421N1600k04928r9333q6817
2975E195050j69794Q1380j40100j05069j6194r9594k8510j43959j49772o7429
2965D356009n6186j56703k7131K6176p6599L7146l4160m4038l2022j42252j12817
2954C737423m569r0259l3542Q729O6696n7638L712j39744N1091j33904K5652J1841
2942C445488l9964l5426k8043m9304J5340j12352j22846O5074J03757k45611k34900
2931B761213P4886K7552L6882p9124l5881m1030M1821o0583J7300j7267l2136
2920B693633q6017M4968k3704n6045j05241R606o3589j3086M4612N819j21303
2909B329653q7421J19114K3636k9176k4128M0114l3781k13169j58060N0948K05334
$$ plain form
2898 2223064 2206935 2201296 2217349 2184978 2221569 2107757 2073030 2018555 1926159 1948573 2059615
2887 2059615 2071845 2013328 1913103 1940022 2054619 1871715 1812605 1892009 1925557 1915343 1866335
2876 1866335 1945371 1925533 1908532 1847837 1779366 1854090 1925755 1890647 1874022 1781373 1770001
2865 1770001 1890823 1897247 1825831 1809783 1836462 1804802 1793131 1786232 1892360 2076634 2302478
2854 2302478 2334907 2336443 2324433 2383764 2546677 2687649 2805050 3132749 3336845 3403227 3390334
2843 3390334 3321381 3120514 2877035 2748063 2421630 2334001 2288442 2352790 2176236 2014810
2833 2014810 2045082 1983491 1909404 1915493 1824539 1821837 1728862 1681766 1651605 1547478 1565936 1573538
2821 1573538 1542399 1569555 1684246 1665494 1563294 1527160 1600767 1664062 1505623 1536166 1628057
$$ packed form
2898B223064j6129n639J6053l2371L6591j13812l4727n4475r2396K2414J11042
2887B059615J2230n8517j00225K6919J14597j82904n9110P9404L3548j0214m9008
2876A866335P9036j9838j7001o0695o8471P4724P1665l5108j6625r2649j1372
2865A770001J20822O424p1416j6048K6679l1660j1671o899J06128J84274K25844
2854B302478L2429J536j2010N9331J62913J40972J17401L27699K04096O6382j2893
2843C390334o8953k00867k43479j28972l26433q7629m5559O4348j76554j61426
2833B014810L0272o1591p4087O089r0954k702r2975m7096l0161j04127J8458P602
2821A573538l1139K7156J14691j8752j02200l6134P3607O3295j58439L0543R1891
$$ plain form
2810 1628057 1403033 1222390 1194341 1298096 1327171 1342289 1382914 1322888 1293505 1324977 1453068
2799 1453068 1407874 1338265 1270377 1257402 1303482 1198654 1055943 1136668 1101883 1120848 1285474
2788 1285474 1147955 980277 968337 1056534 1033513 1048792 933286 992418 1020637 944979 982646
2777 982646 953910 1121162 1128295 920751 1014852 947778 961063 926292 885063 886533 816404 821899
2765 821899 930668 1044858 922261 849426 854376 909300 840416 830668 954734 910222 900060
2754 900060 904906 1039277 920327 782254 842981 863913 871283 820553 904888 935406 839602
2743 839602 887307 888833 943210 809088 845609 878104 780553 809743 1045850 980700 794957
2732 794957 813408 619254 691979 676513 620913 739401 729993 788935 807709 889358 708828
$$ packed form
2810A628057k25024j80643k8049J03755K9075J5118M0625o0026k9383L1472J28091
2799A453068m5194o9609o7888j2975M6080j04828j42711Q0725l4785J8965J64626
2788A285474j37519j67678j1940Q8197k3021J5279j15506N9132K8219p5658L7667
2777I82646k8736J67252P133k07544R4101o7074J3285l4771m1229J470p0129N495
2765H21899J08769J14190j22597p2835M950N4924o8884r748J24066m4512j0162
2754I00060M846J34371j18950j38073O0727K0932P370n0730Q4335L0518r5804
2743H39602M7705J526N4377j34122L6521L2495r7551K9190K36107o5150j85743
2732G94957J8451j94154P2725j5466n5600J18488r408N8942J8774Q1649j80530
$$ plain form
2721 708828 688421 724138 686043 742871 804028 789655 684606 835954 780669 835430 861771
2710 861771 814512 724606 780396 548924 632246 714304 738607 731534 711963 822566 656484
2699 656484 539114 595694 601776 609887 518361 540598 639046 620364 538361 465382 628338 565115
2687 565115 463180 497479 651243 655881 527086 465673 582976 681023 668619 509491 544980
2676 544980 484990 481028 513209 418457 396231 458066 529943 541040 550590 554032 574896 591022
2664 591022 562057 498696 538365 452777 436779 414718 477093 400230 434207 337796 354659 429555
2652 429555 405282 274423 401329 416360 488943 447328 522671 557680 448284 293652 224967
2641 224967 315397 282721 425921 517943 421930 375651 316003 246543 369495 421117 392069
$$ packed form
2721G08828k0407L5717l8095N6828O1157j4373j05049J51348n5285N4761K6341
2710H61771m7259q9906N5790k31472Q3322Q2058K4303p073j9571J10603j66082
2699F56484j17370N6580O082Q111r1526K2237R8448j8682q2003p2979J62956o3223
2687E65115j01935L4299J53764M638j28795o1413J17303R8047j2404j59128L5489
2676E44980n9990l962L2181r4752k2226O1835P1877J1097R550L442K0864J6126
2664E91022k8965o3361L9669q5588j5998k2061O2375p6863L3977r6411J6863P4896
2652D29555k4273j30859J26906J5031P2583m1615P5343L5009j09396j54632o8685
2641B24967R0430l2676J43200R2022r6013m6279n9648o9460J22952N1622k9048
$$ plain form
2630 392069 396163 348484 124149 182591 272062 400207 393469 349935 322790 271289 354959 433295
2618 433295 333898 364979 327530 316938 485832 424387 420639 392988 329702 284553 239166 403776
2606 403776 260392 380788 400148 274332 400375 405447 309151 388408 375263 353130 266496
2595 266496 173577 300999 367717 301362 195472 159661 284094 318176 350581 268996 267119
2584 267119 249829 282934 272525 345470 422143 372039 396746 374102 312032 367791 326874 333196
2572 333196 313625 251031 229027 254972 344371 386052 425245 364251 356988 473374 507310 423424
2560 423424 465505 525879 559193 529116 542009 447754 455146 495998 355843 404058 409244 400202
2548 400202 356874 263581 264784 203308 268375 328166 363301 365137 412173 299633 322647 294457
$$ packed form
2630C92069M094m7679k24335N8442Q9471J28145o738m3534k7145n1501Q3670P8336
2618D33295r9397L1081l7449j0592J68894o1445l748k7651o3286m5149m5387J64610
2606D03776j43384J20396J9360j25816J26043N072r6296P9257j3145k2133q6634
2595B66496r2919J27422O6718o6355j05890l5811J24433L4082L2405q1585j877
2584B67119j7290L3105j0409P2945P6673n0104K4707k2644o2070N5759m0917O322
2572C33196j9571o2594k2004K5945Q9399M1681L9193o0994p263J16386L3936q3886
2560D23424M2081O0374L3314l0077J2893r4255P392M0852j40155M8215N186r042
2548D00202m3328r3293J203o1476O5067N9791L5135J836M7036j12540K3014k8190
$$ plain form
2536 294457 326957 424236 419829 372297 426813 352015 235264 210937 268219 378174 388886
2525 388886 415716 391313 312359 200901 309414 361839 336392 244991 161937 129762 214778
2514 214778 193033 170336 246085 320050 240354 329119 311949 147773 210160 244283 315785
2503 315785 267137 268736 94342 151072 155516 261225 234426 147750 98883 106058 259763 162557
2491 162557 282788 289457 391183 363001 184566 308943 290713 394004 383393 271155 196884
2480 196884 252167 257344 237478 283658 269974 325211 392709 323040 271988 362588 503469 459438
2468 459438 318969 273611 295714 242356 273917 379875 334660 338211 392650 325494 214323
2457 214323 319250 334129 242884 311473 309095 253084 359164 388758 228963 248720 313422
$$ packed form
2536B94457L2500R7279m407m7532N4516p4798j16751k4327N7282J09955J0712
2525C88886K6830k4403p8954j11458J08513N2425k5447r1401q3054l2175Q5016
2514B14778k1745k2697P5749P3965p9696Q8765j7170j64176O2387L4123P1502
2503C15785m8648J599j74394N6730M444J05709k6799q6676m8867P175J53705r7206
2491A62557J20231O669J01726k8182j78435J24377j8230J03291j0611j12238p4271
2480A96884N5283N177j9866M6180j3684N5237O7498o9669n1052R0600J40881m4031
2468D59438j40469m5358K2103n3358L1561J05958m5215L551N4439o7156j11171
2457B14323J04927J4879r1245O8589k378n6011J06080K9594j59795J9757O4702
$$ plain form
2446 313422 218626 63513 92650 129295 299969 255602 164383 31280 98505 388763 536721
2435 536721 400619 343688 264244 351846 504138 473628 454088 390276 351166 396567 401712
2424 401712 290817 235322 282612 464268 387109 156601 104441 359247 319845 452383 329546
2413 329546 249236 335239 309382 301101 441356 471793 609706 462734 462490 586804 505073
2402 505073 532239 535877 451376 529357 470155 452700 423569 514235 479762 489342 427378 456396
2390 456396 433671 597931 723247 606418 634693 702285 724160 718306 608336 670414 727956
2379 727956 796570 835137 758923 833742 724709 767747 919360 977003 1026841 1132241 1030951
2368 1030951 1043014 1294523 1332688 1407013 1603364 1737252 1944797 2157729 2375512 2448012
$$ packed form
2446C13422r4796j55113K9137L6645J70674m4367r1219j33103O7225K90258J47958
2435E36721j36102n6931p9444Q7602J52292l0510j9540o3812l9110M5401N145
2424D01712j10895n5495M7290J81656p7159k30508n2160K54806l9402J32538j22837
2413C29546q0310Q6003k5857q281J40255L0437J37913j46972k44J24314q1731
2402E05073K7166L638q4501P7981n9202j7455k9131R0666l4473R580o1964K9018
2390D56396k2725J64260J25316j16829K8275O7592K1875n854j09970O2078N7542
2379G27956O8614L8567p6214P4819j09033M3038J51613N7643M9838J05400j01290
2368A030951J2063K51509L8165P4325J96351J33888K07545K12932K17783P2500
$$ plain form
2358 2448012 2366830 2204430 2029140 1872674 1720679 1546962 1440124 1311038 1253047 1294952
2348 1294952 1496105 1290398 1293236 1273088 1325968 1347497 1270923 1211417 1360183 1350475 1379270
2337 1379270 1452809 1480278 1455103 1414641 1448719 1507904 1645217 1678715 1689719 1715163 1773355
2326 1773355 2020673 2334750 2433639 2456037 2607814 2800348 3037112 3094655 3306937 3425101
2316 3425101 3642754 4082290 4416251 4802525 5470927 6200488 6983285 7751096 8431702 9049035
2306 9049035 9691658 10618866 11793687 13223638 15013894 16955064 19358830 22766128 27533610
2297 27533610 33917626 42336803 49698658 52871931 49285975 40053046 32222540 26662829
2289 26662829 22847444 19869763 17437704 15394434 13764393 12598738 11682364 11019854
$$ packed form
2358B448012q1182j62400j75290j56466j51995j73717j06838j29086n7991M1905
2348A294952K01153k05707K838k0148N2880K1529p6574n9506J48766r708K8795
2337A379270P3539K7469k5175m0462L4078N9185J37313L3498J1004K5444N8192
2326A773355K47318L14077R8889K2398J51777J92534K36764N7543K12282J18164
2316C425101K17653M39536L33961L86274O68402P29561P82797P67811O80606O17333
2306I049035O42623R27208J174821J429951J790256J941170K403766L407298M767482
2297B7533610O384016Q419177P361855L173273l585956r232929p830506n559711
2289B6662829l815385k977681k432059k043270j630041j165655r16374o62510
$$ plain form
2281 11019854 10327051 9803293 9454522 8918600 8205395 7492892 6811411 6239527 5797864
2272 5797864 5444001 4979868 4731015 4560005 4310640 4093555 3902710 3670476 3364837 3143195
2262 3143195 3156239 3036649 2956948 2838161 2799130 2722431 2671453 2541274 2370058 2349778 2230997
2251 2230997 2107959 1851444 1892203 1931330 1777573 1832065 1825848 1725410 1597363 1564030 1469839
2240 1469839 1355333 1379454 1287505 1308539 1274497 1278867 1196308 1230617 1152376 1006338 1105345
2229 1105345 1165508 1146460 1201869 1174463 1089144 1091182 1033724 943158 1025521 1143596 1122961
2218 1122961 1048081 875045 903880 921345 965961 908756 806065 738400 745004 879658 756121
2207 756121 760043 817715 833823 659192 762361 916029 829471 822626 861130 761871 590528
$$ packed form
2281A1019854o92803n23758l48771n35922p13205p12503o81481n71884m41663
2272E797864l53863m64133k48853j71010k49365k17085j90845k32234l05639k21642
2262C143195J3044j19590p9701j18787l9031p6699n0978j30179j71216k0280j18781
2251B230997j23038k56515M0759L9127j53757N4492o217j00438j28047l3333r4191
2240A469839j14506K4121r1949K1034l4042M370q2559L4309p8241j46038R9007
2229A105345O0163j9048N5409k7406q5319K038n7458r0566Q2363J18075k0635
2218A122961p4880j73036K8835J7465M4616n7205j02691o7665O604J34654j23537
2207G56121L922N7672J6108j74631J03169J53668q6558o845L8504r9259j71343
$$ plain form
2196 590528 514137 551049 579071 584593 579422 587474 504164 460573 642471 525827 488007 528781
2184 528781 501025 486120 414890 474821 521688 498063 432010 490620 616753 564344 419449
2173 419449 470051 537760 365630 423861 542845 452630 444657 375322 303800 316514 361917
2162 361917 373588 296005 375496 352457 422686 579230 501761 342072 374713 360248 430484
2151 430484 516139 487079 404985 298845 446165 298107 235774 249118 294010 483731 474142
2140 474142 448702 263712 240669 268130 305186 375915 374136 299526 209448 260917 409004
2129 409004 405016 277808 288454 323323 357099 339338 322791 236434 275052 379518 276313
2118 276313 197360 227372 316778 330091 351766 358341 379172 246940 223356 222389 134687 153257
$$ packed form
2196E90528p6391L6912K8022N522n171Q052q3310m3591J81898j16644l7820M0774
2184E28781k7756j4905p1230N9931M6867k3625o6053N8610J26133n2409j44895
2173D19449N0602O7709j72130N8231J18984r0215p973o9335p1522J2714M5403
2162C61917J1671p7583P9491k3039P0229J56544p7469j59689L2641j4465P0236
2151D30484Q5655k9060q2094j06140J47320j48058o2333J3344M4892J89721r589
2140D74142k5440j84990k3043K7461L7056P0729j779p4610r0078N1469J48087
2129D09004l988j27208J0646L4869L3776j7761j6547q6357L8618J04466j03205
2118B76313p8953L0012Q9406J3313K1675O575K0831j32232k3584r67q7702J8570
$$ plain form
2106 153257 62844 19933 198541 332899 239745 266329 297257 273758 310102 388816 273751
2095 273751 61258 81819 173755 159936 223177 293366 215804 256679 173251 344407 303318
2084 303318 175440 182226 157211 287516 255917 287409 298519 273998 362387 177555 191283
2073 191283 255922 355723 395138 399670 315961 217257 132134 191176 269822 160159 262649
2062 262649 223000 257556 225198 188667 307318 278201 287006 318672 276830 330452 386905 277388
2050 277388 202600 340306 384065 317946 246673 230249 260359 249690 188686 210946 107367
2039 107367 157602 202490 132945 139979 136967 176859 164762 244959 298710 206908 280242 459840
2027 459840 382117 356381 363853 338495 479450 337911 309248 394911 269893 264261 269270 188698
$$ packed form
2106A53257r0413m2911J78608J34358r3154K6584L0928k3499L6344P8714j15065
2095B73751k12493K0561R1936j3819O3241P0189p7562M0875q3428J71156m1089
2084C03318j27878O786k5015J30305l1599L1492J1110k4521Q8389j84832J3728
2073A91283O4639R9801L9415M532q3709r8704q5123N9042P8646j09663J02490
2062B62649l9649L4556l2358l6531J18651k9117Q805L1666m1842N3622N6453j09517
2050B77388p4788J37706M3759o6119p1273j6424L0110j0669o1004K2260j03579
2039A07367N0235M4888o9545P034l012L9892j2097Q0197N3751r1802P3334J79598
2027D59840p7723k5736P472k5358J40955j41539k8663Q5663j25018n632N009q0572
$$ plain form
2015 188698 168975 73432 116459 175743 265862 193136 160653 178787 93688 14407 94277 177280
2003 177280 158954 179005 219520 167951 174356 64065 -107588 -55847 101115 111262 137283
1992 137283 103769 46109 22062 38747 55590 106054 80824 35551 29111 134962 166482 141681
1980 141681 107376 76304 16732 167769 55060 4985 149215 231078 226381 78476 39412
1969 39412 -26086 -43306 -65243 91595 131769 34819 59272 16921 -30868 21222 31105 63428
1957 63428 117766 182052 206930 84708 39462 182667 31206 154472 284872 126667 -25473
1946 -25473 37147 146917 58200 -45915 111906 3281 3080 93622 99090 226077 208538
1935 208538 13100 21014 11919 50157 98226 192821 84290 59963 -19757 -51365 -9213 8135
$$ packed form
2015A88698j9723r5543M3027N9284R0119p2726l2483J8134q5099p9281P9870Q3003
2003A77280j8326K0051M0515n1569O405j10291j71653N1741J56962J0147K6021
1992A37283l3514n7660k4047J6685J6843N0464k5230m5273o440J05851L1520k4801
1980A41681l4305l1072n9572J51037j12709n0075J44230Q1863m697j47905l9064
1969C9412o5498j7220k1937J56838M0174r6950K4453m2351m7789N2090R883L2323
1957F3428N4338O4286K4878j22222m5246J43205j51461J23266J30400j58205j52140
1946b5473O2620J09770q8717j04115J57821j08625k01R0542N468J26987j7539
1935B08538j95438P914r095L8238M8069R4595j08531k4327p9720l1608M2152J7348
$$ plain form
1923 8135 78986 357402 284589 69990 -10269 31024 175408 165547 82714 -29244 11867
1912 11867 128616 -11035 50198 50617 37483 179234 91582 121899 23627 -30641 22537 91363
1900 91363 222495 240267 262548 322380 279504 113043 89899 147703 162860 -27665 -94594
1889 -94594 -79097 -59782 97164 98386 41717 -94475 -112327 -67649 123995 162126 119438
1878 119438 35090 156028 203373 182118 136498 127576 -4066 77525 126148 218130 197229
1867 197229 99500 -24038 -91932 -109065 -54128 -41803 -4898 47171 83616 -6552 -18573
1856 -18573 185394 64507 -31775 24832 44465 -60849 20296 47860 -144544 17804 82955
1845 82955 -4346 72025 82598 69482 49300 163980 115799 -98861 81974 140139 98290
$$ packed form
1923H135P0851K78416p2813k14599q0259M1293J44384r861q2833j11958M1111
1912A1867J16749j39651O1233M19j3134J41751q7652L0317r8272n4268N3178O8826
1900I1363J31132J7772K2281N9832m2876j66461k3144N7804J5157j90525o6929
1889i4594J5497J9315J56946J222n6669j36192j7852M4678J91644L8131m2688
1878A19438q4348J20938M7345k1255m5620q922j31642Q1591M8623R1982k0901
1867A97229r7729j23538o7894j7133N4937J2325L6905N2069L6445r0168j2021
1856a8573K03967j20887r6282N6607J9633j05314Q1145K7564j92404J62348O5151
1845H2955q7301P6371J0573j3116k0182J14680m8181k14660J80835N8165m1849
$$ plain form
1834 98290 55228 25606 88574 30726 84049 130072 172837 208281 71916 70636 42498 57408
1822 57408 43301 52600 202807 243346 137348 30039 45779 20340 -13394 -71087 -87960
1811 -87960 44352 40348 52019 116829 132263 147224 -25584 -34436 43712 115160 55112 -11889
1799 -11889 -29570 63792 125468 136278 188046 240474 70786 85521 146215 43835 33617
1788 33617 118936 178058 92530 6003 41647 58791 41859 -112678 -238493 -129613 12666
1777 12666 56619 106243 205385 190414 167389 85623 105256 199013 31354 48569 111230 48634
1765 48634 -115228 -97889 21501 -5465 61018 55212 25542 -28420 -19420 -12817 -29387 -135980
1753 -135980 -127768 35421 58098 117629 68081 61752 -2424 -3594 142927 74314 -24863 -147737
$$ packed form
1834I8290m3062k9622O2968n7848N3323M6023M2765L5444j36365j280k8138J4910
1822E7408j4107R299J50207M0539j05998j07309J5740k5439l3734n7693j6873
1811h7960J32312m004J1671O4810J5434J4961j72808q852P8148P1448o0048o7001
1799a1889j7681R3362O1676J0810N1768N2428j69688J4735O0694j02380j0218
1788C3617Q5319N9122q5528q6527L5644J7144j6932j54537j25815J08880J42279
1777A2666M3953M9624R9142j4971k3025q1766J9633R3757j67659J7215O2661o2596
1765D8634j63862J7339J19390k6966O6483n806k9670n3962R000O603j6570j06593
1753a35980Q212J63189K2677N9531m9548o329o4176j170J46521o8613r9177j22874
$$ plain form
1741 -147737 -129562 -35349 -26173 -35319 -64517 -121889 -103725 -110824 -10169 60853 -68552 -83455
1729 -83455 -141114 -109968 -21679 -44843 -77970 30313 84955 121302 23177 37309 120525 23807
1717 23807 66706 85863 39350 -9997 73883 83465 67831 71985 88880 60908 -46466 43431
1705 43431 -60654 -13675 74960 41888 43703 -68226 14066 25735 23555 -78554 28838
1694 28838 122796 -85852 -67603 -127162 -60611 -117763 29857 58612 -80804 -50117 -119227
1683 -119227 -95252 13236 200599 144365 -53655 -89892 -57981 -49342 -67503 -10456 -9394
1672 -9394 -16608 36175 -94501 -203319 -130729 23650 -33870 -60737 53393 -34273 -121300
1661 -121300 -65750 -112777 8638 21021 3160 14120 41183 -35803 -57309 -25482 -22696 -103109
$$ packed form
1741a47737J8175R4213R176r146k9198n7372J8164p099J00655P1022j29405j4903
1729h3455n7659L1146Q8289k3164l3127J08283N4642L6347r8125J4132Q3216r6718
1717B3807M2899J9157m6513m9347Q3880R582j5634M154J6895k7972j07374Q9897
1705D3431j04085M6979Q8635l3072J815j11929Q2292J1669k180j02109J07392
1694B8838R3958k08648J8249n9559O6551n7152J47620K8755j39416L0687o9110
1683a19227K3975J08488J87363n6234j98020l6237L1911Q639j8161N7047J062
1672i394p214N2783j30676j08818P2590J54379n7520k6867J14130q7666q7027
1661a21300N5550m7027J21415J2383j7861J0960K7063p6986k1506L1827K786q0413
$$ plain form
1649 -103109 -4252 149273 -3479 -38908 -55571 -20496 157823 112639 87235 -4930 -13475
1638 -13475 160717 136442 14793 37142 -33002 -20181 73638 109335 -17775 -78930 -22147
1627 -22147 -46200 -150957 -81492 -79439 -112485 -98838 -143724 -100538 -140280 -170993 -72696 -89870
1615 -89870 -128579 -129555 -141184 130085 109628 -117425 -60266 3446 -87918 -146967 -96599 -23482
1603 -23482 4924 57945 74771 -178913 -115323 11355 5569 40804 -78578 -123474 -174762
1592 -174762 -120279 -63394 -37208 18208 85403 121158 88542 2375 132179 44499 23880
1581 23880 -51738 -20926 63162 80321 -42746 -20998 -99526 -43608 3545 -4502 110354 56426
1569 56426 -95265 -85964 142251 190385 84631 12762 44741 -11204 -19287 72341 42718 16244
$$ packed form
1649a03109R8857J53525j52752l5429j6663L5075J78319m5184k5404r2165q545
1638a3475J74192k4275j21649K2349p0144J2821R3819L5697j27110o1155N6783
1627b2147k4053j04757O9465K053l3046J3647m4886M3186l9742l0713R8297j7174
1615h9870l8709r76j1629K71269k0457k27053N7159O3712r1364n9049N0368P3117
1603b3482K8406N3021J6826k53684O3590J26678n786L5235j19382m4896n1288
1592a74762N4483N6885K6186N5416O7195L5755l2616q6167J29804q7680k0619
1581B3880p5618L0812Q4088J7159j23067K1748p8528N5918M7153q047J14856n3928
1569E6426j51691R301K28215M8134j05754p1869L1979n5945q083R1628k9623k6474
$$ plain form
1557 16244 147582 140690 -25109 -28648 19160 41178 -36837 -77799 -117743 -39028 -2307 -120074
1545 -120074 -70447 36018 -8634 -53269 -14288 -33723 -129769 -2552 85222 -12187 -32046
1534 -32046 -13084 -69299 -100297 37103 9969 100389 -19176 -164989 -30921 68326 -50946
1523 -50946 -22583 94107 147632 129932 129461 56248 114523 302309 245507 99771 -51788
1512 -51788 -110379 -104798 -94612 20322 -42005 -64101 -107636 -94022 117818 97714 7161 102230
1500 102230 -70137 -108292 -7930 49614 108691 113407 -67196 -20152 9476 -21669 -42105
1489 -42105 -69671 -146541 -79562 -26689 -176669 -147085 -149961 -133384 -35916 17897 -39574 -34191
1477 -34191 -74002 -31846 -10133 65185 124767 82633 63694 32548 -44592 49459 10238 23051
$$ packed form
1557A6244J31338o892j65799l539M7808K2018p8015m0962l9944P8715L6721j17767
1545a20074M9627J06465m4652m4635L8981j9435r6046J27217Q7774r7409j9859
1534c2046J8962n6215l0998J37400k7134R0420j19565j45813J34068R9247j19272
1523e0946K8363J16690N3525j7700m71p3213N8275J87786n6802j45736j51559
1512e1788n8591N581J0186J14934o2327k2096m3535J3614K11840k0104r0553R5069
1500A02230j72367l8155J00362N7544N9077M716j80603M7044K9628l1145k0436
1489d2105k7566p6870O6979N2873j49980K9584k876J6577R7468N3813n7471N383
1477c4191l9811M2156K1713P5318N9582m2134j8939l1146p7140R4051l9221J2813
$$ plain form
1465 23051 40930 -40430 -152113 -146857 61754 102327 71684 -10100 -10829 12608 -85415 -36217
1453 -36217 11360 -24037 -31658 34861 66785 80635 98499 88127 48154 69939 54591 80216
1441 80216 103958 126309 96333 98900 158865 176673 49477 23613 -27356 -133121 -109601 -98060
1429 -98060 -96028 -116340 -29592 75645 100138 3682 40128 33378 15770 59292 126129 121539
1417 121539 64510 51820 1629 -1592 88604 18652 -90921 77422 45565 -33645 -78844
1406 -78844 -119016 37276 -30409 -108856 28130 100521 -15170 -136121 -97158 -92321 -12433
1395 -12433 61725 136391 74214 49212 18420 -147553 -120034 -38502 -88118 -154630 -42321
1384 -42321 37391 36671 -59394 -34105 98730 154251 134043 223651 177056 205166 47674 22074
$$ packed form
1465B3051J7879q1360j11683N256K08611M0573l0643q1784p29K3437r8023M9198
1453c6217M7577l5397p621O6519L1924J3850J7864j0372l9973K1785j5348K5625
1441H0216K3742K2351k9976K567N9965J7808j27196k5864n0969j05765K3520J1541
1429i8060K032k0312Q6748J05237K4493r6456L6446o750j7608M3522O6837m590
1417A21539n7029j2690n0191l221R0196o9952j09573J68343l1857p9210m5199
1406g8844m0172J56292o7685p8447J36986P2391j15691j20951L8963M837P9888
1395a2433P4158P4666o2177k5002l0792j65973K7519Q1532m9616o6512J12309
1384d2321P9712p20r6065K5289J32835N5521k0208Q9608m6595K8110j57492k5600
$$ plain form
1372 22074 69153 140416 215147 132527 47752 121737 157602 -36750 -92006 10510 41896
1361 41896 94322 24577 -134233 -18231 -3444 29269 109516 103666 54816 144359 47731 -63591
1349 -63591 36382 53870 102954 57234 -32745 29736 -55247 -1970 -52208 -105938 -49110 -44546
1337 -44546 -217 -21804 -142313 -100414 -28561 113923 85025 -68041 -38063 -73374 18022
1326 18022 188127 107693 91668 21002 -63776 -41438 -81559 10588 59482 179895 201207
1315 201207 157390 222656 222161 254130 228951 128681 36447 123937 153592 142184 130461 38061
1303 38061 -45935 13224 83621 117244 71578 125649 127092 33784 98490 -13055 107907 133409
1291 133409 -25037 7845 19754 42578 71821 8505 125181 26167 -131122 42783 28267
$$ packed form
1372B2074M7079P1263P4731q2620q4775P3985L5865j94352n5256J02516L1386
1361D1896N2426o9745j58810J16002J4787L2713Q0247n850m8850Q9543r6628j11322
1349f3591R9973J7488M9084m5720q9979O2481q4983N3277n0238n3730N6828M564
1337d4546M4329k1587j20509M1899P1853J42484k8898j53066K9978l5311R1396
1326A8022J70105q0434j6025p0666q4778K2338m0121R2147M8894J20413K1312
1315B01207m3817O5266m95L1969k5179j00270r2234Q7490K9655j1408j1723r2400
1303C8061q3996N9159P0397L3623m5666N4071J443r3308O4706j11545J20962K5502
1291A33409j58446L2882J1909K2824K9243o3316J16676r9014j57289J73905j4516
$$ plain form
1280 28267 150038 290987 217527 18699 -823 7050 -209107 -120887 -81451 821 -53598
1269 -53598 -19487 -3568 -163804 -165995 -156139 -115967 -167790 -10448 16498 52387 101082 86003
1257 86003 165800 71881 -80878 -160268 72089 84005 81863 42969 -86573 -6139 -1462 31644
1245 31644 148449 72825 104775 82789 134381 110195 -17293 12174 74085 -5580 -5945 49954
1233 49954 48307 129618 175668 125356 53054 -25005 -17025 90051 10808 16822 -47635 23627
1221 23627 172948 164618 109141 91265 24484 -36609 -88560 -171359 -128745 -18763 -98350 -103866
1209 -103866 -60254 14484 18280 15363 -11204 -41694 -103554 -135716 -88218 -99903 -179575 -198711
1197 -198711 59116 176952 72071 42482 -9321 97321 111766 -16658 -147185 -162907
$$ packed form
1280B8267J21771J40949p3460j98828j9522P873k16157Q8220L9436Q2272n4419
1269e3598L4111J5919j60236k191R856M0172n1823J57342K6946L5889M8695j5079
1257H6003P9797r3919j52759p9390K32357J1916k142l8894j29542Q0434M677L3106
1245C1644J16805p5624L1950k1986N1592k4186j27488K9467O1911p9665l65N5899
1233D9954j647Q1311M6050n0312p2302p8059P980J07076p9243O014o4457P1262
1221B3627J49321q330n5477j7876o6781o1093n1951q2799M2614J09982p9587n516
1209a03866M3612P4738L796k917k6567l0490o1860l2162M7498j1685p9672j9136
1197a98711K57827J17836j04881k9589n1803J06642J4445j28424j30527j5722
$$ plain form
1187 -162907 -39125 34720 -23934 -80583 -21777 24985 127038 59572 90454 28224 23946
1176 23946 51324 26960 -165251 -116857 -97690 -170518 30313 -2836 24166 -42709 -74228
1165 -74228 121926 131451 15612 -77402 13345 11580 -35023 -21958 -7401 55100 -30169 -165029
1153 -165029 -112921 29385 -38669 -81466 -151496 -119519 -62955 -134868 -15754 46987 -140930
1142 -140930 -106057 -34206 3298 -1706 -6293 18944 156437 42597 -140145 -44499 -99977
1131 -99977 8280 31450 1673 -59769 -129918 -165684 -81849 -48833 -148630 -68307 71924
1120 71924 110149 149706 98172 -49975 15669 91604 40099 -120375 -101183 -91977 -17487 -52907
1108 -52907 -114778 -66126 -103167 -107207 -85691 -14684 -32974 -109417 64176 30299 20661 73912
$$ packed form
1187a62907J23782P3845n8654n6649N8806M6762J02053o7466L0882o2230m278
1176B3946K7378k4364j92211M8394J9167p2828K00831l3149K7002o6875l1519
1165g4228J96154R525j15839r3014R0747j765m6603J3065J4557O2501q5269j34860
1153a65029N2108J42306o8054m2797p0030L1977N6564p1913J19114O2741j87917
1142a40930L4873P1851L7504n004m587K5237J37493j13840j82742R5646n5478
1131i9977J08257K3170k9777o1442p0149l5766Q3835L3016r9797Q0323J40231
1120G1924L8225L9557n1534j48147O5644P5935n1505j60474J9192R206P4490l5420
1108e2907o1871M8652l7041m040K1516P1007j8290p6443J73593l3877r638N3251
$$ plain form
1096 73912 20132 -8382 14925 62954 51664 -98 -529 28165 -23361 -23138 -150735 -113834
1084 -113834 977 37081 -18491 74141 -40395 -79436 16330 4535 -27205 -21561 -24317 -68281
1072 -68281 -230211 -171083 50554 6659 -97276 87113 185471 134468 241074 79528 -15084
1061 -15084 -15721 38928 73650 76354 235555 181205 23783 -89976 83584 75434 -45462 52824
1049 52824 88884 -6224 -94134 -17775 -31406 20449 74671 140669 12616 -115325 -140793
1038 -140793 20749 4683 106227 -22772 -55113 47072 -87714 67110 4426 52414
1028 52414 112301 -51573 -13076 -56847 -103510 -26634 -58300 -62734 81337 98244 -35481
1017 -35481 -5563 24628 34248 -18875 -99460 36782 140460 56988 -127724 -96457 44115
$$ packed form
1096G3912n3780k8514K3307M8029j1290n1762m31K8694n1526K23j27597L6901
1084a13834J14811L6104n5572R2632j14536l9041R5766j1795l1740N644k756m3964
1072f8281j61930N9128K21637m3895j03935J84389R8358n1003J06606j61546r4612
1061a5084o37N4649L4722K704J59201n4350j57422j13759J73560q150j20896R8286
1049E2824L6060r5108q7910P6359j3631N1855N4222O5998j28053j27941k5468
1038a40793J61542j6066J01544j28999l2341J02185j34786J54824o2684M7988
1028E2414N9887j63874L8497m3771m6663P6876l1666m434J44071J6907j33725
1017c5481K9918L0191R620n3123q0585J36242J03678q3472j84712L1267J40572
$$ plain form
1006 44115 154 24332 -55956 -9154 -5338 -72991 -52784 133842 51806 -200763 -246496 -243900
994 -243900 -189292 -131591 -62857 99431 16882 29626 258545 212394 -82403 -82926 -168215 -90880
982 -90880 63808 30644 99447 47044 66104 -103822 43481 221327 57618 71769 31107
971 31107 38752 106741 13304 -68709 -147582 -61376 25429 36266 -9984 158752 140793 13102
959 13102 101330 71625 103374 229810 127039 -55745 -71691 -50428 -71470 -91577 -8184
948 -8184 9388 5897 -5717 51724 135497 84651 76063 -50257 73401 79694 -8079 59443
936 59443 79874 80435 57144 34525 49828 8589 -80610 -98890 -56221 -84642 -179955 -88872
924 -88872 -108572 -60494 -133865 -127290 6318 -34198 8513 4252 -28601 -63120 -26078 36425
$$ packed form
1006D4115m3961K4178q0288M6802L816o7653K0207J86626q2036k52569m5733K596
994b43900N4608N7701O8734J62288q2549J2744K28919m6151k94797n23q5289P7335
982i0880J54688l3164O8803n2403J9060j69926J47303J77846j63709J4151m0662
971C1107P645O7989r3437q2013p8873Q6206Q6805J0837m6250J68736j7959j27691
959A3102Q8228k9705L1749J26436j02771j82784j5946K1263k1042k0107Q3393
948h184J7572l491j1614N7441Q3773n0846q588j26320J23658O293q7773O7522
936E9443K0431N61k3291k2619J5303m1239q9199j8280M2669k8421r5313R1083
924h8872j9700M8078p3371O575J33608m0516M2711m261l2853l4519L7042O2503
$$ plain form
912 36425 -57880 -19656 -31377 -96223 14109 -53067 -76724 35137 113897 148154 87451 227492
900 227492 209601 51389 85627 42253 -41850 -19035 43955 73649 121989 87873 149711 94042
888 94042 20410 88071 -70903 -21617 -73844 -34457 -88287 -103415 -42206 22830 -12383 47499
876 47499 -19719 -130615 -6465 -15240 72045 43422 118292 142892 55479 -40286 4027 -41610
864 -41610 -45858 -63880 -88528 -104629 -110426 -206132 -217322 -171870 -131275 -21505 81884 86065
852 86065 53971 -4766 -55379 -142471 -160947 -158958 -94668 -156746 -100293 -29695 -44421 -11195
840 -11195 -105161 -82415 14687 37173 -72908 -96742 80255 -11767 -85548 -61051 -84846 -101662
828 -101662 -96641 -17235 -110570 -114539 -111746 -29987 -12281 -22354 -76 -5406 -69751 10172 36554
$$ packed form
912C6425r4305L8224j1721o4846J10332o7176k3657J11861P8760L4257o0703J40041
900B27492j7891j58212L4238m3374q4103K2815O2990K9694M8340l4116O1838n5669
888I4042p3632O7661j58974M9286n2227L9387n3830j5128O1209O5036l5213N9882
876D7499o7218j10896J24150q775Q7285k8623P4870K4600q7413r5765M4313m5637
864d1610m248j8022k4648j6101n797r5706j1190M5452M0595J09770J03389M181
852H6065l2094n8737n0613q7092j8476J989O4290o2078N6453P0598j4726L3226
840a1195r3966K2746R7102K2486j10081k3834J76997r2022p3781K4497k3795j6816
828a01662N021P9406r3335l969K793Q1759J7706j0073K2278n330o4345P9923K6382
$$ plain form
815 36554 -101409 -97848 -138316 -57292 -60389 -151914 -216921 -153373 -53836 31710 15103 -90476
803 -90476 -59296 -60898 -5236 83224 123811 36377 -3747 -34439 30665 -45924 -22946 46728
791 46728 152729 -39339 -104286 5907 76794 128267 161000 17929 -113549 -82287 -52814
780 -52814 22816 5167 -131479 -166992 -175734 -109444 -61016 -12311 -23894 51423 61120 33509
768 33509 62580 76741 92199 -107556 -92156 7925 73334 1715 -143026 -307012 -116861
757 -116861 24449 38436 10250 8352 -66310 -50668 -18726 -29981 -18567 -72924 -76384 -80256
745 -80256 -29340 25369 106044 -5720 -22109 39602 -82730 125965 62291 5728 -56229
734 -56229 -164228 -45446 -57235 -86085 -117273 -16606 39571 113434 167101 9319 -117339
$$ packed form
815C6554j37963L561m0468Q1024l097r1525o5007O3548R9537Q5546j6607j05579
803i0476L1180j602N5662Q8460M0587q7434m0124l0692O5104p6589K2978O9674
791D6728J06001j92068o4947J10193P0887N1473L2733j43071j31478L1262K9473
780e2814P5630j7649j36646l5513q742O6290M8428M8705j1583P5317R697k7611
768C3509K9071J4161J5458j99755J5400J00081O5409p1619j44741j63986J90151
757a16861J41310J3987k8186j898p4662J5642L1942j1255J1414n4357l460l872
745h0256N0916N4709Q0675j11764j6389O1711j22332K08695o3674n6563o1957
734e6229j07999J18782j1789k8850l1188J00667N6177P3863N3667j57782j26658
$$ plain form
723 -117339 -180345 -159428 -112122 -87592 -20999 -61293 -9463 59382 9571 -64748 -61325 -22311
711 -22311 16931 -4257 -84332 -177993 -198673 -92824 -279 -36462 -28150 14045 -27481 -14391
699 -14391 -128544 -144999 -115156 -4885 -69895 -56221 -15089 -35955 23105 -15592 29916 32326
687 32326 -27184 -48394 -56378 -110366 -3296 84975 23258 -25703 -131895 -117294 -83506 -201749
675 -201749 -216619 -2651 31108 -65888 -25951 -58699 -29201 95822 102662 -12240 -193167
664 -193167 -251866 -261706 -105897 -28516 -122031 -197228 -246236 -112246 77923 192478 62140
653 62140 88722 65955 86418 14373 74462 35573 82457 41024 -76364 -158081 -106212 -32
641 -32 -103573 101160 190110 175717 74676 -3174 -43203 18953 -99123 -12017 -84500 -188898
$$ packed form
723a17339o3006K0917M7306K4530O6593m0294N1830O8845m9811p4319L423L9014
711b2311L9242k1188q0075r3661k0680J05849R2545l6183Q312M2195m1526J3090
699a4391j14153j6455K9843J10271o5010J3674M1132k0866N9060l8697M5508K410
687C2326n9510k1210p984n3988J07070Q8271o1717m8961j06192J4601L3788j18243
675b01749j4870K13968L3759r6996L9937l2748K9498J25023O840j14902j80927
664a93167n8699r840J55809P7381r3515p5197m9008J33990J90169J14555j30338
653F2140K6582k2767K0463p2045O0089l8889M6884m1433j17388q1717N1869J06180
641c2j03541K04733Q8950j4393j01041p7850m0029O2156j18076Q7106p2483j04398
$$ plain form
629 -188898 -98449 51131 88647 21927 93976 52850 33824 94243 -55381 -121878 -69512
618 -69512 -33178 294 48725 60031 -2257 -145780 -350735 -185650 -83030 -70294 -177099
607 -177099 -142401 -89396 6136 -40877 -105300 -216750 -145576 10349 -27657 -16083 -3377
596 -3377 -110630 -42717 -74762 26619 81267 48954 51552 18168 62817 30526 10980 28262
584 28262 -24818 24292 84565 -114073 -165820 -166306 -49657 4650 -80242 -222611 -204994 -92865
572 -92865 24862 -41199 -29330 -135832 -120481 -14559 51588 -37041 -2325 -54370 11340
561 11340 49520 -20596 -6330 -107581 -1224 -103388 20731 87877 11032 93275 126883
550 126883 18940 -3507 -79154 -34323 119784 82914 20816 4055 58549 160936 219511
$$ packed form
629a88898R0449J49580L7516o6720P2049m1126j9026O0419j49624o6497N2366
618f9512L6334L3472M8431J1306o2288j43523k04955J65085J02620J2736j06805
607a77099L4698N3005R5532m7013o4423j11450P1174J55925l8006J1574J2706
596c377j07253O7913l2045J01381N4648l2313K598l3384M4649l2291j9546J7282
584B8262n3080M9110O0273j98638n1747m86J16649N4307q4892j42369J7617J12129
572i2865J17727o6061J1869j06502J5351J05922O6147q8629L4716n2045O5710
561A1340L8180p0116J4266j01251J06357j02164J24119O7146p6845Q2243L3608
550A26883j07943k2447p5647M4831J54107l6870o2098j6761N4494J02387N8575
$$ plain form
539 219511 108114 -16365 -17414 -28588 -62087 -2940 -16717 103426 134650 58546 -11610
528 -11610 43498 126627 53957 25606 135920 97557 68306 -2529 -35990 -22114 -84245 -35153
516 -35153 -42555 63478 92226 83729 128901 79353 95451 -15226 -35068 -42573 79156 -85568
504 -85568 -93353 23223 -119932 106739 102077 91124 16944 7683 -3226 41108 107234 23590
492 23590 47376 59126 84807 92533 -5195 -226122 -118236 -67109 -39872 16972 136977 123736
480 123736 4919 29313 -52166 159437 169378 -43444 -152539 -72893 -81494 35602 3093
469 3093 -44215 69072 88951 93851 56298 76860 -3588 -72182 -84634 -133525 -17055 -12488
457 -12488 -8222 -68529 -120054 -43338 66144 -37237 -7852 -6424 -32067 -18420 88825 50293
$$ packed form
539B19511j11397j24479j049j1174l3499N9147j3777J20143L1224p6104p0156
528a1610N5108Q3129p2670k8351J10314l8363k9251p0835l3461J3876o2131M9092
516c5153p402J06033K8748q497M5172m9548J6098j10677j9842p505J21729j64724
504h5568p785J16576j43155K26671m662j0953p4180r261j0909M4334O6126q3644
492B3590K3786J1750K5681P726r7728k20927J07886N1127K7237N6844J20005j3241
480A23736j18817K4394q1479K11603R941k12822j09095P9646q601J17096l2509
469C093m7308J13287J9879M900l7553K0562q0448o8594j2452m8891J16470M567
457a2488M266o0307n1525P6716J09482j03381K9385J428k5643J3647J07245l8532
$$ plain form
445 50293 87853 40074 42474 100461 -68295 -8258 -74924 -113945 2122 40936 -41299 10159
433 10159 31026 -75190 -83390 107180 124557 5845 102243 63646 -92359 -96505 38465
422 38465 -177929 -195686 -12258 -61769 -21464 -35812 -40145 -37998 13050 -12812 73151 33877
410 33877 73128 68491 -79692 -99428 -54151 73111 -34842 -47088 -24470 -8041 -83365 -84925
398 -84925 142568 -69325 22320 -15882 -20913 -122080 -99495 -7321 137446 31713 -2929
387 -2929 94803 46412 -99584 -989 78414 91654 -20855 -10597 -74125 11805 135348 133315
375 133315 91289 -53098 16381 -58250 39852 63637 22273 -34453 -155512 -26444 20789
364 20789 -42689 -93708 -164531 -220076 -240182 -143973 -90655 93102 4146 11608 5559 12334
$$ packed form
445E0293L7560m7779K400N7987j68756O0037o6666l9021J16067L8814q2235N1458
433A0159K0867j06216q200J90570J7377j18712R6398l8597j56005m146J34970
422C8465k16394j7757J83428m9511M0305j4348m333K147N1048k5862Q5963l9274
410C3877L9251m637j48183j9736M5277J27262j07953j2246K2618J6429p5324j560
398h4925K27493k11893R1645l8202n031j01167K2585R2174J44767j05733l4642
387b929R7732m8391j45996R8595P9403J3240j12509J0258o3528Q5930J23543k033
375A33315m2026j44387O9479p4631R8102K3785m1364n6726j21059J29068M7233
364B0789o3478n1019p0823n5545k0106R6209N3318J83757q8956P462o049O775
$$ plain form
352 12334 19239 89457 234347 204260 10433 111133 71156 101377 205767 57235 52742
341 52742 235475 282957 182755 73707 79659 -17728 16035 120340 37092 29436 -122305
330 -122305 -168864 -101646 -184012 -20183 48137 -71737 -75832 -50904 56104 32686 -7307
319 -7307 14314 26786 31813 37174 41154 -35717 -58431 -67279 -149209 -180207 15052 71907 101094
306 101094 53265 97837 85530 -46251 -80719 -103252 -21690 69967 -4555 104856 138799
295 138799 6801 -106895 13090 -6095 15082 150805 36638 -144163 -71459 8250 22545
284 22545 2248 -24230 -126524 -85504 44811 -58424 -38638 -20086 -136813 -93548 36085
273 36085 779 -28026 106782 62550 -77396 -138469 -47981 -9857 -76516 53986 -42147
$$ packed form
352A2334O905P0218J44890l0087j93827J00700l9977L0221J04390j48532m493
341E2742J82733M7482j00202j09048N952r7387L3763J04305q3248p656j51741
330a22305m6559O7218q2366J63829O8320j19874m095K4928J07008k3418l9993
319g307K1621J2472N027N361L980p6871k2714q848q1930l0998J95259N6855K9187
306A01094m7829M4572j2307j31781l4468k2533Q1562R1657p4522J09411L3943
295A38799j31998j13696J19985j9185K1177J35723j14167j80801P2704P9709J4295
284B2545k0297k6478j02294M1020J30315j03235J9786J8552j16727M3265J29633
273C6085l5306k8805J34808m4232j39946o1073R0488L8124o6659J30502r6133
$$ plain form
262 -42147 -18783 108152 65076 35770 134615 94428 26415 61606 34274 -41400 -36745 4916
250 4916 12382 -6871 117576 86740 141479 -6426 36224 86436 59513 85709 122049 117905
238 117905 72682 -24318 -37782 -19469 -64245 -116205 6468 137119 98639 24384 -69104
227 -69104 -54551 12823 -33099 -81213 -80834 30807 118454 51391 45981 -42721 -58596 -49101 -106829
214 -106829 -121925 -64973 45929 30050 81931 15437 -71691 -141818 -54154 110034 111429 -71848
202 -71848 -38936 81771 -5704 -60584 -59873 -27200 -40616 76984 175915 117443 97794 20209
190 20209 46366 -16513 95797 107525 75847 -68849 -163094 -33726 -81326 6501 111717
179 111717 5008 -75743 -33640 59920 157448 115050 68460 120315 16775 54567 96202
$$ packed form
262d2147K3364J26935m3076k9306R8845m0187o8013L5191k7332p5674M655M1661
250D916P466j9253J24447l0836N4739j47905M2650N0212k6923K6196L6340m144
238A17905m5223r7000j3464J8313m4776n1960J22673J30651l8480p4255r3488
227f9104J4553O7374m5922m8114L79J11641Q7647o7063n410q8702j5875R495n7728
214a06829j5096N6952J10902j5879N1881o6494q7128p0127Q7664J64188J395j83277
202g1848L2912J20707q7475n4880P11L2673j3416J17600R8931n8472j9649p7585
190B0209K6157o2879J12310J1728l1678j44696r4245J29368m7600Q7827J05216
179A11717j06709q0751M2103R3560R7528m2398m6590N1855j03540L7792M1635
$$ plain form
168 96202 28235 49732 42429 200315 168185 170190 55822 105439 40218 5829 -27761 27248
156 27248 109937 31063 -21756 -41576 -10646 102464 68312 78999 145315 55278 21498 26608
144 26608 -17788 76573 90196 9175 99320 111660 3741 25632 -41545 -31892 -23634 6138
132 6138 -3642 56305 46376 124352 116457 113075 11206 -19990 -104585 -78104 -625 77527 115426
119 115426 83203 -19555 -8447 78967 -52539 -95462 34898 71940 51784 57937 160429
108 160429 164032 59731 127004 113358 128979 1036 -39822 -39321 -78417 -55879 -46156 -52206
96 -52206 -55983 1248 125412 122074 56839 -80187 -121550 -40005 100571 108840 -4381 -43594
84 -43594 57555 8739 37108 15049 -60514 -94304 -50513 40778 82644 -31906 -18051 44810
$$ packed form
168I6202o7967K1497p303J57886l2130K005j14368M9617o5221l4389l3590N5009
156B7248Q2689p8874n2819j9820L0930J13110l4152J0687O6316r0037l3780N110
144B6608m4396R4361J3623q1021R0145J2340j07919K1891o7177R653Q258K9772
132F138r780N9947r929P7976p895l382j01869l1196q4595K6481P7479P8152L7899
119A15426l2223j02758J1108Q7414j31506m2923J30360L7042k0156O153J02492
108A60429L603j04301O7273j3646J5621j27943m0858N01l9096K2538R723o050
96e2206l777N7231J24164l338o5235j37026m1363Q1545J40576Q269j13221l9213
84d3594J01149m8816K8369k2059p5563l3790M3791R1291M1866j14550J3855O2861
$$ plain form
72 44810 -5534 -51455 -72147 -83092 -14963 -22363 -9576 -16651 -25316 51772 79746 95751 119444
59 119444 9654 41402 33160 50563 109477 99182 36763 92032 86179 18101 12871 -21079
47 -21079 12689 113541 88875 68855 45015 -7282 -5639 79287 164399 219015 120397 57963
35 57963 131493 651 54864 166518 56509 6879 28341 -104273 -38711 4892 -24825
24 -24825 59052 72305 47323 26152 45715 175816 221568 102838 100294 42776 39940 -30952
12 -30952 28935 32393 33699 63035 -23163 27253 6963 25257 46762 58137 49101 -29809
0 -29809
$$ packed form
72D4810n0344m5921k0692j0945O8129p400J2787p075q665P7088K7974J6005K3693
59A19444j09790L1748q242J7403N8914j0295o2419N5269n853o8078n230l3950
47b1079L3768J00852k4666k0020k3840n2297J643Q4926Q5112N4616r8618o2434
35E7963P3530j30842N4213J11654j10009m9630K1462j32614O5562M3603k9717
24b4825Q3877J3253k4982k1171J9563J30101M5752j18730k544n7518k836p0892
12c0952N9887L458J306K9336q6198N0416k0290J8294K1505J1375r036p8910
0b9809
$$ Imaginary data points
##PAGE= N=2
##DATA TABLE= (X++(I..I)), XYDATA
$$ plain form
16383 -1679319 -1701746 -1616991 -1597984 -1581776 -1549342 -1499466 -1467736 -1406302 -1433563 -1376472 -1457930
16372 -1457930 -1447085 -1352864 -1320535 -1286528 -1304098 -1270314 -1201815 -1129763 -1115705 -1177358 -1133375
16361 -1133375 -1185780 -1185650 -1127563 -1113875 -1104594 -1053983 -1042367 -1027676 -948383 -909998 -954087 -986268
16349 -986268 -884978 -831331 -872715 -907350 -826538 -803284 -798922 -757677 -768590 -785342 -721616
16338 -721616 -740695 -654518 -519304 -528264 -592156 -567070 -554279 -534859 -442245 -474119 -540247
16327 -540247 -492205 -466972 -414437 -357414 -305225 -261030 -307122 -317924 -223345 -251631 -173790
16316 -173790 -259399 -141658 -118079 -116237 -90992 -46728 -35449 -22317 -105436 -42600 3296
16305 3296 4926 71232 79972 49871 50654 77260 142200 266125 160153 171159 223512 238681
$$ packed form
16383a679319k2427Q4755J9007J6208L2434M9876L1730O1434k7261N7091q1458
16372a457930J0845R4221L2329L4007j7570L3784O8499P2052J4058o1653M3983
16361a133375n2405J30N8087J3688R281N0611J1616J4691P9293L8385m4089l2181
16349i86268J01290N3647m1384l4635Q0812K3254M362M1245j0913j6752O3726
16338g21616j9079Q6177J35214q960o3892K5086J2791J9420R2614l1874o6128
16327e40247M8042K5233N2535N7023N2189M4195m6092j0802R4579k8286P7841
16316a73790q5609J17741K3579J842K5245M4264J1279J3132q3119O2836M5896
16305C296J630O6306Q740l0101P83K6606O4940J23925j05972J1006N2353J5169
$$ [...]
##END NTUPLES=NMR SPECTRUM
##END=
