##TITLE=1H_DE-80H_X3
 200.13MHz, d2o
 8 sc
 
 19ns.26.2.2025
##JCAMPDX= 6.0         $$ Bruker NMR JCAMP-DX V2.0
##DATA TYPE= NMR SPECTRUM
##DATA CLASS= NTUPLES
##ORIGIN= UXNMR, Bruker Analytische Messtechnik GmbH
##OWNER= pz
$$ XWIN-NMR		Version 3.5
$$ Wed Jul  2 10:01:02 2025 Russian Standard Time (UT+4h)  Yarkov@DPX200
##.OBSERVE FREQUENCY= 200.1313
##.OBSERVE NUCLEUS= ^1H
##.ACQUISITION MODE= SIMULTANEOUS
##.ACQUISITION SCHEME= undefined
##.AVERAGES= 8
##.DIGITISER RES= 18
##SPECTROMETER/DATA SYSTEM= spect
##.PULSE SEQUENCE= zg30
##.SOLVENT NAME= CDCl3
##.SHIFT REFERENCE= (INTERNAL, CDCl3, 0, 15.4913)
##AUDIT TRAIL= $$ (NUMBER, WHEN, WHO, WHERE, WHAT)
$$ ##TITLE= Audit trail, XWIN-NMR		Version 3.5
$$ ##JCAMPDX= 5.01
$$ ##ORIGIN= Bruker BioSpin GmbH
$$ ##OWNER= Yarkov
$$ C:/Bruker/XWIN-NMR/data/yarkov2/nmr/H-C/1/pdata/1/auditp.txt
$$ ##AUDIT TRAIL=  $$ (NUMBER, WHEN, WHO, WHERE, WHAT)
(   1,<2025-07-02 09:59:40.75 +0400>,<Yarkov>,<DPX200>,
      <created by zg, POWCHK disabled, PULCHK disabled
       configuration hash MD5:
       00 E9 B6 7A A2 85 ED C7 34 08 36 98 17 FE 4E 26
       data hash MD5: 16K
       7C 58 EF 0E 2D CF 64 6F B2 31 BE FD B4 6B 40 4D>)
(   2,<2025-07-02 09:59:43.82 +0400>,<Yarkov>,<DPX200>,
      <Start of raw data processing
       efp BC_mod = 2 LB = 0.25 FT_mod = 6 PKNL = 1 PHC0 = -1355.889 PHC1 = -0.03339839 SI = 16K 
       data hash MD5: 16K
       2C 76 3E 3A 8A DE F5 A4 C0 AF D0 A5 D5 CD 27 6E>)
(   3,<2025-07-02 09:59:58.35 +0400>,<Yarkov>,<DPX200>,
      <pk PHC0 = -2.656835 PHC1 = 12.4 
       data hash MD5: 16K
       DE 1B 01 BC 5C 38 5A 11 B0 5C 80 46 9D 94 0A 55>)
$$ ##END=
$$ 
$$ hash MD5
$$ 97 C3 15 62 5A 4F 46 55 2E A8 15 1C D1 B9 00 AD
##$RELAX= 
##$RELAX= 
##$RELAX= 
##$RELAX= 
##$RELAX= 
##$RELAX= 
$$ Bruker specific parameters
$$ --------------------------
##$DU= <C:/Bruker/XWIN-NMR>
##$EXPNO= 1
##$NAME= <H-C>
##$PROCNO= 1
##$TYPE= <nmr>
##$USER= <yarkov2>
##$AMP= (0..31)
100 100 100 100 100 100 100 100 100 100 100 100 100 100 100 100 100 100 
100 100 100 100 100 100 100 100 100 100 100 100 100 100 
##$AQSEQ= 0
##$AQ_mod= 1
##$AUNM= <au_zg>
##$AUTOPOS= <>
##$BF1= 200.13
##$BF2= 200.13
##$BF3= 200.13
##$BF4= 200.13
##$BF5= 200.13
##$BF6= 200.13
##$BF7= 200.13
##$BF8= 200.13
##$BYTORDA= 1
##$CFDGTYP= 0
##$CFRGTYP= 5
##$CHEMSTR= <none>
##$CNST= (0..31)
1 1 145 1 1 1 1 1 1 1 1 1 1 1 1 1 1 1 1 1 1 1 1 1 1 1 1 1 1 1 1 1 
##$CPDPRG= <>
##$CPDPRG1= <>
##$CPDPRG2= <>
##$CPDPRG3= <>
##$CPDPRG4= <mlev>
##$CPDPRG5= <mlev>
##$CPDPRG6= <mlev>
##$CPDPRG7= <mlev>
##$CPDPRG8= <mlev>
##$CPDPRGB= <>
##$CPDPRGT= <>
##$D= (0..31)
0 0.7 0 0 0 0 0 0 0 0 0 0.03 0 0 0 0 0 0 0 0 0 0 0 0 0 0 0 0 0 0 0 0 
##$DATE= 1751435980
##$DBL= (0..7)
120 120 120 120 120 120 120 120 
##$DBP= (0..7)
150 150 150 150 150 150 150 150 
##$DBP07= 0
##$DBPNAM0= <>
##$DBPNAM1= <>
##$DBPNAM2= <>
##$DBPNAM3= <>
##$DBPNAM4= <>
##$DBPNAM5= <>
##$DBPNAM6= <>
##$DBPNAM7= <>
##$DBPOAL= (0..7)
0.5 0.5 0.5 0.5 0.5 0.5 0.5 0.5 
##$DBPOFFS= (0..7)
$$ [...]
##$SUBNAM2= <"">
##$SUBNAM3= <"">
##$SUBNAM4= <"">
##$SUBNAM5= <"">
##$SUBNAM6= <"">
##$SUBNAM7= <"">
##$SUBNAM8= <"">
##$SUBNAM9= <"">
##$SW= 18.0517328524113
##$SWIBOX= (0..15)
0 0 2 0 0 0 0 0 0 0 0 0 0 0 0 0 
##$SW_h= 3612.71676300578
##$TD= 16384
##$TD0= 1
##$TE= 0
##$TE2= 300
##$TE3= 300
##$TEG= 300
##$TL= (0..7)
0 120 120 120 120 120 120 120 
##$TP= (0..7)
150 150 150 150 150 150 150 150 
##$TP07= 0
##$TPNAME0= <>
##$TPNAME1= <>
##$TPNAME2= <>
##$TPNAME3= <>
##$TPNAME4= <>
##$TPNAME5= <>
##$TPNAME6= <>
##$TPNAME7= <>
##$TPOAL= (0..7)
0.5 0.5 0.5 0.5 0.5 0.5 0.5 0.5 
##$TPOFFS= (0..7)
0 0 0 0 0 0 0 0 
##$TUNHIN= 0
##$TUNHOUT= 0
##$TUNXOUT= 0
##$USERA1= <user>
##$USERA2= <user>
##$USERA3= <user>
##$USERA4= <user>
##$USERA5= <user>
##$V9= 5
##$VALIST= <valist>
##$VCLIST= <CCCCCCCCCCCCCCC>
##$VD= 0
##$VDLIST= <DDDDDDDDDDDDDDD>
##$VPLIST= <PPPPPPPPPPPPPPP>
##$VTLIST= <TTTTTTTTTTTTTTT>
##$WBST= 1024
##$WBSW= 4
##$XGAIN= (0..3)
0 0 0 0 
##$XL= 0
##$YL= 0
##$YMAX_a= 150981
##$YMIN_a= -161406
##$ZGOPTNS= <>
##$ZL1= 120
##$ZL2= 120
##$ZL3= 120
##$ZL4= 120
##$ABSF1= 0
##$ABSF2= 0
##$ABSG= 0
##$ABSL= 0
##$ALPHA= 0
##$AQORDER= 0
##$ASSFAC= 0
##$ASSFACI= 0
##$ASSFACX= 0
##$ASSWID= 0
##$AUNMP= <proc_1d>
##$AZFE= 0.1
##$AZFW= 0.1
##$BCFW= 0
##$BC_mod= 2
##$BYTORDP= 0
##$COROFFS= 0
##$CY= -3
##$DATMOD= 1
##$DC= 0
##$DFILT= <>
##$DTYPP= 0
##$F1P= 0
##$F2P= 0
##$FCOR= 1
##$FTSIZE= 16384
##$FT_mod= 6
##$GAMMA= 0
##$GB= 0
##$INTBC= 1
##$INTSCL= 3.241238e-09
##$ISEN= 128
##$LB= 0.25
##$LEV0= 0
##$LPBIN= 0
##$MAXI= 10000
##$MC2= 0
##$MEAN= 0
##$ME_mod= 0
##$MI= 1.114404
##$NCOEF= 0
##$NC_proc= -7
##$NLEV= 6
##$NOISF1= 3.799351
##$NOISF2= 2.8
##$NSP= 0
##$NTH_PI= 0
##$NZP= 0
##$OFFSET= 15.49128
##$PC= 1
##$PHC0= -1358.546
##$PHC1= 12.3666
##$PH_mod= 1
##$PKNL= yes
##$PPARMOD= 0
##$PSCAL= 0
##$PSIGN= 0
##$REVERSE= no
##$SF= 200.130006089241
##$SI= 16384
##$SIGF1= 3
##$SIGF2= 2
##$SINO= 0.751879
##$SIOLD= 32768
##$SREGLST= <19F.Aceton>
##$SSB= 0
##$STSI= 16384
##$STSR= 0
##$SW_p= 3612.71676300578
##$SYMM= 0
##$S_DEV= 0
##$TDeff= 16384
##$TDoff= 0
##$TI= <>
##$TILT= no
##$TM1= 0
##$TM2= 0
##$TOPLEV= 0
##$USERP1= <user>
##$USERP2= <user>
##$USERP3= <user>
##$USERP4= <user>
##$USERP5= <user>
##$WDW= 1
##$XDIM= 16384
##$YMAX_p= 352506563
##$YMIN_p= -1521675
$$ End of Bruker specific parameters
$$ ---------------------------------
##NTUPLES= NMR SPECTRUM
##VAR_NAME=  FREQUENCY,     SPECTRUM/REAL,   SPECTRUM/IMAG
##SYMBOL=    X,             R,               I
##VAR_TYPE=  INDEPENDENT,   DEPENDENT,       DEPENDENT
##VAR_FORM=  AFFN,          ASDF,            ASDF
##VAR_DIM=   16384,         16384,           16384
##UNITS=     HZ,            ARBITRARY UNITS, ARBITRARY UNITS
##FACTOR=    0.220516191357247, 1,           1
##FIRST=     3100.26988108856, 0,            0
##LAST=      -512.446881917223, 0,           0
##MIN=       -512.446881917223, -1521675,    0
##MAX=       3100.26988108856, 352506563,    0
$$ Real data points
##PAGE= N=1
##DATA TABLE= (X++(R..R)), XYDATA
$$ [...]
6142D73958j158j38776k7602j280J1538O8266Q3981j8574q3498l3992r2699j7204
$$ 473958 472800 334024 306422 305142 316680 384946 468927 450353 366855 332863 240164 222960
6130B22960R5801L936j0023J57711k4856o1178m8374Q1539Q3102Q712m7051L0849
$$ 222960 318761 322697 312674 470385 445529 384351 335977 417516 500618 509330 462279 493128
6118D93128n4460l70l8286n7038K924L1071J09063R2419J8321j25640k2398p4251
$$ 493128 438668 438298 400012 342974 345898 376969 486032 578451 596772 471132 448734 374483
6106C74483r458J34931p2973r0384L0715n3419R3491M7908j4419n4933r1683Q1437
$$ 374483 365025 499956 426983 336599 367314 313895 407386 455294 440875 385942 294259 375696
6094C75696k1821N416K4545J7301M2086o5429P8032M9693m2086p6784p376k1532
$$ 375696 353875 359291 383836 401137 443223 377794 455826 505519 463433 386649 379273 357741
6082C57741K283n8605J08275j23189r1892L7714l2744M7316O2115N415J08159
$$ 357741 360024 301419 409694 286505 194613 232327 199583 246899 309014 314429 422588
6071D22588r1919r7868J27586o5204M8569q9191J84565k0792j03182m3298j4368
$$ 422588 330669 232801 360387 295183 343752 254561 439126 418334 315152 271854 257486
6060B57486J07624N4248j37322K778q189l1400M0941M5729K6082N7209q9776J34061
$$ 257486 365110 419358 282036 284814 276625 245225 286166 331895 357977 415186 325410 459471
6048D59471j23825j36726K22353j83118n7895P3555J08413Q494l7228l9465q5494
$$ 459471 335646 198920 421273 238155 180260 253815 362228 370722 333494 294029 208535
6037B08535m8518K3849O8260n795P867q6450J02483o8070R2582K9360p096J29971
$$ 208535 160017 183866 252126 246331 254198 167748 270231 202161 294743 324103 317007 446978
6025D46978j67859j23615K0459J36052k0208j0840O1160O7078L433l7382k7970
$$ 446978 279119 155504 175963 312015 291807 280967 342127 409205 412638 375256 347286
6014C47286o6719N7310k0743R907O3587M4571M8652m0325k01921Q9271p4782k8052
$$ 347286 280567 337877 317134 327041 390628 435199 483851 443526 241605 330876 256094 228042
6002B28042J03914m9273k406r9385l5197M4206J17071m2067K0626n557K8905j11462
$$ 228042 331956 282683 280277 180892 145695 189901 306972 264905 285531 279974 308879 197417
5990A97417Q9445J95087j51996L8736p1967o3703Q0588Q8492j9460q2215j3554
$$ 197417 286862 481949 329953 368689 296722 233019 313607 402099 382639 300424 286870
5979B86870O5328M6983k3426j28002j8672N8373M4720J0825j28720O3046N5461
$$ 286870 352198 399181 375755 247753 229081 287454 332174 342999 214279 277325 332786
5968C32786J3201m1106r18j27238P1036L0865L8639q9365J7733j0965j9256P0894
$$ 332786 345987 304881 303963 176725 247761 278626 317265 227900 245633 234668 215412 286306
5956B86306N1283O328p7864J21664j51p4162N487j49679j7442J384l8163q4908
$$ 286306 337589 343917 266053 387717 387566 313404 318891 169212 151770 153154 114991 30083
5944C0083N5356J08249J06453j0689l2685J9653q114m1776j04323N2152j217R6569
$$ 30083 85439 193688 300141 289452 256767 276420 268306 226530 122207 174359 173142 269711
5932B69711l9768l8556m8348L8444Q8768j40711N1800O9105M5703l7689M869o0181
$$ 269711 229943 191387 143039 181483 270251 129540 181340 250445 296148 258459 263328 203147
5920B03147r0549N1751J07149K5823N0864L5410n4797Q991J05089j52417p9651
$$ 203147 112598 164349 271498 297321 348185 383595 328798 337789 442878 290461 210810
5909B10810p0031K9245J6974l2588J23540J12418K1727n378j55075m8497O6960
$$ 210810 140779 170024 186998 154410 277950 390368 412095 406717 251642 203145 270105
5898B70105J3572K8268p1236K1195n3013O7575P4769p6434M6647K9288r4774o7762
$$ 270105 283677 311945 240709 261904 208891 276466 351235 274801 321448 350736 255962 188200
5886A88200M3013L2856M7003L3486q3611N1273k1296Q8718j9175K0276P0116o6824
$$ 188200 231213 264069 311072 344558 260947 312220 290924 379642 360467 380743 450859 384035
5874C84035r2099j11671j67184Q6909J14511J61723J1866M5128N0054p228j8253
$$ 384035 291936 180265 13081 99990 214501 376224 388090 433218 483272 476044 457791
5863D57791R724j1755m8786R272l6117r3731q471Q45j3804n014r253l5058M0581
$$ 457791 467515 455760 406974 416246 380129 286398 277927 278772 264968 259954 250701 215643 256224
5850B56224r5996j44118J77983O8408J892r0070J7958O9214n0849J11610p0797
$$ 256224 160228 16110 194093 262501 264393 174323 192281 261495 210646 322256 251459
5839B51459L0572p6557R4923L6567n1016n5255k9554J25780N10j49678N4622K12070
$$ 251459 282031 205474 300397 336964 285948 230693 201139 326919 327429 177751 232373 444443
5827D44443n8532N9955k5741r838j9005j38235Q6721R842n6002K7174o4555O0096
$$ 444443 385911 445866 420125 410287 391282 253047 339768 349610 293608 320782 256227 316323
5815C16323j10256p3040R6307O3420O9856o0959R7831j4106m7507n2583P2661
$$ 316323 206067 133027 229334 292754 362610 301651 399482 385376 337869 285286 357947
5804C57947k7411j4769o6414o6273O1607R0898O2508o5949p4977p9470N2635J18455
$$ 357947 330536 315767 249353 183080 244687 335585 398093 332144 257167 177697 230332 348787
5792C48787o1883J5283R4209m9026P3584M4934Q5727r5764j97725j3858P4081
$$ 348787 286904 302187 396396 347370 420954 465888 551615 455851 258126 244268 318349
5781C18349n5049l7830l3019O8188l8963J41273k0204Q48R6376o4940R1472J19338
$$ 318349 263300 225470 192451 260639 221676 362949 342745 343593 439969 375029 466501 585839
5769E85839r2491j02472j00672j9791O6688j13665Q5656O3313M9082R8325r690
$$ 585839 493348 390876 290204 270413 337101 223436 309092 372405 421487 519812 510122
5758E10122J15724j49826M3111l3745j40839j8273N4781m4143q8112n2633J31433
$$ 510122 625846 476020 519131 485386 344547 326274 381055 336912 248800 196167 327600
5747C27600Q7878j09509m3326P3056q176k2336R2641n702q784N7696J27792r5052
$$ 327600 415478 305969 262643 335699 327523 305187 397828 392126 383342 441038 568830 473778
5735D73778k00715M8336L4374J22809m6138p7468N8781j07293k2125J29188o6582
$$ 473778 273063 321399 355773 478582 432444 354976 413757 306464 284339 413527 346945
5724C46945q3242J09102l1013J216J5682L7663K4856M1159o3897j50962Q2573
$$ 346945 263703 372805 341792 343008 358690 396353 421209 462368 398471 247509 330082
5713C30082J11571R1712J0859j01978J2974l6172O2783j36853m9504J94950M8295
$$ 330082 441653 533365 544224 442246 455220 419048 481831 344978 295474 490424 538719
5702E38719q1080K848J4844m1190J4301r6573L9564J61358K3798k09917N9627
$$ 538719 457639 460487 475331 434141 448442 351869 391433 552791 576589 366672 426299
5691D26299Q4125p0603L2736P2800J45309Q0592j5629j44891k69070q4023J39111
$$ 426299 510424 439821 472557 545357 690666 771258 755629 610738 341668 257645 396756
5680C96756p1235p5135P0042J87038K1802p0956p9194j35674P7268J29947p8300
$$ 396756 325521 250386 320428 507466 529268 458312 379118 243444 320712 450659 372359
5669C72359P2489N405n2106L4780P9370l570n8142p9527M0542J19800n3876p5061
$$ 372359 444848 450253 398147 432927 512297 508727 450585 371058 411600 531400 477524 402463
5657D02463L2012J69485L565p2677k6564j09125r1096M1464J64408l7337J87606
$$ 402463 434475 603960 607525 534848 508284 399159 308063 349527 513935 476598 664204
5646F64204J03612j58611q6744L6099N1387n5071m1641p5082q48O7790J21233
$$ 664204 767816 609205 522461 558560 609947 554876 513235 438153 437305 505095 626328
5635F26328M2807j75986q6560J81437K405O1326K1570j10295m8898M760Q6214
$$ 626328 669135 493149 406589 588026 590431 651757 673327 563032 514134 518894 605108
5624F05108j7460j0654k224Q1738r018J0085k7351j8861m7758O792J8326L8547
$$ 605108 587648 576994 574770 656508 647490 657575 630224 611363 563605 570397 588723 627270
5612F27270R0080j87517k7683k4953J41311o0712l1466O400o3509K02850N5865
$$ 627270 717350 529833 502150 477197 618508 557796 526330 532730 469221 672071 727936
5601G27936n7634q0157L6496J0920K8509l4156K591K00714l3953o963r3982J60194
$$ 727936 670302 590145 626641 637561 666070 631914 634505 835219 801266 794303 700321 860515
5589H60515N0281n3487J23859r2096O1265j12577j12263K28038m6336j14939m1430
$$ 860515 910796 857309 981168 889072 950337 837760 725497 953535 907199 792260 750830
5578G50830N914J10893N385j620l7642J41206J5231k7969K7675n5669m7197J1893
$$ 750830 756744 867637 873022 871402 833760 974966 990197 962228 989903 934234 887037 898930
5566H98930m8589J31242o7475p240J24352k5148J82072J31707j62685P6780n3703
$$ 898930 850341 981583 914108 906868 1031220 1006072 1188144 1319851 1157166 1233946 1180243
5555A180243j09558J04299K7365j7986K0635L0512r7171P437L3367r1922P7604
$$ 1180243 1070685 1174984 1202349 1184363 1204998 1235510 1138339 1145776 1179143 1087221 1164825
5544A164825L637N7056J02196o792n1756J56977p3159j29089J20878k9462J5284
$$ 1164825 1168462 1225518 1327714 1320922 1269166 1426143 1352984 1223895 1344773 1315311 1330595
5533A330595n6125q1255J6583J3386K3434J14862Q0184m3095j37540L0373m6918
$$ 1330595 1274470 1193215 1209798 1223184 1246618 1361480 1441664 1398569 1261029 1291402 1244484
5522A244484J4852M7869m8205m9525Q6480k1017P6197o6961L0803O606P57n5945
$$ 1244484 1259336 1307205 1259000 1209475 1295955 1274938 1351135 1284174 1314977 1321583 1322340 1266395
5510A266395L1207R1273P983L2109l5078m7039o4677j26457N8936M1413q2098
$$ 1266395 1297602 1388875 1396858 1428967 1393889 1346850 1282173 1155716 1214652 1256065 1173967
5499A173967p483K9505Q477K10216P064j8404K5949J00057r9208j86998R205j18064
$$ 1173967 1166484 1195989 1204466 1414682 1421746 1403342 1429291 1529348 1430140 1243142 1252347 1134283
5487A134283o0468o2460O5957R7019j26293m8068J68387n1110j27747j419L6321
$$ 1134283 1073815 1011355 1077312 1174331 1048038 999970 1168357 1117247 989500 988081 1024402
5476A024402N0616o8505n2981N7412j56872O535J53475M1248j10892J135J10741
$$ 1024402 1075018 1006513 953532 1010944 854072 860607 1014082 1055330 944438 945573 1056314
5465A056314M4344p7462n2818m150J8042j2437j66788j57099P7264J60977M817
$$ 1056314 1100658 1023196 970378 966228 984270 971833 805045 647946 725210 886187 891004
5454H91004r2328Q041M9145n7822p7683j4117k5813N5641m4319o8294L1497M1951
$$ 891004 798676 806717 855862 798040 720357 706240 680427 736068 691749 623455 654952 696903
5442F96903j9214l1320Q338M6802p0659k02179J22884l1026Q4620k6604n7659
$$ 696903 677689 646369 654707 701509 630850 428671 551555 520529 605149 578545 520886
5431E20886O3750K0938J17621q5759M4764M737j4410j22061k2880o0922L6313
$$ 520886 584636 605574 723195 637436 682200 686937 672527 550466 527586 466664 502977
5420E02977N956N904Q3369L0183l6194p2943p3929J26242n1943o7708q4559j71501
$$ 502977 508933 514837 598206 628389 592195 519252 445323 571565 519622 451914 367355 195854
5408A95854k2142J19622N3451j09232L8495J27607J34159r0382o8167R0482q3419
$$ 195854 173712 293334 346785 237553 276048 403655 537814 447432 379265 469747 386328
5397C86328j52790m0897J49788K07405k33977l0711J89216N4735M1443J9983j06373
$$ 386328 233538 192641 342429 549834 315857 285146 474362 529097 570540 590523 484150
5386D84150q2097O2359l2667J7804M001j5992o981L5428n2867M9009K4962k6154
$$ 484150 402053 464412 431745 449549 453550 437558 430577 466005 413138 462147 487109 460955
5374D60955k0967K1657j9383L7734M2020p9570J12113r5787L404k5920n5146L3490
$$ 460955 439988 461645 442262 479996 522016 442446 554559 458772 462176 436256 381110 414600
5362D14600Q7347L4612j4366N7486J3024j38893N104J08830q4558P1493J17932
$$ 414600 501947 536559 522193 579679 592703 453810 458914 567744 483186 554679 672611
5351F72611k9272j73878n0231K0571N5350Q0265K1056j81624R5375j2596j62380
$$ 672611 643339 469461 419230 439801 495151 575416 596472 414848 510223 497627 335247
5340C35247J20893R1361o0651r4088r4790N8583J24938R4803j4437Q7094n1695
$$ 335247 456140 547501 486850 392762 297972 356555 481493 576296 561859 648953 597258
5329E97258j69975m1074J3668J5983k8939o1390L3303J00281k186K5442j8596
$$ 597258 427283 386209 399877 415860 386921 325531 358834 459115 456929 482371 463775
5318D63775k5698l5389q378j05941N3387N8343K4094R64L8624o638l5614Q4128
$$ 463775 438077 402688 394310 288369 341756 400099 424193 425157 463781 457143 421529 505657
5306E05657P7480j26936K3315O1180k1668o8214M7846O3913K9205p3574k0201
$$ 505657 583137 456201 479516 540696 519028 450814 498660 562573 591778 518204 498003
5295D98003p8938p7579L6908J08820r5118q1137M9531O7214O1715O0479n6479
$$ 498003 419065 341486 378394 487214 392096 310959 360490 427704 489419 549898 493419
5284D93419o0508K3205j33752l7588Q7210r1984N1003J71200m1652n9812P6154
$$ 493419 432911 456116 322364 284776 371986 280002 331005 502205 460553 400741 476895
5273D76895j19885m0891J06277l3233n1564N9027p5552J69105R3593j46506j38295
$$ 476895 357010 316119 422396 389163 337599 396626 321074 490179 583772 437266 298971
5262B98971N5425P0484L7283n9404L8231R9419j27131J3742J5136m0793Q1429
$$ 298971 354396 424880 462163 402759 440990 540409 413278 427020 442156 401363 482792
5251D82792p4987p5064R4306P8464L943r5495J12684j2586M945j5777j17240j25444
$$ 482792 407805 332741 427047 505511 509454 413959 526643 514057 519002 503225 385985 260541
5239B60541O4485k861j01420R9264Q5125n5829n4186R3210r2946j16651p470J41823
$$ 260541 325026 322165 220745 320009 405134 349305 295119 388329 295383 178732 171262 313085
5227C13085J39668q6037J70963L7765k7251j6829n7239J0039r4353n3157J88551
$$ 313085 452753 366716 537679 575444 548193 531364 474125 484164 389811 336654 525205
5216E25205o4478K7054q8221N2905n5039p9029M7656O4579l1216M1500j41208
$$ 525205 460727 487781 399560 452465 397426 318397 366053 430632 399416 440916 299708
5205B99708L3130O4116O9704m5237O1214j43582j49396o3067O8620L3757K2333
$$ 299708 332838 396954 466658 421421 482635 339053 189657 126590 195210 228967 251300
5194B51300R8665N2190n8793j41346O0392J9288L4597J42771O9337j8494J5089
$$ 251300 349965 402155 343362 202016 262408 281696 316293 459064 528401 509907 524996
5183E24996n5592r0575j9747j44250j0050J44453k5188J67608j09095j23988J54031
$$ 524996 469404 378829 359082 214832 204782 349235 324047 491655 382560 258572 412603
5172D12603K9230p8205J38850j82648L0031K6216M8388N066J5746K9871P8000
$$ 412603 441833 363628 502478 319830 349861 376077 424465 429531 445277 475148 553148
5161E53148q977j18064j4383p9312p1699N7797l8702J5626J93385m6992l7948
$$ 553148 544171 426107 411724 332412 260713 318510 279808 295434 488819 441827 403879
5150D03879J15578J5168n2472n0056Q3760p6814L4196k2516J55040M7970m2704
$$ 403879 519457 534625 482153 432097 515857 439043 473239 450723 605763 653733 611029
5139F11029K3658j11264m5852J0903R2000J47424j05273P4652M5144q9885O693
$$ 611029 634687 523423 477571 488474 580474 727898 622625 697277 742421 652536 659229
5128F59229Q7512N088n8801q4044P5448l7300n1253N9325r27P2356P2562N0394
$$ 659229 746741 751829 693028 608984 684432 647132 595879 655204 654277 726633 799195 849589
5116H49589j07194l1508j04941J34895J10059j09556j33831q0M7698J05504R8495
$$ 849589 742395 710887 605946 740841 850900 741344 607513 607433 655131 760635 859130
5105H59130Q7941j57555K6310P518o2919R4826Q6217M1074Q4083k9253l8160L5124
$$ 859130 947071 789516 815826 823344 760425 855251 941468 982542 1066625 1037372 999212 1034336
5093A034336n9826j500q2970o3587O9593R157o677N0755J6210J5530J6700l9211
$$ 1034336 974510 973010 890040 826453 896046 905203 898526 949281 965491 981021 997721 958510
5081I58510m8504r533Q213k0971J3589Q291J13175Q3795J0963N0891l0086J26676
$$ 958510 910006 900473 908686 887715 901304 909595 1022770 1106565 1117528 1168419 1138333 1265009
5069A265009l7730O8587r2334k7482K1553L0121j6513j20214P3006J05163J3635
$$ 1265009 1227279 1295866 1203532 1176050 1197603 1227724 1211211 1090997 1164003 1269166 1282801
5058A282801o7203P258m5384L241L3500o7532j82347J6582p197K4573K2183J13289
$$ 1282801 1215598 1222856 1177472 1180713 1214213 1146681 964334 980916 973719 998292 1020475 1133764
5046A133764K4633j21422Q5608q2898q6292K19497r105p8954l7707O5522p3146
$$ 1133764 1158397 1036975 1122583 1039685 953393 1172890 1163785 1084831 1047124 1112646 1039500
5035A039500j07662J34444Q2904m1131j26085R3688k0247K741M6307j96893L3850
$$ 1039500 931838 1066282 1149186 1108055 981970 1075658 1055411 1058152 1104459 907566 941416
5024I41416o855N6085O5772j20699q5081N2559K28253J718k28344Q8959L4065
$$ 941416 934561 990646 1056418 935719 850638 903197 1131450 1133168 904824 993783 1027848
5013A027848j59017O9060N1669n2073j19031p0839M9567J1100j13905J739M9819
$$ 1027848 868831 937891 989560 937487 818456 747617 797184 808284 694379 696118 745937
5002G45937j1321o0937L7447l5528k0227K0356J1801n3322n9592O6231p279O5878
$$ 745937 734616 673679 711126 675598 655371 675727 687528 634206 574614 640845 633566 699444
4990F99444Q8181j40846k06532L2273J21786L8370o75P3389p5087P548l8078n320
$$ 699444 787625 646779 440247 472520 594306 632676 632001 705390 630303 637851 599773 594453
4978E94453R8188K6030k5114j34270j1273k262M626o2814k8734P6344O5909N5785
$$ 594453 692641 718671 693557 559287 548014 545752 550378 487564 458830 535174 601083 656868
4966F56868l6725j33364j10784J71523K5281J04927l7339k73309O0731P1053N783
$$ 656868 620143 486779 375995 547518 572799 677726 640387 367078 427809 498862 504645
4955E04645k3593q2659j0467J97776O760q7662Q0580j12419p3687o0802l8102
$$ 504645 481052 398393 387926 585702 592462 504800 585380 472961 399274 338472 300370
4944C00370J079Q1707j7507r6302J0807k913J28523M1963M0975J3488n41j3017
$$ 300370 301449 383156 365649 269347 280154 277241 405764 447727 488702 502190 501649 488632
4932D88632N1325j13258J8983J01997J03279l9652R243q3412p9263j8554m5444
$$ 488632 539957 426699 445682 547679 650958 611306 620549 537137 457874 439320 393876
4921C93876l217J48281o4065L7233N1818j18749J1590j22898o8203L1542J69014
$$ 393876 390659 538940 474875 512108 563926 445177 456767 333869 265666 297208 466222
4910D66222j19019O8961J4506O0052J7271O8707L1841p2826j08604l7855M167
$$ 466222 347203 416164 430670 490722 507993 576700 608541 535715 427111 389256 393423
4899C93423P8120P4461N9316O9831M56J6781m1581P2969o0703j68949k007m3964
$$ 393423 471543 546004 605320 675151 675607 692388 650807 723776 663073 494124 492117 448153
4887D48153n1145M6580k7262Q850J35332l8299j95480l0409J17458N274R1541
$$ 448153 397008 443588 416326 425176 560508 522209 326729 296320 413778 419052 510593
4876E10593L4096j89340N8535K3746l3614l8171m2616k2440R0201p423R3150j25563
$$ 510593 544689 355349 413884 437630 404016 365845 323229 300789 390990 383567 476717 351154
4864C51154j23423L4060q0376R6500Q3996q5719k7007J34003J54814o1849q526
$$ 351154 227731 261791 181415 277915 361911 276192 249185 383188 538002 476153 467627
4853D67627j19924Q1634O2646n582l5020N7065n2347r1935Q4201O129J6521O9802
$$ 467627 347703 429337 491983 486401 451381 508446 456099 364164 448365 454494 471015 540817
4841E40817K319p8907l0023m8166K9503J55298l716j60233J82182p2272j18203
$$ 540817 543136 464229 434206 386040 415543 570841 567125 406892 589074 516802 398599
4830C98599k5235n6205N670J91803n8968j9298l5355K1836m264O1808L4273j4445
$$ 398599 373364 317159 322829 514632 455664 436366 401011 422847 418583 480391 514664 500219
4818E00219m6571k2102J06740r098j55647J50744L5772j57331Q8151Q0524j47776
$$ 500219 453648 431546 538286 529188 373541 524285 560057 402726 490877 571401 423625
4807D23625q7359J78888P1344k4804k5453R2872M143j6634j62463o9280J63578
$$ 423625 336266 515154 586498 561694 536241 629113 633256 616622 454159 384879 548457
4796E48457j19373q5049J38230M1080q0023P2019N7935m3476J32343k01435q2210
$$ 548457 429084 344035 482265 523345 443322 515341 573276 529800 662143 460708 378498
4785C78498O215J07434l7170j7001l4527l5335N3089m7085q596K06178J12622
$$ 378498 384713 492147 454977 437976 403449 368114 421203 374118 365522 571700 684322
4774F84322j28488j40544l0883m036o5704O3816O6061M5794p8824p0212O1957
$$ 684322 555834 415290 384407 380371 314667 378483 444544 490338 411514 341302 403259
4763D03259J21271P0468j12137n09p1005j27414R6011J9708K0493k6352J80737
$$ 403259 524530 594998 482861 482352 411347 283933 379944 399652 420145 393793 574530
4752E74530n0195K5513l3898l9390N3342k1505K199j7684j2360O302N8075o5222
$$ 574530 524335 549848 515950 476560 529902 508397 510596 492912 480552 486854 544929 479707
4740D79707j16865M5485R8073m9404M2797J12839M0960j00493j24869J74894o4239
$$ 479707 362842 408327 506400 456996 499793 612632 653592 553099 428230 603124 538885
4729E38885n6464n127m1155J33643k2586p7158J3425m0365p66R9666k1971j400
$$ 538885 482421 477294 436139 569782 547196 470038 483463 443098 442332 541998 520027 518627
4717E18627R1274k5483k03348Q009J8515j09574p4111J28188j3925R0376J15272
$$ 518627 609901 584418 381070 389079 407594 298020 223909 352097 338172 428548 543820
4706E43820o8202L0733p6170J02039M6994j78250r7117N4229J43246m5075m359
$$ 543820 475618 506351 430181 532220 579214 400964 303847 358076 501322 456247 451888
4695D51888K4377j03432o6258Q1550Q1013J37324k5786M487q5318j32505P7418
$$ 451888 476265 372833 306575 388125 469138 606462 580676 585163 499845 367340 444758
4684D44758J70567k2051P2018j06795k4152R0979L155n2379k31017j7151J09785
$$ 444758 615325 593274 665292 558497 534345 625324 628479 576100 345083 327932 437717
4673D37717J66112J0976n2669k8439l4207J11404J4459j00664Q7350L660l2510
$$ 437717 603829 614805 562136 533697 499490 610894 625353 524689 612039 615699 583189
4662E83189P660L6167N903K6214k9137j04018k9160Q8584k2091l0941J18799L1212
$$ 583189 590849 627016 632919 659133 629996 525978 496818 585402 563311 532370 651169 682381
4650F82381K4802O4515j58585N4253q3189j02114J00080J00487J539J01267j56266
$$ 682381 707183 771698 613113 667366 584177 482063 582143 682630 684169 785436 629170
4639F29170q2531M7558L0232P8802L8414R6873o6717j829k0523m0691r4048q8507
$$ 629170 546639 594197 624429 703231 741645 838518 771801 769972 749449 708758 614710 526203
4627E26203L8352J22792M9193k252l8542n7736O9621J45131N3747K5280p5288
$$ 526203 564555 687347 736540 734288 695746 638010 707631 852762 906509 931789 856501
4616H56501o2118j4227M8817M8134J2372K9021l401J207r9538n1160P409r585
$$ 856501 794383 780156 828973 877107 889479 918500 915099 916306 816768 765608 773017 763432
4604G63432J37216j98376N1511R0727o3311M8923j570j26066N2944J12947o0641
$$ 763432 900648 702272 753783 844510 781199 830122 828552 702486 755430 868377 807736
4593H07736k0892M7295J2905j85627L5836J35829m4029J6791J19469j7211K3625
$$ 807736 786844 834139 847044 661417 697253 833082 789053 805844 925313 908102 931727
4582I31727j07146o1574J40242k4200r8130K244m5461n2610Q3961J18191N0363
$$ 931727 824581 763007 903249 879049 780919 783163 737702 685092 769053 887244 937607
4571I37607R2784p0195k04263j6979N605j3750J05703L5764p5517m2039q3468
$$ 937607 1030391 960196 755933 738954 744559 730809 836512 872276 796759 754720 671252
4560F71252o5165O8256J12667N4840l636k0036P3476J5468j51377N5881J57876
$$ 671252 606087 674343 787010 841850 838214 818178 891654 907122 755745 811626 969502
4549I69502j04240j09821j9856L8639J44377l7210j04883m116P9018R181Q481
$$ 969502 865262 755441 735585 774224 918601 881391 776508 772392 851410 860591 869072
4538H69072p2106R595P6968J33544j00050j11759M8118k873j8633J29635L6807
$$ 869072 796966 806561 883529 1017073 917023 805264 853382 850509 831876 961511 998318
4527I98318q6427R3712Q105R4799j32016j52931K871R3984o880j4177O3904M8213
$$ 998318 911891 1005603 1013708 1108507 976491 823560 826431 920415 913535 899358 963262 1011475
4515A011475n9225r3660K9368J09591l7493l4099l4900o4545J31486J1329l0266
$$ 1011475 952250 858590 887958 997549 960056 925957 891057 826512 957998 969327 939061
4504I39061J37620M2407j51986n5862j2217j186K07732p1j16999m6371Q583R2545
$$ 939061 1076681 1119088 967102 911240 899023 897837 1105569 1105498 988499 942128 950711 1043256
4492A043256o497J37560n057K2086J43551j62973o3773Q4148k3262m3065J2435
$$ 1043256 1036759 1174319 1169262 1191348 1334899 1171926 1108153 1192301 1169039 1125974 1138409
4481A138409J86495L2937l0822j1713J9047o2274q6544M8448l6066O1979J6820
$$ 1138409 1324904 1357841 1327019 1315306 1334353 1272079 1185535 1233983 1197917 1259896 1276716
4470A276716q1J3572j23407r0886J51143J6298Q6705M4732P067j33906M0553N4273
$$ 1276716 1276635 1290207 1166800 1075914 1227057 1243355 1330060 1374792 1381859 1247953 1288506 1342779
4458A342779L9436O2637K3049L0456j4271J5820n5429K5754o6323n9347O7333
$$ 1342779 1382215 1444852 1467901 1498357 1484086 1499906 1444477 1470231 1403908 1344561 1411894
4447A411894K35761K8281o9508Q7018M5593j78434J05233K6256j772O2937l7761
$$ 1411894 1647655 1675936 1606428 1693446 1739039 1560605 1665838 1692094 1690322 1753259 1715498
4436A715498m2279J81480K0088o4247r8332K01384R0096j11158J16323n7514r0970
$$ 1715498 1673219 1854699 1874787 1810540 1712208 1913592 2003688 1892530 2008853 1951339 1860369
4425A860369J15207K41334N8814p5656J7923k1001J7166K10912J19410K8123j8374
$$ 1860369 1975576 2216910 2275724 2200068 2217991 2196990 2214156 2425068 2544478 2572601 2554227
4414B554227l134M6097J34675O7674j34377M2088l5010m6047K18990N7917L4888
$$ 2554227 2551093 2597190 2731865 2799539 2665162 2707250 2672240 2626193 2845183 2903100 2937988
4403B937988J15973K39764L5616o44J02352J58641j6736o2311r6093O0574J91096
$$ 2937988 3053961 3293725 3329341 3328697 3431049 3589690 3572954 3510643 3414550 3475124 3666220
4392C666220J00868P36N2451R4433K9234M5133J82044R6409M8959k6256O9752
$$ 3666220 3767088 3767824 3820275 3914708 3943942 3989075 4171119 4267528 4316487 4290231 4359983
4381D359983K34178N7156L4482J96102J32379J9411P0862L6812J79379J66293
$$ 4359983 4594161 4651317 4685799 4881901 5014280 5033691 5104553 5141365 5320744 5487037
4371E487037Q5027K37229L07141K16610J18638L08459L70355J89189J50302L50328
$$ 5487037 5572064 5809293 6116434 6333044 6451682 6760141 7130496 7319685 7469987 7820315
4361G820315L33563L23479M26155N04840L77183M04972M37770N50486N42772M67974
$$ 7820315 8153878 8477357 8903512 9408352 9785535 10190507 10628277 11178763 11721535 12189509
4351A2189509N90209N63880O13369O70152Q00529P38303O95699N65631P65327
$$ 12189509 12779718 13343598 13956967 14627119 15427648 16165951 16861650 17427281 18192608
4342A8192608P84573P14953P68685R32712R23818R85303Q97137Q81859Q16892
$$ 18192608 18977181 19692134 20460819 21393531 22317349 23302652 24199789 25081648 25898540
4333B5898540Q31828O53604P97572P35386N03415N32561N87227N86563N54550
$$ 25898540 26730368 27383972 28181544 28916930 29420345 29952906 30540133 31126696 31681246
4324C1681246O22363N68070M61803M31278M17418K70489J08523j19552j21931
$$ 31681246 32303609 32871679 33333482 33764760 34182178 34452667 34561190 34441638 34319707
4315C4319707j32455l75416k59859k48999m46845l26445k43608k52642l06982
$$ 34319707 34187252 33811836 33551977 33302978 32856133 32529688 32286080 32033438 31726456
4306C1726456m70991n12930n72072o96758p73946p54765p37565p42484o46164
$$ 31726456 31255465 30742535 30170463 29473705 28699759 27944994 27207429 26464945 25818781
4297B5818781p26924o68009q38734p04927p48675p71665p37364o77270n03208
$$ 25818781 25091857 24423848 23585114 22880187 22131512 21359847 20622483 19945213 19442005
4288A9442005n41791p04638n18495o18851n67186n88380n65431m53433k25766
$$ 19442005 18900214 18195576 17677081 17058230 16491044 15902664 15337233 14883800 14658034
4279A4658034k04315l54427l46652k63748j96338j32267p0739k82625p6671M5820
$$ 14658034 14453719 14099292 13752640 13488892 13292554 13160287 13089548 12806923 12730252 12776072
4269A2776072L4025J43098l1071j5114J31851K25354K22724K17087L00582L12594
$$ 12776072 12810097 12953195 12922124 12907010 13038861 13264215 13486939 13704026 14004608 14317202
4259A4317202K94705L70295M03404N25591N44231O24074P10137O26772Q07520
$$ 14317202 14611907 14982202 15385606 15911197 16455428 17079502 17789639 18416411 19223931
4250A9223931Q45336Q93260R22016Q89803Q34695J049917R30908O32402O42705
$$ 19223931 20069267 20962527 21884543 22774346 23609041 24658958 25589866 26222268 26864973
4241B6864973N33504K43423J53270m7418k58779l71433n77005p82997q89907q07502
$$ 26864973 27398477 27641900 27795170 27747752 27488973 27117540 26540535 25757538 24867631 24060129
4231B4060129r55558j014104q82301q28816q77988r16638p22649o08134p53823
$$ 24060129 23104571 22090467 21208166 20379350 19501362 18584724 17862075 17253941 16500118
4222A6500118r54871o38422n98200n14299n28666n78056m86283m75493m22954
$$ 16500118 15545247 14906825 14308625 13794326 13265660 12687604 12201321 11725828 11302874
4213A1302874n52858l26524l32478l18704k23014k84100k77716k34046k15510
$$ 11302874 10750016 10423492 10091014 9772310 9549296 9265196 8987480 8753434 8537924
4204H537924l16427r1781l12381j07322j52724j29774k65081j49495j80193j10706
$$ 8537924 8221497 8129716 7817335 7710013 7557289 7427515 7162434 7012939 6832746 6722040
4194F722040k14194o3698k7072j59533j09893j08900j01241q0524k2882k9262
$$ 6722040 6507846 6444148 6417076 6257543 6147650 6038750 5937509 5856985 5834103 5804841
4184E804841J22720j80882j72819o1037N5545j05468j3358m689o7270J02950J7279
$$ 5804841 5927561 5746679 5573860 5512823 5568368 5462900 5449542 5444853 5377583 5480533 5497812
4173E497812M5071J7338q3109n925p2538j21486K3123R9021j43380K1692j18237
$$ 5497812 5542883 5560221 5477112 5471187 5398649 5277163 5300286 5399307 5255927 5277619 5159382
4162E159382q024R0322k5146r8483L1585j13869J02118r6101l7099M1415Q4958
$$ 5159382 5151358 5241680 5216534 5118051 5149636 5035767 5137885 5041784 5004685 5046100 5131058
4151E131058o4254j64922O0594J71630k4517n1967k4437L5781L3813r5865J0764
$$ 5131058 5066804 4901882 4962476 5134106 5109589 5057622 5033185 5068966 5102779 5006914 5017678
4140E017678q6837L7490P492p5386J01064J07638j31850K3189L9594N0668J46696
$$ 5017678 4930841 4968331 4975823 4900437 5001501 5109139 4977289 5000478 5040072 5090740 5237436
4129E237436m8180M4904R541Q5613n6984q7464L9508R0913R549J5103j8946l2491
$$ 5237436 5189256 5234160 5243701 5329314 5272330 5184866 5224374 5315287 5324836 5339939 5320993 5288502
4117E288502P6157O2196J674Q1347K67437M1410j2330N7038K69750J41808J38404
$$ 5288502 5364659 5426855 5428529 5509876 5777313 5818723 5806393 5863431 6133181 6274989 6413393
4106F413393q7131K4613J3613J33515K89098K6758m1771K24879L36770J57182
$$ 6413393 6326262 6350875 6364488 6498003 6787101 6813859 6772088 6996967 7333737 7490919
4096G490919K6295J37563L37089J16052J21937K1318K40133K43226J53103K25804
$$ 7490919 7517214 7654777 7991866 8107918 8229855 8251173 8491306 8734532 8887635 9113439
4086I113439L94615L27871O4370L83949J02552K74513L33509M31168L16616J81316
$$ 9113439 9508054 9835925 9900295 10284244 10386796 10661309 10994818 11425986 11742602 11923918
4076A1923918L41014M90117L62200M07777N88327M80012M73362N87177P54263
$$ 11923918 12264932 12755049 13117249 13525026 14113353 14593365 15066727 15653904 16408167
4067A6408167O26361N66337Q61687Q03233Q38065J082391J078395J140286J227968
$$ 16408167 17034528 17600865 18462552 19265785 20103850 21186241 22264636 23404922 24632890
4058B4632890J367156J511954J507106J590225J851036K098121K195857K478801
$$ 24632890 26000046 27512000 29019106 30609331 32460367 34558488 36754345 39233146
4050C9233146K536201K565218L005861L062375L039982L240654L055704L059717
$$ 39233146 41769347 44334565 47340426 50402801 53442783 56683437 59739141 62798858
4042F2798858K925060K656253K469726K103820J962603J360980R49742Q76819
$$ 62798858 65723918 68380171 70849897 72953717 74916320 76277300 77227042 78103861
4034G8103861M02759L10285J27020J0194j72502k79179n94398o23307q63204j399174
$$ 78103861 78506620 78816905 78943925 78954119 78781617 78502438 77908040 77284733 76421529 75022355
4024G5022355j668419j950210k095052k415790k549420k915003k938026k896480
$$ 75022355 73353936 71403726 69308674 66892884 64343464 61428461 58490435 55593955
4016E5593955k697253k675689k554736k636100k350480k326647k244552j892436
$$ 55593955 52896702 50221013 47666277 45030177 42679697 40353050 38108498 36216062
4008C6216062k001851j808837j672268j468635j207888j365937j179182j043286
$$ 36216062 34214211 32405374 30733106 29264471 28056583 26690646 25511464 24468178
4000B4468178r91617q85225q42903p97958q97096p45650n90852n10850m11465
$$ 24468178 23476561 22591336 21748433 20950475 20053379 19307729 18716877 18206027 17794562
3991A7794562m83617m72557l56595m15727m31238l39158l98005k54710k67769
$$ 17794562 17310945 16838388 16481793 16066066 15634828 15295670 14897665 14642955 14375186
3982A4375186k51216j58453r2967r5510l71037j78560p7332l58935j72220L7222
$$ 14375186 14123970 13965517 13872550 13777040 13406003 13227443 13150111 12791176 12618956 12656178
3972A2656178q0834j16978n2051j34869j31062L1790N1505o3922Q8987O2159k3110
$$ 12656178 12575344 12458366 12406315 12271446 12140384 12172174 12223679 12159757 12248744 12310903 12287793
3961A2287793j35095m3278M9438J0539J05635K15777J83632J39803K3596K7383
$$ 12287793 12152698 12109420 12158858 12169397 12275032 12490809 12674441 12814244 12837840 12865223
3951A2865223K54188L16395M3274J01631M00533L62084K30180L64924L44990N16978
$$ 12865223 13119411 13435806 13479080 13580711 13981244 14343328 14573508 14938432 15283422 15800400
3941A5800400N09439L42019N47362O84759P05577P21347P03382Q79700R12128
$$ 15800400 16309839 16651858 17199220 17883979 18589556 19310903 20014285 20893985 21806113
3932B1806113P01414Q08948R46201P91859M89208N83725K27330L09911M742o8301
$$ 21806113 22507527 23316475 24262676 25054535 25543743 26127468 26354798 26664709 26669451 26601150
3922B6601150j15467j57338l36183m32812k31639l62201k06555J0214r251O464
$$ 26601150 26485683 26328345 25992162 25559350 25327711 24965510 24758955 24769169 24759918 24766382
3912B4766382r1786J44163K24193K76792L89192L42838M39023N82223O65320N93369
$$ 24766382 24674596 24818759 25042952 25319744 25708936 26051774 26490797 27073020 27738340 28331709
3902B8331709R67736R43894J046243J248662J283666J213905J353148J788028
$$ 28331709 29299445 30243339 31289582 32538244 33821910 35035815 36388963 38176991
3894C8176991J816807J925167K095656K505399K595773K803935L074881L491108
$$ 38176991 39993798 41918965 44014621 46520020 49115793 51919728 54994609 58485717
3886E8485717L678023L947850M394087M516772M738926N056700N056441N005984
$$ 58485717 62163740 66111590 70505677 75022449 79761375 84818075 89874516 94880500
3878I4880500M796412M483074M319571L737539L146323K564517J984337J312302
$$ 94880500 99676912 104159986 108479557 112217096 115363419 117927936 119912273 121224575
3870A21224575J001350N71569J86611l9080p3361m21016m10284m74545n08098
$$ 121224575 122225925 122797494 122984105 122945025 122871664 122450648 122040364 121565819 121057721
3861A21057721o72338q50774r49508j301651j547903j843102k016111k446849
$$ 121057721 120385383 119534609 118585101 117283450 115735547 113892445 111876334 109429485
3853A09429485k924698l238054l518700l704589l902933l934795l914296m094830
$$ 109429485 106504787 103266733 99748033 96043444 92140511 88205716 84291420 80196590
3845H0196590l953455l672297l604084l634542l288484l214353k855511k765039
$$ 80196590 76243135 72570838 68966754 65332212 62043728 58829375 55973864 53208825
3837E3208825k672587k278493k131748j965123j766143j484766j628701j383108
$$ 53208825 50536238 48257745 46125997 44160874 42394731 40909965 39281264 37898156
3829C7898156j198152j070855j007411r02748q17820p87475o99400o12821n00823
$$ 37898156 36700004 35629149 34621738 33718990 32901170 32113695 31414295 30801474 30300651
3820C0300651n14121m79550l36538l37700k88395j14383k82416N6133J41639K2297
$$ 30300651 29786530 29306980 28970442 28632742 28344347 28229964 27947548 28003681 28145320 28167617
3810B8167617P3649Q8506L0798N1212J29109J0832l4216k80669l91943m98431
$$ 28167617 28241266 28329772 28360570 28411782 28540891 28551723 28517507 28236838 27844895 27346464
3800B7346464n27340n54077o30029p43548p61606r37501r42344q23180q56634
$$ 27346464 26819124 26265047 25635018 24891470 24129864 23192363 22250019 21426839 20570205
3791B0570205p17122q18472o30719p12025p32021p22412n47524o14211n69217
$$ 20570205 19853083 19034611 18403892 17691867 16959846 16237434 15689910 15075699 14506482
3782A4506482l14922n05160m61059l24942l37232l38700k17670l43024j76519
$$ 14506482 14191560 13686400 13225341 12900399 12563167 12224467 12006797 11663773 11487254
3773A1487254k55463j53407j27039k08179k93630k73714p6496j37155r7317k90980
$$ 11487254 11231791 11078384 10951345 10743166 10449536 10175822 10099326 9962171 9864854 9573874
3763I573874j75937j3067q6707j42622j28925q7673j66265j18065q4309j54990
$$ 9573874 9397937 9384870 9298163 9155541 9026616 8938943 8772678 8654613 8570304 8415314
3753H415314K0860j6581m9769k21756j05136j7586j24663k38977k9756l4197q7282
$$ 8415314 8436174 8419593 8369824 8148068 8042932 8025346 7900683 7661706 7631950 7597753 7510471
3742G510471P4421m7813p6281j98645l0617J16471j0448o5402j47623j32516r1195
$$ 7510471 7584892 7537079 7460798 7262153 7231536 7348007 7337559 7272157 7124534 6992018 6900823
3731F900823j33506j5518p1942N3131j48818L3307j48279p1473L9657j22650j76663
$$ 6900823 6767317 6751799 6679857 6732988 6584170 6617477 6469198 6397725 6437382 6314732 6138069
3720F138069N6063R4553q9025j13694k4121L4219j63541j8301j9628M504M9262
$$ 6138069 6194132 6288685 6199660 6085966 6061845 6096064 5932523 5914222 5894594 5899098 5948360
3709E948360n9750j3490L7474p348L0606M1842j10867r295K896o4048R5595J2874
$$ 5948360 5888610 5875120 5912594 5905246 5935852 5977694 5866827 5857532 5860428 5796380 5891975 5904849
3697E904849n1435k8882l654J629N8749L6738O5321m6588l7148J83112j5388K9980
$$ 5904849 5853414 5824532 5820878 5822507 5881256 5917994 5983315 5936727 5899579 6082691 6067303 6097283
3685F097283K4858m2400q7731N7379J55376R666r756J42681J16187M6757m0170
$$ 6097283 6122141 6079741 5992010 6049389 6204765 6214431 6204675 6347356 6463543 6510300 6470130
3674F470130J108J87789J37662J30424j5182O8218L7491R3344R9078J07893O5787
$$ 6470130 6471238 6659027 6796689 6927113 6911931 6980149 7017640 7110984 7210062 7317955 7383742
3663G383742J24026K4362P4204J58620K10219J73252J94867O0138J97644K65503
$$ 7383742 7507768 7532130 7606334 7764954 7975173 8148425 8343292 8403430 8601074 8866577
3653H866577K43397K32888L55355L03801K55902L01879M75814L51165L97639N83548
$$ 8866577 9109974 9342862 9698217 10002018 10257920 10559799 11035613 11386778 11784417 12367965
3643A2367965N57509M23657N30529Q20748O88957O78474Q22652R66347Q00736
$$ 12367965 12925474 13349131 13879660 14700408 15389365 16067839 16890491 17856838 18657574
3634A8657574P78475R18902P86576P39232N76304O44276N93677M36914L94577
$$ 18657574 19436049 20354951 21141527 21880759 22457063 23101339 23695016 24131930 24526507
3625B4526507K23130L16171L28036K86668K69649J36581O0553J69502J49368n3811
$$ 24526507 24749637 25065808 25393844 25680512 25950161 26086742 26147295 26316797 26466165 26412354
3615B6412354k10823k69354k34693j84487l34544l39258m00756k91615l15141
$$ 26412354 26201531 25932177 25697484 25512997 25178453 24839195 24438439 24146824 23831683
3606B3831683k43563k45479j24477m8371P2575J56152P9158K12217L28426M50916
$$ 23831683 23588120 23342641 23218164 23169793 23242368 23398520 23477678 23689895 24018321 24469237
3596B4469237O97793N88170O81119P95713Q16019J055337J344846J353505J480708
$$ 24469237 25167030 25755200 26436319 27232032 28048051 29103388 30448234 31801739 33282447
3587C3282447J684242J758495J843878K010585J992110K188933K560363K534933
$$ 33282447 34966689 36725184 38569062 40579647 42571757 44760690 47321053 49855986
3579D9855986K484736K613776K683201K682671K477071K383516K132548J918555
$$ 49855986 52340722 54954498 57637699 60320370 62797441 65180957 67313505 69232060
3571F9232060J655992J527167J282911J070868Q76998M20022L29048L22737J25673
$$ 69232060 70888052 72415219 73698130 74768998 75645996 76066018 76395066 76717803 76843476
3562G6843476k9566k05668n13167o27841o94684r98452j008406j156379j416068
$$ 76843476 76813910 76608242 76095075 75467234 74772550 73774098 72765692 71609313 70193245
3553G0193245j437631j473567j340166j329349j303679j089829p13198p13895
$$ 70193245 68755614 67282047 65941881 64612532 63308853 62219024 61505826 60791931
3545F0791931o34095j75610J86346L28125M19845N79876J027337J233061J123467
$$ 60791931 60157836 59982226 60168572 60496697 60916542 61496418 62523755 63756816 64880283
3536F4880283J200082J303266J364650J347456J073842Q75423Q09088Q23446O76405
$$ 64880283 66080365 67383631 68748281 70095737 71169579 72045002 72854090 73677536 74353941
3527G4353941N15290J22280n7350M53j42402l77788m72760o25119q60120j081879
$$ 74353941 74869231 74991511 74934161 74934614 74792212 74414424 73941664 73316545 72456425 71374546
3517G1374546j289751j544586j694431j744160k056149k295434k380763k333143
$$ 71374546 70084795 68540209 66845778 65101618 63045469 60750035 58369272 56036129
3509E6036129k307356k400022k307832k300920k062238j856683j832266j939528
$$ 56036129 53728773 51328751 49020919 46719999 44657761 42801078 40968812 39029284
3501C9029284j491040j409662j205409j044355j074146j053044q04759o34028
$$ 39029284 37538244 36128582 34923173 33878818 32804672 31751628 30946869 30312841
3493C0312841p85751n28976l58037k87406k71085j34336r559n5159J03460J99521
$$ 30312841 29527090 28998114 28640077 28352671 28081586 27947250 27937691 27882532 27985992 28185513
3483B8185513K35459M68124N22888N28482N38268N32535N76949O05394O29501
$$ 28185513 28420972 28889096 29411984 29940466 30478734 31011269 31588218 32193612 32823113
3474C2823113P56253N76803L06066M20385L80257K97785L49841K40514K71042
$$ 32823113 33579366 34156169 34462235 34882620 35262877 35560662 35910503 36151017 36422059
3465C6422059J72386K46253K60683J46797R6479R512p2995k13581m25991l38909
$$ 36422059 36594445 36840698 37101381 37248178 37344657 37354169 37281174 37067593 36641602 36302693
3455C6302693o21520n22745p77150j093029j166361j256368j195971j050390q93635
$$ 36302693 35681173 35158428 34381278 33288249 32121888 30865520 29669549 28619159 27725524
3446B7725524r52283q89351p12647p86262p07436m45807l64956m23183k04763
$$ 27725524 26773241 25883890 25171243 24384981 23677545 23231738 22866782 22443599 22238836
3437B2238836l88947l18252j47675m5333l3196K7807K66975J68752J59654K37744
$$ 22238836 21849889 21531637 21383962 21338629 21305433 21333240 21600215 21768967 21928621 22166365
3427B2166365K20804M34717O49116M07518P31747O13260P28416Q45653O96057
$$ 22166365 22387169 22821886 23471002 23878520 24610267 25223527 25951943 26797596 27493653
3418B7493653P77094R23172R10316R67980J008248J132496J385277J478519J578379
$$ 27493653 28270747 29193919 30104235 31072215 32080463 33212959 34598236 36076755 37655134
3409C7655134J897707J856482K015107K110714K142028K188317J978419K043699
$$ 37655134 39552841 41409323 43424430 45535144 47677172 49865489 51843908 53887607
3401E3887607J968191J969714J748201J538797J437227J109908J008389Q80661
$$ 53887607 55855798 57825512 59573713 61112510 62549737 63659645 64668034 65548695
3393F5548695O10245O67515O26710N44111M26934K87514K52317J15347K14690
$$ 65548695 66158940 66826455 67453165 67997276 68424210 68711724 68964041 69079388 69294078
3384F9294078J03473j42789m45998o95374q94822j227301j715596k039470k146372
$$ 69294078 69397551 69254762 68808764 68113390 67218568 65991267 64275671 62236201 60089829
3375F0089829k493710k633413k570751k624520k837933k442306k359116k500322
$$ 60089829 57596119 54962706 52391955 49767435 46929502 44487196 42128080 39627758
3367C9627758k134172k052255j903291j783607j699628j449847j286057j336607
$$ 39627758 37493586 35441331 33538040 31754433 30054805 28604958 27318901 25982294
3359B5982294j145728j064233j238778r68828o80357q34137q13154p50004n69743
$$ 25982294 24836566 23772333 22533555 21564727 20884370 20050233 19237079 18487075 17917332
3350A7917332m94911n44147n31784m17958l11120m16632k51786k35469k63606
$$ 17917332 17422421 16878274 16346490 15928532 15617412 15200780 14948994 14713525 14449919
3341A4449919k08715j46346k38261l19626n3233N6840q6512K2563J1516K426J54847
$$ 14449919 14241204 14094858 13856597 13536971 13483738 13540578 13454066 13476629 13488145 13490571 13645418
3330A3645418R1387J27316K22102J48003J18435O4584J95517O6669j69136j05264
$$ 13645418 13736805 13864121 14086223 14234226 14352661 14417245 14612762 14679431 14510295 14405031
3320A4405031l21792k87118l80431n32225l93409k23002l38144n56657m68553
$$ 14405031 14083239 13796121 13415690 12883465 12490056 12267054 11928910 11372253 10903700
3311A0903700k33508l39572l67449l54158j78875k40384k94047k04098k84117
$$ 10903700 10670192 10330620 9963171 9609013 9430138 9189754 8895707 8691609 8407492
3302H407492j23715k46311p1806j11616o6428l75351k39049r511M8983n0876k38688
$$ 8407492 8283777 8037466 7965660 7854044 7787616 7412265 7173216 7163705 7212688 7161812 6923124
3291F923124m4805o0772j00479O184l1524p3063k3132r925n5315j54652L7996
$$ 6923124 6878319 6817547 6717068 6723252 6691728 6618665 6595533 6585608 6530293 6375641 6413637
3280F413637N0633j39428j02971l8166r5749j2577O7768o9405j10080o1384m2196
$$ 6413637 6464270 6324842 6221871 6183705 6087956 6075379 6143147 6073742 5963662 5902278 5860082
3269E860082O5704J10959l3428r0034M1784m8639p2688n2638m1581r1203O8163
$$ 5860082 5925786 6036745 6003317 5913283 5955067 5906428 5833740 5781102 5739521 5648318 5716481
3258E716481j8166o1122P9683K8243n4341n3242m434N9843m2354l0820k8493r7361
$$ 5716481 5698315 5637193 5716876 5745119 5690778 5637536 5633102 5692945 5650591 5619771 5591278 5493917
3246E493917k4439K5292n8716l51J56205n286p7352N612R8003k7517o5634r699
$$ 5493917 5469478 5494770 5436054 5435703 5591908 5586622 5509270 5514882 5612885 5585368 5519734 5510035
3234E510035J04606N3426j36091M6557Q9664m5633J5554K9169k6075j2391J96811
$$ 5510035 5614641 5668067 5531976 5578533 5668197 5622564 5638118 5667287 5641212 5628821 5825632
3223E825632O0770l6065P2585j82k6553J79672J02897L1195o5951P6848J98920
$$ 5825632 5886402 5850337 5922922 5922740 5896187 6075859 6178756 6209951 6144000 6220848 6419768
3212F419768K8805P2339P2942J32332J87410P0703O5573J04060L7781J97986J97134
$$ 6419768 6448573 6520912 6593854 6726186 6913596 6984299 7049872 7153932 7191713 7389699 7586833
3201G586833J68110P6792Q3220N6892J95937J28843J63897K19505J30242Q9137
$$ 7586833 7754943 7831735 7914955 7971847 8167784 8296627 8460524 8680029 8810271 8899408
3191H899408K43419K13121R4965P0977K36037L11657K79240J65594L19770K64229
$$ 8899408 9142827 9355948 9450913 9521890 9757927 10069584 10348824 10514418 10834188 11098417
3181A1098417L14607L29503K48308M44785K29160L68775M17447K49041N3548R3812
$$ 11098417 11413024 11742527 11990835 12435620 12664780 13033555 13451002 13700043 13753591 13847403
3171A3847403L42409N64024L27493L83010L72748M33831N65975P19598O89227
$$ 13847403 14189812 14753836 15081329 15464339 15837087 16270918 16836893 17556491 18245718
3162A8245718P04681R74004R40047J400800J477151J534245J310160O03073O7384
$$ 18245718 18950399 19924403 20864450 22265250 23742401 25276646 26586806 27189879 27257263
3153B7257263l31422l92135o09884l25350j06005l562K28181L60908K71648N01199
$$ 27257263 26925841 26533706 25923822 25598472 25492467 25488905 25717086 26077994 26349642 26850841
3143B6850841N98169N53549O84052N96574R06208J009555R32067R61855J053926
$$ 26850841 27449010 28002559 28686611 29283185 30189393 31198948 32131015 33092870 34146796
3134C4146796J248176J181141J348166J489990J554787J813522J864416J997238
$$ 34146796 35394972 36576113 37924279 39414269 40969056 42782578 44646994 46644232
3126D6644232K211624K357448K645847L004886L216233L427736L570921L814360
$$ 46644232 48855856 51213304 53859151 56864037 60080270 63508006 67078927 70893287
3118G0893287M109608M460604M812781N402253O007308O480936P193225P971261
$$ 70893287 75002895 79463499 84276280 89678533 95685841 102166777 109360002 117331263
3110A17331263Q863007J0009301J1318185J2609363J4159277J5896134J7836523
$$ 117331263 126194270 136203571 147521756 160131119 174290396 190186530 208023053
3103B08023053J9740380K1491641K2872908K3195333K1952947J8453224J2444533
$$ 208023053 227763433 249255074 272127982 295323315 317276262 335729486 348174019
3096C48174019M332544m296941j1694781j7090993j9872662k0739877k0412632
$$ 348174019 352506563 348209622 336514841 319423848 299551186 278811309 258398677
3089B58398677j9328251j7821201j6495929j5031680j3652464j2555144j1659320
$$ 258398677 239070426 221249225 204753296 189721616 176069152 163514008 151854688
3082A51854688j0899281r874286r100493q047197p487016o628739o205323n656734
$$ 151854688 140955407 131081121 121980628 113933431 106446415 99817676 93612353 87955619
3074H7955619n165339m715111m110587l812900l611598l434040l042174k714332
$$ 87955619 82790280 78075169 73964582 70151682 66540084 63106044 60063870 57349538
3066E7349538k666687k413248k240131k126725j917607j895333j843901j770321
$$ 57349538 54682851 52269603 50029472 47902747 45985140 44089807 42245906 40475585
3058D0475585j587416j531615j433190j405747j210538j237445j074695j055310
$$ 40475585 38888169 37356554 35923364 34517617 33307079 32069634 30994939 29939629
3050B9939629r41361r42503r85591q07613o79804q68407o57466o87172o76794
$$ 29939629 28998268 28055765 27070174 26262561 25582757 24714350 24056884 23369712 22692918
3041B2692918n44209p14859o00538n68227n35636n06303m50192l21131m73931
$$ 22692918 22148709 21433850 20833312 20265085 19729449 19223146 18772954 18451823 17977892
3032A7977892n16382n68543m17254k59908m82049l89495l02405k62903k40191
$$ 17977892 17461510 16892967 16475713 16215805 15733756 15344261 15041856 14778953 14538762
3023A4538762k52969k35163r1304k14286l79687k46170k70667j88572j62769k25751
$$ 14538762 14285793 14050630 13959326 13745040 13365353 13119183 12848516 12659944 12497175 12271424
3013A2271424l15487k24121k11489k00172l25317j91228j51101k08478j75327
$$ 12271424 11955937 11731816 11520327 11320155 10994838 10803610 10652509 10444031 10268704
3004A0268704k15102J6662j57363q8008k92475j18256j35085k25844j87904n1553
$$ 10268704 10053602 10070264 9912901 9824893 9532418 9414162 9279077 9053233 8865329 8813776
2994H813776Q8598q6084j01804j69809k12900j95435j28966j56439p9360p4332
$$ 8813776 8902374 8816290 8714486 8544677 8331777 8136342 8007376 7850937 7771577 7697245
2984G697245j63044N1531J235j51348R353j60942j29742j01803p7148k8007p6247
$$ 7697245 7534201 7585732 7586967 7435619 7444972 7284030 7154288 7052485 6975337 6947330 6871083
2973F871083j30932j73739m5691R6283j38335j82455m1645j19628m5317o029p9731
$$ 6871083 6740151 6566412 6520721 6617004 6478669 6296214 6254569 6134941 6089624 6083595 6003864
2962F003864j71271j10431L918p1344r4887r3035j47181j80035p0427L2593q9694
$$ 6003864 5832593 5722162 5726080 5654736 5559849 5466814 5319633 5139598 5069171 5101764 5012070
2951E012070q2750j02006N5957j4200j66106j33381k28268k7271K0685L2285j20878
$$ 5012070 4929320 4827314 4883271 4869071 4702965 4569584 4341316 4314045 4334730 4367015 4246137
2940D246137j02065M0032n6737m1469j39520o5711J0264J03218n5307j51558j27308
$$ 4246137 4144072 4184104 4127367 4085898 3946378 3880667 3890931 3994149 3938842 3787284 3659976
2929C659976o2649Q2936j1492L1952j713p1512k7030n8762q0647k0186J9249J741
$$ 3659976 3597327 3680263 3668771 3700723 3699010 3627498 3600468 3541706 3461059 3440873 3460122 3461863
2917C461863j36926k26842q4554O9621Q5195p2661N6374J01404J8945r8886o2727
$$ 3461863 3324937 3098095 3013541 3083162 3168357 3095696 3152070 3253474 3272419 3173533 3110806
2906C110806n3447p3699J5091N5587j32963r8591m0237j6231R5770r0064o6340
$$ 3110806 3057359 2983660 2998751 3054338 2921375 2822784 2782547 2766316 2862086 2772022 2705682
2895B705682k9178j13084K8329o0458p0089n7936J9989l7200o0763k2842O1740
$$ 2705682 2676504 2563420 2591749 2531291 2461202 2403266 2423255 2386055 2325292 2302450 2364190
2884B364190J04707j0950j29165j11089l3968q0978k7863Q0955O9172p2982o1458
$$ 2364190 2468897 2457947 2328782 2217693 2183725 2102747 2074884 2155839 2225011 2152029 2090571
2873B090571l062K9976j24000l468M0905J51515J09904j48369j07299K9364j10358
$$ 2090571 2087509 2117485 1993485 1990017 2030922 2182437 2292341 2143972 2036673 2066037 1955679
2862A955679P4460p2299j04607k3784j07050O5956N4383k6148O872R6062k9619
$$ 1955679 2030139 1957840 1853233 1829449 1722399 1788355 1842738 1816590 1823462 1919524 1889905
2851A889905p7834L1733m9592N6149M1193j00410n866m8806o749k3227o0045J21302
$$ 1889905 1812071 1843804 1794212 1850361 1891554 1791144 1785278 1736472 1729723 1706496 1646451 1767753
2839A767753J40543P026K8481k4843j7009p5198J35338l768j6997L023O7391L9289
$$ 1767753 1908296 1915322 1943803 1918960 1901951 1826753 1962091 1958323 1941326 1944349 2011740 2051029
2827B051029j01209J06909P2726J60511q5701k4582N1624J04868J20478O0127
$$ 2051029 1949820 2056729 2129455 2289966 2204265 2179683 2231307 2336175 2456653 2516780
2817B516780J44624J72547K3055K7561k0681O1365M911r059L4107q1972j87160
$$ 2516780 2661404 2833951 2857006 2884567 2863886 2925251 2930162 2921103 2955210 2873238 2686078
2806B686078j14263j48727p9209J1735q280m7623j04021r9744k6979j01714o2151
$$ 2686078 2571815 2423088 2343879 2355614 2347334 2299711 2195690 2095946 2068967 1967253 1905102
2795A905102O1000o4623r7880k22815m6280j1101m2841K2563P8779P813p7839
$$ 1905102 1966102 1901479 1803599 1580784 1534504 1523403 1480562 1503125 1581904 1589717 1511878
2784A511878p4272J5260N262J2577L5639M6898r3215n9863R451k5011L8173j93350
$$ 1511878 1437606 1452866 1458128 1470705 1506344 1553242 1460027 1400164 1409615 1384604 1422777 1229427
2772A229427K4631M4865J1185o7442j2460m4426l0597J47715q0401j09096J79906
$$ 1229427 1254058 1298923 1310108 1242666 1230206 1185780 1155183 1302898 1222497 1113401 1293307
2761A293307L9894j09681L0058L3901j09638p4561P2673M2920l5911L5099m3616
$$ 1293307 1333201 1223520 1253578 1287479 1177841 1103280 1175953 1218873 1182962 1218061 1174445
2750A174445j82137l1698K5460l5804n7981P6067p4348P8394J94677j88247j19010
$$ 1174445 992308 960610 986070 950266 892285 968352 894004 972398 1167075 978828 859818
2739H59818J17291k9223l948q0230j03023P7907R9177j15042q8398m6751Q1972
$$ 859818 977109 947886 943938 863708 760685 838592 937769 822727 734329 687578 769550
2728G69550K3899J9078j09862Q5204K9364j05137j58083l7133K39655J50092j16872
$$ 769550 793449 812527 702665 787869 817233 712096 554013 516880 756535 906627 789755
2717G89755o5173k233j9039O775J00946O2126j08995p4914Q7973q9545q5697q5303
$$ 789755 724582 722349 703310 710085 811031 873157 764162 689248 777221 687676 601979 516676
2705E16676L2082J53911J54472J37746k35977k29902J80805k1169l0731N1240
$$ 516676 548758 702669 857141 994887 758910 529008 709813 688644 657913 709153
2695G09153P7914R3L399r2842j17252N0004J5993J30126p6113K5864Q446Q0239
$$ 709153 787067 787160 790559 697717 580465 630469 646462 776588 700475 726339 734785 815024
2683H15024n4557R982r2721J02881K8309p5600L1668n1000j83559O7255N1568
$$ 815024 760467 770449 677728 780609 808918 733318 764986 713986 530427 597682 649250
2672F49250j24120J79597n8302q7126L5237l29J6806N8488O5591L80j61599K0110
$$ 649250 525130 704727 646425 559299 594536 594207 611013 669501 735092 735472 573873 593983
2660E93983P2766j00539J68766J04458j30176k1492p1889Q1935J29636j27385
$$ 593983 666749 566210 734976 839434 709258 687766 615877 697812 827448 700063
2650G00063k5229J1310M5690O8676o7677k03508m1159J98316R4211j41108J5664
$$ 700063 674834 686144 731834 800510 732833 529325 488166 686482 780693 639585 655249
2639F55249K9721K7730o4821k6855Q2016o5994J15442N826q4639m2671J6115R6740
$$ 655249 684970 712700 647879 621024 703040 637046 752488 758314 673675 631004 647119 743859
2627G43859j25823M8377l7110p5899L9105p1509q4J39154L0275L4011r576K797
$$ 743859 618036 666413 629303 553404 592509 521000 520916 660070 690345 724356 714780 717577
2615G17577K5818j51647J2004n4614l5180j6844j05737j8823J34673N5645P1346
$$ 717577 743395 591748 603752 549138 513958 497114 391377 372554 507227 562872 634218
2604F34218k7935j75528K101m5363J05978R1227l75M7851Q0977j59456N5595N0500
$$ 634218 606283 430755 432856 387493 493471 584698 584323 632174 713151 553695 609290 659790
2592F59790J29906K4612n0829k992j30820R6346k5763l2334L8166P4226j4214
$$ 659790 789696 814308 763479 760487 629667 726013 700250 667916 706082 780308 766094
2581G66094j51996m159K4695M2453j63811j7292k8916J3117N5362P4520k1936
$$ 766094 614098 609939 634634 677087 513276 495984 467068 480185 535547 610067 588131
2570E88131N435M0046l3520l9651p9887j2917L8693J82007o2271n5430p6825N6522
$$ 588131 593566 633612 600092 560441 480554 467637 506330 688337 626066 570636 493811 550333
2558E50333j0893P402J38241k4638n9798N1852k4857j24576r561K5896j52160
$$ 550333 539440 546842 685083 660445 600647 652499 627642 503066 493505 519401 367241
2547C67241M6536Q7047k135J72121q1073R135M3253l2631J8163m6564k3862l7014
$$ 367241 413777 500824 498689 670810 589737 598872 642125 609494 627657 581093 557231 520217
2535E20217q712j74874R2510k9771n2769L6491k3838l0043J38921P1551P4935
$$ 520217 511505 336631 429141 399370 346601 383092 359254 329211 468132 539683 614618
2524F14618r4452j64728l9499L9996P0797l0544k8994M0303j8297R4005N1943
$$ 614618 520166 355438 315939 355935 426732 396188 367194 407497 389200 483205 535148
2513E35148j0130j1998n0473J38173M8279m0493O435m4707k9507j5921O1682o9299
$$ 535148 525018 513020 462547 600720 648999 608506 614941 570234 540727 524806 586488 517189
2501E17189k3138L7081o1625N2370l5633j13281P1859Q3263N5637j90959J18032
$$ 517189 494051 531132 469507 521877 486244 372963 444822 528085 583722 392763 510795
2490E10795k430j14078Q6799J16235L0380O2890l2735j41163j6848j13600l1177
$$ 510795 508365 394287 481086 597321 627701 690591 657856 516693 499845 386245 355068
2479C55068J45940M8889j8651r6728K135N461L2164L9494M3092m1477O4286L8845
$$ 355068 501008 549897 531246 434518 436653 442114 474278 513772 556864 515387 579673 618518
2467F18518l00014J8440J12446k429R8459L9938n3152j07417p2504Q2746K2414
$$ 618518 318504 336944 449390 446961 545420 585358 532206 424789 352285 435031 457445
2456D57445J3070k3442J64588j9209m6875k4441n9232M2845j4029N2995R7993
$$ 457445 470515 447073 611661 592452 545577 521136 461904 504749 490720 543715 641708
2445F41708j45383l2696J29635Q2245k1928J16177J7998j08776k17277l5853l4326
$$ 641708 496325 463629 593264 675509 653581 769758 787756 678980 461703 425850 391524
2434C91524O5429J07643m4355n1228r418P1550J25918K0535l2807r2070p9858
$$ 391524 456953 564596 520241 469013 459595 531145 657063 677598 644791 552721 472863
2423D72863O2634j2121p8364J34854J17619P3312q1032m0421j45407J14511M676
$$ 472863 535497 523376 445012 579866 697485 770797 689765 649344 503937 618448 623124
2412F23124n8849J02841J04288o487l7454l7834J6442m2045j7375p9193K38589
$$ 623124 564275 667116 771404 764917 727463 689629 706071 664026 646651 567458 806047
2401H06047j67396l5702M7945M4940J15895j31358P6616J17015K676O957Q2670
$$ 806047 638651 602949 650894 695834 811729 680371 756987 874002 876678 883635 966305
2390I66305K3708J21144j00934n7180M073j2182l9306K7585K22636j4677j20024
$$ 966305 990013 1111157 1010223 953043 957116 944934 905628 933213 1155849 1141172 1021148
2379A021148p644Q1156P1165j38637M4650Q2559N3098l8914K19634N6345j8304
$$ 1021148 1013504 1094660 1165825 1027188 1071838 1154397 1207495 1168581 1388215 1444560 1426256
2368A426256J19376J02929K2640P5278J8535j39213J17181K59713m0953O781K02942
$$ 1426256 1545632 1648561 1671201 1746479 1765014 1625801 1742982 2002695 1961742 1968523 2171465
2357B171465K23672n7614M2019R6570J32961N5155P1875K23859K14577Q6317J31773
$$ 2171465 2395137 2337523 2379542 2476112 2609073 2664228 2736103 2959962 3174539 3260856 3392629
2346C392629J45273K95632J97140L90385L77557K55688M30397L96869M58852M88397
$$ 3392629 3537902 3833534 4030674 4421059 4798616 5054304 5484701 5881570 6340422 6828819
2336F828819P19470O75907N44412N23164N15888N68490Q60289J179774J445997
$$ 6828819 7548289 8224196 8768608 9291772 9807660 10376150 11236439 12416213 13862210
2327A3862210J583646J955681K520937L177814M205085N864336P658139R030545
$$ 13862210 15445856 17401537 19922474 23100288 27305373 33169709 40827848 49858393
2319D9858393O926798j909701o983833p833791o736569m749222l673799k846254
$$ 49858393 56785191 54875490 47891657 40057866 33321297 28572075 24898276 22052022
2311B2052022k445466j871684j613218j156754r20435r56742r15865q30601r51633
$$ 22052022 19606556 17734872 16121654 14964900 14044465 13087723 12171858 11341257 10389624
2302A0389624r03978q58828n81351o03234o04384m58593l67100l86424l92601
$$ 10389624 9485646 8626818 8045467 7442233 6837849 6379256 6012156 5625732 5233131
2293E233131k70110k15971j93215k29771k17941j49400k76394r2490q3654k43310
$$ 5233131 4963021 4747050 4553835 4324064 4106123 3956723 3680329 3587839 3504185 3260875
2283C260875l3274q695j16258j47656j85212r8204j57841j56078l7591J4264j14411
$$ 3260875 3227601 3218906 3102648 2954992 2769780 2671576 2513735 2357657 2320066 2334330 2219919
2272B219919n9824q2121N9220n6471k22730p7843m299o2909J772O4637m9769r6166
$$ 2219919 2160095 2077974 2137194 2080723 1857993 1780150 1775851 1712942 1714714 1779351 1729582 1633416
2260A633416p2737L3289n0198j25669J7484j48179J04209J18201p1804p4138J2734
$$ 1633416 1560679 1593968 1543770 1418101 1435585 1287406 1391615 1509816 1438012 1363874 1376608
2249A376608J0408m6626j00644j21597J2719p6786R4687o5276J03406P1326l4085
$$ 1376608 1387016 1340390 1239746 1118149 1130868 1054082 1148769 1083493 1186899 1258225 1224140
2238A224140k6065p9485L5978p1096O9743j26321j6866j09692P5394J19949k2989
$$ 1224140 1198075 1118590 1154568 1083472 1153215 1026894 1010028 900336 975730 1095679 1072690
2227A072690m3368n4825j35375j3233p1874J25075j6489m5901j4415l1331k3247
$$ 1072690 1029322 974497 839122 825889 754015 879090 862601 816700 802285 770954 747707
2216G47707L1026p6450j0770K19891L0357p4445j06881k9847j7909K9784P4025
$$ 747707 778733 702283 691513 911404 941761 867316 760435 730588 712679 742463 816488
2205H16488j08100Q9249O6016j34971j21004M8095J06959k1907n9134l3042q5000
$$ 816488 708388 797637 863653 728682 607678 655773 762732 740825 681691 648649 563649
2194E63649J50674Q0194K768l014r5883j6723j00069M0921J2989p7649j7764k8879
$$ 563649 714323 794517 797285 794271 698388 681665 581596 622517 635506 557857 540093 511214
2182E11214r3250L5605J58546M455K4249M7915k6800r89j4897K8159j38710l0861
$$ 511214 417964 453569 612115 616570 640819 688734 661934 660945 646048 674207 535497 504636
2170E04636N5003J1563k8193n0698J46945p882r2730Q6883l4187O818k18708J6451
$$ 504636 559639 571202 543009 492311 639256 631374 538644 625527 591340 598158 379450 395901
2158C95901P355p4168K7572k647N9267Q0334K8420o6924m7125N711l9789Q5046
$$ 395901 403256 329088 356660 354013 413280 493614 522034 455110 407985 413696 373907 458953
2146D58953m6159j2274J8437J08427j24296k34849J13961J10201j5247N3667m7718
$$ 458953 412794 400520 418957 527384 403088 168239 282200 392401 377154 430821 383103
2135C83103M3928k2431q1265J4274J38278L3759L7317j85142N2912l2939O0679
$$ 383103 427031 404600 323335 337609 475887 509646 546963 361821 414733 381794 442473
2124D42473q8345r1753M7070n0536l401m6451o899J22461m2226N183n5191j38290
$$ 442473 354128 262375 309445 258909 255508 209057 202158 324619 282393 287576 232385 94095
2112I4095K41589j28496j09705R9817L3538M3516N6648L3041l4320J53952k5940
$$ 94095 335684 207188 97483 197300 230838 274354 331002 364043 329723 483675 457735
2101D57735l8447Q2377q7922r5703R620J4544K1716P3095k2072j1049j17563J3175
$$ 457735 419288 501665 413743 318040 327660 342204 363920 437015 414943 403894 286331 299506
2089B99506P0295j12770R9547P8502j16534J2819L9958p3432q5837n2102J46468
$$ 299506 369801 257031 356578 435080 318546 331365 371323 297891 212054 159952 306420
2078C06420Q2219N4394j50095k5120J24822J5370K4156j29484Q6330j61464R3433
$$ 306420 388639 443033 292938 267818 392640 408010 432166 302682 389012 227548 320981
2067C20981J1755N1686n0942J37820M0318p558j23744q3356N5949J14716k8902
$$ 320981 332736 384422 333480 471300 511618 504060 380316 296960 352909 467625 438723
2056D38723Q7806l0944j3113n2220N4309n9153l9501M8640J13444K0911j23512
$$ 438723 526529 495585 482472 430252 484561 425408 385907 434547 547991 568902 445390
2045D45390K005m2810J3824N1433j34368J0594N7788q7960M9738k9564J9347Q3217
$$ 445390 447395 404585 418409 469842 335474 346068 403856 315896 365634 336070 355417 438634
2033D38634m0617q4496j01200O4140K8040n2883N4714m2379j8406p4619k1261
$$ 438634 398017 313521 212321 276461 304501 251618 306332 263953 245547 170928 149667
2022A49667J173q3941R7181J55937Q2285j1683r9566J9087j880J8510r5508n5526
$$ 149667 150840 66899 164080 320017 402302 390619 291053 310140 308260 326770 231262 175736
2010A75736O0503N9633o098J63517K3761l7477m0823K2800j43269j4710J41749
$$ 175736 236239 295872 289774 453291 477052 439575 398752 421552 278283 263573 405322
1999D05322n3012p7755O8086J4683k0986n2099j9224R5300j5934k01271N0442
$$ 405322 352310 274555 342641 357324 336338 284239 265015 360315 344381 143110 193552
1988A93552O4779k3716O6592k8j79185J63599n7723j9229R9403O4642m645j01842
$$ 193552 258331 234615 301207 301179 121994 285593 227870 208641 308044 372686 368041 266199
1976B66199n2689N3358k7817r3478N9563K4311J08904J9987j00216K239k5395
$$ 266199 213510 266868 239051 145573 205136 229447 338351 358338 258122 260361 234966
1965B34966p9019m3511l35N732Q4875l7525k6912M6323n343k8892q1678p2949
$$ 234966 155947 112436 112101 117833 202708 165183 138271 184594 179251 150359 68681 -4268
1953d268N7988K03966P3361j54098J1408M2539j12931J22906J56664m8501j02259
$$ -4268 53720 257686 331047 176949 188357 230896 117965 240871 397535 349034 246775
1942B46775M1930J9061j8588o675J08859K212k5412j36415k2901o2482J4548o9527
$$ 246775 288705 307766 289178 282503 391362 393574 368162 231747 208846 146364 160912 91385
1930I1385J31079K4529R812p8629r530M2674J6989l3529o4116K4769L0025N1356
$$ 91385 222464 246993 256805 178176 168646 211320 228309 194780 130664 155433 185458 236814
1918B36814p5816P084l8144m7244J14827m7878J24007L0395j45977L5810L7247
$$ 236814 160998 168082 129938 82694 197521 149643 273650 304045 158068 193878 231125
1907B31125k8694j05856p4104Q0430J53964j04056q1082l9684M9211J4602n6086
$$ 231125 202431 96575 22471 102901 256865 152809 71727 32043 81254 95856 39770
1896C9770P2086n0429j2648J6967J9848R215P3322L9053p4675J60378J9055N71
$$ 39770 111856 61427 48779 65746 85594 94809 168131 207184 132509 292887 311942 312513
1884C12513Q68p5103r2364L0763N453p426J7459M0499q3853J01871r2677J20613
$$ 312513 313381 238278 145914 176677 182130 174704 192163 232662 148809 250680 158003 278616
1872B78616j9564r2895L8729j10225K858j96482J95374J34048q7281k6464M5250
$$ 278616 259052 166157 204886 94661 97519 -98963 96411 230459 143178 116714 161964
1861A61964O7069K158P4216j04256K0671O2460j15445o9001J13318k6471o4505
$$ 161964 229033 231191 305407 201151 221822 284282 168837 99836 213154 186683 122178
1850A22178o7260J0943O1130p098o3005j5019J3721J94732j12266q6935K2689
$$ 122178 54918 65861 126991 119893 56888 41869 55590 250322 138056 51121 73810
1839G3810n0838n737J00136Q5061j26842j31595O3890J92054J49225L5439N1424
$$ 73810 22972 17235 117371 202432 75590 -56005 7885 199939 349164 384603 436027
1828D36027j10031k17136m0968Q1269K3450j44283K05683L4838k7307q8604O0006
$$ 436027 325996 108860 67892 149161 172611 28328 234011 268849 241542 152938 212944
1817B12944r3738J99161M3857j47306N6314J05825j73783j05009J49239J333m0714
$$ 212944 119206 318367 362224 214918 271232 377057 203274 98265 247504 248837 208123
1806B08123j15871k0560Q9754J15104r1091j0713J12185j04270M6119k2571j9817
$$ 208123 92252 71692 161446 276550 185459 174746 286931 182661 228780 206209 186392
1795A86392J19547N5194n8502j71640O596P04R5713p999R280k6904q4468j5091
$$ 186392 305939 361133 302631 130991 137587 138291 234004 226005 235285 208381 123913 108822
1783A08822P0659J28053q6052j2291p2615J07780K8237j4046j7010r963K7576
$$ 108822 179481 307534 221482 209191 136576 244356 272593 258547 241537 231574 259150
1772B59150K8608J9344p5740K5395R7367l6585l2956j2391l8954R3917j87504
$$ 259150 287758 307102 231362 256757 354124 317539 284583 272192 233238 327155 139651
1761A39651r7292J90258j15575n4457J32716l2905m6888O0997R1786k3410k5884
$$ 139651 42359 232617 117042 62585 195301 162396 115508 176505 268291 244881 218997
1750B18997q385N0764K1505o8049q2323n7967R2284o1034n6396L8121R2638P4001
$$ 218997 210612 261376 282881 214832 132509 74542 166826 105792 49396 87517 180155 254156
1738B54156l5219P2704j3779N8373j0438k2858l5796n0689m3512J6368K6487j08883
$$ 254156 218937 291641 277862 336235 325797 302939 267143 216454 172942 189310 215797 106914
1726A06914J2450P925Q2823k3938L1472J6660n8847j41169L0766J88767R7973
$$ 106914 119364 127289 210112 186174 217646 234306 175459 34290 65056 253823 351796
1715C51796n0548k5353q9992j4614O4795J9106K6952k7853L2105m031Q5973j78940
$$ 351796 301248 275895 185903 171289 236084 255190 282142 254289 286394 282363 368336 189396
1703A89396L3655R0425L0005m3313p535r0050j7821o6691Q3146m2374q8498L6559
$$ 189396 223051 313476 343481 300168 292633 202583 184762 118071 201217 158843 70345 106904
1691A06904M7674J05388m302p7239P801R7849k8938m5650M1773q594J58128J3685
$$ 106904 154578 259966 255664 178425 186226 284075 255137 209487 251260 242666 400794 414479
1679D14479j42370r5236O0876L7209j39370o6258M6825l1956M1446o1653J04786
$$ 414479 272109 176873 237749 274958 135588 69330 116155 84199 125645 63992 168778
1668A68778l6472p1902L3266J51195o0864j10053M9561J22787P8629m1034n6808
$$ 168778 132306 60404 93670 244865 184001 73948 123509 246296 324925 283891 227083
1657B27083k9289J34257k6964k27731p0304J22549m6452J27634j722J01358k0012
$$ 227083 197794 332051 305087 77356 7052 129601 83149 210783 209061 310419 290407
1646B90407j32432l062J43027k2726j17894J23161O7245j16784r9819Q5950Q6256
$$ 290407 157975 154913 297940 275214 157320 280481 347726 230942 131123 217073 303329
1635C03329p7962j46874l7937K4445M090O3162n710O4868l8819j4775k6899J02001
$$ 303329 225367 78493 40556 65001 69091 132253 126543 191411 152592 137817 110918 212919
1623B12919j26305J06077l8899o078j8841p0024J27002M8005m6307K8565j11235
$$ 212919 86614 192691 153792 147714 128873 58849 185851 233856 187549 216114 104879
1612A04879Q1586o6644q0330P2905R8900n3695M0538K2559j03318m5430J24032
$$ 104879 186465 119821 39491 112396 211296 157601 198139 220698 117380 71950 195982
1601A95982j7412n5708N4505M3746l4003q5642k5956J16015Q5956l4593l5968
$$ 195982 178570 122862 177367 221113 187110 101468 75512 191527 277483 242890 206922
1590B06922j21535k0234J06061Q0511p6111r817O0701m3600j62133K39119P9416
$$ 206922 85387 65153 171214 251725 175614 165797 226498 182898 20765 259884 339300
1579C39300k00873R235N1557l9877J45519j27524o1867L746O5873L7513O7318
$$ 339300 138427 147662 199219 159342 304861 177337 115470 119216 185089 222602 289920
1568B89920j24861j6295p8904J48257K6558p7444P9707q9473K9930n6198n2386
$$ 289920 165059 148764 69860 218117 244675 167231 246938 157465 187395 131197 78811
1557G8811R2606R0630o2923l5115Q3328o4649k2108J31237n4441k03750N6766
$$ 78811 171417 262047 199124 164009 247337 182688 160580 291817 237376 33626 90392
1546I0392k3471j8596k3153J06718J86769j7904j87520j22861J01025R8316N3788
$$ 90392 66921 48325 25172 131890 318659 300755 113235 -9626 91399 189715 243503
1535B43503L9830m2782o9604o881k4491J5335r4773Q4377K49484r6101r6825p81
$$ 243503 283333 240551 170947 164066 139575 154910 60137 144514 393998 297897 201072 200291
1523B00291N1744j47424P783j10736J12415R9096k04007P1174l3657J43525Q8355
$$ 200291 252035 104611 112394 1658 114073 213169 9162 80336 46679 190204 278559
1512B78559o9639M4481Q5467j54044j17293N7581j1195J24164M7874j14798n9506
$$ 278559 208920 253401 338868 184824 67531 125112 113917 238081 285955 171157 111651
1501A11651l7797L8823l5801O0573l7913j694k6794J58330o1805p1727J8827K3413
$$ 111651 73854 112677 76876 137449 99536 97842 71048 229378 167573 95846 114673 138086
1489A38086M1460l4198J19677j52506n3075L5082Q7354J9195J3833J0837J13602
$$ 138086 179546 145348 265025 112519 59444 94526 181880 201075 214908 225745 339347
1478C39347j27254L0854N150j63838K29445K151j32735o1713m3408Q761K4006
$$ 339347 212093 242947 248097 84259 313704 315855 183120 121407 77999 86760 110766
1467A10766O9419j0777M3426L5622J9126j21l8033M9745n5758J0588j07483p6899
$$ 110766 180185 169408 212834 248456 267582 267461 229428 279173 223415 234003 126520 49621
1455D9621j2305J29543O5354P641o581O7715j97697p2119J2261J3133L6877J27640
$$ 49621 37316 166859 232213 239854 233273 300988 103291 31172 43433 56566 93443 221083
1443B21083l2500p791m4967m0089M3987j30407K6160Q764K2666J64115O476j47343
$$ 221083 188583 180792 135825 95736 139723 9316 35476 44240 66906 231021 237497 90154
1431I0154K944K9782R4333O7351l9271O093m0953j19397K8553k9700N004N3379
$$ 90154 93098 122880 217213 284564 245293 251386 210433 91036 119589 89889 94893 148272
1419A48272l2703J48212j40948p763J13023p6120N1614L0897j33636j0565j40522
$$ 148272 115569 263781 122833 115070 228093 151973 203587 234484 100848 90283 -50239
1408e0239J4432J30006L5009K5998Q4128M1259j00292K3845N8397m0406k6012
$$ -50239 -35807 94199 129208 155206 239334 280593 180301 204146 262543 222137 196125
1397A96125r0972j05159J82168R2094J8943j56188m1058j29571O3815p915l0778
$$ 196125 105153 -6 182162 274256 293199 137011 95953 -33618 30197 22282 -8496
1386h496M714Q1599O1974l6376J53193j4214m7879Q115J04043J2161p2015r9882
$$ -8496 -3782 77817 139791 103415 256608 242394 194515 202630 306673 318834 246819 146937
1374A46937K2809k4182K4597J19719j40030k3496n3017J33174l9198j0283l3261
$$ 146937 169746 145564 170161 289880 149850 126354 73337 206511 167313 157030 123769
1363A23769m5342J8200o28L9820J19518k0038L8733j54292l8506k8601J0384N4289
$$ 123769 78427 96627 95999 135819 255337 235299 274032 119740 81234 52633 63017 117306
1351A17306j09068J06276J13509j21793N3743j4311q8172n411J02951J4094L1308
$$ 117306 8238 114514 228023 106230 159973 145662 57490 52079 155030 169124 200432
1340B00432J25735j32170o7403l7189m427l1475J02785j28725m8600O0926M709
$$ 200432 326167 193997 126594 89405 84978 53503 156288 27563 -21037 39889 44598
1329D4598R398J18906R0654K884p8195r2874m4690M7136J46987j16359j64146
$$ 44598 53996 172902 263556 266440 188245 95371 50681 97817 244804 128445 -35701
1318c5701R7910P8915q115J66373P5492l4690l8925n7251m9600m4465n0917p8064
$$ -35701 62209 141124 133009 299382 374874 340184 301259 244008 194408 149943 99026 20962
1306B0962p369o334O9772M6829K7288m3630P4027M6704q1131N5615m4372q8473
$$ 20962 13593 7259 77031 123860 151148 107518 181545 228249 147118 202733 158361 69888
1294F9888m5281R951P8975K0544R0831n8461l2523m1404o4784K3263L6468l2838
$$ 69888 24607 34558 113533 134077 224908 166447 133924 92520 27736 50999 87467 54629
1282E4629J34852n4159J02792O393m0886p5053M005J3221o83o4423R7165J29314
$$ 54629 189481 135322 238114 244507 203621 128568 132573 145794 145111 80688 177853 307167
1270C07167j461j12592n8904k2848j4417O4587m5840o7350N4394J16747m034R991
$$ 307167 305706 193114 134210 111362 96945 161532 115692 48342 102736 219483 215449 225440
1258B25440q7786Q9562q1515L1620R4649M0653K9222k11329j42276k7014J46309
$$ 225440 137654 227216 145701 177321 271970 312623 341845 130516 -11760 -38774 107535
1247A07535L7079j17672J1368J0102J05504M5463n2958q0159L3924P311k4565
$$ 107535 144614 26942 38310 48412 153916 199379 146421 66262 100186 107497 82932
1236H2932n0234J1967J303q410P5998L9651k6870n529J8443p841p2445n4446R1424
$$ 82932 32698 44665 45968 37558 113556 153207 126337 120808 139251 131410 58965 4519 95943
1223I5943K878J9416m7828L9064P5358r1628o1917n6191P1470m5184L2392O519
$$ 95943 98821 118237 70409 109473 184831 93203 31286 -24905 46565 1381 33773 40292
1211D0292R9411J7231R7577K1424o1280k4561k8005o1944n8318k1440J74118O3909
$$ 40292 139703 156934 254511 275935 214655 190094 162089 100145 41827 20387 194505 258414
1199B58414o5070o6885m0931p9410O1157M5684J55882J4617q4815L1111n9313
$$ 258414 193344 126459 85528 6118 67275 112959 268841 283458 198643 229754 170441
1188A70441l9328n6926J06596j01807o8111J44021J06801P3441Q7994j40820q7726
$$ 170441 131113 74187 180783 78976 10865 154886 261687 335128 423122 282302 194576
1177A94576k0237J16408j00147o5984k1980N7782Q5618K5882o7059l4350O3024
$$ 194576 174339 290747 190600 124616 102636 160418 246036 271918 204859 170509 233533
1166B33533L0911o566k16941n5896K0746N9882O8236J1895M9761J9670m4944J9084
$$ 233533 264444 257878 40937 -14959 5787 65669 133905 145800 195561 215231 170287 189371
1154A89371k8236k8152j34423p368O1451R4970N0703l3431J8728k2317O9889o9354
$$ 189371 161135 132983 -1440 -8808 52643 147613 198316 164885 183613 161296 231185 161831
1142A61831j25272J0137Q6071N2150n0233r9030N2083j42957J01035J5945L7274
$$ 161831 36559 46696 132767 184917 134684 35654 87737 -55220 45815 61760 99034
1131I9034k9663L1903K9850m605J14765q3777j39213l9669R2054K25074J5600
$$ 99034 69371 101274 131124 126519 241284 157507 18294 -21375 70679 295753 311353
1120C11353j41892r7179j28771J88840N7428m1639l83M2224N4324n4178j84989
$$ 311353 169461 72282 -56489 132351 189779 148140 147757 189981 244305 190127 5138
1109E138J7566R3931O6252l2685J11931O1781n6410k08642M1667M1549q5452Q3028
$$ 5138 22704 116635 182887 150202 262133 323914 267504 58862 100529 142078 56626 139654
1097A39654M0153R2441L0517q6467n0952k524K633j5704l7067J23443j2911J7761
$$ 139654 179807 272248 302765 216298 165346 162822 165455 149751 112684 236127 223216 240977
1085B40977N9184n6249j47998r5138o5892J1311q300J56049J03955j5238K0378
$$ 240977 300161 243912 95914 776 -65116 -53805 -62105 93944 197899 182661 203039
1074B03039m5784m1702q1771J18289J0298L443R264L5546q59j31546J02547N6435
$$ 203039 157255 115553 33782 152071 162369 165812 175076 210622 209763 78217 180764 237199
1062B37199M3734N6223j30153n7995O5763L3875j12821J6769L5393L1192k7854
$$ 237199 280933 337156 207003 149008 214771 248646 135825 152594 187987 219179 191325
1051A91325m223J19933r8306l0248Q1753J56n5885L4621j30214Q2976m5403q9408
$$ 191325 187102 307035 208729 178481 260234 260390 204505 239126 108912 191888 146485 57077
1039E7077q8909o0569K28500M3760r3982L3269L677R0015r2697o4235K14056o6140
$$ 57077 -31832 -92401 136099 179859 85877 119146 122823 212838 120141 55906 269962 203822
1027B03822j17738n9421L5256m5685N1677O7058k1035K793K3393L0069k9220m0853
$$ 203822 86084 26663 61919 16234 67911 134969 113934 116727 140120 170189 140969 100116
1015A00116o4488L6489J469m5710J47546O5408j64211j46866p906K35769J09590
$$ 100116 35628 72117 73586 27876 175422 240830 76619 -70247 -78153 157616 267206
1004B67206k0374Q1290k3287n8061L6927o8198j81001K4916m4907q512k5702q4140
$$ 267206 246832 328122 304835 246774 283701 215503 34502 59418 14511 5999 -19703 -103843
992a03843R1451L5971K8923J10379j01612j26769J17876J38623M7408P5141j05840
$$ -103843 -12392 23579 52502 162881 61269 -65500 52376 190999 238407 313548 207708
981B07708m1290j03572J39208Q2696p9736K3496M1994j15448O8645r444L6336
$$ 207708 166418 62846 202054 284750 205014 228510 270504 155056 223701 214257 250593
970B50593L3597n1384N7906r7838j06795J8660O8085j09879J0429k7404N4415
$$ 250593 284190 232806 290712 192874 86079 104739 172824 62945 73374 45970 100385
959A00385R3378q3971n7177J05906l410j9816m9704O6484M0728J302m6889m2382
$$ 100385 193763 109792 52615 158521 155111 135295 85591 152075 192803 194105 147216 104834
947A04834m2409J2900Q1319k5006j1485M119m9558o307k3600K6524L6582R2668
$$ 104834 62425 75325 156644 131638 120153 124272 74714 68407 44807 71331 107913 200581
935B00581l6039K1829n6894J21602j08751q7863J4893O0345n4324j8248K335j51019
$$ 200581 164542 186371 129477 251079 142328 54465 69358 129703 75379 57131 59466 -91553
923i1553L2769M3200J39571k5911L0404m9828P9055N1772N4812J04014j1863j36994
$$ -91553 -58784 -15584 123987 98076 128480 78652 157707 209479 264291 368305 356442 219448
911B19448l9510M4696o5161j6786R4240r1638j16070j1766O9123J09244o1512
$$ 219448 179938 224634 159473 142687 236927 145289 29219 17453 86576 195820 134308
900A34308K9382J23319M3683N5298L0054p6431j24957k6593o9102P8176J6104
$$ 134308 163690 287009 330692 385990 416044 339613 214656 188063 118961 197137 213241
889B13241J14378q8427q1612N9750o9817n844P0694M317k7256m1780P538R4283
$$ 213241 327619 239192 157580 217330 147513 141669 212363 216680 189424 147644 155182 249465
877B49465o6381o4527n3390P7872j6471k257K999k8887j2597J6682j31220l8641
$$ 249465 183084 118557 65167 143039 126568 124311 127310 98423 85826 102508 -28712 -67353
865f7353N7180O1826Q8462R6834N4294j80193l4678Q7598N6030L9840p0104n7750
$$ -67353 -10173 51653 140115 236949 291243 111050 76372 163970 220000 259840 189736 131986
853A31986M3824r9130K0293N1315M4147p9018q762J78112q094L8849j86125O7952
$$ 131986 175810 76680 96973 148288 192435 113417 104655 282767 274673 313522 127397 195349
841A95349Q5309p1871j13659l5653l3732m8915k7596M5535K82479L0424o731j93980
$$ 195349 280658 208787 95128 59475 25743 -23172 -50768 -5233 277246 307670 300939 106959
829A06959l8377M4201p1399O8582N9465q565n3713Q4953P6278o3100j51020K9384
$$ 106959 68582 112783 41384 109966 169431 160866 107153 192106 268384 205284 54264 83648
817H3648L7822k0191P7361n8421K7522R8128j4196j25777n2475j2789J08917q1989
$$ 83648 121470 101279 178640 120219 147741 245869 231673 105896 53421 40632 149549 67560
805F7560R3647P0029j26356R489Q827j8374L0136j30011N6551J72077j71550j97
$$ 67560 161207 231236 104880 114369 123196 104822 134958 4947 61498 233575 62025 61828
793F1828M9996k1220J31934l1830o6434L3074O5435j3072k5224k8965j3617q880
$$ 61828 111824 90604 222538 190708 124274 157348 222783 209711 184487 155522 141905 133025
781A33025j16139N2864l710N3851Q7816P5703k03757p2066M1943n1414R3982J34853
$$ 133025 16886 69750 66040 119891 207707 283410 79653 7587 49530 -1884 92098 226951
769B26951r1927L4755n7145n9139l7138J15241k6758m1922R5013J35296j03073
$$ 226951 135024 169779 112634 53495 16357 131598 104840 62918 157931 293227 190154
758A90154j90558P0863M6668R7769N8723J0138j32434J5551R5799L6007j28387
$$ 190154 -404 70459 117127 214896 273619 283757 151323 166874 262673 298680 170293
747A70293j1523J07630j23125l3948P736n2919J07546J157p9016l0416n3042n0505
$$ 170293 158770 266400 143275 109327 117063 64144 171690 172847 93831 63415 10373 -40132
735d0132R1723K8165J59319k3597K4518q2530p5378n4945k4691P6289J80020P3163
$$ -40132 51591 79756 239075 215478 239996 157466 82088 27143 2452 78741 258761 331924
723C31924j04497n5161l1094J15957j2870J5030K6403j03808o1423J03759M334
$$ 331924 227427 172266 141172 257129 244259 259289 285692 181884 120461 224220 228554
712B28554N2429j65800N3945R8000o1073j78561M9012R3708M9036k0174m6771
$$ 228554 280983 115183 169128 267128 206055 27494 76506 170214 219250 199076 152305
701A52305R4291j4473m7768j29534j4462n0109J26176J11386n9042J454j1056
$$ 152305 246596 232123 184355 54821 40359 -9750 116426 227812 168770 170224 159168
690A59168p9286O7171O1495m0356j47110L8392l2649M4996J48346l4964n8941
$$ 159168 79882 147053 208548 168192 21082 59474 26825 71821 220167 185203 126262
679A26262L3966J3468q9337O0800J9276l3452O4642o40M0758M0174q7552q8493
$$ 126262 160228 173696 84359 145159 164435 130983 195625 194985 235743 275917 188365 99872
667I9872K3497q6415J3891J32504j3075J28946P598j39508j21765K7235P3019
$$ 99872 123369 36954 50845 183349 170274 299220 306818 167310 45545 72780 145799
656A45799o6840j45896J93257P4465n9412j2189o4584l4323j17158Q4904Q093
$$ 145799 78959 -66937 126320 200785 141373 129184 64600 30277 -86881 -1977 6116
645F116J3507O7856J15822Q7016q5457l1662j44157l7256O4573J68694m4285M0740
$$ 6116 19623 87479 203301 290317 204860 173198 29041 -8215 56358 225052 180767 221507
633B21507O7288j16368j02007p1460J33212l3652n7552R168P8602Q7335P3383
$$ 221507 288795 172427 70420 -1040 132172 98520 40968 50136 128738 216073 289456
622B89456j15040J01649o9379p3920J18514j72496q8844p7370J45289Q9204R699
$$ 289456 174416 276065 206686 132766 251280 78784 -10060 -87430 57859 147063 156762
611A56762m9917j95054M2714N2623L5208K8174J18793j34573P1382J4291p2193
$$ 156762 106845 -88209 -45495 7128 42336 70510 189303 54730 126112 140403 68210
600F8210J89240l4804j63602p0593M4457M4170N7756N1367m9883K5503k2872L9383
$$ 68210 257450 222646 59044 -11549 32908 77078 134834 186201 136318 161821 138949 178332
588A78332j7258q7188J18029J63582q5195o3261J38319j76316M424k6282m4926
$$ 178332 161074 73886 191915 355497 270302 207041 345360 169044 173468 147186 102260
577A02260q9149p4575K12217L8656L8351P8920r4530R900K355N530j1523j12814
$$ 102260 13111 -61464 150753 189409 227760 306680 212150 222050 224405 229935 218412 105598
565A05598R3651N0054m8145N5595j50998N84m0039O9522l1177j31325N1441J5503
$$ 105598 199249 249303 201158 256753 105755 106339 66300 135822 104645 -26680 24761 40264
553D0264J0061l1186L2982K1910q7017n7J10880k0051j4843j16555j900L890k7254
$$ 40264 50325 19139 52121 74031 -12986 -13043 97837 77786 62943 -53612 -55512 -51622 -78876
540g8876N9327j1239J46618l1415p4936J29512m647L7941Q3136r579o1943l3123
$$ -78876 -19549 -30788 115830 84415 9479 138991 134344 172285 255421 245842 183899 150776
528A50776m8107l6526J60466m0257J9150m3059P2736q1454j6735Q6263j26715
$$ 150776 102669 66143 226609 186352 205502 162443 235179 153725 136990 223253 96538
517I6538q4788n3701J76468K1947J60413K8461j80632Q3768J9777p7558j26742
$$ 96538 11750 -41951 134517 156464 316877 345338 164706 248474 268251 190693 63951
506F3951K9017q96k1315P5814p8283j2128k5315R2206O3081N1462n4393j10821
$$ 63951 92968 92072 70757 146571 68288 56160 30845 123051 186132 237594 183201 72380
494G2380J7751L9362q7879o068J16623R2255k04056p3829J24258M2400P6408k7211
$$ 72380 90131 129493 41614 35546 152169 244424 40368 -33461 90797 133197 209605 182394
482A82394o5572R866L8911p336l9508J50915J7366k24107m2576P8982P082P9214
$$ 182394 116822 126688 165599 158263 118755 269670 287036 62929 20353 99335 106417 185631
470A85631K5622j48905n4489L8191Q0785P566m6766J5167l4997O2594J9124p0853
$$ 185631 211253 62348 7859 46050 126835 134401 87635 102802 67805 130399 149523 78670
458G8670j380Q1797O120j0483j4506j28817N4130L9106P8446m306L2298Q3613
$$ 78670 77290 159087 165207 154724 140218 11401 65531 104637 183083 178777 211075 294688
446B94688p6148j65066k5069O9177P6236R2491J8628P2029j89156q0262J21579
$$ 294688 218540 53474 28405 97582 173818 266309 284937 356966 167810 87548 209127
435B09127L4513p4752j92311Q0516q551j7475J25039J09408j52967j49640N7412
$$ 209127 243640 168888 -23423 57093 48542 31067 156106 265514 112547 -37093 20319
424B0319O4975J2788j10653O7840k4943N4678P4358j64864J25939l6552j07171
$$ 20319 85294 98082 -12571 55269 30326 85004 159362 -5502 120437 83885 -23286
413b3286J22544K8179M5535J0214r4078j40956M6340r379Q0698J66571j4526l7745
$$ -23286 99258 127437 172972 183186 89108 -51848 -5508 -14887 65811 232382 217856 180111
401A80111k8527n2929L8916K2983K0492j0100l5182J6591J07616R7450q9072j85846
$$ 180111 151584 98655 137571 160554 181046 170946 135764 152355 259971 357421 268349 82503
389H2503p4514P1796J4821q383J04099p5550o921J1298Q8731O397O9869J1661
$$ 82503 7989 79785 94606 86223 190322 114772 107851 119149 207880 214277 284146 295807
377B95807q7624j2196k5986K4724q5407K7984j9693Q8732K5872o2276J502J3476
$$ 295807 208183 195987 170001 194725 109318 137302 117609 206341 232213 169937 171439 184915
365A84915p3439j1006J65791o9781j27870K8595j33901L1610Q8308O4272q0877
$$ 184915 111476 100470 266261 196480 68610 97205 -36696 -5086 83222 147494 66617
354F6617p3189L2001J13866l3566N8060J5509j11153j3509L1084M1272N1474l8685
$$ 66617 -6572 25429 139295 105729 163789 179298 68145 54636 85720 126992 178466 139781
342A39781P2510k8640k7767r8613m6098K3200m4142L0315L3840L3051J18296M257
$$ 139781 212291 183651 155884 57271 11173 34373 -9769 20546 54386 87437 205733 209990
330B09990o2043l8638j8973k2995K4290J68903K4474n3778j7973M0789l9417O990
$$ 209990 147947 109309 90336 67341 91631 260534 285008 231230 213257 254046 214629 221619
318B21619j25041J6546L5256J25478Q342n4071m1693L5960j2808J6929l6954k3747
$$ 221619 96578 113124 148380 273858 282200 228129 186436 222396 209588 226517 189563 165816
306A65816q8527p7298N9856M194k3044Q3590Q1016l9930L4886p3001j2586O0217
$$ 165816 77289 -9 59847 64041 40997 124587 205603 165673 200559 127558 114972 175189
294A75189m1632P2535m706r0294J918l5059m122m1450K934O6109n235J38493O1325
$$ 175189 133557 206092 201386 111092 113010 77951 73829 32379 35313 101422 96187 234680 296005
281B96005N187j73636r3757Q4224Q1443N433j06061q5880J14565j10716J47874
$$ 296005 301192 127556 33799 118023 199466 204899 98838 12958 127523 16807 164681
270A64681L0508j40991O8213M6260j17404k3368K3945o4575j6696J793P5021O408
$$ 164681 195189 54198 122411 168671 51267 27899 51844 -12731 -29427 -27634 47387 53795
258E3795J19778N186Q4820j18630N3906o5507n6028o9184k5739K0984L1330r97
$$ 53795 173573 178759 263579 144949 198855 133348 77320 8136 -17603 3381 34711 33714
246C3714o0120l3354J29191P1247j9024j42708J05925j9980r9370J06614M0437
$$ 33714 -26406 -59760 69431 140678 121654 -21054 84871 64891 -34479 72135 112572
235A12572R5287l8047p8330M7727r5632j1890Q951O9331k6514J0331Q4460L7312
$$ 112572 207859 169812 91482 139209 43577 31687 40638 109969 83455 93786 178246 215558
223B15558n7946L201o252q2571m7386Q36J13612m0159J3885o45k2457N3644j20904
$$ 215558 157612 160813 154561 71990 24604 25440 139052 98893 112778 112133 89676 143320 22416
210B2416P7176J05894j4006k2883n2332p8258K107J43398j03172K2476K0535m287
$$ 22416 99592 205486 191480 168597 116265 38007 40114 183512 80340 102816 123351 119064
198A19064j3152j9117k6925k4680N6171K3185j42756k915M4963J51062q541L062
$$ 119064 105912 86795 59870 35190 91361 114546 -28210 -31125 13838 164900 156359 159421
186A59421q323P0875r2979q3727M2837P8485j01943j5868k9491q9358O1023J10852
$$ 159421 151098 221973 128994 45267 88104 166589 64646 48778 19287 -70071 -9048 101804
174A01804R4137n0301j19655J9617o1996R6003J57764p0350k2508L0377j04687
$$ 101804 195941 145640 25985 45602 -16394 79609 237373 167023 144515 174892 70205
163G0205k0622O344n338j9086R3711J26831m1570m8777m8766l5458l4849j1633
$$ 70205 49583 55927 50589 31503 125214 252045 210475 161698 112932 77474 42625 30992
151C0992p5367J4018P3795L072k2960n2730j2271J02709J1621q5149J39081N9084
$$ 30992 -44375 -30357 43438 46510 23550 -29180 -41451 61258 72879 -12270 126811 185895
139A85895o2783m943k8925n8317j03543J63702r8276P89k5048k8598J04492J9489
$$ 185895 123112 118169 89244 30927 -72616 91086 -7190 -6401 -31449 -60047 44445 63934
127F3934J2887l1817k7563K4133p505J9709O434k3251J35505j01845j2435j4473
$$ 63934 76821 45004 17441 41574 34069 53778 60212 36961 172466 70621 58186 43713
115D3713L3851R1853j35340m9756J7223P783J3413o891k6816K2169P4818N2991
$$ 43713 77564 169417 34077 -15679 1544 9327 22740 15849 -10967 11202 86020 139011
103A39011j61227K4706K2543j8201Q696k0678P7965P7523o1953m0792j2092Q4321
$$ 139011 -22216 2490 25033 6832 15528 -5150 72815 150338 88385 47593 35501 119822
91A19822O0979j8024j12978m294k1700m1781Q7643J8258n7142j7204j7846J3845
$$ 119822 180801 162777 49799 45505 23805 -17976 69667 87925 30783 13579 -4267 9578
79I578k7844N2594l1185n9069l4125J1804J00640r38n9388j6774p6131N8524j2419
$$ 9578 -18266 34328 3143 -55926 -90051 -78247 22393 21455 -37933 -54707 -130838 -72314 -84733
66h4733o332j3767K9125J0026J5613M5807k4143K9152l6741j21943k2281M6905
$$ -84733 -91065 -104832 -75707 -65681 -50068 -4261 -28404 748 -35993 -157936 -180217 -133312
54a33312n6803P0266J73269l0085j39529L9856j12577J05186J8497k4024j8024
$$ -133312 -190115 -119849 53420 23335 -116194 -76338 -188915 -83729 -65232 -89256 -107280
43a07280K374J27464k9585m5264m0082q092j5573n4461Q990Q8213j4630Q7048
$$ -107280 -104906 22558 -7027 -52291 -92373 -100465 -116038 -170499 -161509 -73296 -87926 -878
31h78p3118p3580P7733k7286m0498m3201M0926N8537j2663m4776J44695J5372
$$ -878 -73996 -147576 -69843 -97129 -137627 -180828 -139902 -81365 -94028 -138804 5891 21263
19B1263L2844p8117n0446m7664L3179m6179k9698O0876o4912J3898o7450M5099
$$ 21263 54107 -24010 -74456 -122120 -88941 -135120 -164818 -103942 -168854 -154956 -222406 -177307
7a77307j3104N0317L2019j14665J4647p727O6122
$$ -177307 -190411 -140094 -108075 -222740 -208093 -215820 -149698
0a49698
$$ -149698
$$ Imaginary data points
##PAGE= N=2
##DATA TABLE= (X++(I..I)), XYDATA
16383a227250M896j29351L8527M5976O7549n7731N8839n3102n0071N5716N5812
$$ -1227250 -1222354 -1351705 -1313178 -1267202 -1199653 -1257384 -1198545 -1251647 -1301718 -1246002 -1190190
16372a190190L1312O3395L4642M3972p2451L4166Q5372o7982Q7870L2133J369
$$ -1190190 -1158878 -1095483 -1060841 -1016869 -1089320 -1055154 -969782 -1037764 -949894 -917761 -916392
16361i16392l5396r2176J0932J17677J8985o501O7037M8210O690M3106K8459k9882
$$ -916392 -951788 -1043964 -1033032 -915355 -896370 -902871 -835834 -787624 -780934 -737828 -709369 -739251
16349g39251n8034N2625O9563k3546L3733K1610N1846l348M7603N0849O7386J3031
$$ -739251 -797285 -744660 -675097 -698643 -664910 -643300 -591454 -594802 -547199 -496350 -428964 -415933
16337d15933P8564l8925N7622l4030K7162p4603k2923j9354l6733J01375K0023
$$ -415933 -337369 -376294 -318672 -352702 -325540 -400143 -423066 -442420 -479153 -377778 -357755
16326c57755q535P5831J45641l3613j46968J12396J72892K2642j12497r8858j1212
$$ -357755 -366290 -290459 -144818 -178431 -325399 -213003 -40111 -17469 -129966 -228824 -240036
16315b40036N5271L7731o8848J03354K6278P2572q1236k5566R2350m751K1181
$$ -240036 -184765 -147034 -215882 -112528 -86250 -13678 -94914 -120480 -28130 -32881 -11700
16304a1700J15957J03205l6521j2207r8230m505P3035p5751k522R9400J09141
$$ -11700 104257 207462 170941 158734 60504 55999 129034 53283 50761 150161 259302
16293B59302n8699m9394Q712N7293J39164k5242j19785l3138N9752P6063R9419
$$ 259302 200603 151209 159921 217214 356378 331136 211351 178213 237965 314028 413447
16282D13447j9910K5509n0134P2757P6826r2906J05023k4247M711j33468r33J09970
$$ 413447 393537 419046 368912 441669 518495 425589 530612 506365 511076 377608 376675 486645
16270D86645J2177J1506M325m6506J20205Q8142p4668n1265J01981P7853j01891
$$ 486645 498822 510328 514653 468147 588352 676494 601826 550561 652542 730395 628504
16259F28504o1521K6101K6111P4968J8270j12472M420N3894k607M870J00205J38263
$$ 628504 566983 593084 619195 694163 712433 599961 604381 658275 655668 660538 760743 899006
16247H99006j32046j02736P2143K5597J30258p1789k7110r7530L1129J06912J3598
$$ 899006 766960 664224 736367 761964 892222 820433 793323 695793 726922 833834 847432
16236H47432O8328p6058O259J87205o6945j29477J53188L9003o8756L3786K6582
$$ 847432 915760 839702 845961 1033166 966221 836744 989932 1028935 960179 993965 1020547
$$ [...]
##END NTUPLES=NMR SPECTRUM
##END=
