##TITLE=1H_DE-80H_X3
 200.13MHz, d2o
 8 sc
 
 19ns.26.2.2025
##JCAMPDX= 6.0         $$ Bruker NMR JCAMP-DX V2.0
##DATA TYPE= NMR SPECTRUM
##DATA CLASS= NTUPLES
##ORIGIN= UXNMR, Bruker Analytische Messtechnik GmbH
##OWNER= pz
$$ XWIN-NMR		Version 3.5
$$ Tue Jul  1 10:28:01 2025 Russian Standard Time (UT+4h)  Yarkov@DPX200
##.OBSERVE FREQUENCY= 200.1313
##.OBSERVE NUCLEUS= ^1H
##.ACQUISITION MODE= SIMULTANEOUS
##.ACQUISITION SCHEME= undefined
##.AVERAGES= 8
##.DIGITISER RES= 18
##SPECTROMETER/DATA SYSTEM= spect
##.PULSE SEQUENCE= zg30
##.SOLVENT NAME= CDCl3
##.SHIFT REFERENCE= (INTERNAL, CDCl3, 0, 15.4968)
##AUDIT TRAIL= $$ (NUMBER, WHEN, WHO, WHERE, WHAT)
$$ ##TITLE= Audit trail, XWIN-NMR		Version 3.5
$$ ##JCAMPDX= 5.01
$$ ##ORIGIN= Bruker BioSpin GmbH
$$ ##OWNER= Yarkov
$$ C:/Bruker/XWIN-NMR/data/yarkov2/nmr/H-C/1/pdata/1/auditp.txt
$$ ##AUDIT TRAIL=  $$ (NUMBER, WHEN, WHO, WHERE, WHAT)
(   1,<2025-07-01 10:26:49.85 +0400>,<Yarkov>,<DPX200>,
      <created by zg, POWCHK disabled, PULCHK disabled
       configuration hash MD5:
       00 E9 B6 7A A2 85 ED C7 34 08 36 98 17 FE 4E 26
       data hash MD5: 16K
       B3 2C 4E 70 C9 44 E1 C7 31 1A 43 69 C2 15 34 CE>)
(   2,<2025-07-01 10:27:13.54 +0400>,<Yarkov>,<DPX200>,
      <Start of raw data processing
       efp BC_mod = 2 LB = 0.25 FT_mod = 6 PKNL = 1 PHC0 = -1355.82 PHC1 = 3.966602 SI = 16K 
       data hash MD5: 16K
       31 DA 3F 3D 12 F8 4F C0 C3 69 FB F5 75 40 92 9C>)
(   3,<2025-07-01 10:27:19.60 +0400>,<Yarkov>,<DPX200>,
      <abs ABSG = 5 
       data hash MD5: 16K
       7B B8 B4 9D 73 AA E7 C3 57 83 82 5C F4 78 4D B7>)
$$ ##END=
$$ 
$$ hash MD5
$$ BE 97 52 4B 26 90 55 B7 79 19 E2 DD 9E 84 DC FD
##$RELAX= 
##$RELAX= 
##$RELAX= 
##$RELAX= 
##$RELAX= 
##$RELAX= 
$$ Bruker specific parameters
$$ --------------------------
##$DU= <C:/Bruker/XWIN-NMR>
##$EXPNO= 1
##$NAME= <H-C>
##$PROCNO= 1
##$TYPE= <nmr>
##$USER= <yarkov2>
##$AMP= (0..31)
100 100 100 100 100 100 100 100 100 100 100 100 100 100 100 100 100 100 
100 100 100 100 100 100 100 100 100 100 100 100 100 100 
##$AQSEQ= 0
##$AQ_mod= 1
##$AUNM= <au_zg>
##$AUTOPOS= <>
##$BF1= 200.13
##$BF2= 200.13
##$BF3= 200.13
##$BF4= 200.13
##$BF5= 200.13
##$BF6= 200.13
##$BF7= 200.13
##$BF8= 200.13
##$BYTORDA= 1
##$CFDGTYP= 0
##$CFRGTYP= 5
##$CHEMSTR= <none>
##$CNST= (0..31)
1 1 145 1 1 1 1 1 1 1 1 1 1 1 1 1 1 1 1 1 1 1 1 1 1 1 1 1 1 1 1 1 
##$CPDPRG= <>
##$CPDPRG1= <>
##$CPDPRG2= <>
##$CPDPRG3= <>
##$CPDPRG4= <mlev>
##$CPDPRG5= <mlev>
##$CPDPRG6= <mlev>
##$CPDPRG7= <mlev>
##$CPDPRG8= <mlev>
##$CPDPRGB= <>
##$CPDPRGT= <>
##$D= (0..31)
0 0.7 0 0 0 0 0 0 0 0 0 0.03 0 0 0 0 0 0 0 0 0 0 0 0 0 0 0 0 0 0 0 0 
##$DATE= 1751351209
##$DBL= (0..7)
120 120 120 120 120 120 120 120 
##$DBP= (0..7)
150 150 150 150 150 150 150 150 
##$DBP07= 0
##$DBPNAM0= <>
##$DBPNAM1= <>
##$DBPNAM2= <>
##$DBPNAM3= <>
##$DBPNAM4= <>
##$DBPNAM5= <>
##$DBPNAM6= <>
##$DBPNAM7= <>
##$DBPOAL= (0..7)
0.5 0.5 0.5 0.5 0.5 0.5 0.5 0.5 
##$DBPOFFS= (0..7)
0 0 0 0 0 0 0 0 
##$DE= 6
$$ [...]
##$SUBNAM3= <"">
##$SUBNAM4= <"">
##$SUBNAM5= <"">
##$SUBNAM6= <"">
##$SUBNAM7= <"">
##$SUBNAM8= <"">
##$SUBNAM9= <"">
##$SW= 18.0517328524113
##$SWIBOX= (0..15)
0 0 2 0 0 0 0 0 0 0 0 0 0 0 0 0 
##$SW_h= 3612.71676300578
##$TD= 16384
##$TD0= 1
##$TE= 0
##$TE2= 300
##$TE3= 300
##$TEG= 300
##$TL= (0..7)
0 120 120 120 120 120 120 120 
##$TP= (0..7)
150 150 150 150 150 150 150 150 
##$TP07= 0
##$TPNAME0= <>
##$TPNAME1= <>
##$TPNAME2= <>
##$TPNAME3= <>
##$TPNAME4= <>
##$TPNAME5= <>
##$TPNAME6= <>
##$TPNAME7= <>
##$TPOAL= (0..7)
0.5 0.5 0.5 0.5 0.5 0.5 0.5 0.5 
##$TPOFFS= (0..7)
0 0 0 0 0 0 0 0 
##$TUNHIN= 0
##$TUNHOUT= 0
##$TUNXOUT= 0
##$USERA1= <user>
##$USERA2= <user>
##$USERA3= <user>
##$USERA4= <user>
##$USERA5= <user>
##$V9= 5
##$VALIST= <valist>
##$VCLIST= <CCCCCCCCCCCCCCC>
##$VD= 0
##$VDLIST= <DDDDDDDDDDDDDDD>
##$VPLIST= <PPPPPPPPPPPPPPP>
##$VTLIST= <TTTTTTTTTTTTTTT>
##$WBST= 1024
##$WBSW= 4
##$XGAIN= (0..3)
0 0 0 0 
##$XL= 0
##$YL= 0
##$YMAX_a= 104695
##$YMIN_a= -108708
##$ZGOPTNS= <>
##$ZL1= 120
##$ZL2= 120
##$ZL3= 120
##$ZL4= 120
##$ABSF1= 15.49678
##$ABSF2= -2.555069
##$ABSG= 5
##$ABSL= 3
##$ALPHA= 0
##$AQORDER= 0
##$ASSFAC= 0
##$ASSFACI= 0
##$ASSFACX= 0
##$ASSWID= 0
##$AUNMP= <proc_1d>
##$AZFE= 0.1
##$AZFW= 0.1
##$BCFW= 0
##$BC_mod= 2
##$BYTORDP= 0
##$COROFFS= 0
##$CY= -3
##$DATMOD= 1
##$DC= 0
##$DFILT= <>
##$DTYPP= 0
##$F1P= 0
##$F2P= 0
##$FCOR= 1
##$FTSIZE= 16384
##$FT_mod= 6
##$GAMMA= 0
##$GB= 0
##$INTBC= 1
##$INTSCL= 3.241238e-09
##$ISEN= 128
##$LB= 0.25
##$LEV0= 0
##$LPBIN= 0
##$MAXI= 10000
##$MC2= 0
##$MEAN= 0
##$ME_mod= 0
##$MI= 1.114404
##$NCOEF= 0
##$NC_proc= -8
##$NLEV= 6
##$NOISF1= 3.799351
##$NOISF2= 2.8
##$NSP= 0
##$NTH_PI= 0
##$NZP= 0
##$OFFSET= 15.49678
##$PC= 1
##$PHC0= -1355.82
##$PHC1= 3.966602
##$PH_mod= 1
##$PKNL= yes
##$PPARMOD= 0
##$PSCAL= 0
##$PSIGN= 0
##$REVERSE= no
##$SF= 200.13000498805
##$SI= 16384
##$SIGF1= 3
##$SIGF2= 2
##$SINO= 0.751879
##$SIOLD= 32768
##$SREGLST= <19F.Aceton>
##$SSB= 0
##$STSI= 16384
##$STSR= 0
##$SW_p= 3612.71676300578
##$SYMM= 0
##$S_DEV= 0
##$TDeff= 16384
##$TDoff= 0
##$TI= <>
##$TILT= no
##$TM1= 0
##$TM2= 0
##$TOPLEV= 0
##$USERP1= <user>
##$USERP2= <user>
##$USERP3= <user>
##$USERP4= <user>
##$USERP5= <user>
##$WDW= 1
##$XDIM= 16384
##$YMAX_p= 420189374
##$YMIN_p= -3130002
$$ End of Bruker specific parameters
$$ ---------------------------------
##NTUPLES= NMR SPECTRUM
##VAR_NAME=  FREQUENCY,     SPECTRUM/REAL,   SPECTRUM/IMAG
##SYMBOL=    X,             R,               I
##VAR_TYPE=  INDEPENDENT,   DEPENDENT,       DEPENDENT
##VAR_FORM=  AFFN,          ASDF,            ASDF
##VAR_DIM=   16384,         16384,           16384
##UNITS=     HZ,            ARBITRARY UNITS, ARBITRARY UNITS
##FACTOR=    0.220516191357247, 1,           1
##FIRST=     3101.37073785169, 0,            0
##LAST=      -511.346025154086, 0,           0
##MIN=       -511.346025154086, -3130002,    0
##MAX=       3101.37073785169, 420189374,    0
$$ Real data points
##PAGE= N=1
##DATA TABLE= (X++(R..R)), XYDATA
$$ [...]
5990F03027L7159J43670o8927K23400J86451j29867k56632k13171K91620r551
$$ 603027 640186 783856 714929 938329 1124780 994913 738281 525110 816730 807179
5980H07179l4024n3400n0807j83663K33611J45842k22640Q4400K28173J42939
$$ 807179 773155 719755 668948 485285 718896 864738 642098 726498 954671 1097610
5970A097610J4030j58830P7911q967j28078L2996n4554j44040j61433L01633J7349
$$ 1097610 1111640 952810 1030721 1021754 893676 926672 872118 728078 566645 868278 885627
5959H85627j17104K7201j76711P7911J32236m9274o5513J04003J38047J18700
$$ 885627 768523 795724 619013 696924 829160 779886 714373 818376 956423 1075123
5949A075123P7585j75406k34681K41687N8848m0817j65054K10121P8820j81201
$$ 1075123 1152708 977302 742621 984308 1043156 1002339 837285 1047406 1126226 945025
5939I45025j34456Q8386K76980k6763l78158J020J59777p487J30707Q2136M4590
$$ 945025 810569 898955 1175935 1149172 771014 772034 931811 924324 1055031 1137167 1181757
5928A181757j91081k62249n1836l15j33730K27306J14942m2334J03782N4008n8593
$$ 1181757 990676 728427 676591 676276 542546 769852 884794 842460 946242 1000250 941657
5917I41657P1064n1545K1614j15363j4307l564R0268J8950J32975Q3293l07088
$$ 941657 1012721 961176 982790 867427 853120 849556 939824 958774 1091749 1175042 867954
5906H67954p665J08525q4137q0233p4881L12451Q8355q7180q8753r7337L0257
$$ 867954 860289 968814 884677 804444 729563 1042014 1130369 1043189 954436 857099 887356
5895H87356J05890J20J70469q6535j55490J02822k7596k23516K6844K29431P3747
$$ 887356 993246 993366 1163835 1077300 921810 1024632 997036 773520 800364 1029795 1103542
5884A103542n5747R6918L04896m16462J60451j02012J7028p5577j30366P3063
$$ 1103542 1047795 1144713 1449609 1033147 1193598 1091586 1108614 1033037 902671 975734
5874I75734J20068k7774j37935K6540j96047J4035n4214j30154K52494J25909
$$ 975734 1095802 1068028 930093 956633 760586 774621 720407 590253 842747 968656
5864I68656q9635l8972L716M320J93674j44354K28969J08727m59809J57195R3985
$$ 968656 879021 840049 843765 848085 1041759 897405 1126374 1235101 775292 932487 1026472
5853A026472m2816Q8406J44769l11300k53322J92020L86084p741k8038p6902j34859
$$ 1026472 983656 1072062 1216831 905531 652209 844229 1230313 1222572 1194534 1117632 982773
5842I82773K85660L4217j04156L9589J27820o1669k55124j59326K6546J21625
$$ 982773 1268433 1302650 1198494 1238083 1365903 1304234 1049110 889784 916330 1037955
5832A037955j55081j88125O3101J96770j87421J31717J20456K474J95884k4046
$$ 1037955 882874 694749 757850 954620 767199 898916 1019372 1021846 1217730 1193684
5822A193684k94820M3680L33892L41938k15541l25082J16225K5405K98958p6108
$$ 1193684 898864 942544 1276436 1618374 1402833 1077751 1193976 1219381 1518339 1442231
5812A442231k02940o9727o3336N7144o0894R5759l1036j02368J69926Q2525P2207
$$ 1442231 1239291 1169564 1106228 1163372 1102478 1198237 1167201 1064833 1234759 1317284 1389491
5801A389491Q5965l3029M3473o8787K8272r3395k38902K21997M34590k08792j12299
$$ 1389491 1475456 1442427 1485900 1417113 1445385 1351990 1113088 1335085 1769675 1560883 1448584
5790A448584R6753j16829j78242R3571N2474q0149o6551J21038K50862n2433q9076
$$ 1448584 1545337 1428508 1250266 1343837 1396311 1316162 1249611 1370649 1621511 1569078 1480002
5779A480002p9757j42085r2355k63383L05238P3789q5979J51985L4650K05806
$$ 1480002 1400245 1258160 1165805 902422 1207660 1281449 1195470 1347455 1382105 1587911
5769A587911j97521q123n2758n983j15113K29563j21688O8852O7164k07965J49467
$$ 1587911 1390390 1382267 1329509 1323526 1208413 1437976 1316288 1385140 1452304 1244339 1393806
5758A393806k0684j86297N6470K59661K29096O7769j26778k38885j80979j29855
$$ 1393806 1373122 1186825 1243295 1502956 1732052 1799821 1673043 1434158 1253179 1123324
5748A123324K36722J20756m5521N2324L0988R5515j28551l37001J19013J98350
$$ 1123324 1360046 1480802 1435281 1487605 1518593 1614108 1485557 1148556 1267569 1465919
5738A465919j20864k18813K81449L239K0756o6169J46603J19018k61312J51644
$$ 1465919 1345055 1126242 1407691 1410930 1431686 1365517 1512120 1631138 1369826 1521470
5728A521470q610j63317M3010J70748j70840Q7037O400R16j03297J55588l3048
$$ 1521470 1512860 1349543 1392553 1563301 1392461 1479498 1485898 1486814 1383517 1539105 1506057
5717A506057K30909K19164j91587N3582J46042L7795Q2146j44988M9209Q8618
$$ 1506057 1736966 1956130 1764543 1818125 1964167 2001962 2084108 1939120 1988329 2076947
5707B076947p2277k91435k57539J40293M259K89158k1450l037k3924J97085R3061
$$ 2076947 2004670 1713235 1455696 1595989 1600248 1889406 1867956 1864919 1840995 2038080 2131141
5696B131141k66362k2449M2435Q958o9131K64718k47400L72684J69458j29294
$$ 2131141 1864779 1842330 1884765 1893723 1824592 2089310 1841910 2214594 2384052 2254758
5686B254758J96885k10471j12018L79823R8774k39059n0562P4598j02738M4532
$$ 2254758 2451643 2241172 2129154 2508977 2607751 2368692 2318130 2392728 2289990 2334522
5676B334522j52992o2729M1691j31010k25743r1538Q0988j14059J68977j81473
$$ 2334522 2181530 2118801 2160492 2029482 1803739 1712201 1793189 1679130 1848107 1666634
5666A666634K01947P3745j3544Q0294K1870J61877J9034j62365J15492J66484
$$ 1666634 1868581 1942326 1928782 2009076 2030946 2192823 2211857 2049492 2164984 2331468
5656B331468k65678O9295O8970l13230J85961J8895j04598N6142O8072j1699L59606
$$ 2331468 2065790 2135085 2204055 1890825 2076786 2095681 1991083 2047225 2115297 2103598 2463204
5645B463204J11471m5361j02295J8315o9758J95061K83412j26242q2309j62631
$$ 2463204 2574675 2529314 2427019 2445334 2375576 2570637 2854049 2727807 2645498 2482867
5635B482867L60689m242k22871K62857J02920j81247J25317K4465K2831O7866
$$ 2482867 2843556 2839314 2616443 2879300 2982220 2800973 2926290 2950755 2973586 3041452
5625C041452J15819j52860o6603j41095r2692O2735L6106m3956M9054K69574m7234
$$ 3041452 3157271 3004411 2937808 2796713 2704021 2766756 2802862 2758906 2807960 3077534 3030300
5614C030300j9031J04085P5727J09653K13756J78906k74304k1367K72872l935
$$ 3030300 3011269 3115354 3191081 3300734 3514490 3693396 3419092 3397725 3670597 3666662
5604C666662o6082J50465K82564Q9496J8496L13741O8335k2825K41476R6298P2654
$$ 3666662 3600580 3751045 4033609 4123105 4141601 4455342 4523677 4500852 4742328 4838626 4911280
5593D911280l665K88563N39224O4041O3556M81418K63355M36609L77162K26337
$$ 4911280 4907615 5196178 5735402 5799443 5862999 6344417 6607772 7044381 7421543 7647880
5583G647880K53622O80708N03344K83407N14494K45775J57227J75787L34207K10304
$$ 7647880 7901502 8582210 9085554 9368961 9883455 10129230 10286457 10462244 10796451 11006755
5573A1006755O9094K14914J31713n4108K20666K75406J32434M36859J01771K75795
$$ 11006755 11075849 11290763 11422476 11368368 11589034 11864440 11996874 12433733 12535504 12811299
5563A2811299L48211M86082Q29604O59637K65333M50890O30330N52254N37441
$$ 12811299 13159510 13645592 14475196 15134833 15400166 15851056 16481386 17033640 17571081
5554A7571081N75380L24439L63556P35378M30551M74184L3808q331N06834J55854
$$ 17571081 18146461 18470900 18834456 19569834 20000385 20474569 20508377 20500046 21006880 21162734
5544B1162734n0688L2747k329L02218J90446J97315J02847N07452N37839N11930
$$ 21162734 21112046 21144793 21142464 21444682 21635128 21832443 21935290 22442742 22980581 23492511
5534B3492511P03727M22819M86891P61122Q37542O03851K04083M02486K70576
$$ 23492511 24196238 24619057 25105948 25867070 26704612 27308463 27512546 27915032 28185608
5525B8185608J16314R3155j43358j06343r2065q725m38536L1792k2474k79343
$$ 28185608 28301922 28395077 28251719 28145376 28053311 28044586 27606050 27637842 27615368 27336025
5515B7336025K69781j30480J60471k735J8887J36559K77674J71170L47116O38290
$$ 27336025 27605806 27475326 27635797 27633062 27651949 27788508 28066182 28237352 28584468 29222758
5505B9222758K71275K73249J56006L24653J55268K6219J82048L6061m85730n46540
$$ 29222758 29494033 29767282 29923288 30247941 30403209 30429428 30611476 30647537 30161807 29615267
5495B9615267j38382r1146p97981p77230l11668l25388m52530m05354p2691n3546
$$ 29615267 29476885 29385739 28587758 27810528 27498860 27173472 26720942 26315588 26242897 26189351
5485B6189351K5038k99464j55056M4914N2743L526n9627k46839j42687K149k05143
$$ 26189351 26214389 25914925 25759869 25804783 25857526 25861052 25801425 25554586 25411899 25414048 25208905
5474B5208905m23018o66204l19598n92530p47087p80318o31147m39510m42188
$$ 25208905 24785887 24119683 23800085 23207555 22460468 21680150 21049003 20609493 20167305
5465B0167305p71036m27371l23349p95340p21792k53796k65569n49331k78867
$$ 20167305 19396269 18968898 18645549 17850209 17128417 16874621 16609052 16059721 15780854
5456A5780854M8677m03360o60833j48024n6776l46539k97613k76302L4253m32915
$$ 15780854 15829531 15426171 14765338 14617314 14560538 14213999 13916386 13640084 13674337 13241422
5446A3241422m13475l91060m84997m36261m33465l79419o07118l55524l93430
$$ 13241422 12827947 12436887 11951890 11515629 11082164 10702745 10095627 9740103 9346673
5437I346673l97784m77214k08947j22205p43846j45816k47788j99652n5606l23669
$$ 9346673 8948889 8471675 8262728 8140523 7396677 7250861 7003073 6803421 6747815 6424146
5427F424146n39726m2929j64605m26393R7813m15391k15352k61841r3588o2632
$$ 6424146 5884420 5841491 5676886 5250493 5348306 4932915 4717563 4455722 4362134 4299502
5417D299502K49694j68609j39215Q4133m7218j6856j61818l16268k8972L4350
$$ 4299502 4549196 4380587 4241372 4325505 4278287 4261431 4099613 3783345 3754373 3788723
5407C788723k33756j35265k04670o3027R0217N3414j01932o8321R1435n1667p7537
$$ 3788723 3554967 3419702 3215032 3152005 3242222 3295636 3193704 3125383 3216818 3165151 3087614
5396C087614m50260q5825K08820J2110N1466k95306j48291j99308p4639L65585
$$ 3087614 2637354 2551529 2760349 2772459 2823925 2528619 2380328 2181020 2106381 2471966
5386B471966l61492R9309J30925j43428R8114J9883P659K1456j26059Q2828O5130
$$ 2471966 2110474 2209783 2340708 2197280 2295394 2315277 2322936 2344392 2218333 2301161 2366291
5375B366291k00631L6918N5887J93838j89391k23124k29059J34031L27670K1343
$$ 2366291 2165660 2202578 2258465 2452303 2262912 2039788 1810729 1944760 2272430 2293773
5365B293773o8730q7795J1971n7804p9811j11125j215O5767j31009J1826P6059
$$ 2293773 2225043 2137248 2149219 2091415 2011604 1900479 1899264 1965031 1834022 1845848 1921907
5354A921907K1295m410k02760O3458P9992j35155j15980J0712j1034K42161N8453
$$ 1921907 1943202 1938792 1736032 1799490 1879482 1744327 1628347 1639059 1628025 1870186 1928639
5343A928639J06085l66l50609J40519k09472Q5750j17081l8060J58754j26682
$$ 1928639 2034724 2034358 1683749 1824268 1614796 1700546 1583465 1545405 1704159 1577477
5333A577477K47827K62674m61389r9600J53924j20357m7480J88402l9817r3099
$$ 1577477 1825304 2087978 1626589 1526989 1680913 1560556 1513076 1701478 1661661 1568562
5323A568562L85776k5882j62789R4776j6343j98120n5782L6805J05527k72922
$$ 1568562 1954338 1928456 1765667 1860443 1844100 1645980 1590198 1627003 1732530 1459608
5313A459608j28984O6157k04040k692J69191k6929l3660l1949J37248R2624J47176
$$ 1459608 1330624 1396781 1192741 1190049 1359240 1332311 1298651 1266702 1403950 1496574 1643750
5302A643750J75613k40074l1963L7774J92391k99157J00341M4584k23670J3055
$$ 1643750 1819363 1579289 1547326 1585100 1777491 1478334 1578675 1623259 1399589 1412644
5292A412644K92659Q9571O8108Q6857n7049L4808k20430p0067P6972m8861r9526
$$ 1412644 1705303 1794874 1862982 1949839 1892790 1927598 1707168 1637101 1714073 1665212 1565686
5281A565686K73148k02677l1658O7422P4231r3925L6856l6686K71935l3433j10806
$$ 1565686 1838834 1636157 1604499 1671921 1746152 1652227 1689083 1652397 1924332 1890899 1780093
5270A780093q7640L321K4465n3381L0061M3634K8797l70555J92113K23739J68145
$$ 1780093 1692453 1695774 1720239 1666858 1696919 1740553 1769350 1398795 1590908 1814647 1982792
5259A982792j43234r8341j50224o8816L90606L4836j06369j80258q3507L15024
$$ 1982792 1839558 1741217 1590993 1522177 1912783 1947619 1841250 1660992 1577485 1892509
5249A892509p7141o9605m3053k0006j19278P3856J67053J35663k98859r9670P8886
$$ 1892509 1815368 1745763 1702710 1682704 1563426 1637282 1804335 1939998 1641139 1541469 1620355
5238A620355O3071l5372K34608o1256r1131q0752J08346M6627L7382J08681j9008
$$ 1620355 1683426 1648054 1882662 1821406 1730275 1649523 1757869 1804496 1841878 1950559 1931551
5227A931551J55502j28803N6245R996L8269p5980p2419l01028k9592K58560J36267
$$ 1931551 2087053 1958250 2014495 2024491 2062760 1986780 1914361 1613333 1583741 1842301 1978568
5216A978568j21773j01064J57624j8671k44755K85339J12629r8885J77595K60725
$$ 1978568 1856795 1755731 1913355 1894684 1649929 1935268 2047897 1949012 2126607 2387332
5206B387332o14844J95293K02336K73871o6542k7475l6791J12766J15886n2084
$$ 2387332 1772488 1967781 2170117 2443988 2377446 2349971 2313180 2425946 2541832 2489748
5196B489748K72462l77206j0486J69328j99675j30937j12531L04111k4664O0705
$$ 2489748 2762210 2385004 2374518 2543846 2344171 2213234 2100703 2404814 2380150 2440855
5186B440855r4251M50437M6147k53838J85716J23414m8259M3430J0722K0398q7693
$$ 2440855 2346604 2797041 2843188 2589350 2775066 2898480 2850221 2893651 2904373 2924771 2837078
5175B837078r3317K45152j25281J59993J4420K13384j74868J90894L5844P9914
$$ 2837078 2743761 2988913 2863632 3023625 3038045 3251429 3076561 3267455 3303299 3383213
5165C383213J04999O9963j24791J51440q507R1982j26493K77436K7587j09896
$$ 3383213 3488212 3558175 3433384 3584824 3576317 3668299 3541806 3819242 3846829 3736933
5155C736933K79788K36295l962J24746J10283K0095K61185M17850K30862K56328
$$ 3736933 4016721 4253016 4249054 4373800 4484083 4504178 4765363 5183213 5414075 5670403
5145E670403K69327J20569L04412L82260M41236O1632M24524L77625N41867M27526
$$ 5670403 5939730 6060299 6364711 6746971 7188207 7249839 7674363 8051988 8593855 9021381
5135I021381L44214M59771J41230J77986L27174J1861l5699N28126K40160L05153
$$ 9021381 9365595 9825366 9966596 10144582 10471756 10483617 10447918 10976044 11216204 11521357
5125A1521357n9113R0022M398l0590J28497k819J59144M13554L52662M22554M41938
$$ 11521357 11462244 11552266 11556664 11526074 11654571 11651752 11810896 12224450 12577112 12999666 13441604
5114A3441604N53451L08678K73539O69054O08906N49514N85554M15816N28652
$$ 13441604 13995055 14303733 14577272 15246326 15855232 16404746 16990300 17406116 17934768
5105A7934768P84658P25142O71114Q42002N90811N05937L14062J39965K73695
$$ 17934768 18719426 19444568 20115682 20957684 21548495 22054432 22368494 22508459 22782154
5096B2782154j36415Q4472k31708Q7421M439j75683J03928J43714p0674m0039
$$ 22782154 22645739 22730211 22498503 22585924 22590363 22414680 22518608 22662322 22591648 22551609
5086B2551609J49223K60791M2649Q0510K34301J55252J04656L96723K91262K98538
$$ 22551609 22700832 22961623 23004272 23084782 23319083 23474335 23578991 23975714 24266976 24565514
5076B4565514J09769M06005J88032M37789N02597O73016L42856L10256M73087
$$ 24565514 24675283 25081288 25269320 25707109 26209706 26882722 27225578 27535834 28008921
5067B8008921L11969J65011J44896K90294n5883j48513l58700k56024n76178j38412
$$ 28008921 28320890 28485901 28630797 28921091 28865208 28716695 28357995 28101971 27525793 27387381
5057B7387381l4211l925M9889K3535Q745j68300k1437p2795l10095Q3377l37665
$$ 27387381 27353170 27349245 27399134 27422669 27431414 27263114 27241677 27168882 26858787 26942164 26604499
5046B6604499j88706n04286l94644l08534n06503l59674l50955r5639p2014k97773
$$ 26604499 26415793 25911507 25516863 25208329 24701826 24342152 23991197 23895558 23823544 23525771
5036B3525771k67130p6079k07328j60432n77933J22813k05617j67458k08923m07117
$$ 23525771 23258641 23182562 22975234 22814802 22236869 22359682 22154065 21986607 21777684 21370567
5026B1370567j36803J63435l48799J15334P1810k58273L8586K8918k45549k39468
$$ 21370567 21233764 21397199 21048400 21163734 21235544 20977271 21015857 21044775 20799226 20559758
5016B0559758k37593j73401k08536n23047m61214p83946o45465q05540m18472
$$ 20559758 20322165 20148764 19940228 19417181 18955967 18172021 17526556 16721016 16302544
5007A6302544o82346o63173o80340m29880l10306l98903l57296m91699Q6430j85303
$$ 16302544 15620198 14957025 14276685 13846805 13536499 13137596 12780300 12288601 12375031 12189728
4997A2189728k60986k17243m40016m0613k09673j99108p7053j54985l0371Q7807
$$ 12189728 11928742 11711499 11271483 11230870 11021197 10822089 10745036 10590051 10559680 10647487
4987A0647487m0695J2734L0840j43438m71193l47325j94124m24923k54401j11448
$$ 10647487 10606792 10619526 10650366 10506928 10035735 9688410 9494286 9069363 8814962 8703514
4977H703514o49754l34055j18427o03448j07763r6646l09003k59538o3998l18276
$$ 8703514 8053760 7719705 7601278 6997830 6890067 6793421 6484418 6224880 6160882 5842606
4967E842606o6720l80721l07643j14720K62518J25195k65155K3301m28376j33068
$$ 5842606 5775886 5395165 5087522 4972802 5235320 5360515 5095360 5118661 4690285 4557217
4957D557217L28533m8213m32883j30011M5797L2499l62501j55345K2140q3401
$$ 4557217 4885750 4837537 4404654 4274643 4320440 4352939 3990438 3835093 3857233 3773832
4947C773832p7850j93379k10157k1426k6619K16370k44559J77434J20877j23232
$$ 3773832 3695982 3502603 3292446 3271020 3244401 3460771 3216212 3393646 3514523 3391291
4937C391291l4597j41397k83145j85610O2134K71349j80839q6283j4405N5595
$$ 3391291 3356694 3215297 2932152 2746542 2808676 3080025 2899186 2812903 2798498 2854093
4927B854093J28048k28399j39561j36100P271J67376O7148R972m53913j23728
$$ 2854093 2982141 2753742 2614181 2478081 2485352 2652728 2719876 2729848 2275935 2152207
4917B152207K19982j51155j25480R392K09739m9194j66029j56967J9740j7221
$$ 2152207 2372189 2221034 2095554 2104946 2314685 2265491 2099462 1942495 1962235 1945014
4907A945014p8055K26917k8822j88967k23398J71720K99515J80645k69463k30698
$$ 1945014 1866959 2093876 2065054 1876087 1652689 1824409 2123924 2304569 2035106 1804408
4897A804408L3273p6853J11118q3911j14658J18269O0764k24439L34340Q855L0075
$$ 1804408 1837681 1760828 1871946 1788035 1673377 1791646 1852410 1627971 1962311 1971166 2001241
4886B001241m62k10k26325K6662J52005k3554j38253l66831L02028j3720k29322
$$ 2001241 2000779 2000569 1774244 1800906 1952911 1929357 1791104 1424273 1726301 1712581 1483259
4875A483259J69257J50061P3694L19982l8598l0117L8102j0995R8764m1829J44097
$$ 1483259 1652516 1802577 1876271 2196253 2157655 2127538 2165640 2154645 2253409 2211580 2355677
4864B355677M4541M40950J69625M10081L57214R8445K81886R5728j42336k22002
$$ 2355677 2400218 2841168 3010793 3420874 3778088 3876533 4158419 4254147 4111811 3889809
4854C889809l22260M1165m8419l69892l82387L8155j28378l13339k29598o9543
$$ 3889809 3567549 3608714 3560295 3190403 2808016 2846171 2717793 2404454 2174856 2105313
4844B105313o9158j26044j81699J38798L42437j2882j68558k31581K9950M9189
$$ 2105313 2036155 1910111 1728412 1867210 2209647 2196765 2028207 1796626 1826576 1875765
4834A875765j60649l9876j85940J10184J21423M3919L7085q8451j29492Q0410
$$ 1875765 1715116 1675240 1489300 1599484 1720907 1764826 1801911 1713460 1583968 1664378
4824A664378j04808k234r5497q107j6024P5795P0791j48906l8554j30932l2330
$$ 1664378 1559570 1557336 1461839 1453732 1437708 1513503 1584294 1435388 1396834 1265902 1233572
4813A233572Q7279L80868j25460j20236K42429J99991k05895j01830j9827J438
$$ 1233572 1320851 1701719 1576259 1456023 1698452 1898443 1692548 1590718 1570891 1572329
4803A572329P2988K110r6028J46902L8765J11596j15166j71981L8476M2477l14392
$$ 1572329 1645317 1647427 1551399 1698301 1737066 1848662 1733496 1561515 1599991 1642468 1328076
4792A328076M0004J43298K45053P7011k80295q242J19411o6367O0849O9620J63705
$$ 1328076 1368080 1511378 1756431 1833442 1553147 1544905 1664316 1597949 1658798 1728418 1892123
4781A892123J2227l09724j18189N7350l9731J2575K02149l3942j6682j03513O4716
$$ 1892123 1904350 1594626 1476437 1533787 1494056 1506631 1708780 1674838 1658156 1554643 1619359
4770A619359J88899k20518J66362j34769P921n916j89196O6877o5790K9582l40633
$$ 1619359 1808258 1587740 1754102 1619333 1627254 1621338 1432142 1499019 1433229 1462811 1122178
4759A122178j59385M17854J78276p5889k7597j39682n7399K15173M5999r6360
$$ 1122178 962793 1380647 1558923 1483034 1455437 1315755 1258356 1473529 1519528 1423168
4749A423168m4911M25087j6193k20194k29303j07514J31462J46202K14909j06553
$$ 1423168 1378257 1803344 1787151 1566957 1337654 1230140 1361602 1507804 1722713 1616160
4739A616160J3147M2740Q6649n0403J64743k4188p4428m8487j79819K49650m4155
$$ 1616160 1629307 1672047 1758696 1708293 1873036 1848848 1774420 1725933 1546114 1795764 1751609
4728A751609O9636j59660Q7226K88919j88700M0816k6988k915p3004q1890J81907
$$ 1751609 1821245 1661585 1748811 2037730 1849030 1889846 1862858 1859943 1786939 1705049 1886956
4717A886956J9349Q0719M097K6791J83479r8790j57404K13267L94752l17450K3115
$$ 1886956 1906305 1987024 1991121 2017912 2201391 2102601 1945197 2158464 2553216 2235766 2258881
4706B258881N2528j54873m7668j28175J83375K33901o6655k60755M0481L27204
$$ 2258881 2311409 2156536 2108868 1980693 2164068 2397969 2331314 2070559 2111040 2438244
4696B438244l19303J69789o6197O2560J48819P864Q3762J35104r9301k60284N8866
$$ 2438244 2118941 2288730 2222533 2285093 2433912 2441776 2525538 2660642 2561341 2301057 2359923
4685B359923p7277J41295J45852l2837l4600J6942k8368o9010m1499j07492n8996
$$ 2359923 2282646 2423941 2569793 2536956 2502356 2519298 2490930 2421920 2380421 2272929 2213933
4674B213933k386J48281L53652L35493p2208m52436k25648L44315q7464J8713
$$ 2213933 2211547 2359828 2713480 3048973 2976765 2524329 2298681 2642996 2555532 2574245
4664B574245M8866j8720L3674L16724o8805k73305j4315p0989J01156k36200J96419
$$ 2574245 2623111 2604391 2638065 2954789 2885984 2612679 2598364 2527375 2628531 2392331 2588750
4653B588750r2172j36823k4469M07856J82448l33590J69772j5375j07942j15349
$$ 2588750 2496578 2359755 2335286 2743142 2925590 2592000 2761772 2746397 2638455 2523106
4643B523106N062j04852M43639P2794k44632o7954k703K92740l09443j43416j6192
$$ 2523106 2528168 2423316 2866955 2939749 2695117 2627163 2624460 2917200 2607757 2464341 2448149
4632B448149Q714N191M2608q0174q6144K22930K08292j46938p4446m7019j33606
$$ 2448149 2456863 2462054 2504662 2424488 2338344 2561274 2769566 2622628 2548182 2501163 2367557
4621B367557j0999J62071J03884Q0424l40360L90419K48520j62358r6628m3295
$$ 2367557 2356558 2518629 2622513 2702937 2362577 2752996 3001516 2839158 2742530 2699235
4611B699235K0197L4201J951r5036k34728j08757L0821L1219J94357K61057k63689
$$ 2699235 2719432 2753633 2755584 2660548 2425820 2317063 2347884 2379103 2573460 2834517 2570828
4600B570828l06438J53695p3473k50026J37086m7311L27326N0427L36416J00259
$$ 2570828 2264390 2418085 2344612 2094586 2231672 2184361 2511687 2562114 2898530 2998789
4590B998789j74231j62568R0135m3714j14922P0939j7964J58876k4119n589l75348
$$ 2998789 2824558 2661990 2752125 2708411 2593489 2664428 2646464 2805340 2781221 2775632 2400284
4579B400284N2572K88747P1376p9535R1092k04727j46790Q8492N8160j12838k071
$$ 2400284 2452856 2741603 2812979 2733444 2824536 2619809 2473019 2561511 2619671 2506833 2504762
4568B504762J01002p5151k8772K47944L524J2656J60343M4319j25326j889k07023
$$ 2504762 2605764 2530613 2501841 2749785 2753309 2765965 2926308 2970627 2845301 2843412 2636389
4557B636389k0994o0746L73867k20566j09709j3359j05759K75352J18788j8583
$$ 2636389 2615395 2554649 2928516 2707950 2598241 2584882 2479123 2754475 2873263 2854680
4547B854680q9365O1014K67869j43880R8987j49177J54321M5158J0375q3908n8552
$$ 2854680 2765315 2826329 3094198 2950318 3049305 2900128 3054449 3099607 3109982 3026074 2967522
4536B967522k0574m4108N9695O4745j027R741K77559J0473J191k20245j07029
$$ 2967522 2946948 2902840 2962535 3027280 3026253 3035994 3313553 3324026 3325217 3104972 2997943
4525B997943L4359J07006P977K11987K61801j08507j84738q3191j59320L79571
$$ 2997943 3032302 3139308 3147285 3359272 3621073 3512566 3327828 3244637 3085317 3464888
4515C464888J23245m7062k88327Q581K60693j88308P011J07297J49997p1276r0018
$$ 3464888 3588133 3541071 3252744 3261325 3522018 3333710 3340721 3448018 3598015 3526739 3436721
4504C436721P6385J4853j12347K42855K80556j15813p9809n6751m2477J03630
$$ 3436721 3513106 3527959 3415612 3658467 3939023 3823210 3743401 3686650 3644173 3747803
4494C747803J58248N3473J65608J36853k97350J4104J96729J60282J80127p1730
$$ 3747803 3906051 3959524 4125132 4261985 3964635 3978739 4175468 4335750 4515877 4444147
4484D444147Q2611n3704N5727N6436K0171r907J54324m0465l62831j97724J63119
$$ 4444147 4526758 4473054 4528781 4585217 4605388 4595481 4749805 4709340 4346509 4148785 4311904
4473D311904J66675P4790J53853K5407M5392R6158j64252M12334q3569L5147J43257
$$ 4311904 4478579 4553369 4707222 4732629 4778021 4874179 4709927 5122261 5038692 5073839 5217096
4462E217096K45549J8605O1788m8376j176R0214R1656p4623k7574L84005L87047
$$ 5217096 5462645 5481250 5543038 5494662 5493486 5583700 5675356 5600733 5573159 5957164 6344211
4451F344211J25233J17995J47171N0418L65034n427K09986M5661J57224J80759
$$ 6344211 6469444 6587439 6734610 6785028 7150062 7144635 7354621 7400282 7557506 7738265
4441G738265J92956L23148M15255M14559K49701M80546J24056M36616M04939M59101
$$ 7738265 7931221 8254369 8669624 9084183 9333884 9814430 9938486 10375102 10780041 11239142
4431A1239142N32678R68028O68508N99431N37479O16957Q65842N55592J046695
$$ 11239142 11771820 12739848 13408356 14007787 14545266 15162223 16028065 16583657 17630352
4422A7630352M09596J23945M35988O87541P06691M98510M06211O60538R63070
$$ 17630352 18039948 18163893 18599881 19287422 19994113 20492623 20898834 21559372 22522442
4413B2522442J094455J307335J138889J307808J162776Q38068O87646L08034R8529
$$ 22522442 23616897 24924232 26063121 27370929 28533705 29371773 30059419 30367453 30465982
4404C0465982k86616J62796J64384L13543P50533P31829J079355J406488Q59294
$$ 30465982 30179366 30342162 30506546 30820089 31570622 32302451 33381806 34788294 35647588
4395C5647588P60546N97047M84891l09031l31053m74201q25832m07579N8854j03190
$$ 35647588 36408134 37005181 37490072 37181041 36849988 36375787 35549955 35142376 35201230 35098040
4385C5098040K95230O71388P91753O27769M76229L72580J87075j39391n64459
$$ 35098040 35393270 36064658 36856411 37484180 37960409 38332989 38520064 38380673 37816214
4376C7816214n10202m55570o43866n67363j85255k09590k13656k367l83700l65850
$$ 37816214 37306012 36850442 36206576 35639213 35453958 35244368 35030712 35028345 34644645 34278795
4366C4278795j41001J6830k12110m31740m85411j13243m48154k40546L55139j70640
$$ 34278795 34137794 34154624 33942514 33510774 33025363 32912120 32463966 32223420 32578559 32407919
4356C2407919j94543L6071M25744P10379N00494N43280K28670N46042N13349J83996
$$ 32407919 32213376 32249447 32675191 33385570 33886064 34429344 34658014 35204056 35717405 35901401
4346C5901401O2328q2116J20913k52295m06786l26823j4936l23781l17099J8310
$$ 35901401 35963729 35881613 36002526 35750231 35343445 35016622 35001686 34677905 34360806 34379116
4336C4379116L02465L8278P1735O6265M63760M30133K82030K51129M72503M29044
$$ 34379116 34681581 34719859 34791594 34857859 35321619 35751752 36033782 36284911 36757414 37186458
4326C7186458M33792P33799k5876k08041k07984m52084j25078n9709n12198m30731
$$ 37186458 37620250 38354049 38328173 38120132 37912148 37460064 37334986 37275277 36763079 36332348
4316C6332348l39249j54076j98890p02584l33363n07292m26964l28174m66416
$$ 36332348 35993099 35839023 35640133 34937549 34604186 34096894 33669930 33341756 32875340
4307C2875340n91141m67609p45747j26925k34853k38207k61840R2768M8827k49773
$$ 32875340 32284199 31816590 31070843 30943918 30709065 30470858 30209018 30301786 30350613 30100840
4297C0100840K10664J53332N9144j95210k78239p52885n34411o69398n19354j101913
$$ 30100840 30311504 30464836 30523980 30328770 30050531 29297646 28763235 28093837 27574483 26472570
4287B6472570r31483j163562o64330o64635p79554n95507o45672m50943o53355
$$ 26472570 25541087 24377525 23713195 23048560 22269006 21673499 21027827 20576884 19923529
4278A9923529k98026n37117m42935m48051n59399l74077m57534l77044j08993
$$ 19923529 19625503 19088386 18645451 18197400 17638001 17263924 16806390 16429346 16320353
4269A6320353q56l43017n40899l29201l62888n8967q5346j69095j19140o4327
$$ 16320353 16319497 15976480 15435581 15106380 14743492 14684525 14599179 14430084 14310944 14246617
4259A4246617j77257n4862j62868j08451n9515l0884l91241l71027j89754m6990
$$ 14246617 14069360 14014498 13851630 13743179 13683664 13652780 13261539 12890512 12700758 12653768
4249A2653768j68878R6064k45276n6464j08049m8358j76680J5782k01944p2654
$$ 12653768 12484890 12580954 12335678 12279214 12171165 12122807 11946127 11961909 11759965 11687311
4239A1687311n3349k30423k62881n83383k01580m14101j81566j59998k51592l37761
$$ 11687311 11633962 11403539 11140658 10557275 10355695 9941594 9760028 9600030 9348438 9010677
4229I010677l4006N4713o9752k66888k35973k43692J64723j73788J56153J05423
$$ 9010677 8976671 9031384 8961632 8694744 8458771 8215079 8379802 8206014 8362167 8467590
4219H467590j44405l61419J17764l070k3797J60116j15562m7261l3831j1479k9113
$$ 8467590 8323185 7961766 8079530 8076460 8052663 8212779 8097217 8049956 8016125 8004646 7975533
4208G975533k3345n9467K3862j51408Q7397L04444M7796R8026J71221k2409M1183
$$ 7975533 7952188 7892721 7916583 7765175 7852572 8157016 8204812 8302838 8474059 8451650 8492833
4197H492833o9767k1595O6601J33580m8180j36452K31410J95362j9587j42239
$$ 8492833 8423066 8401471 8468072 8601652 8553472 8417020 8648430 8843792 8824205 8681966
4187H681966k33216K930K01177J77438l4692l07037j93887M31817J89412j07500
$$ 8681966 8448750 8451680 8652857 8830295 8795603 8488566 8294679 8726496 8915908 8808408
4177H808408L76J3444n725o3113j55786J82798q295N0428j56257j2823j02j80172
$$ 8808408 8808784 8822228 8816503 8753390 8597604 8780402 8772107 8822535 8666278 8653455 8653353 8473181
4165H473181j36685J35020K85972K90200K79121k76927n3199n9055P6013j01406
$$ 8473181 8336496 8471516 8757488 9047688 9326809 9049882 8996683 8937628 9013641 8912235
4155H912235K67932J09191J53986m6066K5091j46142J85319M50496N9233N95593
$$ 8912235 9180167 9289358 9443344 9397278 9422369 9276227 9461546 9912042 9971275 10566868
4145A0566868J84217L11164K33492K20163N26966O9379r360Q6721M78573K79087
$$ 10566868 10751085 11062249 11295741 11515904 12042870 12112249 12102889 12189610 12668183 12947270
4135A2947270K06319M03921M48304L91828J29975N25284M69947J01189K52630
$$ 12947270 13153589 13557510 14005814 14397642 14527617 15052901 15522848 15624037 15876667
4126A5876667L29654K89495r8242L12872J10132K84950M36963M38504K87497L41353
$$ 15876667 16206321 16495816 16397574 16710446 16820578 17105528 17542491 17980995 18268492 18609845
4116A8609845M80578M51507L19306K81677M63095L81512N95011N05263L09676
$$ 18609845 19090423 19541930 19861236 20142913 20606008 20987520 21582531 22087794 22397470
4107B2397470N57760J81415L44037L87277M19473M82110M71331P61295O32129
$$ 22397470 22955230 23136645 23480682 23867959 24287432 24769542 25240873 26002168 26634297
4098B6634297M86087N43378P62287R99105Q79316N64271J107482O81887J344147
$$ 26634297 27120384 27663762 28426049 29425154 30304470 30868741 31976223 32658110 34002257
4089C4002257P75277J067638J131076Q77285J429698J085304J176524J165386
$$ 34002257 34777534 35845172 36976248 37853533 39283231 40368535 41545059 42710445
4081D2710445R05242Q44101J219365R64165Q80808J096581R05859O62249R92880
$$ 42710445 43615687 44459788 45679153 46643318 47524126 48620707 49526566 50188815 51181695
4072E1181695J071270J360062J457361J376761J576015J439320J655938J884743
$$ 51181695 52252965 53613027 55070388 56447149 58023164 59462484 61118422 63003165
4064F3003165K030409J866063K093868K411418K217289K185398K053288K312197
$$ 63003165 65033574 66899637 68993505 71404923 73622212 75807610 77860898 80173095
4056H0173095K288620J735311J962790J694482J342698J213223R86642N91350
$$ 80173095 82461715 84197026 86159816 87854298 89196996 90410219 91396861 91988211
4048I1988211L80689L68490M49899k34196L036k6738n3534K59548L31653O10384
$$ 91988211 92368900 92737390 93187289 92953093 92956129 92929391 92875857 93135405 93467058 94077442
4038I4077442J004858J369592J722496J886420K179156K315856K365874K243593
$$ 94077442 95082300 96451892 98174388 100060808 102239964 104555820 106921694 109165287
4030A09165287K009394J593874J131199N93323K511m46229j264212j789647j700948
$$ 109165287 111174681 112768555 113899754 114493077 114495588 114049359 112785147 110995500 109294552
4021A09294552j979208k258599j674699r16056j290881j112470o29308o04889
$$ 109294552 107315344 105056745 103382046 102465990 101175109 100062639 99433331 98828442
4013I8828442j095013j429777j739180k698594l317935l713797l938338m143000
$$ 98828442 97733429 96303652 94564472 91865878 88547943 84834146 80895808 76752808
4005G6752808m305200m233850m174367m085449l455126k925895k956440k921767
$$ 76752808 72447608 68213758 64039391 59953942 56498816 53572921 50616481 47694714
3997D7694714k421806k164970k054472j967481j854825j690941j593011j336004
$$ 47694714 45272908 43107938 41053466 39085985 37231160 35540219 33947208 32611204
3989C2611204j137313j214412j002042r36247r72270r20347n76636o27379k92915
$$ 32611204 31473891 30259479 29257437 28321190 27348920 26428573 25851937 25224558 24931643
3980B4931643p96218m00107l50738l81761o72178l46980l47615o44866l50746
$$ 24931643 24135425 23735318 23384580 23002819 22330641 21983661 21636046 20991180 20640434
3971B0640434k96343l69602k99029l45105k33879k70494n50546k01536k54909
$$ 20640434 20344091 19974489 19675460 19330355 19096476 18825982 18275436 18073900 17818991
3962A7818991l55554r0771k44642k03892j67046k63480k9740q664k60146j93089
$$ 17818991 17463437 17372666 17128024 16924132 16757086 16493606 16463866 16455202 16195056 16001967
3952A6001967n5186m871m29117k78414l09389k68577k3777l41797J03231k7034
$$ 16001967 15946781 15941910 15512793 15234379 14924990 14656413 14632636 14290839 14394070 14367036
3942A4367036j61396j70003N6997k6039k2871j99494n8453J1831M3409J78715
$$ 14367036 14205640 14035637 14092634 14066595 14043724 13844230 13785777 13797608 13841017 14019732
3932A4019732J47020P1617N0594K30269M99181K27982J3200k06m6709r8612M28508
$$ 14019732 14166752 14238369 14288963 14519232 15018413 15246395 15259595 15259389 15212680 15114068 15542576
3921A5542576J36109k65266J38394k54436p5416R1459l9333N2762J8539J73305
$$ 15542576 15678685 15413419 15551813 15297377 15221961 15313420 15274087 15326849 15345388 15518693
3911A5518693K63657J81486j99461j44099M05358L14827L66865K45541J9833R7741
$$ 15518693 15782350 15963836 15764375 15620276 16025634 16340461 16707326 16952867 16972700 17070441
3901A7070441L88185L21312O12880N31035M99036M70353N66108K34751L77134
$$ 17070441 17458626 17779938 18392818 18923853 19422889 19893242 20459350 20694101 21071235
3892B1071235N92239N46915M67119O83439R99769Q71767J062050J095851R49208
$$ 21071235 21663474 22210389 22677508 23360947 24360716 25232483 26294533 27390384 28339592
3883B8339592J193976J635876J295712J370998J599655J584391J732402J453681
$$ 28339592 29533568 31169444 32465156 33836154 35435809 37020200 38752602 40206283
3875D0206283J384768J222133O13340O02643K45773p5782l1956m55761j94777
$$ 40206283 41591051 42813184 43426524 44029167 44274940 44199158 44167202 43711441 43516664
3866D3516664n25458q18105n64610n67995l01420k35850j08262j28754j92610
$$ 43516664 42991206 42173101 41608491 41040496 40739076 40503226 40394964 40266210 40073600
3857D0073600n16401J93104R9405K51456L10940m9544j27666L8359J49089J95748
$$ 40073600 39557199 39750303 39849708 40101164 40412104 40362560 40234894 40273253 40422342 40618090
3847D0618090N8849j75382K65611N86088M47186O03059R82156P60428J303516
$$ 40618090 40676939 40501557 40767168 41353256 41800442 42403501 43385657 44146085 45449601
3838D5449601J440754J442447K172698K352683K607296L345839M043950M163788
$$ 45449601 46890355 48332802 50505500 52858183 55465479 58811318 62855268 67019056
3830F7019056M759363N272665O060538O200323O295948O364376O468597O079128
$$ 67019056 71778419 77051084 83111622 89311945 95607893 101972269 108440866 114519994
3822A14519994N126639M413333L710427L020234K155392J167338N61913p6005
$$ 114519994 119646633 124059966 127770393 130790627 132946019 134113357 134675270 134599265
3814A34599265p64566j138254j896645j919218k178856k672419k639867l120658
$$ 134599265 133834699 132696445 130799800 128880582 126701726 124029307 121389440 118268782
3806A18268782k840800l481825m059450m254943m367938m786900n274353n312424
$$ 118268782 115427982 111946157 107886707 103631764 99263826 94476926 89202573 83890149
3798H3890149n047532m663670n192875m849050m403710m394608l848256l292126
$$ 83890149 78842617 74178947 68986072 64137022 59733312 55338704 51490448 48198322
3790D8198322l245222l046306k685485k224539j953353j829256k072076j386912
$$ 48198322 44953100 41906794 39221309 36996770 35043417 33214161 31142085 29755173
3782B9755173j421360j290281j098738r56274j203725j108349m74354o46687o85862
$$ 29755173 28333813 27043532 25944794 24988520 23784795 22676446 22202092 21555405 20869543
3773B0869543m02595k36037n73991n34365l09091R8882k75914j91085r4698K553
$$ 20869543 20466948 20230911 19656920 19122555 18813464 18912346 18636432 18445347 18350649 18353202
3763A8353202M5212Q8865N67814Q6226n8762M37469J49490K87235K63730J21269
$$ 18353202 18398414 18487279 19055093 19141319 19082557 19520026 19669516 19956751 20220481 20341750
3753B0341750p0304j23962j68372l00047k70509m00781n99938p01516q53662o30076
$$ 20341750 20271446 20147484 19979112 19679065 19408556 19007775 18407837 17706321 16852659 16222583
3743A6222583j33365p06694q71344m44533o04646p59411K2445n22598m81406m26780
$$ 16222583 16089218 15382524 14511180 14066647 13462001 12702590 12725035 12202437 11721031 11294251
3733A1294251j33562M600k13591n39416l88525k38948j02036j45644j92477l90804
$$ 11294251 11160689 11165289 10951698 10412282 10023757 9784809 9682773 9537129 9344652 8953848
3723H953848m1025J50775j22823r0777K5260J95830Q8118k78804k25285k92272
$$ 8953848 8912823 9063598 8940775 8849998 8875258 9071088 9159206 8880402 8655117 8362845
3713H362845k8768j96908j6385n9612l10739K78464K1333j26371k27921P7453
$$ 8362845 8334077 8137169 8120784 8061172 7750433 8028897 8050230 7923859 7695938 7773391
3703G773391m9675P6695j26474j9929k43878L948K47839j78103L39994j75453
$$ 7773391 7723716 7800411 7673937 7654008 7410130 7414078 7661917 7483814 7823808 7648355
3693G648355j92655j25364J06225K0547j55667j19838k0418K1701N4969k2804
$$ 7648355 7455700 7330336 7436561 7457108 7301441 7181603 7161185 7182886 7237855 7215051
3683G215051j31109r7471k07887L66152K57597j89832j35353J16272j19617J09711
$$ 7215051 7083942 6986471 6778584 7144736 7402333 7212501 7077148 7193420 7073803 7183514
3673G183514n579J9249L84502J3349o8929O7264k0582J10926K42737L8131M724
$$ 7183514 7177935 7197184 7581686 7595035 7526106 7593370 7572788 7683714 7926451 7964582 7969306
3662G969306J43566m1981J53214K67372R9908J26265N11982J66290O0493L32963
$$ 7969306 8112872 8070891 8224105 8491477 8591385 8717650 9229632 9395922 9456415 9789378
3652I789378K98958k12718K65354N14474L87085N74872K78936K44682P78445Q85273
$$ 9789378 10088336 9875618 10140972 10655446 11042531 11617403 11896339 12141021 12919466 13804739
3642A3804739L00991M16733N90850L44651N80021O44942N55193M74822M17070
$$ 13804739 14105730 14522463 15113313 15457964 16037985 16682927 17238120 17712942 18130012
3633A8130012K40259N3294J09383L83606J70472L99003L66369l5789K86338L57476
$$ 18130012 18370271 18423565 18532948 18916554 19087026 19486029 19852398 19816609 20102947 20460423
3623B0460423L1711m6492M53857J29983j28611j12650N8809K06953j85392N4945
$$ 20460423 20492134 20445642 20899499 21029482 20900871 20788221 20847030 21053983 20868591 20923536
3613B0923536L54537K58231L23446M52506N33580M32280N42488O56109P25168
$$ 20923536 21278073 21536304 21859750 22312256 22845836 23278116 23820604 24476713 25201881
3604B5201881R79197J003290J124225R27249J352980J578828J812836J874404
$$ 25201881 26181078 27184368 28308593 29235842 30588822 32167650 33980486 35854890
3596C5854890K111331K300748K359142K922155L292815L489222M080275M432310
$$ 35854890 37966221 40266969 42626111 45548266 48841081 52330303 56410578 60842888
3588F0842888M860516N552308O027630O274652O697005O500154O403959O545982
$$ 60842888 65703404 71255712 77283342 83557994 90254999 96755153 103159112 109705094
3580A09705094O121366N182956M759663M541860M157571L564658K930881K801250
$$ 109705094 115826460 121009416 125769079 130310939 134468510 138033168 140964049 143765299
3572A43765299K748406J804546J513732J062042k5783l39557j282988j867133
$$ 143765299 146513705 148318251 149831983 150894025 150868242 150528685 149245697 147378564
3564A47378564k662604k935584l417045l800803m045470m456210n021741n601450
$$ 147378564 144715960 141780376 138363331 134562528 130517058 126060848 121039107 115437657
3556A15437657n713748n709330n820954n955380n855966n797626n640384n328176
$$ 115437657 109723909 104014579 98193625 92238245 86382279 80584653 74944269 69616093
3548F9616093m593046m230289m001273l272468l015899k416866k238445k031299
$$ 69616093 65023047 60792758 56791485 53519017 50503118 48086252 45847807 43816508
3540D3816508j810631j336859j184896j269896j063065o58264j072667l27545
$$ 43816508 42005877 40669018 39484122 38214226 37151161 36492897 35420230 35092685
3532C5092685m86367n54139n13802l39679M2352R3438j45383l72870k94791k86227
$$ 35092685 34606318 34052179 33538377 33198698 33241050 33334488 33189105 32816235 32521444 32235217
3522C2235217k09696o1883O5685j40920J0740Q5699J33746L3573n4389l89014
$$ 32235217 32025521 31963638 32029323 31888403 31899143 31984842 32118588 32152161 32097772 31708758
3512C1708758l8747M3662l25475k36744l67365j02511k74895r93242r09004o66666
$$ 31708758 31670011 31713673 31388198 31151454 30784089 30681578 30406683 29413441 28504437 27837771
3502B7837771r94482q26696p15126q79261m65035n88163m18847n94535l28703
$$ 27837771 26843289 26016593 25301467 24422206 23957171 23369008 22950161 22355626 22026923
3493B2026923m29292m11774k92284j07181Q1368j62728J8210J41435L04969J35087
$$ 22026923 21597631 21185857 20893573 20786392 20867760 20705032 20723242 20864677 21169646 21304733
3483B1304733L62074J3430N24359O62352O33493N32596L24140j866K7197J98655
$$ 21304733 21666807 21680237 22204596 22866948 23500441 24033037 24357177 24355311 24382508 24581163
3473B4581163R6430J04428K21922M21529M03792M09576K08385M4750Q1308K29519
$$ 24581163 24677593 24782021 25003943 25425472 25829264 26238840 26447225 26491975 26573283 26802802
3463B6802802L89192K29413J02068L9906k85758K3584n9952J50746p3300N2637
$$ 26802802 27191994 27421407 27523475 27563381 27277623 27301207 27241255 27392001 27318701 27371338
3453B7371338J49399J67497K8360k87162k4915M652l85461J25145K97769L43782
$$ 27371338 27520737 27688234 27716594 27429432 27404517 27409169 27023708 27148853 27446622 27790404
3443B7790404J03159j768M7355N93895J081210J232280J140715J087368J360662
$$ 27790404 27893563 27891795 27939150 28533045 29614255 30846535 31987250 33074618 34435280
3434C4435280J905259J598848K060652K453982K134542K643789L071063L560098
$$ 34435280 36340539 37939387 40000039 42454021 44588563 47232352 50303415 53863513
3426E3863513M011880M654089N261381N588106N880245O158772N700338N357899
$$ 53863513 57875393 62529482 67790863 73378969 79259214 85417986 91118324 96476223
3418I6476223M806555L554609K483280P80108l67425j926009l568151m637588
$$ 96476223 101282778 104837387 107320667 108100775 107733350 105807341 102239190 97601602
3410I7601602n261221n697300n869312o042894n335206m696269m907837m074325
$$ 97601602 92340381 86643081 80773769 74730875 69395669 64699400 59791563 55717238
3402E5717238l495960l063143k695841k088673j872967j839587j471512j253179
$$ 55717238 52221278 49158135 46462294 44373621 42500654 40661067 39189555 37936376
3394C7936376j316095j418974j303010j321769j380517j143735j078424n34928
$$ 37936376 36620281 35201307 33898297 32576528 31196011 30052276 28973852 28438924
3386B8438924r49376j049444n65373m22044n21525m02998o49872m65001l38532
$$ 28438924 27489548 26440104 25874731 25452687 24931162 24528164 23878292 23413291 23074759
3377B3074759m84091j31802m35687m16138n61131m65095l43194l45243m43954
$$ 23074759 22590668 22458866 22023179 21607041 21045910 20580815 20237621 19892378 19448424
3368A9448424l67493j07113k77738p22915p72796j084601q77411o08481l92516
$$ 19448424 19080931 18973818 18696080 17973165 17200369 16115768 15238357 14629876 14237360
3359A4237360o33408n05234k85618n07373l84978n22983j10988m06052k79982
$$ 14237360 13603952 13098718 12813100 12305727 11920749 11397766 11286778 10880726 10600744
3350A0600744l08016k54878m30454j51060r3985l65027k08402l05421N3094q79
$$ 10600744 10292728 10037850 9607396 9456336 9362351 8997324 8788922 8483501 8536595 8535716
3340H535716j29625j23239k53035j78844j81696k63728l53722O4237j33638Q0025
$$ 8535716 8406091 8282852 8029817 7850973 7669277 7405549 7051827 7116064 6982426 7062451
3330G062451O1959J4204p5045r1687p5168O4067K17530n9928j0717j57693j53861
$$ 7062451 7124410 7138614 7063569 6971882 6896714 6960781 7178311 7118383 7107666 6949973 6796112
3319F796112J86315k8711j51049r0842J18007L2280j98998j80373k77706j04676
$$ 6796112 6982427 6953716 6802667 6711825 6829832 6862112 6663114 6482741 6205035 6100359
3309F100359k61687k93370L20265k88710O4805J12228j96037K91086K4232m09319
$$ 6100359 5838672 5545302 5865567 5576857 5641662 5753890 5557853 5848939 5873171 5463852
3299E463852j05900r5899J17146j6764k1819J03454r8141R3034j422L03388J0348
$$ 5463852 5357952 5262053 5379199 5362435 5340616 5444070 5345929 5438963 5437541 5740929 5751277
3288E751277j15642j22639o552j75773k15321K8395K71522j35873J48572l0658
$$ 5751277 5635635 5512996 5506444 5330671 5115350 5143745 5415267 5279394 5427966 5397308
3278E397308J11595O0834j69160o2189J79515j13693j3861M4817L38853J34000
$$ 5397308 5508903 5569737 5400577 5338388 5517903 5404210 5390349 5435166 5774019 5908019
3268E908019P6362K4334r6016k56515R3390J05093k34931j00269J67379j09977
$$ 5908019 5984381 6008715 5912699 5656184 5749574 5854667 5619736 5519467 5686846 5576869
3258E576869j34810J92332N5548j02109J14485K81765j89577r8747j56748J48623
$$ 5576869 5442059 5634391 5689939 5587830 5702315 5984080 5794503 5695756 5539008 5687631
3248E687631K45909J22767j48833l5048K17238J27262l9237J67098J13728J49675
$$ 5687631 5933540 6056307 5907474 5872426 6089664 6216926 6177689 6344787 6458515 6608190
3238F608190o1022K4955L55332j06260j6749R5173N53462M70087K04713R7445
$$ 6608190 6547168 6572123 6927455 6821195 6804446 6899619 7453081 7923168 8127881 8225326
3228H225326j4788M93999K80138K54214J59255J60500J02157K03805K62751J89840
$$ 8225326 8210538 8704537 8984675 9238889 9398144 9558644 9660801 9864606 10127357 10317197
3218A0317197N45717L18414L20686J48113J6111K99197N86279N53669J47224L97490
$$ 10317197 10862914 11181328 11502014 11650127 11666238 11965435 12551714 13105383 13252607 13650097
3208A3650097K86054K71779O40259M48849M75448R86329Q55496Q31121P65676
$$ 13650097 13936151 14207930 14848189 15297038 15772486 16758815 17614311 18445432 19211108
3199A9211108O97990R35199J127971J018716J262350R07537J236581J107516R57896
$$ 19211108 19909098 20844297 21972268 22990984 24253334 25160871 26397452 27504968 28462864
3190B8462864O57580O55252O42766N97806M31435Q47031J250018J080509J311490
$$ 28462864 29120444 29775696 30418462 31016268 31447703 32294734 33544752 34625261 35936751
3181C5936751J590089J528227J780709J544940J950556K308574K392428K478681
$$ 35936751 37526840 39055067 40835776 42380716 44331272 46639846 49032274 51510955
3173E1510955K919068L346136L386851M005455M365422M892439N355917O331537
$$ 51510955 54430023 57776159 61163010 65168465 69533887 74426326 79782243 86113780
3165H6113780O935618P776883R115588J0340939J1495788J2655381J4463599J6903425
$$ 86113780 93049398 100826281 109941869 120282808 131778596 144433977 158897576 175801001
3157A75801001J9640235K3979586K8909568L4358753L8570681M0735110L6673950
$$ 175801001 195441236 219420822 248330390 282689143 321259824 361994934 398668884
3150C98668884K1520490m509781l1439315m6888459m6815518m0268133l2868726
$$ 398668884 420189374 415679593 384240278 337351819 290536301 250268168 217399442
3143B17399442k6247606k0508309j6129125j3169616j0870577r563134q048276
$$ 217399442 191151836 170643527 154514402 141344786 130474209 120911075 112862799
3136A12862799p173513o735508n668328m908909m111871l967250l135551k912678
$$ 112862799 105689286 98953778 93285450 88376541 84264670 80297420 77161869 74249191
3128G4249191k198059k013464j644055j380739j207779j053943j148575r95479
$$ 74249191 72051132 70037668 68393613 67012874 65805095 64751152 63602577 62607098
3120F2607098p76995n68340p42648l33810n17969l04747o58622p59817m48625
$$ 62607098 61830103 61261763 60519115 60185305 59667336 59362589 58703967 57944150 57495525
3111E7495525k24563M23603Q40183R06627J225453J908687K496252K789905L036818
$$ 57495525 57270962 57694565 58534748 59441375 60666828 62575515 65071767 67861672 70898490
3102G0898490L187171L602732K664132J684662K86114j361883l297670m343032
$$ 70898490 74085661 77688393 80352525 82037187 82323301 80961418 77663748 73320716
3094G3320716n059460n262032m761138m193401l986425l677270l242807k428133
$$ 73320716 68261256 62999224 58238086 54044685 50058260 46380990 43138183 40710050
3086D0710050k383784k050404j815740k017129j552729j801357j721653j627837
$$ 40710050 38326266 36275862 34460122 32442993 30890264 29088907 27367254 25739417
3078B5739417j646342j540753j102252j195421j226435p51985q49575n53592p15056
$$ 25739417 24093075 22552322 21450070 20254649 19028214 18276229 17426654 16873062 16158006
3069A6158006n94420n75224k95182o89825m04642n34593n55790n25414o97284
$$ 16158006 15563586 14988362 14693180 14003355 13598713 13064120 12508330 11982916 11285632
3060A1285632j15374l65925o08418m50898j9363m98675n47076l12294m48517M094
$$ 11285632 11170258 10804333 10195915 9745017 9725654 9226979 8679903 8367609 7919092 7923186
3050G923186l15339k83770j67996k43316j86167j03619j86655p9942l38162l73201
$$ 7923186 7607847 7324077 7156081 6912765 6726598 6622979 6436324 6356382 6018220 5645019
3040E645019q4981k96607j52436j82533p2382p2407J1580l39041l54809k7782
$$ 5645019 5560038 5263431 5110995 4928462 4856080 4783673 4795253 4456212 4101403 4073621
3030D073621N8245j05000Q3850k59210k33892l2661j8052L5570O4404k65135k91413
$$ 4073621 4131866 4026866 4110716 3851506 3617614 3584953 3566901 3602471 3666875 3401740 3110327
3019C110327j20962p4129M5414o2146j00198J86291m11657k77301j01228J36632
$$ 3110327 2989365 2915236 2960650 2898504 2798306 2984597 2572940 2295639 2194411 2331043
3009B331043Q0059j45077k07982l06186O1241r6098J97809L25662l25770l33524
$$ 2331043 2411102 2266025 2058043 1751857 1813098 1717000 1914809 2240471 1914701 1581177
2999A581177J90977q929k21092j34523j91133R8819k778j42812p026N0804l85323
$$ 1581177 1772154 1763225 1542133 1407610 1216477 1315296 1312518 1169706 1162680 1213484 828161
2988H28161n4596J7187k13893J56714J61631j52504j50571M5726k93736j71972
$$ 828161 773565 790752 576859 733573 895204 742700 592129 637855 344119 172147
2978A72147K62743P6782Q5729l1954k4523j40914l28149K12234J17050p7792O8161
$$ 172147 434890 511672 597401 565447 540924 400010 71861 284095 401145 323353 391514
2967C91514O4736o2655p0381j23063J44832K10014l10624j64268J54412j7138
$$ 391514 456250 393595 323214 200151 344983 554997 244373 80105 234517 217379
2957B17379L4285J39966j3062J83626k14516r9206j02884K8260J62616l10677
$$ 217379 251664 391630 378568 562194 347678 248472 145588 173848 336464 25787
2947B5787k48581q3913J70276J33444L3874O9770r5482N9926p2585k86079K12759
$$ 25787 -222794 -306707 -136431 -2987 30887 100657 5175 65101 -7484 -293563 -80804
2936h0804J28013M3328j61864J26617r1117J58688j24931j37915l8056J82279
$$ -80804 47209 90537 -71327 55290 -35827 122861 -2070 -139985 -178041 4238
2926D238j8032j03185K6148N9528N29o6889M7363M8147j8023L04J7742N8477k54773
$$ 4238 -13794 -116979 -90831 -31303 -30774 -97663 -50300 -2153 -20176 -19872 -2130 56347 -198426
2913a98426j49274J32723K05333J20812j6177k41336J52899J56839j95995N0426
$$ -198426 -347700 -214977 -9644 111168 94991 -146345 6554 163393 -32602 17824
2903A7824k77632j36032K43749M7560l8793n090L7222q3198j1862R5028k57704
$$ 17824 -259808 -395840 -152091 -104531 -143324 -148414 -111192 -194390 -206252 -111224 -368928
2892c68928L21951j77341j78331j78684J48479N29831J07912m15592k22793K10900
$$ -368928 -46977 -224318 -402649 -581333 -432854 96977 204889 -210703 -433496 -222596
2882b22596O198J49343P197k1537L49331k2669k7013j42144J10374J63603q0776
$$ -222596 -216398 -67055 -59858 -81395 267936 245267 218254 76110 186484 350087 269311
2871B69311J46323L09810K28495J25910J59054J80121L39413o2934j42516k70489
$$ 269311 415634 725444 953939 1079849 1238903 1419024 1758437 1695503 1552987 1282498
2861A282498l31374k99443L9990l7062l71738j08756l0195l4039j07573N6854
$$ 1282498 951124 651681 691671 654609 282871 174115 143920 109881 2308 59162
2851E9162n6367P7809j13410j94692K39961p7668j46441p0867J8971l9368N2370
$$ 59162 2795 80604 -32806 -227498 12463 -65205 -211646 -282513 -263542 -302910 -250540
2840b50540j5431j60628J30932j2741J45397K21615j90985j44446q0250L2852
$$ -250540 -265971 -426599 -295667 -308408 -163011 58604 -132381 -276827 -357077 -324225
2830c24225L51876k05552K55349r8243k60389Q6887K0307J06724j98141Q042J54042
$$ -324225 27651 -177901 77448 -20795 -281184 -194297 -173990 -67266 -265407 -257365 -103323
2819a03323O4362K06765m9538j13004l4191J84926m20997K7045N9270j13890L0066
$$ -103323 -38961 167804 118266 5262 -28929 155997 -265000 -237955 -178685 -292575 -262509
2808b62509j64626K11849m0879q1340J39258K3710n99J06472k55349o7987J74751
$$ -262509 -427135 -215286 -256165 -337505 -198247 -174537 -175136 -68664 -324013 -392000 -217249
2797b17249K204k70068P4938k74268J74330K08858r6773j23258K21548o4481j95834
$$ -217249 -215045 -485113 -410175 -684443 -510113 -301255 -398028 -521286 -299738 -364219 -560053
2786e60053k9559J9750q4240k5191k4840k0053j94784o1781J80326L90433K99842
$$ -560053 -589612 -569862 -654102 -679293 -704133 -724186 -918970 -980751 -800425 -409992 -110150
2775a10150k00253p9809p9084M9250J60210K0620N333j61599j02557j41061J53760
$$ -110150 -310403 -390212 -469296 -420046 -259836 -239216 -233883 -395482 -498039 -639100 -485340
2764d85340L07983q2890J6710N6215q7593j03961L8883m1452j501k3719N3447
$$ -485340 -177357 -260247 -243537 -187322 -274915 -378876 -339993 -381445 -382946 -406665 -353218
2753c53218k28491R9101K50295k15599k26447j15248K48268K02962l0495k1121
$$ -353218 -581709 -482608 -232313 -447912 -674359 -789607 -541339 -338377 -368872 -389993
2743c89993N0312k25329Q1334K01031k29041j76407J2816K85933j19572J56745
$$ -389993 -339681 -565010 -483676 -282645 -511686 -688093 -675277 -389344 -508916 -352171
2733c52171R4460J04978j51279l86875J63508q5389o2506J71870J29608j3106
$$ -352171 -257711 -152733 -304012 -690887 -527379 -612768 -675274 -503404 -373796 -386902
2723c86902N8771J25784m5896J9580k67363j87223J24771L350Q6746k99974o318
$$ -386902 -328131 -202347 -248243 -228663 -496026 -683249 -558478 -555128 -468382 -768356 -774674
2712g74674K47352J00750p6790L3335K54798j35531o9854K37164r4117l27694
$$ -774674 -527322 -426572 -503362 -470027 -215229 -350760 -420614 -183450 -277567 -605261
2702f05261N2145R7709M1774j83451J62917k70151J66295K11624k35787r6672
$$ -605261 -553116 -455407 -413633 -597084 -434167 -704318 -538023 -326399 -562186 -658858
2692f58858j13285K72366j33730J51714J58408j57697m1183j7100m4928j05880
$$ -658858 -772143 -499777 -633507 -481793 -323385 -481082 -522265 -539365 -584293 -690173
2682f90173L1020L4328l5213r6501M4830J78577K9442j22294J70884m0611k54542
$$ -690173 -659153 -624825 -660038 -756539 -711709 -533132 -503690 -625984 -455100 -495711 -750253
2671g50253J76733J42994N7530r0199J17291M2621j13170Q1926k80865K05992
$$ -750253 -573520 -430526 -372996 -463195 -345904 -303283 -416453 -334527 -615392 -409400
2661d09400K01317k82251L3624J13338j50570j76982j252k45214J83929J07328
$$ -409400 -208083 -490334 -456710 -343372 -493942 -670924 -672176 -917390 -733461 -626133
2651f26133j06276R8925Q7207j6802J8165M7189m6998M6639j1976k31656R0866
$$ -626133 -732409 -633484 -546277 -563079 -544914 -497725 -544723 -498084 -510060 -741716 -650850
2640f50850J75952j13151K09946K0788K15512M097j74272n7938J19873j57208
$$ -650850 -474898 -588049 -378103 -357315 -141803 -137706 -311978 -369916 -250043 -407251
2630d07251J47748j47055j45788o7312O094J88681k29688K28440Q8460J61486
$$ -407251 -259503 -406558 -552346 -619658 -613564 -424883 -654571 -426131 -337671 -176185
2620a76185l65660j57254J89058L7003j17145N8515J83649J87922n6271k43312
$$ -176185 -541845 -699099 -510041 -473038 -590183 -531668 -348019 -160097 -216368 -459680
2610d59680j21035j0099J54757r0386j75973K26765r2263J97384L5405o1311R7102
$$ -459680 -580715 -590814 -436057 -526443 -702416 -475651 -567914 -370530 -335125 -396436 -299334
2599b99334k1513P2615J44581L4294l9811o5142k87766L1621L02218Q5919k64057
$$ -299334 -320847 -248232 -103651 -69357 -109168 -174310 -462076 -430455 -128237 -42318 -306375
2588c06375K22865J77548Q2794P60l22660K00364J48646M3216J76157P9047k62737
$$ -306375 -83510 94038 176832 177592 -145068 55296 203942 247158 423315 502362 239625
2577B39625m79787o1427L2445J47411j22544P9111J46516k23511j98747L29402
$$ 239625 -240162 -301589 -269144 -121733 -244277 -165166 -18650 -242161 -440908 -111506
2567a11506K59896j70173m23728K20274R9494J52207k22991k95967Q5259n5355
$$ -111506 148390 -21783 -445511 -225237 -125743 26464 -196527 -492494 -407235 -462590
2557d62590N2180K41375J47065k60659j19476m5482J17998r2822N1657P6300Q5583
$$ -462590 -410410 -169035 -21970 -282629 -402105 -447587 -329589 -422411 -370754 -294454 -208871
2546b08871p2131J9730j07970L4171J83394J60302o685J36564p3758L9065k62234
$$ -208871 -281002 -261272 -369242 -335071 -151677 8625 1940 138504 64746 103811 -158423
2535a58423j69638J37133j0974J48354j15556j92670j00535O1067N1061J74619
$$ -158423 -328061 -190928 -201902 -53548 -169104 -361774 -462309 -401242 -350181 -175562
2525a75562k2472J79623m7028O1349K429l04302k31774J28602J98864R6951j95339
$$ -175562 -198034 -18411 -65439 -4090 -1661 -305963 -537737 -409135 -210271 -113320 -308659
2514c08659L31154J18791j77772j92449j80947J85156J17363K09507k33538j45026
$$ -308659 22495 141286 -36486 -228935 -409882 -224726 -107363 102144 -131394 -276420
2504b76420J56013k572r7071J11959J40489j43157j8686L20781n0129j77586n724
$$ -276420 -120407 -122979 -220050 -108091 32398 -110759 -129445 191336 141207 -36379 -42103
2493d2103Q540J39339K14569l55380l0392J39355K9160j11631J38097K20113p9370
$$ -42103 -33563 105776 320345 -35035 -65427 73928 103088 -8543 129554 349667 270297
2482B70297j40290J89552j3193p1003J06105J06108m17697L0360K34555r6561
$$ 270297 130007 319559 306366 235363 341468 447576 29879 60239 294794 198233
2472A98233O193j66763m9488k07354J11503J68482j8007o6432L39040K96804l36895
$$ 198233 204426 37663 -11825 -219179 -107676 60806 42799 -23633 315407 612211 275316
2461B75316p2018J5904P0100l2413P415k6303J01922k4710l34743J94019m7970
$$ 275316 203298 219202 289302 256889 264304 238001 339923 315213 -19530 174489 126519
2450A26519j45469l5104N6671J65593j61695J31773J22940J99863R6263l12589
$$ 126519 -18950 -54054 2617 168210 6515 138288 261228 461091 557354 244765
2440B44765j18769K82004j36436l40499n4849k6438L43933k3664J10932K0682
$$ 244765 125996 408000 271564 -68935 -123784 -150222 193711 170047 280979 301661
2430C01661j09475j37239L01693R4664M4964j08859k26889O4394J55964j8806
$$ 301661 192186 54947 356640 451304 496268 387409 160520 224914 380878 362072
2420C62072l07988p932J36139j1097J57447J38920r8826l6869j00923j76479M04714
$$ 362072 54084 46152 182291 171194 328641 467561 368735 331866 230943 54464 459178
2409D59178o858k8243p2247J16763O909Q8118l4916J37068J58951k68065K07179
$$ 459178 452320 424077 351830 468593 475502 563620 528704 665772 824723 556658 763837
2398G63837K53502k56103j67390K29105K9025p4914N7722J93096j21831r9891
$$ 763837 1017339 761236 593846 822951 851976 777062 834784 1027880 906049 806158
2388H06158Q8428L7578R5824K60510j14512k09871M4987J84916K39191K88631
$$ 806158 894586 932164 1027988 1288498 1173986 964115 1009102 1194018 1433209 1721840
2378A721840j3797j98436P1335n4589r861n2193P9618J29336j956J13965J16290
$$ 1721840 1708043 1509607 1580942 1526353 1516492 1464299 1543917 1673253 1671297 1785262 1901552
2367A901552J57449M4374k15255M6808J32980K9929J93697M25612N5604J6327
$$ 1901552 2059001 2103375 1888120 1934928 2067908 2097837 2291534 2717146 2772750 2789077
2357B789077O0072j3672R0930q6485K94794J66540J62107K03014L61248K31252
$$ 2789077 2849149 2835477 2926407 2839922 3134716 3301256 3463363 3666377 4027625 4258877
2347D258877L03229K44564J01012N67596M60019K34742N90061K28090M88959N86601
$$ 4258877 4562106 4806670 4907682 5475278 5935297 6170039 6760100 6988190 7477149 8063750
2337H063750L13192M81274Q57003J188512J005983J240390J586645J477645J810864
$$ 8063750 8376942 8858216 9715219 10903731 11909714 13150104 14736749 16214394 18025258
2328A8025258J566078J313896J187433J839494K213861L006505L572017M307078
$$ 18025258 19591336 20905232 22092665 23932159 26146020 29152525 32724542 37031620
2320C7031620N123837P236174Q610055J0950839J3152382J6103526J5572134M018580
$$ 37031620 42155457 49391631 58001686 68952525 82104907 98208433 113780567 117799147
2312A17799147j6922715k4112439j6149357j0840065p832527o200267m566047
$$ 117799147 100876432 76763993 60614636 49774571 41942044 35741777 31175730
2305C1175730l711620k797163k139340j600146j287534r40186j029842p10692
$$ 31175730 27464110 24666947 22527607 20927461 19639927 18699741 17669899 16959207
2297A6959207j496744j727446j297606j012709q28603p64435q36156p99997p62300
$$ 16959207 15462463 13735017 12437411 11424702 10596099 9831664 8995508 8195511 7433211
2288G433211j47727n60318n29557j58884K6137n49728m19028k15050j72816k67502
$$ 7433211 7285484 6725166 6195609 6036725 6062862 5513134 5094106 4879056 4706240 4438738
2278D438738j24381k72542k59474k13091J7711M2107m50243k28916j23789k57450
$$ 4438738 4314357 4041815 3782341 3569250 3586961 3629068 3178825 2949909 2826120 2568670
2268B568670k9243j24958p057m05884l09525j45102k10729P9013M0953M0838K78577
$$ 2568670 2539427 2414469 2407412 2001528 1692003 1546901 1336172 1415185 1456138 1496976 1775553
2257A775553m4855l79786j15707l8241l24888R6509K06016j09333k40276J58828
$$ 1775553 1730698 1350912 1235205 1196964 872076 968585 1174601 1065268 824992 983820
2247I83820J53438j15119N5784k8549k06977j29669K9931r3634J8885j67644K4958
$$ 983820 1137258 1022139 1077923 1049374 842397 712728 742659 649025 667910 500266 525224
2236E25224K2346k3184o3186K25930P4162j29282n0668R359j46174K97917k46138
$$ 525224 547570 524386 461200 687130 761292 632010 581342 590701 444527 742444 496306
2225D96306r702k2505j12820J10948J05065j80900l06242R7744Q9181k15569r1941
$$ 496306 486604 464099 351279 462227 567292 386392 80150 177894 267075 51506 -40435
2214d0435J19030J39410K5287j44227n2639Q8689p8696N8153r2461j80510L45405
$$ -40435 78595 218005 243292 99065 46426 135115 56419 114572 22111 -158399 187006
2203A87006m2688m2600R1813j32215j64749o4817J40375Q6040j5557J04818l5282
$$ 187006 144318 101718 193531 61316 -103433 -168250 -27875 58165 42608 147426 112144
2192A12144K3645p6234n9747j366p518N2236P2054Q033k55688L52260j792l01492
$$ 112144 135789 59555 -192 -1558 -9076 43160 115214 123247 -132441 219819 218027 -83465
2180h3465R5717n1880N7904q5453j55986J1958r0930j82491n3048K00146K23992
$$ -83465 12252 -39628 18276 -67177 -223163 -211205 -302135 -484626 -537674 -337528 -113536
2169a13536n5725o6101l6198L83236j93245j89193j507K62607J32589j14230k47839
$$ -113536 -169261 -235362 -271560 111676 -81569 -270762 -272269 -9662 122927 8697 -239142
2158b39142M888k6761j2798Q465m9473L8026r7075J3537m1176J37110k8084r4262
$$ -239142 -234254 -261015 -273813 -265348 -314821 -276795 -373870 -360333 -401509 -264399 -292483 -386745
2146c86745J66378L57961l01325k67903O9525j73454L6947J50091K7327K41991
$$ -386745 -220367 137594 -163731 -431634 -362109 -535563 -498616 -348525 -321198 -79207
2136g9207M7087r4215j44361n0102j01194M5658m8356J72004p6991k28967J18406
$$ -79207 -32120 -126335 -270696 -320798 -421992 -376334 -424690 -252686 -329677 -558644 -440238
2125d40238K14931J95058n331j68478M0416n052o0303K45129q5038l60274J70395
$$ -440238 -225307 -30249 -35580 -204058 -163642 -168694 -228997 16132 -68906 -429180 -258785
2114b58785Q5555l829m8361j03238K0348l78733j00304K29213J14718L98060M1479
$$ -258785 -173230 -177059 -225420 -328658 -308310 -687043 -787347 -558134 -443416 -45356 -3877
2103c877k23766J554P9064M5513K04889n6962l83363p5502K04716K00631N6806
$$ -3877 -227643 -226089 -147025 -101512 103377 46415 -336948 -412450 -207734 -7103 49703
2092D9703j08837k64543o67p4410j6409K21695J70724k32959R2556J05021o9654
$$ 49703 -59134 -323677 -324344 -398754 -415163 -193468 -22744 -255703 -163147 -58126 -127780
2081a27780n0831o307K26272n7978o3223K2775r7222K4621j19120K64903j86131
$$ -127780 -178611 -184918 41354 -16624 -79847 -57072 -154294 -129673 -248793 16110 -170021
2070a70021j92295J5952J23191P6214J63818l6136j74538k7048j02278Q6449J38590
$$ -170021 -362316 -346364 -223173 -146959 16859 -19277 -193815 -220863 -323141 -236692 -98102
2059i8102j0524M7407j09210j72480L6857M4933J5477j49930O3428J28663N6845
$$ -98102 -108626 -61219 -170429 -342909 -306052 -261119 -245642 -395572 -332144 -203481 -146636
2048a46636J90399K87664L7008J1405J1454m8814k19341k03943n8105K72096j37305
$$ -146636 43763 331427 368435 379840 391294 342480 123139 -80804 -138909 133187 -4118
2037d118l01552j65266R0433q9896J28344K64153r2588R0666j93243j3279J5835
$$ -4118 -305670 -470936 -380503 -470399 -342055 -77902 -170490 -79824 -273067 -286346 -270511
2026b70511r0779J2412R9853J26607o6918J71290j98247j43274M334J20188Q085
$$ -270511 -361290 -348878 -249025 -122418 -189336 -18046 -216293 -359567 -355233 -235045 -226960
2015b26960p7586K27466l03564j51087P8558J08124J32008l0761J16240J19202
$$ -226960 -304546 -77080 -380644 -531731 -453173 -345049 -213041 -243802 -127562 -8360
2005h360k64974k9152q8928M6092J63276k2782J79121j09827O8970J59455l9966
$$ -8360 -273334 -302486 -391414 -345322 -182046 -204828 -25707 -135534 -66564 92891 52925
1994E2925m38866j8815K44644l5753k08695K18438K5045q554j21029o7645R5174
$$ 52925 -385941 -404756 -160112 -195865 -404560 -186122 -161077 -169631 -290660 -358305 -263131
1983b63131J81189k05680j06469Q4193J82777J61632p2902N1989J07222J72949
$$ -263131 -81942 -287622 -394091 -309898 -127121 34511 -38391 13598 120820 293769
1973B93769l98420n6730j88355J2433J21192j62429J09521K24331k37538j13560
$$ 293769 -104651 -161381 -349736 -337303 -216111 -378540 -269019 -44688 -282226 -395786
1963c95786l1275K42226j00824p2605K33916n6181j03618o9419L48050J5561k82528
$$ -395786 -427061 -184835 -285659 -358264 -124348 -180529 -284147 -353566 -5516 10045 -272483
1952b72483K18380K26499k24458j30338R0703q7452j0980N4844J24915j03209
$$ -272483 -54103 172396 -52062 -182400 -91697 -179149 -190129 -135285 -10370 -113579
1942a13579l20282O2625J92775J39233l34680J31654K34125j68552o4749l87055
$$ -113579 -433861 -371236 -178461 -39228 -373908 -242254 -8129 -176681 -241430 -628485
1932f28485J20505L15205M7960K03824J20966l83030k15366K23221J15434l24485
$$ -628485 -507980 -192775 -144815 59009 179975 -203055 -418421 -195200 -79766 -404251
1922d04251J73545P8465K41819k70857j68031J79421L8810l43599q0477M53304
$$ -404251 -230706 -152241 89578 -181279 -349310 -169889 -131079 -474678 -555155 -101851
1912a01851J17701J9388M4106p9379m9856P4672m2078j5712k6780k98270N3096
$$ -101851 15850 35238 79344 -35 -49891 24781 -17297 -33009 -59789 -358059 -304963
1901c04963J5458j62957n5167K22673J90748m6344l31883Q9425J49033J7967k63525
$$ -304963 -289505 -452462 -507629 -284956 -94208 -140552 -472435 -383010 -233977 -216010 -479535
1890d79535L8972K84756j79536J01629K16O4090P2097j34230J54654J55847m48402
$$ -479535 -440563 -155807 -335343 -233714 -233498 -169408 -97311 -231541 -76887 78960 -369442
1879c69442m4173L7931K42864P0815L78379m2324l14716j62089N7693j55973L49755
$$ -369442 -413615 -375684 -132820 -62005 316374 274050 -40666 -202755 -145062 -301035 48720
1868D8720j49377j11706K27330J47585j00737k21633Q3725J41949j41137P6182
$$ 48720 -100657 -212363 14967 162552 61815 -159818 -76093 65856 -75281 901
1858I01N4956p650j22828P9272J00397j69682j48314P6667O1661j69641j22910
$$ 901 55857 48207 -74621 4651 105048 -64634 -212948 -136281 -74620 -244261 -367171
1847c67171L11052J13297j56924k13365j12109K29237K32059j29375k24718N0559
$$ -367171 -56119 57178 -99746 -313111 -425220 -195983 36076 -93299 -318017 -267458
1837b67458r3443R2558p233L5035L8126K61759j14500r7811J5943J36848q6014
$$ -267458 -360901 -268343 -275576 -240541 -202415 59344 -55156 -152967 -137024 -176 -86190
1826h6190k87153J62846J42083J15146K89137K171l83614N1203J48905l48659
$$ -86190 -373343 -210497 -68414 46732 335869 338040 -45574 5629 154534 -194125
1816a94125j51154L02349J70229j28141J22540p4598l56290j24693k15363l285
$$ -194125 -345279 -42930 127299 -842 121698 47100 -309190 -433883 -649246 -652531
1806f52531J03373K77733K34154J83076p9751l69240O8467J44374m368p331q3984
$$ -652531 -549158 -271425 -37271 145805 66054 -303186 -234719 -90345 -94713 -102044 -186028
1795a86028n8355K7895K5683J4237p0376J38592K5856k08468o8884L4239k0783
$$ -186028 -244383 -216488 -190805 -176568 -246944 -108352 -82496 -290964 -359848 -325609 -346392
1784c46392M60558J55121r6123j65430r0070n419j20016P8425M09258j29243k31652
$$ -346392 114166 269287 173164 7734 -82336 -87755 -207771 -129346 279912 150669 -80983
1773h0983k12354n648J01000l05845L79541J19242l75839M5292q0751K70432J37285
$$ -80983 -293337 -298985 -197985 -503830 -124289 -5047 -380886 -335594 -416345 -145913 -8628
1762h628r4844l15687k0729J94615R0157J61838q7227m26931J1841J69871J25256
$$ -8628 -103472 -419159 -439888 -245273 -155116 6722 -80505 -507436 -495595 -325724 -200468
1751b00468M54792l86889J67767O0925j32942N8781j60696J32183j1989N3052
$$ -200468 254324 -132565 35202 96127 -36815 21966 -138730 -6547 -18536 34516
1741C4516l03796L6571L9679J44174L9940L2527l4056j019k72668m2453J24646
$$ 34516 -269280 -232709 -193030 -48856 -8916 23611 -10445 -11464 -284132 -326585 -201939
1730b01939J17298K57648j22720j22974K32120j15193k81743K41892J63950m6676
$$ -201939 -84641 173007 50287 -72687 159433 44240 -237503 4389 168339 121663
1720A21663K3033j90224j20061J07844J48672J17481J8744k74612l11378M57019
$$ 121663 144696 -45528 -165589 -57745 90927 208408 227152 -47460 -358838 98181
1710I8181r9866j02654J71419P79j5207o4823l3115J3031N776M7471j33340K22596
$$ 98181 -1685 -104339 67080 67859 52652 -12171 -45286 -32255 -26479 20992 -112348 110248
1698A10248l56461J78365m7728m4852j93700p2166q457m5445L71848j40262m3308
$$ 110248 -246213 -67848 -115576 -160428 -354128 -426294 -434751 -480196 -108348 -248610 -291918
1687b91918R3208J19458J52633K6538j62931J20372j89750j14712K94632k5535
$$ -291918 -198710 -79252 73381 99919 -63012 57360 -132390 -247102 47530 21995
1677B1995P2900J09370k27932j75519j04496L17309K01495O727k68903n9332J160
$$ 21995 94895 204265 -23667 -199186 -303682 13627 215122 221849 -47054 -106386 -105226
1666a05226J23561R321m07598R8165J66623M843j03692J49492J51271J28004j08962
$$ -105226 18335 27656 -379942 -281777 -115154 -110311 -214003 -64511 86760 214764 105802
1655A05802M4943L9384j84125J23733m5300j81342N0118j01435J2777J69781K5954
$$ 105802 150745 190129 6004 129737 84437 -96905 -46787 -148222 -135445 34336 60290
1644F0290P0132M7981k26997N4893M7037j62236N3279R9587j87556K05710k09811
$$ 60290 130422 178403 -48594 6299 53336 -108900 -55621 43966 -143590 62120 -147691
1633a47691k73816K17632Q4255K78772j59338N4206j75330Q870j16671l8476K99057
$$ -147691 -421507 -203875 -119620 159152 -186 54020 -121310 -112440 -229111 -267587 31470
1622C1470o8891k9520j32206J68554J95858r686j51507J1168l3204k81232n1618
$$ 31470 -37421 -66941 -199147 -30593 165265 155579 4072 15240 -17964 -299196 -350814
1611c50814M2388L33920L9958m2114O6130j00215N6254n12187j25667J89802K67518
$$ -350814 -308426 25494 65452 23338 89468 -10747 45507 -466680 -592347 -402545 -135027
1600a35027M7280P671N6124m5382n2335L5572J15607l5193N8436R6739J69386
$$ -135027 -87747 -80076 -23952 -69334 -121669 -86097 29510 -5683 52753 149492 318878
1589C18878j99545o3763R045J6090j11717n5547q9073P464r8373l8489J94354
$$ 318878 119333 55570 64615 80705 -31012 -86559 -175632 -168168 -266541 -305030 -110676
1578a10676k0349J05270K01554K3810j17934m0720j44563k15199R5166K66372
$$ -110676 -131025 -25755 175799 199609 81675 40955 -103608 -318807 -223641 42731
1568D2731M7894l9738L6692j01279J04453m6121l46989O1128K07806J02597r9022
$$ 42731 90625 50887 87579 -13700 90753 44632 -302357 -241229 -33423 69174 -29848
1557b9848m5857Q8212J49893j78588m14282M14269L3019J5883j55578l58181j3768
$$ -29848 -75705 12507 162400 -16188 -430470 -16201 16818 32701 -122877 -481058 -494826
1546d94826M64284K50729m29470J3976N8142L3813J6019q7949K1002j0339j84316
$$ -494826 -30542 220187 -209283 -195307 -137165 -103352 -87333 -175282 -154280 -164619 -348935
1535c48935J98247J92727J73523j05087m7534J87941l08179M3583J3978n1052
$$ -348935 -150688 42039 215562 110475 62941 250882 -57297 -13714 264 -50788
1525e0788j0229j26012N5702K59899j74614m0497o2643j2399P9171k0723J02584
$$ -50788 -61017 -187029 -131327 128572 -46042 -86539 -149182 -161581 -82410 -103133 -549
1514e49j5159K28466r0065k58073M5078n2715j12577O5041K90823n1788j08005
$$ -549 -15708 212758 122693 -135380 -90302 -143017 -255594 -190553 100270 48482 -59523
1503e9523k460J80654n5667q9989k7350R2287k10183j64333j0914M7836L91539
$$ -59523 -61983 118671 63004 -26985 -54335 37952 -172231 -336564 -347478 -299642 91897
1492I1897J32651r9706j14428P686J22144n051k74244m5587m8024O3528k60809
$$ 91897 224548 124842 10414 18100 140244 135193 -139051 -184638 -232662 -169134 -429943
1481d29943j16821K5220r8934L60611J80429l8572j60129J88967J27972k69902
$$ -429943 -546764 -521544 -620478 -259867 -79438 -118010 -278139 -89172 38800 -231102
1471b31102J53862J88509j71167j43834l7945r6331N23877J77423j37956j01724
$$ -231102 -77240 111269 -59898 -203732 -241677 -338008 185869 363292 225336 123612
1461A23612j38730l2091j43408J08535J60294k40249J42079J93217r6030k47736
$$ 123612 -15118 -47209 -190617 -82082 78212 -162037 -19958 173259 77229 -170507
1451a70507J55276N4322l6251j85098J47295K0984J01977J19829j64750K62451
$$ -170507 -15231 39091 2840 -182258 -34963 -13979 87998 207827 43077 305528
1441C05528j47464k11018L3656P5972K11279J24214J4926k13726k30961j41478
$$ 305528 158064 -52954 -19298 56674 267953 392167 407093 193367 -37594 -179072
1431a79072L36610J33106m9323j68652J23790J18850k04454j26871J5739K92489
$$ -179072 157538 290644 241321 72669 196459 315309 110855 -16016 -277 292212
1421B92212o0748j48091R1361j87679P0363j81403P57L7033k29513J98527J17136
$$ 292212 231464 83373 174734 -12945 57418 -123985 -123228 -86195 -315708 -117181 -45
1410d5j57763K5276L14339r7575j02393j02605L60376r080k55234K4028K21916
$$ -45 -157808 -132532 181807 84232 -18161 -120766 239610 230530 -24704 -676 221240
1399B21240j05090j2190k08276o7351J38260M679j99784J25503j7016j50983K38316
$$ 221240 116150 103960 -104316 -171667 -33407 -28728 -228512 -103009 -120025 -271008 -32692
1388c2692O328m9905O8291J21254j4569J46631j66000l8231J45474R426o1310
$$ -32692 -26364 -76269 -7978 113276 98707 245338 79338 41107 186581 196007 134697
1377A34697k21126K27627P2521k97231p0572J49884K3617L6895L7023j37214j13986
$$ 134697 -86429 141198 213719 -83512 -154084 -4200 19417 56312 93335 -43879 -157865
1366a57865p1947k4834N37574j5373j91558p1097j44736O8237l809J38414j2539
$$ -157865 -229812 -254646 282928 267555 75997 4900 -139836 -71599 -75408 63006 50467
1355E0467O3696k38038j7487K83792N6880m06718K68887N48220k22704l54225
$$ 50467 114163 -123875 -141362 142430 199310 -207408 61479 609699 386995 32770
1345C2770j76488K95047k31415k17457J59449p2582J71632J64620j71641j003
$$ 32770 -143718 151329 -80086 -297543 -138094 -210676 -39044 125576 -46065 -47068
1335d7068N290K80506R6721j84724k07542o308o3775l7532K19088o8641J55049
$$ -47068 -41778 238728 335449 150725 -56817 -63125 -126900 -164432 54656 -13985 141064
1324A41064k29298k2714K77694O1264k4599k86769j6908r9158L26850J94513j73675
$$ 141064 -88234 -110948 166746 228010 203411 -83358 -100266 -199424 127426 321939 148264
1313A48264j07522J66493k7906Q5927j30763j95845K05630J61629k06796Q3691
$$ 148264 40742 207235 179329 265256 134493 -61352 144278 305907 99111 182802
1303A82802L42982l1831j79599k91934j174l21959K62740K95679j42046j39844
$$ 182802 525784 493953 314354 22420 21246 -300713 -37973 257706 115660 -24184
1293b4184J34177j03531n7173j25534J21915J13051L7009j32855j2041J80201
$$ -24184 109993 6462 -50711 -176245 -54330 58721 95730 -37125 -49166 131035
1283A31035J50215J31381j76720r1779j29885p7801k5668J4756N915P686K23389
$$ 131035 281250 412631 235911 144132 14247 -63554 -89222 -74466 -68551 -60865 162524
1272A62524k18664N3574J66387j56535J82162l557k67040O9570M169K869J81065
$$ 162524 -56140 -2566 163821 7286 189448 185891 -81149 -11579 -7410 -4541 176524
1261A76524R5545j37396k06551j83340M1237J95949K32903J40149j29664k99560
$$ 176524 272069 134673 -71878 -255218 -213981 -18032 214871 355020 225356 -74204
1251g4204r9813K3005k4189Q2730p2983p8192j23494r270K20184J33578j12521
$$ -74204 -174017 -151012 -175201 -92471 -165454 -243646 -367140 -376410 -156226 -22648 -135169
1240a35169J38490j87411j17386Q5404K27599K9798K21091l4985R6101j39033
$$ -135169 3321 -184090 -301476 -216072 11527 41325 262416 227431 323532 184499
1230A84499j39899k0453r848r6263n947K25665P9618j06335p7322Q0906l2921
$$ 184499 44600 24147 14299 -81964 -87911 137754 217372 111037 33715 114621 81700
1219H1700o5887J55409P6529k29592k26721N2718j01969J83678J69328Q2294k1816
$$ 81700 15813 171222 247751 18159 -208562 -155844 -257813 -74135 95193 177487 155671
1208A55671j95328J76470M7770R4136j07514j05759m366J57641l6498l61J18326
$$ 155671 -39657 136813 184583 278719 171205 65446 61080 218721 182223 181862 300188
1197C00188j15207j37469n2154q4254J61261j03548J54829m4755R1523J15886
$$ 300188 184981 47512 -4642 -88896 72365 -31183 123646 78891 170414 286300
1187B86300K756j50977p2218P3108j25163j15663J13229J04342K8294k19645o5139
$$ 286300 289056 138079 65861 138969 13806 -101857 11372 115714 144008 -75637 -140776
1176a40776j73823P749N08015p0767j20949O3685O4693j83271J09121m2159M095
$$ -140776 -314599 -306850 201165 130398 9449 73134 137827 -45444 63677 21518 25613
1165B5613J32029r404j45398p4445K39594K37161r8557q783K48792k63336j91795
$$ 25613 157642 148238 2840 -71605 167989 405150 306593 297810 546602 283266 91471
1154I1471k8975Q120j23610k1698r3082P0641L9549J5075k3172J98700r8861J26784
$$ 91471 62496 70616 -52994 -74692 -167774 -97133 -57584 -42509 -65681 133019 34158 160942
1142A60942K1910j65857J03448L2358p1904k6838j94557O9066J37323Q3858k7659
$$ 160942 182852 16995 120443 152801 80897 54059 -140498 -71432 65891 149749 122090
1131A22090O2297J03863J46370k5028l97464k764m8754P5338J66601M607k07723
$$ 122090 184387 288250 434620 409592 12128 9364 -39390 35948 202549 207156 -567
1120e67J50264p2981R604m9599l404k36612j545k1359j36354K09853l707j67663
$$ -567 149697 76716 86320 36721 33317 -203295 -204840 -226199 -362553 -152700 -156407 -324070
1108c24070K65455l1534q9072J34455J33581L2559r538K16920j08393n9455Q8697
$$ -324070 -58615 -90149 -179221 -44766 88815 121374 111836 328756 220363 160908 249605
1097B49605J09541J1791l48037J72281J13745k58448k8198l6377M0832J39268
$$ 249605 359146 370937 22900 195181 308926 50478 22280 -14097 26735 166003
1087A66003j50824J5835J26188J70659j87320k47045j68048R6774O6841L3619
$$ 166003 15179 31014 157202 327861 140541 -106504 -274552 -177778 -110937 -77318
1077g7318K05649j49600j75674R8453M33676j05456n10491P7793J36461J84082
$$ -77318 128331 -21269 -196943 -98490 335186 229730 -280761 -202968 -66507 117575
1067A17575l8547J19632n6412J3537m9545K3793n3465K51806m514k38114j12557
$$ 117575 79028 198660 142248 155785 106240 130033 76568 328374 323860 85746 -26811
1056b6811j07123J8165J03193J32849j98294J84338p1704k039j93091j5428N2792
$$ -26811 -133934 -115769 -12576 120273 -78021 106317 34613 32574 -160517 -175945 -123153
1045a23153Q6953j01829K82920J17605j28540J71328k92224k1085Q6894m9610
$$ -123153 -36200 -138029 144891 262496 133956 305284 13060 -8025 78869 29259
1035B9259J15443K8599r175k94997M2305R8675K144P2410Q299P31p4481j47935
$$ 29259 144702 173301 164126 -130871 -88566 10109 12253 84663 92962 93693 19212 -128723
1023a28723J45921j17703L1346K52684J68110P4189k66742l02696K76376J99661
$$ -128723 17198 -100505 -69159 183525 351635 425824 159082 -143614 132762 332423
1013C32423k51180k42047n2311J24327J04557P0762l18126R2845J31559m0186
$$ 332423 81243 -160804 -213115 -88788 15769 86531 -231595 -138750 -7191 -47377
1003d7377K32470r9540k46505J57283J33271J10676j87658l68351J52345J93847
$$ -47377 185093 85553 -160952 -3669 129602 240278 52620 -315731 -163386 30461
993C0461P9976N0607M7560l60624K02650J30095J55753Q3729k55465j45373k6750
$$ 30461 110437 161044 208604 -152020 50630 180725 336478 420207 164742 19369 -7381
982g381K70984K7951l2960j10833n0416J49658J17756p2472k05742j87081j48992
$$ -7381 263603 291554 258594 147761 97345 247003 364759 292287 86545 -100536 -249528
971b49528K1675m811Q3801P7922k42015O3407K25380J75472k17560j4767L26501
$$ -249528 -227853 -232664 -148863 -70941 -312956 -249549 -24169 151303 -66257 -81024 245477
960B45477n4611j18955m809j16594P9680O318n6132J10221m6652J41967o1154
$$ 245477 190866 71911 67102 -49492 30188 36506 -19626 90595 43943 185910 124756
949A24756q2780o0238r1325J72152J6075j01P1625J84086k5632k31051Q510k9503
$$ 124756 41976 -18262 -109587 62565 78640 78539 150164 334250 308618 77567 86077 56574
937E6574j12243J13796J18689j78829K63066R4783p7491P0520p1022j328l74179
$$ 56574 -55669 58127 176816 -2013 261053 355836 278345 348865 277843 276515 -97664
926i7664L0512p45l0283m0444R2014J35281m1351k9186n4711j00407o1759K17628
$$ -97664 -67152 -67897 -98180 -138624 -46610 88671 47320 18134 -36577 -136984 -198743 18885
914A8885M75680K25950l08292l07046j36737O0214o2152j49701j66704J39490
$$ 18885 494565 720515 412223 105177 -31560 28654 -33498 -183199 -349903 -210413
904b10413o0023J85235j747K04106J77822J12681j93888j48255P1342j17958j5846
$$ -210413 -270436 -85201 -86948 117158 294980 407661 213773 65518 136860 18902 3056
893C056O7076j9712j16969K07121j25879R4698N5400J14737j61138l3885J78272
$$ 3056 70132 50420 -66549 140572 14693 109391 164791 279528 118390 84505 262777
882B62777j50356k52173R4161j94203Q7428J58946j76960o5153k9234r6096J56264
$$ 262777 112421 -139752 -45591 -239794 -152366 6580 -170380 -235533 -264767 -360863 -204599
871b04599J05615L0008j22066m9790K11088j00401p7451J15851n7692q9903K51435
$$ -204599 -98984 -68976 -191042 -240832 -29744 -130145 -207596 -91745 -149437 -239340 12095
860A2095j0482r933k08316P5768K35779k7599J39620o2248j82563K07491K32567
$$ 12095 1613 -8320 -216636 -140868 94911 67312 206932 144684 -37879 169612 402179
849D02179q9398l20230j02161j1311q3946K6659L4677L02093j51655J0173m0782
$$ 402179 312781 -7449 -109610 -120921 -204867 -178208 -143531 158562 6907 17080 -23702
838b3702k2047p6731K43567M1366K2130m4898J87778n7438o5207Q0719L4553O1373
$$ -23702 -45749 -122480 121087 162453 184583 139685 327463 270025 204818 285537 320090 381463
826C81463j63175j72866M6294J2036k51084L57608l08853k01557Q1525J19207
$$ 381463 218288 45422 91716 103752 -147332 210276 -98577 -300134 -218609 -99402
816i9402j7817J95640j9751J98131J52572j21774j72401j5001J31004K7558J91143
$$ -99402 -117219 78421 58670 256801 409373 287599 115198 100197 231201 258759 449902
805D49902k08419j61566J30457k1498k2526q8682J20266q0970J5315N4607R6900
$$ 449902 241483 79917 210374 188876 166350 77668 197934 116964 132279 186886 283786
794B83786j09225l43124K11386M2519M7208J02912j4478j14853m1889m4203k45077
$$ 283786 174561 -168563 42823 85342 132550 235462 220984 106131 64242 20039 -225038
783b25038p3084Q059L3246N88461p4137j95559J77579l84059q6212j7239M4772
$$ -225038 -298122 -290063 -256817 331644 257507 61948 239527 -144532 -230744 -247983 -203211
772b03211K5848l9996L6480P9313K12069r4979j03903p2414P010P4082q9843L03164
$$ -203211 -177363 -217359 -180879 -101566 110503 15524 -88379 -160793 -153783 -79701 -169544 133620
760A33620r6454j38929P5309J31693k37085j17024K66611L7338n4817m7414L4610
$$ 133620 37166 -101763 -26454 105239 -131846 -248870 17741 55079 262 -47152 -12542
749a2542k75449J98733q68k37081K22780K29581K68898o5172j95549j17767O3367
$$ -12542 -287991 -89258 -90126 -327207 -104427 125154 394052 328880 133331 15564 78931
738G8931n8214J69891j6019j04280j40516p6226J22856o391J87524P9732m3433
$$ 78931 20717 190608 174589 70309 -70207 -146433 -23577 -29968 157556 237288 193855
727A93855l8130j22129j23563Q3011Q1622m7927o5975R9544J67664j41849K96668
$$ 193855 155725 33596 -89967 -6956 74666 26739 -39236 60308 227972 86123 382791
716C82791j06705k44495o1463M9473J65869N0159l8133k0705k56385L587L01391
$$ 382791 276086 31591 -29872 19601 185470 235629 197496 176791 -79594 -76007 225384
705B25384k02239p7901R33K84286o9390k2596M4155n7836p606K10301O1615r0286
$$ 225384 23145 -54756 -53823 230463 161073 138477 182632 124796 117190 327491 389106 298820
693B98820j67901J26817j80155l98068p9537L56335J33017K14195r9065k56973
$$ 298820 130919 257736 77581 -320487 -400024 -43689 89328 303523 204458 -52515
683e2515j80560K97108J88151l85989q8392J85215m1062J83680o2415j19344p0614
$$ -52515 -233075 64033 252184 -133805 -222197 -36982 -78044 105636 43221 -76123 -146737
672a46737k41435K77296J54184J51677l09021k2802K13883M2297K23270K444p9307
$$ -146737 -388172 -110876 43308 194985 -114036 -136838 77045 119342 342612 345056 265749
661B65749l47452L391K88190L0221N3471l09037o7328K9693J76428n4222K0236
$$ 265749 -81703 -78312 209878 240099 293570 -15467 -82795 -53102 123326 69104 89340
650H9340j41589j07464Q0400R7931N501L4975K03860O535j39971p1410N2426m8136
$$ 89340 -52249 -159713 -79313 18618 24119 59094 262954 269489 129518 58108 110534 62398
638F2398J19656M5265l87889l2065J88226J44646M3846r8060J519l3870N4638
$$ 62398 182054 227319 -160570 -192635 -4409 140237 184083 86023 87542 53672 108310
627A08310m1465k51658j56919K25616R587r3464j5593J74061j8204J58379J05164
$$ 108310 66845 -184813 -341732 -116116 -106529 -199993 -215586 -41525 -59729 98650 203814
616B03814j4188N7797j27306k81186K15553J46440k68990J47494M80739j0144
$$ 203814 189626 247423 120117 -161069 54484 200924 -68066 79428 560167 550023
606E50023j16356P6601q8413m6851p8442M6937j13808j96955p4526q0608p7321
$$ 550023 433667 510268 421855 375004 296562 343499 229691 32736 -41790 -122398 -199719
595a99719R5822J51421L1424O6613K5744k60800J83247j59862J81745n967k15478
$$ -199719 -103897 47524 78948 145561 171305 -89495 93752 -66110 115635 109668 -105810
584a05810j98922m1441L37604R4307K16585k70000k04667L43204J38314l55067
$$ -105810 -304732 -346173 -8569 85738 302323 32323 -172344 170860 309174 -45893
574d5893J78041q0839o5567J20214o6100K23335J23006k93489J20446m3524k12766
$$ -45893 132148 51309 -14258 105956 39856 263191 386197 92708 213154 169630 -43136
563d3136O2832J4069N3473K6313Q6944K60157j58455j76141J04398J386Q0616
$$ -43136 19696 33765 87238 113551 200495 460652 302197 126056 230454 231840 312456
552C12456k27507l14551J37135K19808j89152J36357J85576p4273q0641M2201
$$ 312456 84949 -229602 -92467 127341 -61811 74546 260122 185849 105208 147409
542A47409N2181k56378j76798J38222K11605K12896k10225Q6063N7019M1112j66224
$$ 147409 199590 -56788 -233586 -95364 116241 329137 118912 204975 261994 303106 136882
531A36882j16717J33693K43470k54148j00399J51044k83928J20115k79658q177
$$ 136882 20165 153858 397328 143180 42781 193825 -90103 30012 -249646 -257823
521b57823K66746k42687K7084J57502j38521M5849L14155j19683o2181L23102
$$ -257823 8923 -233764 -206680 -49178 -187699 -141850 172305 52622 -9559 313543
511C13543O5193j16933j88512k22773P5252o9009K1859J40591r3223j5361K75310
$$ 313543 378736 261803 73291 -149482 -74230 -143239 -121380 19211 -74012 -89373 185937
500A85937J27220j25479M7225m7408j92116M0707m6910N6170J4508j00384j28404
$$ 185937 313157 187678 234903 187495 -4621 36086 -10824 45346 59854 -40530 -168934
489a68934k9595L6134O550J91627P8456J5141n6295O1063Q4788j50767L7160o0609
$$ -168934 -198529 -162395 -155845 35782 114238 129379 73084 134147 218935 68168 105328 44719
477D4719l3015k79141k13517J67440K24153J18195m8838J45010k5001N054J18168
$$ 44719 11704 -267437 -480954 -313514 -89361 28834 -20004 125006 100005 105059 223227
466B23227j10850J11507N7745k20280K11203K4904j84423P7183l7619j12834q1637
$$ 223227 112377 223884 281629 61349 272552 297456 113033 190216 152597 39763 -41874
455d1874K4619K12199j56215j32165j52985K42812m7051J34944P7142k39217k2973
$$ -41874 -17255 194944 38729 -93436 -246421 -3609 -50660 84284 161426 -77791 -100764
444a00764P598j41163K97724J60590j33157k49473j23911J31626o5105k6627J3232
$$ -100764 -93166 -234329 63395 223985 90828 -158645 -282556 -150930 -216035 -242662 -229430
433b29430J30475J78483K50926l5747r8945N8908m703l58020l72032O7039j8395
$$ -229430 -98955 79528 330454 294707 195762 254670 249967 -108053 -480085 -413046 -431441
422d31441J58005m7512P3247J25444Q4092K48041n4871n3400n7078J9560J31161
$$ -431441 -273436 -320948 -247701 -122257 -38165 209876 155005 101605 44527 64087 195248
411A95248K02660K0112k67735q1251j35363j692m9724K05429m131M5140O1341
$$ 195248 397908 418020 150285 69034 -66329 -68021 -117745 87684 83553 128693 190034
400A90034j74661N8996j58306q4365L41009O7123k41096J96274j03791J6810j10011
$$ 190034 15373 74369 -83937 -168302 172707 239830 -1266 195008 91217 108027 -1984
389a984Q0296j9548k16894Q1882j8485m409J10367j8889j22088q6119R1268m7766
$$ -1984 78312 58764 -158130 -76248 -94733 -99142 11225 -7664 -129752 -215871 -124603 -172369
377a72369m8518J2412m025L64514J54797k26680k44642J76519J97409k22838j13945
$$ -172369 -220887 -208475 -212500 152014 306811 80131 -164511 12008 209417 -13421 -127366
366a27366q1574Q3381j19555P7687Q3711j35598K7640J52883j41332J41716K88274
$$ -127366 -208940 -125559 -245114 -167427 -83716 -219314 -191674 -38791 -180123 -38407 249867
355B49867n3484j79127K71034k38653n8726J02583j15749J00286R9145N4046l04695
$$ 249867 196383 17256 288290 49637 -9089 93494 -22255 78031 177176 231222 -73473
344g3473l0653O4487J96464j46799J99947O0394j11544J57228j4815Q5163j34673
$$ -73473 -104126 -39639 156825 10026 209973 270367 158823 316051 301236 386399 251726
333B51726M6668Q8978l12146k73301Q0298K22073j29835q4727j8259J51083J50958
$$ 251726 298394 387372 75226 -198075 -117777 104296 -25539 -110266 -128525 22558 173516
322A73516J7074R2246j07029q7588j84948L8534J86414Q8947n2231n1768k2703
$$ 173516 190590 282836 175807 88219 -96729 -58195 128219 217166 164935 113167 90464
311I0464R7922j61883K5847p2827L19146j06622j79889J0446j71036J83933J35392
$$ 90464 188386 26503 52350 -20477 298669 192047 12158 22604 -148432 35501 170893
300A70893k35909j40843M45812P0395k28839R9189o0440j55514O602K03245J1035
$$ 170893 -65016 -205859 239953 310348 81509 180698 120258 -35256 -28654 174591 185626
289A85626K6401k3498n9996j01229o9624Q0475k24690K91136j65302j50723J8558
$$ 185626 212027 188529 128533 27304 -42320 38155 -186535 104601 -60701 -211424 -192866
278a92866r5772k96373K36776L36495K79034q9923k45198k50167N668K16583N5011
$$ -192866 -288638 -585011 -348235 -11740 267294 177371 -67827 -317994 -312326 -95743 -40732
267d0732J78754j86377j20683K05030l2097p862j58534j45404J44186K08868k8631
$$ -40732 138022 -48355 -169038 35992 3895 -3967 -162501 -307905 -163719 45149 16518
256A6518r9054J30234l2615j88870K63603j3574j6116j25071J36334J23823q5098
$$ 16518 -82536 47698 15083 -173787 89816 76242 60126 -64945 71389 195212 110114
245A10114Q9407N5996j55420m1193j70547j16013R0125j72054J97982R4011J19690
$$ 110114 199521 255517 100097 58904 -111643 -227656 -137531 -309585 -111603 -17592 102098
234A02098O0363j83276M9695K34501j47661j63081o5248J11064M53419k16108
$$ 102098 162461 -20815 28880 263381 115720 -47361 -112609 -1545 451874 235766
224B35766l34161J0423K52991o4119L7757J72083o9663J9337j57259j85070L17734
$$ 235766 -98395 -87972 165019 100900 138657 310740 241077 260414 103155 -81915 235819
213B35819q5776J3742R8196k074K33689k71669j32914n6719J61399l28096O7965
$$ 235819 150043 163785 261981 259907 493596 221927 89013 32294 193693 -134403 -66438
202f6438P1132J71031p5033K8467P4878j50499k96120Q7884P2407L7095K467P1076
$$ -66438 4694 175725 100692 129159 204037 53538 -242582 -154698 -82291 -45196 -42729 28347
190B8347K36645k80359k34976N2200R2856R5623O0185J74703j73373j39440n8430
$$ 28347 264992 -15367 -250343 -198143 -105287 -9664 50521 225224 51851 -87589 -146019
179a46019K12074K0454J73187M8238r9341J2438r2418J25118j11338j0823j77737
$$ -146019 66055 86509 259696 307934 208593 221031 128613 253731 142393 131570 -46167
168d6167N6934j56912r8537K21087K57950q0959j17256j48078o0408J69125K602
$$ -46167 10767 -146145 -244682 -23595 234355 153396 36140 -111938 -172346 -3221 -619
157f19j10890m0732J68369R7312m5973M9136j86543J8278R4853j42140L2051o6006
$$ -619 -111509 -152241 16128 113440 67467 116603 -69940 -51662 43191 -98949 -66898 -132904
145a32904Q6711J20744K0090P4473k34532L0592L41843j48686K510j33915k03476
$$ -132904 -46193 74551 94641 169114 -65418 -34826 307017 158331 160841 26926 -176550
134a76550K30344k47252o7066K49139j14071J45462J44296r1760j03933N7973
$$ -176550 53794 -193458 -260524 -11385 -125456 20006 164302 72542 -31391 26582
124B6582J928O2022P444r9425R9130k7906J12237J6726K07006q1163j33410j03144
$$ 26582 28510 90532 97976 -1449 97681 69775 182012 198738 405744 324581 191171 88027
112H8027L7475p1953J55804j72991j02441J5858j0257R3065O9064J09179k5089
$$ 88027 125502 53549 209353 36362 -66079 -50221 -60478 32587 101651 210830 185741
101A85741k25338n4019J1347l2133R1559n9702L1721j55496l2175J19780J85858
$$ 185741 -39597 -93616 -82269 -114402 -22843 -82545 -50824 -206320 -238495 -118715 67143
90F7143k1379p0096l0378k11896l3696L23329R3315J5956l7028j29429m1924K27758
$$ 67143 45764 -24332 -54710 -266606 -300302 23027 116342 132298 95270 -34159 -76083 151675
78A51675m45129m1857R3739L3704K01353r0109r9037J32447j3806k1055J11407
$$ 151675 -293454 -335311 -241572 -207868 -6515 -96624 -195661 -63214 -77020 -98075 13332
$$ [...]
##END NTUPLES=NMR SPECTRUM
##END=
