##TITLE=1H_DE-80H_X3
 200.13MHz, d2o
 8 sc
 
 19ns.26.2.2025
##JCAMPDX= 6.0         $$ Bruker NMR JCAMP-DX V2.0
##DATA TYPE= NMR SPECTRUM
##DATA CLASS= NTUPLES
##ORIGIN= UXNMR, Bruker Analytische Messtechnik GmbH
##OWNER= pz
$$ XWIN-NMR		Version 3.5
$$ Mon Jun 30 10:45:38 2025 Russian Standard Time (UT+4h)  Yarkov@DPX200
##.OBSERVE FREQUENCY= 200.1313
##.OBSERVE NUCLEUS= ^1H
##.ACQUISITION MODE= SIMULTANEOUS
##.ACQUISITION SCHEME= undefined
##.AVERAGES= 8
##.DIGITISER RES= 18
##SPECTROMETER/DATA SYSTEM= spect
##.PULSE SEQUENCE= zg30
##.SOLVENT NAME= CDCl3
##.SHIFT REFERENCE= (INTERNAL, CDCl3, 0, 15.4968)
##AUDIT TRAIL= $$ (NUMBER, WHEN, WHO, WHERE, WHAT)
$$ ##TITLE= Audit trail, XWIN-NMR		Version 3.5
$$ ##JCAMPDX= 5.01
$$ ##ORIGIN= Bruker BioSpin GmbH
$$ ##OWNER= Yarkov
$$ C:/Bruker/XWIN-NMR/data/yarkov2/nmr/H-C/1/pdata/1/auditp.txt
$$ ##AUDIT TRAIL=  $$ (NUMBER, WHEN, WHO, WHERE, WHAT)
(   1,<2025-06-30 10:44:32.45 +0400>,<Yarkov>,<DPX200>,
      <created by zg, POWCHK disabled, PULCHK disabled
       configuration hash MD5:
       00 E9 B6 7A A2 85 ED C7 34 08 36 98 17 FE 4E 26
       data hash MD5: 16K
       BD 9E DF 07 4B D6 2B 9A 0A 7A 2C E8 8F A5 C1 8D>)
(   2,<2025-06-30 10:44:38.62 +0400>,<Yarkov>,<DPX200>,
      <Start of raw data processing
       efp BC_mod = 2 LB = 0.25 FT_mod = 6 PKNL = 1 PHC0 = -1354.82 PHC1 = 3.966602 SI = 16K 
       data hash MD5: 16K
       B5 9C 69 F7 73 CC BE AD 86 1F BC FA F0 50 8B 38>)
(   3,<2025-06-30 10:44:49.14 +0400>,<Yarkov>,<DPX200>,
      <abs ABSG = 5 
       data hash MD5: 16K
       5C AD 07 0F 7A BB 91 DE 8D DA F2 1C 7F 6E A2 A7>)
$$ ##END=
$$ 
$$ hash MD5
$$ 03 9B 8B BB F9 D0 39 37 A5 CC FE 68 2B D0 4B 08
##$RELAX= 
##$RELAX= 
##$RELAX= 
##$RELAX= 
##$RELAX= 
##$RELAX= 
$$ Bruker specific parameters
$$ --------------------------
##$DU= <C:/Bruker/XWIN-NMR>
##$EXPNO= 1
##$NAME= <H-C>
##$PROCNO= 1
##$TYPE= <nmr>
##$USER= <yarkov2>
##$AMP= (0..31)
100 100 100 100 100 100 100 100 100 100 100 100 100 100 100 100 100 100 
100 100 100 100 100 100 100 100 100 100 100 100 100 100 
##$AQSEQ= 0
##$AQ_mod= 1
##$AUNM= <au_zg>
##$AUTOPOS= <>
##$BF1= 200.13
##$BF2= 200.13
##$BF3= 200.13
##$BF4= 200.13
##$BF5= 200.13
##$BF6= 200.13
##$BF7= 200.13
##$BF8= 200.13
##$BYTORDA= 1
##$CFDGTYP= 0
##$CFRGTYP= 5
##$CHEMSTR= <none>
##$CNST= (0..31)
1 1 145 1 1 1 1 1 1 1 1 1 1 1 1 1 1 1 1 1 1 1 1 1 1 1 1 1 1 1 1 1 
##$CPDPRG= <>
##$CPDPRG1= <>
##$CPDPRG2= <>
##$CPDPRG3= <>
##$CPDPRG4= <mlev>
##$CPDPRG5= <mlev>
##$CPDPRG6= <mlev>
##$CPDPRG7= <mlev>
##$CPDPRG8= <mlev>
##$CPDPRGB= <>
##$CPDPRGT= <>
##$D= (0..31)
0 0.7 0 0 0 0 0 0 0 0 0 0.03 0 0 0 0 0 0 0 0 0 0 0 0 0 0 0 0 0 0 0 0 
##$DATE= 1751265871
##$DBL= (0..7)
120 120 120 120 120 120 120 120 
##$DBP= (0..7)
150 150 150 150 150 150 150 150 
##$DBP07= 0
##$DBPNAM0= <>
##$DBPNAM1= <>
##$DBPNAM2= <>
##$DBPNAM3= <>
##$DBPNAM4= <>
##$DBPNAM5= <>
##$DBPNAM6= <>
##$DBPNAM7= <>
##$DBPOAL= (0..7)
0.5 0.5 0.5 0.5 0.5 0.5 0.5 0.5 
##$DBPOFFS= (0..7)
0 0 0 0 0 0 0 0 
##$DE= 6
$$ [...]
##$SUBNAM3= <"">
##$SUBNAM4= <"">
##$SUBNAM5= <"">
##$SUBNAM6= <"">
##$SUBNAM7= <"">
##$SUBNAM8= <"">
##$SUBNAM9= <"">
##$SW= 18.0517328524113
##$SWIBOX= (0..15)
0 0 2 0 0 0 0 0 0 0 0 0 0 0 0 0 
##$SW_h= 3612.71676300578
##$TD= 16384
##$TD0= 1
##$TE= 0
##$TE2= 300
##$TE3= 300
##$TEG= 300
##$TL= (0..7)
0 120 120 120 120 120 120 120 
##$TP= (0..7)
150 150 150 150 150 150 150 150 
##$TP07= 0
##$TPNAME0= <>
##$TPNAME1= <>
##$TPNAME2= <>
##$TPNAME3= <>
##$TPNAME4= <>
##$TPNAME5= <>
##$TPNAME6= <>
##$TPNAME7= <>
##$TPOAL= (0..7)
0.5 0.5 0.5 0.5 0.5 0.5 0.5 0.5 
##$TPOFFS= (0..7)
0 0 0 0 0 0 0 0 
##$TUNHIN= 0
##$TUNHOUT= 0
##$TUNXOUT= 0
##$USERA1= <user>
##$USERA2= <user>
##$USERA3= <user>
##$USERA4= <user>
##$USERA5= <user>
##$V9= 5
##$VALIST= <valist>
##$VCLIST= <CCCCCCCCCCCCCCC>
##$VD= 0
##$VDLIST= <DDDDDDDDDDDDDDD>
##$VPLIST= <PPPPPPPPPPPPPPP>
##$VTLIST= <TTTTTTTTTTTTTTT>
##$WBST= 1024
##$WBSW= 4
##$XGAIN= (0..3)
0 0 0 0 
##$XL= 0
##$YL= 0
##$YMAX_a= 113970
##$YMIN_a= -119095
##$ZGOPTNS= <>
##$ZL1= 120
##$ZL2= 120
##$ZL3= 120
##$ZL4= 120
##$ABSF1= 15.49678
##$ABSF2= -2.555069
##$ABSG= 5
##$ABSL= 3
##$ALPHA= 0
##$AQORDER= 0
##$ASSFAC= 0
##$ASSFACI= 0
##$ASSFACX= 0
##$ASSWID= 0
##$AUNMP= <proc_1d>
##$AZFE= 0.1
##$AZFW= 0.1
##$BCFW= 0
##$BC_mod= 2
##$BYTORDP= 0
##$COROFFS= 0
##$CY= -3
##$DATMOD= 1
##$DC= 0
##$DFILT= <>
##$DTYPP= 0
##$F1P= 0
##$F2P= 0
##$FCOR= 1
##$FTSIZE= 16384
##$FT_mod= 6
##$GAMMA= 0
##$GB= 0
##$INTBC= 1
##$INTSCL= 3.241238e-09
##$ISEN= 128
##$LB= 0.25
##$LEV0= 0
##$LPBIN= 0
##$MAXI= 10000
##$MC2= 0
##$MEAN= 0
##$ME_mod= 0
##$MI= 1.114404
##$NCOEF= 0
##$NC_proc= -8
##$NLEV= 6
##$NOISF1= 3.799351
##$NOISF2= 2.8
##$NSP= 0
##$NTH_PI= 0
##$NZP= 0
##$OFFSET= 15.49678
##$PC= 1
##$PHC0= -1354.82
##$PHC1= 3.966602
##$PH_mod= 1
##$PKNL= yes
##$PPARMOD= 0
##$PSCAL= 0
##$PSIGN= 0
##$REVERSE= no
##$SF= 200.130004987996
##$SI= 16384
##$SIGF1= 3
##$SIGF2= 2
##$SINO= 0.751879
##$SIOLD= 32768
##$SREGLST= <19F.Aceton>
##$SSB= 0
##$STSI= 16384
##$STSR= 0
##$SW_p= 3612.71676300578
##$SYMM= 0
##$S_DEV= 0
##$TDeff= 16384
##$TDoff= 0
##$TI= <>
##$TILT= no
##$TM1= 0
##$TM2= 0
##$TOPLEV= 0
##$USERP1= <user>
##$USERP2= <user>
##$USERP3= <user>
##$USERP4= <user>
##$USERP5= <user>
##$WDW= 1
##$XDIM= 16384
##$YMAX_p= 329533666
##$YMIN_p= -2733799
$$ End of Bruker specific parameters
$$ ---------------------------------
##NTUPLES= NMR SPECTRUM
##VAR_NAME=  FREQUENCY,     SPECTRUM/REAL,   SPECTRUM/IMAG
##SYMBOL=    X,             R,               I
##VAR_TYPE=  INDEPENDENT,   DEPENDENT,       DEPENDENT
##VAR_FORM=  AFFN,          ASDF,            ASDF
##VAR_DIM=   16384,         16384,           16384
##UNITS=     HZ,            ARBITRARY UNITS, ARBITRARY UNITS
##FACTOR=    0.220516191357247, 1,           1
##FIRST=     3101.37073785086, 0,            0
##LAST=      -511.346025154923, 0,           0
##MIN=       -511.346025154923, -2733799,    0
##MAX=       3101.37073785086, 329533666,    0
$$ Real data points
##PAGE= N=1
##DATA TABLE= (X++(R..R)), XYDATA
$$ [...]
5987C20891n9932P8039o4527j76906L31481m1716J80551K54310J15149j39038
5977G98302k59217P358j79465l2643n6655J81008K43211j23966P000K38082K2050
5966H45065k70708j42560o749k26844J34959K05041J58677O3560l52181j19046
5956B89214P2107L4304J57736k5949r9336K14447l27037J08227o0632k2936J60622
5945E00767J78043K53461k23249k37049j25770N6196l40094J17409K61350Q7778
5935E28842J07228J6026K20096j89773Q5245m0906j66051P4988m1014j4768m3210
5924E36703k60244j45854P7052J42355L48011J30868j25018j20305j30512P8770
5914E31826M5379j3303k02833L36160N0577J40602N167q8255N456n7791n8901
$$ plain form
5987 320891 260959 338998 274471 97565 429046 387330 567881 822191 937340 798302
5977 798302 539085 546443 366978 334335 277680 458688 701899 577933 584933 823015 845065
5966 845065 574357 431797 425048 198204 333163 538204 696881 760441 408260 289214
5956 289214 361321 395625 553361 527412 428076 642523 315486 423713 363081 340145 500767
5945 500767 678810 932271 709022 471973 346203 402399 62305 179714 441064 528842
5935 528842 636070 652096 872192 682419 767664 726758 560707 635695 594681 579913 536703
5924 536703 276459 130605 207657 350012 698023 828891 703873 583568 453056 531826
5914 531826 577205 563902 361069 697229 747806 888408 893575 805320 810776 752985 694084
5903F94084l58453n6491J00409J63310L43415M1377k86841r706J25623n8446k36382
5892D61899l4501J08270J02752j26605O8647J03619m7656O7005o5599k81934p3259
5881B82638L80851J45389k3173N769K5988j08272k61969P4292j5781K87697o944
5870G86485j71447m1902l11054R2204K20849j03186N9207K96512j05366N3755
5860G76057n2642J37252R2010j48176M6866l25027J92918L45282l52494l91627
5850C20419K23867J84536M8371k81740L611K69561O6487j87210n6989K64691o6640
5839G88964l8552j84854P6389K37113O1146O5809l37820q4680R9600J33999j69233
5828F47881j339N8754r4600J71920l27880n9341K36009J33423J2051Q4315O6550
$$ plain form
5903 694084 335631 279140 379549 542859 886274 927651 640810 631104 756727 698281 461899
5892 461899 427398 535668 638420 511815 580462 684081 636425 703430 637831 355897 282638
5881 282638 663489 808878 785705 791474 817462 709190 447221 521513 505732 793429 786485
5870 786485 615038 573136 262082 354286 575135 471949 531156 827668 722302 776057
5860 776057 723415 860667 952677 804501 851367 526340 719258 1064540 712046 320419
5850 320419 544286 728822 777193 495453 499064 768625 835112 647902 590913 855604 788964
5839 788964 750412 565558 641947 879060 940206 1006015 668195 583515 683115 817114 647881
5828 647881 646542 705296 610696 782616 454736 395395 631404 764827 776878 861193 927743
5817I27743j79153o9304j8540M0009K17472n5358j6100Q9859J0353N1857J6617
5806A015455j84930o4607k40646K69495N3620n0017j62829o7567K40912j75594
5796F33292J07726j44121j50853J22175J5946P7336J72638K9221P2781r7582m20013
5785D18546J17348M50101J4967M988p5297M7455j07266j72317k12001j73326J10728
5774D23926K52323k7932K15363j37028j50976J48059P9799k4499J81906L10619
5764A271560N277m03645j15138K39829j85278Q5232L1140M6568q7695j16095j4377
5753G57378N8769K28901k5976k56903j90015J97136K3349m6744P5965M1213n2168
5742H10905j16952J18822Q5739K7353j83701j03595J23985m6288r1849M21892
$$ plain form
5817 927743 748590 679286 660746 700755 918227 862869 846769 936628 946981 998838 1015455
5806 1015455 830525 765918 525272 794767 848387 798370 635541 567974 808886 633292
5796 633292 741018 596897 446044 568219 584165 661501 834139 863360 936141 838559 418546
5785 418546 535894 985995 1000962 1005950 930653 978108 870842 698525 486524 313198 423926
5774 423926 676249 648317 863680 726652 575676 723735 803534 779035 960941 1271560
5764 1271560 1276837 873192 758054 997883 812605 897837 928977 975545 887850 771755 757378
5753 757378 816147 1045048 1019072 762169 572154 769290 792639 745895 821860 863073 810905
5742 810905 693953 812775 898514 925867 742166 638571 762556 716268 624419 1046311
5732A046311j74048M0285q3816j36378K32841L7359P0049Q4955Q8304p6472k42730
5721H86660L1796j72088K1909J22338J89474J34532k40936N466k5007Q1116l03299
5710G31961Q9957K18285j14258j28339M3478R6052J00251l2229J55380L20384
5700A480922k94860p1398J02495k5685j75897Q7443K11535o8623J3639k41348
5690A018223K87660J81886j07057j25105l48505J50357K80827k38732J77065q1397
5680A195222J30174j39779J86514r4883R4924j62729k05060K58115j68129J36689
5670A231058j92278k18465j7017K91254P7540l6186K6855J09406l1908J13059
5660A353318j03m6105K09693j12602j84993Q5794O4510J36567q7259O736P8568
$$ plain form
5732 1046311 872263 912548 828732 692354 925195 962554 1032603 1117558 1205862 1129390 886660
5721 886660 918456 746368 768277 890615 1080089 1214621 973685 979151 954144 1035260 731961
5710 731961 821918 1040203 925945 797606 841084 937136 1037387 1005158 1160538 1480922
5700 1480922 1186062 1114664 1217159 1191474 1015577 1103020 1314555 1245932 1259571 1018223
5690 1018223 1305883 1487769 1380712 1255607 907102 1057459 1338286 1099554 1276619 1195222
5680 1195222 1325396 1185617 1372131 1277248 1372172 1209443 1004383 1262498 1094369 1231058
5670 1231058 1038780 820315 803298 1094552 1172092 1135906 1162761 1272167 1240259 1353318
5660 1353318 1353215 1307110 1516803 1404201 1219208 1305002 1369512 1506079 1418820 1425556 1504124
5649A504124j23675R2554K62049j64325j57305P074m9092j3532K11311J82994
5639A752177M1885O4183p2835k93967r0092J19925M32474j08753J40759J33034
5629B118790m5845l19522K2139J15026L7815J24165J32973K7306J323Q32n3257
5618B161745j02692K0135K31936Q0024p219j99438K26662N5480L18111L91072
5608C175816J58658n8609k35508k4554N3336R4803M8661m397K72302J70607N233
5597C656348L4197J73887J53329L08369J20060K07713L52383J03781M87472N38695
5587F136234K83634J96135J76651L29465N08820J52095J29133L88191L35969K19686
5577H856013m3590M8449j16506M09182j07067n112L62069J61011K41719K37925
$$ plain form
5649 1504124 1380449 1473003 1735052 1570727 1413422 1420496 1371404 1357872 1569183 1752177
5639 1752177 1794062 1858245 1785410 1491443 1401351 1521276 1953750 1844997 1985756 2118790
5629 2118790 2072945 1753423 1775562 1890588 1928403 2052568 2185541 2212847 2214170 2215002 2161745
5618 2161745 2059053 2079188 2311124 2391148 2383929 2184491 2411153 2466633 2784744 3175816
5608 3175816 3334474 3275865 3040357 3015803 3069139 3163942 3212603 3208206 3480508 3651115 3656348
5597 3656348 3690545 3864432 4017761 4326130 4446190 4653903 5006286 5110067 5597539 6136234
5587 6136234 6419868 6616003 6792654 7122119 7630939 7783034 7912167 8300358 8636327 8856013
5577 8856013 8812423 8860872 8744366 9153548 9046481 9041369 9403438 9564449 9806168 10044093
5567A0044093O19834K23682L5672N31921M81233O35677K29553N13176P08656O38692
5557A4662189N11675J61951P97898K12073K76392M22185J3615N3830N7149J40558
5547A7309515K1472l42340K0337O3347K1362K21932L50770J04391L77390J78025
5537A8326201N32281P52365K48567Q50340J014288N26144N75444M80505K14043
5528B3520178L13006J31800N870O5062K47877l7105p18529o80265k63629n00147
5518B2084118k49075J13593o0707L1498K02083R7833Q6709L00601N3661O84063
5508B3344377P09255J14385L02417L00335N52162o6649K20070J8739j56668R9458
5498B5437881J45183j23729m18481k31246j11681j4588j40224n26607q36085j023722
$$ plain form
5567 10044093 10663927 10887609 10923281 11455202 11936435 12572112 12801665 13314841 14023497 14662189
5557 14662189 15173864 15335815 16133713 16345786 16622178 17044363 17057978 17111808 17168957 17309515
5547 17309515 17330987 16988647 17008984 17072331 17093693 17315625 17666395 17770786 18148176 18326201
5537 18326201 18858482 19610847 19859414 20709754 21724042 22250186 22825630 23306135 23520178
5528 23520178 23833184 23964984 23970854 24035916 24283793 24246688 23528159 22847894 22584265 22084118
5518 22084118 21835043 21948636 21887929 21919427 22121510 22219343 22306052 22606653 22660314 23344377
5508 23344377 24053632 24168017 24470434 24770769 25322931 25256282 25476352 25495091 25338423 25437881
5498 25437881 25583064 25459335 25040854 24809608 24697927 24683339 24543115 24016508 23180423 22156701
5488B2156701l70845j64488k70063n4923k0137J65305j69284q8841k49684L3397
5478B0967138J37573j28938m5875m94293k62520m64688p47807n91512o30438o12844
5468A7125796p11986J65078l09761o29570k2494j09531j53926L90100J29153l94569
5458A5478290r18149q35439n72927n11322n26337k75939o9594o9041k86568k69257
5448A1143717q2477l30142j36385o14222n80980n55856n08174l31878m60924l47913
5438G194766k50138m22207j85952l75041l00868p454J38422k18572J89020K6401
5428E788377j2826k91881n18251m89317k68323P7135l46435l21670p5837m007
5418C536965J03879j55860m23659Q8444J7369O1337j81820K5984k57545j16791
$$ plain form
5488 22156701 21785856 21621368 21351305 21296382 21276245 21441550 21272266 21183425 20933741 20967138
5478 20967138 21104711 20975773 20929898 20435605 20173085 19708397 18960590 18369078 17738640 17125796
5468 17125796 16413810 16578888 16269127 15639557 15617063 15507532 15353606 15743706 15872859 15478290
5458 15478290 14560141 13724702 13151775 12640453 12114116 11838177 11768583 11699542 11412974 11143717
5448 11143717 11061240 10731098 10594713 9980491 9399511 8843655 8335481 8003603 7542679 7194766
5438 7194766 6944628 6522421 6336469 5961428 5660560 5653106 5791528 5572956 5761976 5788377
5428 5788377 5775551 5483670 4965419 4476102 4207779 4284914 3938479 3616809 3540972 3536965
5418 3536965 3640844 3484984 3061325 3149769 3167138 3228475 3046655 3072639 2815094 2698303
5408B698303p5668N0876j82504J06274J45365k95367K6219j30590N8534k18559
5398B182883L1205K31671j24100j27790j51241j3393k277J38644o1157L7870k52665
5387A889650k08341K38104M9866j3073j65856k68417O5212J66124K36608j71616
5377A818261r3143r1205l95991J19730J93076p9150K13708J58597l3393j82811
5367A627679k4725J55758l7675q9908r6355j63885K80057j31766j03353o0569
5357A355258N1251K34267k2130j97244J8769j70054o3577K09335J00477K32605
5347A748957j83242q3939O7103k2104l78599O8701J67157J11021J03682j53777
5337A444960j11185J77876m4696J78005k27906n6956q8866r6286L02105k71723
$$ plain form
5408 2698303 2622635 2673511 2491007 2597281 2742646 2447279 2473498 2342908 2401442 2182883
5398 2182883 2214088 2445759 2321659 2193869 2042628 2029235 2026958 2165602 2104445 2142315 1889650
5387 1889650 1681309 1919413 1969279 1956206 1790350 1521933 1587145 1753269 1989877 1818261
5377 1818261 1725118 1633913 1237922 1357652 1550728 1471578 1685286 1843883 1810490 1627679
5367 1627679 1602954 1758712 1721037 1631129 1534774 1370889 1650946 1519180 1415827 1355258
5357 1355258 1406509 1640776 1618646 1421402 1440171 1270117 1206540 1415875 1516352 1748957
5347 1748957 1565715 1481776 1548879 1526775 1148176 1216877 1384034 1495055 1598737 1444960
5337 1444960 1333775 1511651 1466955 1644960 1417054 1360098 1271232 1174946 1477051 1205328
5327A205328j01468N75286k22826k05774j42732m5220p1140q9668J21018L0209
5317A053013N583M59368j68297l4072L48724L9874l68590k59717J44307j19548
5307A100645M5796l90812P4149L99891l8607l0419j31552K30123j33431J25558
5297A251341j56947o9558Q0118o7989J73850N6663l5312j15475P0571k49893p4474
5286H62895J51012o5546m021J40801R5224J43110p0867R5040k1310q1161n3524
5275A191653j07953k16973J58952K1837Q4804k9596P6003O6367l1404j07088k90899
5264H15703J18507K05472J11506J00774k99787Q7237L13049k10392p9822K557
5254A164804o1250J73641l03391J24726Q3506J92095r5569k64494K43719J04078
$$ plain form
5327 1205328 1103860 1679146 1456320 1250546 1107814 1062594 991454 901786 1022804 1053013
5317 1053013 1058596 1517964 1349667 1315595 1664319 1704193 1335603 1075886 1220193 1100645
5307 1100645 1146441 755629 829778 1229669 1191062 1160643 1029091 1259214 1125783 1251341
5297 1251341 1094394 1024836 1104954 1036965 1210815 1267478 1232166 1116691 1187262 937369 862895
5286 862895 1013907 948361 944340 1085141 1180365 1323475 1252608 1347648 1326338 1245177 1191653
5275 1191653 1083700 866727 1025679 1047516 1132320 1102724 1178727 1245094 1213690 1106602 815703
5264 815703 934210 1139682 1251188 1351962 1052175 1139412 1452461 1242069 1162247 1164804
5254 1164804 1103554 1277195 973804 1098530 1182036 1374131 1278562 1014068 1257787 1361865
5244A361865j51940r744m4028R2541K16546P1345j30664J37571m7434k87029o1590
5233A147439k8036J5222J16857j2040m4834l34044J6785J66386N4939L32799j04958
5222A326515J7548K4784K63652J07604P9040j91420j72882l7220j28363j28457
5212A160801M852J93743l4701j39445L4179N1743J84248j80563J8341K57786R1129
5201A642113J39983m649o5859j14403J26324J38360j03666j64303k44185N6665
5191A406380L76197j47414l02986N6268L10574L4185j8468M13366Q4177j12555
5181B099724l856p5557K7028Q4485k38377m2105o8355J06540L4723K15115J89722
5170B329087j99968O5342K87631L0267k09582r3914K41934j1536J15658J21331
$$ plain form
5244 1361865 1209925 1200181 1156153 1248694 1465240 1536585 1405921 1543492 1496058 1209029 1147439
5233 1147439 1119403 1134625 1251482 1239442 1194608 860564 877349 1043735 1098674 1431473 1326515
5222 1326515 1344063 1368847 1632499 1740103 1819143 1627723 1454841 1417621 1289258 1160801
5212 1160801 1165653 1359396 1324695 1185250 1219429 1271172 1455420 1274857 1293198 1550984 1642113
5201 1642113 1782096 1777447 1711588 1597185 1723509 1861869 1758203 1593900 1349715 1406380
5191 1406380 1782577 1635163 1332177 1388445 1699019 1733204 1714736 2128102 2212279 2099724
5181 2099724 2095868 2020311 2047339 2131824 1893447 1851342 1782987 1889527 1924250 2139365 2329087
5170 2329087 2129119 2194461 2482092 2512359 2302777 2208863 2450797 2439261 2554919 2676250
5160B676250O2668j61331J49366J69582J11194P4038K76973P5735j8873P5004
5150C490606J77203J80476K02716K38234J50826M8174K04798N01256o1789L07284
5140E439784L16360L65765J41676K61496M66339N00431J68551M06047J25419J07173
5130H299041L3565K58272j05737l51411K55660J23851o6177J37765J08574L34281
5120I027684K61673K8062J08337K41343K26320J00909J89931L36856L76343J43172
5110A1040630N21728M39759P60467Q10083N30682O02350O81819J066234N64748
5101A7018500M25766L95498P0163L58809L69132l54012n34552l06964l59l3313
5091A7408668j58397J78340p3106j97341K4269l193L80491J59292k46481J06045
$$ plain form
5160 2676250 2738918 2577587 2726953 2896535 3007729 3081767 3358740 3434475 3415602 3490606
5150 3490606 3667809 3848285 4051001 4289235 4440061 4488235 4693033 5194289 5132500 5439784
5140 5439784 5756144 6121909 6263585 6525081 6991420 7491851 7660402 8066449 8191868 8299041
5130 8299041 8332606 8590878 8485141 8133730 8389390 8513241 8447064 8584829 8693403 9027684
5120 9027684 9289357 9317419 9425756 9667099 9893419 9994328 10184259 10521115 10897458 11040630
5110 11040630 11562358 12002117 12762584 13572667 14103349 14705699 15387518 16453752 17018500
5101 17018500 17444266 17839764 17909927 18268736 18637868 18283856 17749304 17442340 17441981 17408668
5091 17408668 17250271 17428611 17355505 17158164 17182433 17179240 17559731 17719023 17472542 17578587
5081A7578587N13015Q9726J1869P30558K56098M01625m069K40090O03246N41438
5071B0962183L05844O2557K90243M13480K29650K58158n3292M3626Q8356m08215
5061B2192590n03447j27254l15323j18271k69914l28624K81877l4849k84784L29014
5051B0821015L43423J27054M2445n33830k82698l94685k02156l78315k0940j01735
5041A9419578m96379n54944j08575j2013m14335q5085L5027k55282k98965o8643
5031A7160384J35450j92588l91245j87764q2283j55927l96213J19271K68171k6054
5021A6251202K81907k8235j03487k25955o1649j21496k79063m22156n46138o41765
5011A4103165m88107n40542p07688q39886n72684o4346l11893r0287l39702m89916
$$ plain form
5081 17578587 18091602 18181328 18193197 18923755 19179853 19581478 19577409 19817499 20420745 20962183
5071 20962183 21268027 21330584 21620827 22034307 22263957 22522115 22468823 22512449 22600805 22192590
5061 22192590 21689143 21561889 21246566 21128295 20858381 20529757 20811634 20776785 20492001 20821015
5051 20821015 21164438 21291492 21333937 20800107 20517409 20122724 19920568 19542253 19521313 19419578
5041 19419578 18923199 18368255 18259680 18247667 17833332 17748247 17783274 17527992 17229027 17160384
5031 17160384 17295834 17103246 16712001 16524237 16441954 16286027 15889814 16009085 16277256 16251202
5021 16251202 16533109 16504874 16401387 16175432 16113783 15992287 15713224 15291068 14744930 14103165
5011 14103165 13615058 13074516 12366828 11526942 10954258 10889912 10578019 10487732 10148030 9658114
5001I658114k30179k79179k25921l18670k01090o806j26921J74597r6089m12o7787
4990H279657K978j89574k13201R1934O4118j95780j32360j72902j43098k14246
4980G177526l82663l9093k12849o32404m96316j78591j22851k57753P4882j80553
4970D749335l44127q4834l8539o483m17176K3949N1039l0619n9415l06985J18706
4959C654851J7976J92759j46055l82597j56752q5400j42337k56837J13348R7895
4949B906851l18186q847J98712l62628j15346k1815P6660J5396m9719N7955J70261
4938B549294j98465J14301J01275k83944l2426l14741K02238K19954k59963j1600
4928B085923j36469J28452j69468P053J77249N8794J14857l04276q5522J22658
$$ plain form
5001 9658114 9427935 9148756 8922835 8604165 8403075 8396269 8269348 8443945 8347856 8347444 8279657
4990 8279657 8282635 8093061 7879860 7971794 8035912 7840132 7707772 7534870 7391772 7177526
4980 7177526 6794863 6755770 6542921 5910517 5414201 5235610 5112759 4855006 4929888 4749335
4970 4749335 4405208 4320374 4281835 4275352 3858176 3882125 3933164 3902545 3843130 3536145 3654851
4959 3654851 3672827 3865586 3719531 3336934 3180182 3094782 2952445 2695608 2808956 2906851
4949 2906851 2588665 2579818 2778530 2415902 2300556 2278741 2355401 2370797 2321078 2379033 2549294
4938 2549294 2350829 2465130 2566405 2282461 2250035 1935294 2137532 2357486 2097523 2085923
4928 2085923 1949454 2077906 1908438 1915491 2092740 2151534 2266391 1962115 1876593 1999251
4918A999251M1780R8097j36920j75749R8987L32063L4067L6237j90543j09130
4908B028140K97098P9714L3145j03480N3682L12936n1171K41190K81273K13617
4898C386144j0742m21821k51682m09546L0568j60396k55915J7414J13537O8865
4888B106426k73538O0789k4614J47577k79540k94278K25865l1522O3626k06763
4878A494028J5646l0526j87107n9637R7592R4776j4540n2058K0031J68212j89607
4867A356810j99118K06561p3878j47439L2133M3825O9639J03294o2101m7568j97309
4856A084849K18789R3257j31629J53517J65606j15677j24708J5839K60752j33342
4846A487253M1171k2804k2901m9500l00695L3285R6602J84863K267m6044K0523
$$ plain form
4918 1999251 2041031 2139128 2002208 1826459 1925446 2257509 2291576 2327813 2137270 2028140
4908 2028140 2325238 2404952 2438097 2334617 2388299 2701235 2650064 2891254 3172527 3386144
4898 3386144 3375402 2953581 2701899 2292353 2322921 2162525 1906610 1924024 2037561 2106426
4888 2106426 1832888 1893677 1869063 2016640 1737100 1442822 1668687 1637165 1700791 1494028
4878 1494028 1509674 1479148 1292041 1232404 1329996 1424772 1410232 1358174 1378205 1546417 1356810
4867 1356810 1157692 1364253 1290375 1142936 1175069 1218894 1288533 1391827 1329726 1282158 1084849
4856 1084849 1303638 1396895 1265266 1418783 1584389 1468712 1344004 1359843 1620595 1487253
4846 1487253 1528424 1505620 1482719 1433219 1132524 1165809 1262411 1447274 1449541 1403497 1424020
4835A424020J46815j82171q3979J70731n0844M2239J66780j57154l70191k4239
4825A082007O4887L5778l3385M25161Q7658k84324J5375K52998j18132l36694
4815A191329J95719m1792N5085j68411L16593O771k46931J21069M2873m1542j97901
4804A232862j75411L79343K62665o5793k10063J49950n1673n0373K14360l47261
4794A338606k84141L03896l2080n9370J32042J29858J79034k45637o6945K10860
4784A606123M17508k67295l1433j7872k28449Q4125o0650j56981m388J96284J80797
4773A717769j21098J92042P3591k16738k70238M8365R1002J36066J41990l61394
4763A431357R4856K67461k0636r6181J81715l2986k76524K4059R9493K507l2251
$$ plain form
4835 1424020 1570835 1388664 1304685 1475416 1424572 1466811 1633591 1476437 1106246 1082007
4825 1082007 1146894 1182672 1149287 1574448 1662106 1377782 1393157 1646155 1528023 1191329
4815 1191329 1387048 1345256 1400341 1231930 1548523 1555294 1308363 1429432 1472305 1430763 1232862
4804 1232862 1057451 1436794 1699459 1633666 1423603 1573553 1521880 1471507 1685867 1338606
4794 1338606 1054465 1358361 1326281 1266911 1398953 1528811 1707845 1462208 1395263 1606123
4784 1606123 2023631 1756336 1724903 1707031 1478582 1562707 1502057 1345076 1340688 1536972 1717769
4773 1717769 1596671 1788713 1862304 1645566 1375328 1423693 1514695 1650761 1792751 1431357
4763 1431357 1526213 1793674 1773038 1676857 1858572 1825586 1549062 1573121 1672614 1675121 1642870
4752A642870m25062O7845J73425N8924j24557N5611P5826k36849M62451K33019
4742A983503l05611j74150L27765j2810r2154q4302j30276M4806o5100j48035
4732A343636J73531M8449j96183K32873R4605j47892j97602K09831K8738K10257
4722A800243l7934J0848M6643J46386p1453N0414j36154P4781K5691j98061p0550
4711A640854L9119m616K9990Q328o6587K12191K13701N8125l73553m1863K60697
4700A976386J49112r2197J65473J31771k28778j23496J65690k84906N7609j28629
4690A788035j15401R8223J52054m3623n7880L2599k13927K73119K44830j34876
4680B023153k16832k6092Q2383m9063J91527J77868p0417p2137j62002J44486
$$ plain form
4752 1642870 1217808 1285653 1459078 1518002 1393445 1449056 1524882 1288033 1750484 1983503
4742 1983503 1677892 1503742 1831507 1818697 1726543 1642241 1511965 1556771 1491671 1343636
4732 1343636 1517167 1565616 1369433 1602306 1696911 1549019 1351417 1561248 1589986 1800243
4722 1800243 1762309 1773157 1819800 1966186 1894733 1945147 1808993 1883774 1909465 1711404 1640854
4711 1640854 1679973 1675357 1705347 1713675 1647088 1859279 2072980 2131105 1757552 1715689 1976386
4700 1976386 2125498 2033301 2198774 2330545 2101767 1978271 2143961 1859055 1916664 1788035
4690 1788035 1672634 1770857 1922911 1879288 1821408 1854007 1640080 1913199 2158029 2023153
4680 2023153 1806321 1780229 1862612 1813549 2005076 2182944 2112527 2040390 1878388 2022874
4670B022874J92026l52907J86335j17130J14692o706l40726J14035M62523p6925
4660B198091j00095K19750j42275l49952j14864K33128K14683M369p7292K57976
4650B343519K14270j40405J19239r1011m7170J90902j24567k19815M47587J26248
4640B818797k74026j55103k57062K81590j37811o2189M12K29918N017j1734j02028
4629B335781J27891N4223l10826R5496n2808R5813K27512P0400l63761o155L23144
4618B596710J08919l09180k62805J10765l5675L1555j25518k311M6565L99624
4608B558649k5010j09344J13700P0839j8377J04051J0880m49981j7937L00205
4598B537675J04362L333L4277l15404K24805J1619l9846N3263J650j4943J17492
$$ plain form
4670 2022874 2214900 1861993 2048328 1931198 2045890 2039184 1698458 1812493 2275016 2198091
4660 2198091 2097996 2317746 2175471 1825519 1710655 1943783 2158466 2162835 2085543 2343519
4650 2343519 2557789 2417384 2536623 2445612 2398442 2589344 2464777 2244962 2692549 2818797
4640 2818797 2544771 2389668 2132606 2414196 2276385 2214196 2214608 2444526 2449543 2437809 2335781
4629 2335781 2463672 2517895 2207069 2302565 2249757 2345570 2573082 2643482 2279721 2273566 2596710
4618 2596710 2705629 2396449 2133644 2244409 2208734 2240289 2114771 2112460 2159025 2558649
4608 2558649 2533639 2424295 2537995 2608834 2590457 2694508 2705388 2255407 2237470 2537675
4598 2537675 2642037 2645370 2679647 2364243 2589048 2600667 2560821 2614084 2615734 2600791 2718283
4587B718283R0806m75467J37891K69765m4569R9828K36748Q1608j60401k48941
4577B705551J29338Q9266L6115j14387P1197J49415l72389J10879L11928l53812
4567B763101j01648L65925J74455K05549j08674j17612K48082k17364l06435Q5461
4557B990840q2L3279n5548J23939J89868j1310j47764J55087Q5499j56473K89284
4546C496619m2626Q6199J16635L3312o52J04229Q0229p9568p4263L6266j6070
4535C740310L0894O3781K05967J35776m8926r5638j24827n2195K37108J28401
4525D220651N1393j5667j4610l7811l0014j20869K11579J24996K1502j29527J47556
4514D429179J46535O3552J43432j84064J00460J54359J53611J9644R0061j36539
$$ plain form
4587 2718283 2809089 2333622 2471513 2741278 2696709 2796537 3033285 3114893 2954492 2705551
4577 2705551 2834889 2924155 2960270 2845883 2917080 3066495 2694106 2804985 3116913 2763101
4567 2763101 2661453 3027378 3201833 3407382 3298708 3181096 3429178 3211814 2905379 2990840
4557 2990840 2990758 3024037 2968489 3092428 3282296 3270986 3123222 3278309 3363808 3207335 3496619
4546 3496619 3453993 3540192 3656827 3690139 3689487 3793716 3873945 3794377 3720114 3756380 3740310
4535 3740310 3771204 3834985 4040952 4176728 4127802 4032164 3907337 3855142 4092250 4220651
4525 4220651 4272044 4256377 4241767 4203956 4173942 4053073 4264652 4389648 4411150 4281623 4429179
4514 4429179 4575714 4639266 4782698 4598634 4699094 4853453 5007064 5026708 5116769 4980230
4504D980230K33943q8281J7593J46057P0576k00576j46621K49981N2665L16233
4494E631800j4206Q029J31267q4079R5519j52073L26130L35500k7095k4689Q7217
4483F313320j68472K45742L37839J98676l24102J58493J56940j31288q190r5279
4473F683679M53578K54046N5737J38603j83200J77216K23736N1024K12224j7324
4463H049319M19487K14990Q1910J30956K22249l0310k757N10538L55966J50759
4453A0103107M82238L3764J4239L38747J75645K28856L17422N36384M88189L28016
4443A3046607L95774L68052O94573N99199N0282M30036O26901O35752L09775L01311
4433A7458262O78412P02727J086878R61926P21247R87294P65893R60793J072422
$$ plain form
4504 4980230 5214173 5125892 5143485 5289542 5360118 5159542 5012921 5262902 5315567 5631800
4494 5631800 5617594 5625623 5756890 5672811 5768330 5616257 5942387 6277887 6250792 6226103 6313320
4483 6313320 6144848 6390590 6728429 6927105 6603003 6761496 6918436 6787148 6778958 6683679
4473 6683679 7137257 7391303 7447040 7585643 7402443 7579659 7803395 7854419 8066643 8049319
4463 8049319 8468806 8683796 8765706 8896662 9118911 9088601 9085844 9596382 9952348 10103107
4453 10103107 10585345 10619109 10633348 10972095 11147740 11376596 11694018 12230402 12718591 13046607
4443 13046607 13442381 13810433 14505006 15104205 15154487 15584523 16211424 16847176 17156951 17458262
4433 17458262 18136674 18839401 19926279 20888205 21609452 22596746 23362639 24323432 25395854
4424B5395854O75828Q92731Q03473R80364O13756P25632J216077J129227J196400
4415C3629342J006785J560368J752539J514219J435841J420296R80085Q79231
4407D4178706O44746P67026O83075Q95270J014475Q88290J469554J244634J418968
4398E3204744J358954J277003J162327N10545O1660j61905l06526n03928j28791
4389E6474083k17494m80267o0685Q9111L29147J10306K11379M1948L2828p62726
4379E5767630o38617j244812j442447j231903j287717r54745o46347o68433n55583
4370D7097026l75366m95069l71183m81247p54049r27874q60714p11246n46617
4361D1573661o69362k46296l98387j11737k71709L26449K55296K36986K60269
$$ plain form
4424 25395854 26071682 26964413 27767886 28748250 29362006 30087638 31303715 32432942 33629342
4415 33629342 34636127 36196495 37949034 39463253 40899094 42319390 43299475 44178706
4407 44178706 44823452 45590478 46273553 47168823 48183298 49071588 50541142 51785776 53204744
4398 53204744 54563698 55840701 57003028 57513573 57575233 57413328 57106802 56602874 56474083
4389 56474083 56256589 55776322 55715637 55804748 56133895 56244201 56455580 56497528 56530356 55767630
4379 55767630 55129013 53884201 52441754 51209851 49922134 48967389 48321042 47652609 47097026
4370 47097026 46721660 46226591 45855408 45374161 44620112 43692238 42831524 42120278 41573661
4361 41573661 40904299 40658003 40259616 40147879 39876170 40202619 40457915 40694901 40955170
4352D0955170M29030L57804L36573K97051J02685l66200L0077k86636m48800k08634
4342D1198120j34395M0471L108j29445R5237Q02152M09004L01046O25211Q28083
4332D4038592O57489P20040O67653P24651O33128K43174J15569N3826k88573j85275
4322D7380274m61408l07806P3480J91983k11610k46205l56668q3614l04179n18790
4312D5155457o23682o91832q76746r61571r16150m06477n91124p17153n72516
4303C8798206k77621l34254n11552l00461l90619k00329j90645l34319m87260
4294C5771146o03901j003009j151745j059660j349557j574842j490761j173485
4286B6364186q86083o57282r29036p85749n70107q26590o17362p04026n88916
$$ plain form
4352 40955170 41384200 41742004 42078577 42375628 42478313 42112113 42142190 41855554 41406754 41198120
4342 41198120 41063725 41104196 41107304 40977859 41073096 41875248 42284252 42585298 43210509 44038592
4332 44038592 44696081 45416121 46083774 46808425 47441553 47684727 47800296 47854122 47565549 47380274
4322 47380274 46918866 46611060 46684540 46876523 46664913 46418708 46062040 45978426 45674247 45155457
4312 45155457 44531775 43839943 42963197 42001626 41085476 40678999 40087875 39370722 38798206
4303 38798206 38520585 38186331 37674779 37374318 36983699 36783370 36592725 36258406 35771146
4294 35771146 35167245 34164236 33012491 31952831 30603274 29028432 27537671 26364186
4286 26364186 25478103 24820821 23891785 23106036 22535929 21709339 21091977 20387951 19799035
4277A9799035m37215p88041n87806j91965n77134m85165n27340m43397k28444
4268A5532528n09837l58484k84720l59234k49703k46805k30906K8316l34812Q5359
4258A3071702O2633n56618K57m48346l27879j78471j78802l10328M2757j41939
4248A1034966j03432j63426O8401K57424L4814j69173j03566k77880n60338m17254
4238I600536l6902m14090l17414k09262l66808j79710k73278k38318j71891J1081
4228G403944j53613j07116J41690o6522l8408k18293j49933K02525j66148j78731
4218F669395k03592j1247P7541L53718L7688J22042J46827j64753o470j31668
4208F889481M9679l05328J0678Q3350K53776k3099k32303K11673Q9442r2437P54
$$ plain form
4277 19799035 19361820 18573779 17985973 17794008 17216874 16731709 16204369 15760972 15532528
4268 15532528 15022691 14664207 14379487 14020253 13770550 13523745 13292839 13321155 12986343 13071702
4258 13071702 13134335 12577717 12577974 12129628 11801749 11623278 11444476 11134148 11176905 11034966
4248 11034966 10931534 10768108 10836509 11093933 11128747 10959574 10856008 10578128 10017790 9600536
4238 9600536 9563634 9149544 8832130 8622868 8256060 8076350 7803072 7564754 7392863 7403944
4228 7403944 7250331 7143215 7284905 7218383 7179975 6961682 6811749 7014274 6848126 6669395
4218 6669395 6465803 6454556 6532097 6885815 6923503 7045545 7192372 7027619 7021149 6889481
4208 6889481 6939160 6633832 6644510 6727860 6981636 6958537 6726234 6937907 7027349 6934912 6935666
4197F935666R5383L2367N5537J48232K41055j94431j59822K02799M33628k11397
4187G579017l2172K03593L34780j49295N8682J31042r962J05443o602K9574j3564
4176H230536m260k61668j34606J67908M9251j83849j71966m4024p7704J59680
4166G729298M06201Q8240l69090o0871K39255j86000m4611l55910j5210K44549
4156G675851J89920J90432k71054l730R9325k7945J2510J60303K23494L40064
4146H589170n0242O8157L21938K07732O8419K52265O7511o5078L86313K42077
4136A0088262n0160K05068M18040K06502l9702N07473L03432l2721J27278J05978
4126A1839450K38829P0891k0082M4934J79821L39967n1600Q6583K65497M63861
$$ plain form
4197 6935666 7031049 7063416 7118953 7267185 7508240 7313809 7153987 7356786 7790414 7579017
4187 7579017 7546845 7750438 8085218 7935923 7994605 8125647 8115685 8221128 8214526 8244100 8230536
4176 8230536 8226276 7964608 7830002 7997910 8047161 7863312 7691346 7647322 7569618 7729298
4166 7729298 8135499 8223739 7854649 7793778 8033033 7847033 7802422 7446512 7431302 7675851
4156 7675851 7865771 8056203 7785149 7781419 7880744 7852799 7865309 8025612 8249106 8589170
4146 8589170 8538928 8607085 8929023 9136755 9205174 9457439 9524950 9459872 9846185 10088262
4136 10088262 10038102 10243170 10661210 10867712 10828010 11335483 11638915 11606194 11733472 11839450
4126 11839450 12078279 12149170 12129088 12174022 12353843 12693810 12642210 12728793 12994290 13458151
4116A3458151N18751K46085J60081K77862M88243M36898J94651p1371K76927K93296
4106A6279574J21649J13314K00531K2177M11585L29195N46762N23531M55405K83768
4096A9287491L69008Q45852P53709M54735O02564N10339P53133N06050N45549
4087B4628430Q39934O74164O74556N56981P44171M94148O60134L73161M53707
4078C0099386M79991K98492J57982K56336P0628j1484M52911M78442L65572L83474
4068C3031730O90497M22631P25361R79814J126532J173058J407636J326939J330507
4059D2214705J447520J448057J597729J656551J865765J635020J770087K136388
4051E5771822J866312K114220K045950K449790K930119K287996K677350K968307
$$ plain form
4116 13458151 13976902 14222987 14383068 14660930 15149173 15586071 15780722 15709351 15986278 16279574
4106 16279574 16401223 16514537 16715068 16737245 17148830 17478025 18024787 18548318 19003723 19287491
4096 19287491 19656499 20502351 21256060 21710795 22313359 22823698 23576831 24082881 24628430
4087 24628430 25468364 26142528 26817084 27374065 28118236 28612384 29272518 29645679 30099386
4078 30099386 30579377 30877869 31035851 31292187 31362815 31351331 31804242 32282684 32648256 33031730
4068 33031730 33722227 34144858 34870219 35850033 36976565 38149623 39557259 40884198 42214705
4059 42214705 43662225 45110282 46708011 48364562 50230327 51865347 53635434 55771822
4051 55771822 57638134 59752354 61798304 64248094 67178213 69466209 72143559 75111866
4043G5111866K979534K937609L094259L143570L273217L501415L091273L025054
4035A00157797L286338K852536K769479K461628K457991K037857J398455J048645
4027A18470726L37301m67716q97316j224571k015592k432325k547125k312807
4019A06910575k137651k115668k007707k097644j840579k063109k599884k965583
4011H9082750l050029l530425l890384l842341m170787m363007m088156l942510
4003E8205111l681447l386502l342811k936287k700340k193826j874064k029979
3995C6059855j692275j317532j629917j512860j462158r36176j020854q82958
3987B5605125q33551q79777n77918p36093m99932m69461k73804n40744k25701
$$ plain form
4043 75111866 78091400 81029009 84123268 87266838 90540055 94041470 97132743 100157797
4035 100157797 103444135 106296671 109066150 111527778 113985769 116023626 117422081 118470726
4027 118470726 118808027 118340311 117442995 116218424 114202832 111770507 109223382 106910575
4019 106910575 104772924 102657256 100649549 98551905 96711326 94648217 92048333 89082750
4011 89082750 86032721 82502296 78611912 74769571 70598784 66235777 62147621 58205111
4003 58205111 54523664 51137162 47794351 44858064 42157724 39963898 38089834 36059855
3995 36059855 34367580 33050048 31420131 29907271 28445113 27508937 26488083 25605125
3987 25605125 24771574 23891797 23313879 22577786 22077854 21608393 21334589 20793845 20568144
3978B0568144j02916l28785k62570k04337k06503p94873j74672m80471m58585
3969A7554432r0203j85943n7497l40333j35381j7266k45169l52205J05423L84814
3959A6620672k1786Q5664o0646j14764j53499J05746K36765m830j84613j3899
3949A6494810l98107q8482l397l1684J23744j75797K08261N1344M9441K30188
3939A6460321M22969J75471K58470K64803J82703J32036M66418Q3249L18102N88226
3929A9352768N68258P10197P54095M24139L98292M08865M37630J60245L04598
3920B3519087O9370J38999j16643j14217q4171o08978k01446o3751k22957j67965
3910B2147328k14745J10965m0776n9151J18200Q1419L56532L06960M08567O12884
$$ plain form
3978 20568144 20465228 20136443 19873873 19669536 19463033 18668160 18493488 18013017 17554432
3969 17554432 17464229 17278286 17220789 16880456 16745075 16727809 16482640 16130435 16235858 16620672
3959 16620672 16598886 16684550 16623904 16509140 16355641 16461387 16698152 16693322 16508709 16494810
3949 16494810 16096703 16008221 16004824 15973140 16096884 15921087 16129348 16180692 16230133 16460321
3939 16460321 16883290 17058761 17317231 17582034 17764737 17896773 18363191 18446440 18764542 19352768
3929 19352768 19921026 20631223 21385318 21809457 22207749 22616614 23054244 23214489 23519087
3920 23519087 23588457 23727456 23610813 23496596 23412425 22803447 22602001 22538250 22315293 22147328
3910 22147328 21932583 22043548 22002772 21943621 22061821 22143240 22499772 22806732 23215299 23828183
3900B3828183O14577M16210P89943O04659O70831R98102J220559J077892J156684
3891C1377640R27262J023312J612937K011405J766209J731738J985205K669842
3883D5105550K661386K795587K782391L024472L275447L318085L640841L383000
3875F9986759L435765L236565L400004K946619K471754J950529J402377J194135
3867I0024507O32680K42918M3748P1747m04961p05028k10668n75804p04691j44457
3857H8269991m2830m94461l04426l06668l60463n07988n14757o39529p26403j134881
3847H3237585j272554j193522j394206j147947j496137j460313j447941j107944
3839G2717021r36038n67858k49635J09909L32133P71322J581057J715805K284060
$$ plain form
3900 23828183 24442760 24858970 25648913 26253572 26924403 27922505 29143064 30220956 31377640
3891 31377640 32304902 33328214 34941151 36952556 38718765 40450503 42435708 45105550
3883 45105550 47766936 50562523 53344914 56369386 59644833 62962918 66603759 69986759
3875 69986759 73422524 76659089 80059093 83005712 85477466 87427995 88830372 90024507
3867 90024507 90657187 90900105 90943853 91015600 90610639 89905611 89694943 89119139 88414448 88269991
3857 88269991 88227161 87732700 87428274 87121606 86761143 86253155 85738398 85098869 84372466 83237585
3847 83237585 81965031 80771509 79377303 78229356 76733219 75272906 73824965 72717021
3839 72717021 71780983 71213125 70963490 71073399 71405532 72176854 73757911 75473716 77757776
3830G7757776L109225L587486L920458M197821M483816M168063L553822L041151
3822A07819618K985774K315899J459882O46919K65686J36089l41431j187374j243376
3813A12857686j775549j416147j659726j943629j912031k093807k339408k686782
3805I7030607k419641k792670l056543l618019l768468l927531m065118m186676
3797F9195941l897927l855787l580491l672174l258875l017377l148883l008259
3789D1756168k540141k244786k069905k137817j778200j553581j331782j590609
3781B6509347j248105j160946j111553r02109o92468p47491q28479l15587l64102
3772A9138507m23513m07597l30342l90485L3726j17041J7644K4312o3932j01585
$$ plain form
3830 77757776 80867001 84454487 88374945 92572766 97056582 101224645 104778467 107819618
3822 107819618 110805392 113121291 114581173 115228092 115493778 115629867 115288436 114101062 112857686
3813 112857686 111082137 109665990 108006264 106062635 104150604 102056797 99717389 97030607
3805 97030607 94610966 91818296 88761753 85143734 81375266 77447735 73382617 69195941
3797 69195941 65298014 61442227 57861736 54189562 50930687 47913310 44764427 41756168
3789 41756168 39216027 36971241 34901336 32763519 30985319 29431738 28099956 26509347
3781 26509347 25261242 24100296 22988743 22086634 21394166 20646675 19818196 19502609 19138507
3772 19138507 18714994 18307397 17977055 17586570 17620296 17503255 17520899 17545211 17481279 17379694
3762A7379694K68400K45578J68112J18346l5072K20619N0656P5620J41564j27049
3752A8506468j45963k60748k11937l76585n16691l64327r80633o43643k82359
3743A4723582m72963o28493o36992k76073j02377m95501k83901l26820m74283
3734A1026179j82817m07293k27942l29580n14790j18456P3718j52336l42864q7538
3724H736281j30099q386L6652k68670J87874J80293k30953m26004K41048J14218
3714H432254l07007p45R1036j3033L6678j1514k79343K43527j9332l63206j342
3703G807973o8853R4397O5806j74076j19482j57545J91282Q5358j53514J25800
3693G697146k14190P2274l1008p2558o2048L11775J17891p797k7870m1591Q5503
$$ plain form
3762 17379694 17648094 17893672 18061784 18180130 18145058 18365677 18416333 18491953 18633517 18506468
3752 18506468 18360505 18099757 17887820 17511235 16994544 16630217 15649584 15005941 14723582
3743 14723582 14250619 13622126 12985134 12709061 12606684 12111183 11827282 11500462 11026179
3734 11026179 10843362 10436069 10208127 9878547 9363757 9245301 9319019 9166683 8823819 8736281
3724 8736281 8606182 8597796 8634448 8365778 8553652 8733945 8502992 8076988 8318036 8432254
3714 8432254 8125247 8124502 8215538 8202505 8239183 8227669 7948326 8191853 8172521 7809315 7807973
3703 7807973 7739120 7833517 7899323 7725247 7605765 7448220 7639502 7724860 7571346 7697146
3693 7697146 7482956 7555230 7524222 7451664 7389616 7701391 7819282 7811485 7783615 7742024 7827527
3682G827527k86983K42973j18829o7103K73483J35117J72807J37777j39248p2415
3672H105106J53917O641j39634J18860K50063M16120R4407l617M1998J39169N8515
3661I241545o6020J99337R0289J84141L30081J72984L47743M12950K73281M85017
3651A1671348L09381L15489N81908M75188L52637M94456M74178M38374N39242
3642A5652201R81575O20002O33961M53638P86684L47060M91837J025568J041963
3633B2034489M95205M35252P57836N66298O61852M27783P08704P08462O01828
3624B7397709J68824L98380K4437l668L52412M23264j21040J12050J99208K96472
3614B9248048K94326o3676L65072O39095R9509L64105M56152R2319K62810N70615
$$ plain form
3682 7827527 7540544 7783517 7664688 7597585 7871068 8006185 8178992 8316769 8177521 8105106
3672 8105106 8259023 8265664 8126030 8244890 8494953 8911073 9005480 9001863 9043861 9183030 9241545
3661 9241545 9175525 9374862 9465151 9649292 9979373 10152357 10500100 10913050 11186331 11671348
3651 11671348 11980729 12296218 12878126 13353314 13705951 14200407 14674585 15112959 15652201
3642 15652201 16633776 17253778 17887739 18341377 19128061 19475121 19966958 20992526 22034489
3633 22034489 22529694 22964946 23722782 24289080 24950932 25378715 26087419 26795881 27397709
3624 27397709 27566533 27964913 27989350 27985682 28338094 28761358 28640318 28752368 28951576 29248048
3614 29248048 29542374 29478698 29843770 30482865 30582374 30946479 31402631 31494950 31757760 32328375
3604C2328375N27142Q93183P66257R92690J259359J412164J816907J791826K159710
3595D3947613K390504K734354K783977L282800L481983L993910M910033N134143
3587G2659317N097342N567924N776186N554446N632987N596743N070311M882318
3579A15837574M683852M665651L822805L853436L976064L208850K782149K261488
3571A45091869J658075J560959R85424O3302l67585j272380j888319k095431k945697
3562A40790217l052948l400964l986356l926092m126559m762761n119265m843849
3554A07571423n167651n190258m926549m970604m622687m344981m209722l406063
3546G0732908l167867k430179k455315k090858j334536j107754j022004r88749
$$ plain form
3604 32328375 32855517 33748700 34514957 35507647 36767006 38179170 39996077 41787903 43947613
3595 43947613 46338117 49072471 51856448 55139248 58621231 62615141 67525174 72659317
3587 72659317 77756659 83324583 89100769 94655215 100288202 105884945 110955256 115837574
3579 115837574 120521426 125187077 129009882 132863318 136839382 140048232 142830381 145091869
3571 145091869 146749944 148310903 149296327 149359629 148992044 147719664 145831345 143735914 140790217
3562 140790217 137737269 134336305 130349949 126423857 122297298 117534537 112415272 107571423
3554 107571423 102403772 97213514 92286965 87316361 82693674 78348693 74138971 70732908
3546 70732908 67565041 65134862 62679547 60588689 59254153 58146399 57124395 56135646
3538E6135646m28452k40133R7801L06239J48753M79298M50366K99980K25139M08453
3528E7883090L19789K81548k7394J34544P7770J83515J31809m36651m60688m92950
3518E7594382l88667p68504n32455o21643q57464j049974j381050j218165j337790
3509D9438670j212448j837665k116807j733054j819209j709542j826458j658235
3501C5525252j686540j324185j217039p03156r01467j142059p84035m44936r45355
3492B6376480p51033n14148m52927n23233r9460j61863r7601j34846J54359K01247
3482B3996975M78363P19009L23660J0432j09105J99839J03886L88639J46724O35580
3472B6894002N08206J25173r4341J39889J09882K80048N270M43811M05444L54255
$$ plain form
3538 56135646 55707194 55467061 55564862 55871101 56019854 56499152 56949518 57249498 57474637 57883090
3528 57883090 58202879 58484427 58457033 58591577 58669347 58852862 58984671 58548020 58087332 57594382
3518 57594382 57205715 56437211 55904756 55283113 54425649 53375675 51994625 50776460 49438670
3509 49438670 48226222 46388557 44271750 42538696 40719487 39009945 37183487 35525252
3501 35525252 33838712 32514527 31297488 30594332 29692865 28550806 27766771 27321835 26376480
3492 26376480 25625447 25111299 24658372 24135139 24035679 23873816 23776215 23641369 23795728 23996975
3482 23996975 24475338 25194347 25518007 25528439 25419334 25619173 25723059 26111698 26258422 26894002
3472 26894002 27402208 27527381 27433040 27572929 27682811 27962859 27968129 28411940 28817384 29171639
3462B9171639J46017K86105K16337M7812K40767K14272M16932J10980J87738K20610
3452C1259209L73544p1105J75747M27653P08210K49924p5567m30007o96172n00811
3442C1420625J0790J37748M55812N02305P67045J024879R91818J143752J642188
3433C8096962J698629J739283K019068K326407K859826L106698L699363L945088
3425E9491324M317318M542642M782045N111173N056890M348784L808487L267305
3417I4725968K715116J886245N97273j795222l624017m629614m064923l791660
3409H2019166m161206m151881l094066k835104k566512k066328j421116j012730
3401F0710223r51246p42146j77085L5929r0974j35870l15236l26444l55814l51531
$$ plain form
3462 29171639 29317656 29603761 29820098 29867910 30108677 30322949 30739881 30850861 31038599 31259209
3452 31259209 31632753 31561648 31737395 32165048 32873258 33123182 33047615 32617608 31921436 31420625
3442 31420625 31431415 31569163 32024975 32527280 33294325 34319204 35311022 36454774 38096962
3433 38096962 39795591 41534874 43553942 45880349 48740175 51846873 55546236 59491324
3425 59491324 63808642 68351284 73133329 78244502 83301392 87650176 91458663 94725968
3417 94725968 97441084 99327329 99924602 98129380 94505363 89875749 85810826 82019166
3409 82019166 77857960 73706079 70612013 67776909 65210397 63144069 61722953 60710223
3401 60710223 59758977 59016831 58839746 58875675 58784701 58648831 58333595 58007151 57651337 57299806
3391E7299806n06070l97507k07544J5795Q1725o8736k28497Q4954r7914p36749
3381E5239263j011157j252825j135702j202816j114006j572129j757747j646962
3373D4545919j623858k030927j919306j806420j839633j727108j775732j953267
3365B9869668j881646j698835j430420j254734j343137q81583p65038o85120j041445
3356A8887710p50366o13053p49966r07640l74599l02860p69173l64771k38115
3347A3817167n61802m36782l85682N5031l17046n31797n10196o1603k43933k64660
3337A0558697j96593m5460j19381J47872k26387j03938j39964O6271J71568J31598
3327A0244283J79450J09118p5697m03351J18303J02736K19595j65228l40400j5245
$$ plain form
3391 57299806 56793736 56396229 56188685 56204480 56286205 56217469 55988972 56073926 55976012 55239263
3381 55239263 54228106 52975281 51839579 50636763 49522757 47950628 46192881 44545919
3373 44545919 42922061 40891134 38971828 37165408 35325775 33598667 31822935 29869668
3365 29869668 27988022 26289187 24858767 23604033 22260896 21379313 20614275 19929155 18887710
3356 18887710 18137344 17524291 16774325 15866685 15492086 15189226 14420053 14055282 13817167
3347 13817167 13255365 12818583 12432901 12487932 12170886 11639089 11128893 11067290 10823357 10558697
3337 10558697 10362104 10316644 10197263 10345135 10118748 10014810 9874846 9941117 10112685 10244283
3327 10244283 10423733 10532851 10457154 10053803 10172106 10274842 10494437 10329209 9988809 9973564
3317I973564l34070n9254J4820l44606j99926k00272n8619o8019l07956m11799
3307H003863m34314k61677j31829P2260j37133L2163j5547l68661j0671j4162
3297F734292J01635K3141j61247j68882q9720k2237l9985q8884J151l2497J80695
3286F437462p893l40661j35945K52708J90780M7853o6458j47208j9598M0271l0650
3275F220661m9961R1550o692R3025n1554k53213M9573j23721J71132j2216J05382
3264F233966J28025j42938j6411K23900j03055j742J126j79801J12215K95640
3254F550925j27891k78885J00924K64775Q1495K19083l6768k1578l13835J51851
3244F590096L88764j30618l433J52499K546J80799K02609q486L45164J69340M4027
$$ plain form
3317 9973564 9639494 9580240 9595060 9250454 9050528 8850256 8791637 8723618 8415662 8003863
3307 8003863 7569549 7307872 7176043 7248303 7111170 7143333 7127786 6759125 6748454 6734292
3297 6734292 6835927 6859068 6697821 6528939 6439219 6416982 6376997 6288113 6289264 6256767 6437462
3286 6437462 6429569 6088908 5952963 6205671 6396451 6444304 6377846 6230638 6211040 6251311 6220661
3275 6220661 6170700 6262250 6255558 6348583 6297029 6043816 6093389 5969668 6140800 6128584 6233966
3264 6233966 6361991 6219053 6202642 6426542 6323487 6321745 6322871 6143070 6255285 6550925
3254 6550925 6423034 6144149 6245073 6509848 6591343 6810426 6773658 6752080 6438245 6590096
3244 6590096 6978860 6848242 6844809 6997308 6999854 7180653 7383262 7374776 7719940 7889280 7933307
3233G933307L19112j5199p8961J82735J48173j3942j240M69650M08207L41297
3223I693139J40124J11992J55201L28228K03268p0671L51998L73330L57463K96418
3213A1940490L85557L02393R1267K43464M19084M86412L03536P95853L46562J02544
3203A5417162Q19638P93801N52920R68497J186868Q31270P99363R12048J377026
3194B3658593J350656J079819J146279N30678M83385N26111Q51554Q36610J036980
3185C1500665J313240J432964J383094K036541K273865K142129K152813K174178
3177D6409489J826381J461030J641733J864453K144914K635513K886188L684669
3169F4554370M377649M595773N423071O455546P136946P834995Q757352J0015697
$$ plain form
3233 7933307 8252419 8237220 8158259 8340994 8489167 8475225 8473985 8943635 9351842 9693139
3223 9693139 9833263 9945255 10100456 10428684 10631952 10561281 10913279 11286609 11644072 11940490
3213 11940490 12326047 12628440 12719707 12963171 13382255 13868667 14172203 14968056 15314618 15417162
3203 15417162 16236800 17030601 17583521 18552018 19738886 20570156 21369519 22281567 23658593
3194 23658593 25009249 26089068 27235347 27766025 28249410 28775521 29627075 30463685 31500665
3185 31500665 32813905 34246869 35629963 37666504 39940369 42082498 44235311 46409489
3177 46409489 48235870 49696900 51338633 53203086 55348000 57983513 60869701 64554370
3169 64554370 68932019 73527792 78950863 85406409 92543355 100378350 109135702 119151399
3161A19151399J1228776J2574290J4630834J6632802J8474067K0993569K4146310
3154B37832047K7359176K9111695K4697369J0533379j1888894l0499284l7919061
3147B49226427l5044219k8345608k2542776j7789018j3602928j0447551q668258
3140A12786069p446726o537825n878921n114275m227113l423430k958632k350732
3132G4848415k051492j336202j472681j143197p23883j99979K9046k50694k3694
3123F7675639R9371O45018O57929J161316J198360J901322K413316K491333K964735
3114H1208339L538938M425559M908104N355828O218767O784787P553123Q466610
3106A28460055R511206J0349605J1008137J1974939J2748704J2755636J2870454
$$ plain form
3161 119151399 130380175 142954465 157585299 174218101 192692168 213685737 237832047
3154 237832047 265191223 294302918 319000287 329533666 317644772 287145488 249226427
3147 249226427 214182208 185836600 163293824 145504806 131901878 121454327 112786069
3140 112786069 105339343 98801518 92922597 87808322 83581209 80157779 77199147 74848415
3132 74848415 72796923 71460721 69988040 68844843 68120960 67920981 67950027 67699333 67675639
3123 67675639 67775010 68420028 69077957 70239273 71437633 73338955 75752271 78243604 81208339
3114 81208339 84747277 89172836 94080940 99436768 105655535 112440322 119993445 128460055
3106 128460055 137971261 148320866 159329003 171303942 184052646 196808282 209678736
3099B09678736J1653601Q987703M813371q34313p264107j2097402j5175375j6440013
3091A83322201j5991354j4577245j3642303j2155093j0264548r257145q295773
3084I9138740p449053o626287o095627n623894m818857m785980m418531l505296
3076E5815215l439343l172898k729628k798924k779808j982099k203621j882194
3068C4826700j565532j667362j655209j183976j235053j310565r59476j204189
3060B4045338q02426q22144j047419o24343q19422r29104q62524l99069n11515
3051A7227372n32143n22067p42171n29902m66904n41444m31225m80464m81090
3042A2499962l72428n06960k71710j17263l66041k74145k04623j40765n11330
$$ plain form
3099 209678736 221332337 230320040 235133411 234299098 227034991 214937589 199762214 183322201
3091 183322201 167330847 152753602 139111299 126956206 116691658 107434513 99138740
3084 99138740 91689687 85063400 78967773 73343879 68525022 63739042 59320511 55815215
3076 55815215 52375872 49202974 46473346 43674422 40894614 38912515 36708894 34826700
3068 34826700 33261168 31593806 29938597 28754621 27519568 26209003 25249527 24045338
3060 24045338 23242912 22420768 21373349 20749006 19929584 19000480 18137956 17738887 17227372
3051 17227372 16695229 16173162 15430991 14901089 14434185 13892741 13461516 12981052 12499962
3042 12499962 12127534 11620574 11348864 11231601 10865560 10591415 10386792 10246027 9734697
3033I734697m49518l20544j10647l46339j49047j07592m15640p4064k46528P1081
3023G585859l22569l47742j63296j39618p8714l09944o5209j34760r9901m4089
3013E880017r0285j08578l33984r896R2989k56972j54299o6552j79653k15348
3003D557439K95021K05015l53503l46082l46754J43750m1411k4235L6419k33217
2993C892442q6824j11690R4511R482k11708j32904M0311j03743n5731M2146j78981
2982C197311P9802Q2504k22887L3279R7451j0599j19671k92909j38504n2959J51101
2971B803919J31212l54034k72278L470M30406j78489l89005L1330L8691j81217
2961B064005N1531Q2875k4379O8272m02029n987J73126K8167l40146L9577j12721
$$ plain form
3033 9734697 9285179 8964635 8853988 8507649 8358602 8251010 7835370 7761306 7514778 7585859
3023 7585859 7263290 6915548 6752252 6612634 6533920 6223976 6158767 6024007 5924106 5880017
3013 5880017 5789732 5681154 5347170 5337274 5430263 5173291 5018992 4952440 4772787 4557439
3003 4557439 4852460 5057475 4703972 4357890 4011136 4154886 4113475 4089240 4125659 3892442
2993 3892442 3805618 3693928 3788439 3797921 3586213 3453309 3493620 3389877 3334146 3376292 3197311
2982 3197311 3277113 3359617 3136730 3170009 3267460 3256861 3137190 2844281 2705777 2652818 2803919
2971 2803919 2935131 2581097 2308819 2312289 2742695 2564206 2175201 2206531 2245222 2064005
2961 2064005 2115536 2198411 2174032 2242304 1840275 1834288 2007414 2035581 1695435 1735012 1622291
2950A622291K14344J72852l11773O3457K1599l52195j67830J11967J60000N3225
2940A587937k89773N047K12869j07235J06099j77626j52638O1101K4237M1788
2930A311806k44709K06688N1779j0108o5714l18443J43835l3891l80856q2648
2920E77739J25858J83398K5828J89772J62933l70926J24705k18492J13401j10193
2910H04023k22899K58859K76030J41482j96502o7086p6856j6210L9247k8889m3382
2899H67817n8257k09673J00641J11925J79515k75804o2361o6992Q4635Q4738M9965
2888H06149j1133M78236j85140o39342R5571K73469n7881L6782J70305n9876Q9321
2877I96461Q6147M96895J97056k33344j25431p9458J20097P2236N9341J64592
$$ plain form
2950 1622291 1836635 2009487 1697714 1761171 1782770 1430575 1262745 1374712 1534712 1587937
2940 1587937 1298164 1303211 1516080 1408845 1514944 1337318 1184680 1245781 1270018 1311806
2930 1311806 1067097 1273785 1325564 1315456 1249742 931299 1075134 1041243 660387 577739
2920 577739 703597 886995 912823 1102595 1265528 894602 1019307 800815 914216 804023
2910 804023 581124 839983 1116013 1257495 1060993 993907 917051 900841 940088 911199 867817
2899 867817 809560 599887 700528 812453 991968 716164 653803 586811 671446 756184 806149
2888 806149 795016 1273252 1088112 448770 544341 817810 759929 796711 967016 907140 996461
2877 996461 1082608 1579503 1776559 1543215 1417784 1338326 1458423 1530659 1590000 1754592
2867A754592Q799m4212j49580j01499O0909j18610r7798J11315m15706k81823
2857G26387k8978J1183r7352j54750l11094P7460K65795p2678j78212L68597R9180
2846G05538l3085k86630k10075J94491K51713R8121r7582j23167N8996j61241
2836C97079k98775K07185j05294J0409l18149L16826K32832k10375M7381L30883
2826F10002K3890L8887J24977J9852K89099q1184K480L0343j51579J09010J14201
2815A129978K16398K4971l91738J6968j7984l71079K43578J08798M5520m13926
2805E91484j6620J64465j38748J1223l2875K15692l3877j19421k54340m8550k24559
2794A13874R062p263m9921P5429j29640P2552r5673j26717L12140K22272k1058
$$ plain form
2867 1754592 1763391 1719179 1569599 1468100 1529009 1410399 1312601 1423916 1008210 726387
2857 726387 697409 708592 611240 456490 145396 222856 488651 415973 237761 606358 705538
2846 705538 672453 385823 175748 370239 621952 720073 622491 499324 558320 397079
2836 397079 98304 305489 200195 210604 -107545 209281 442113 231738 279119 610002
2826 610002 633892 672779 797756 817608 1106707 1025523 1028003 1058346 906767 1015777 1129978
2815 1129978 1346376 1371347 979609 996577 978593 607514 851092 959890 1005410 591484
2805 591484 574864 739329 600581 611804 578929 794621 760744 641323 386983 338433 113874
2794 113874 122936 115673 65752 141181 11541 84093 -11580 -138297 173843 396115 375057
2783C75057j38012k58316J38677j25872k1400J38209j81087K09058j33750n2123
2773d9559k1667Q9139j27534K9657j04456j54787K90936j04691j55856m7886K05586
2762a51118J43706O7673l8485l34142m9129J45029q1012j79458n2613K19744N2316
2751b57489j10045J23433M1104k46496p594k4629j26365R1991K20413M207l5082
2740c26552L61018O4906k22906j93526l1185K13130l073j0054J3934L4935j8977
2729a18350j87461N6345N844j66658p0001K53753J98124k53466L8986K01327j78344
2718b19901L1781l9217m5563J12626j0472j51057p7524j62727o6268K04513K56513
2707a67296o7067p227J08098j14965O2888k50901P4079J74842N3981L4087k00468
$$ plain form
2783 375057 237045 -21271 117406 -8466 -29866 108343 -72744 136314 2564 -49559
2773 -49559 -71226 17913 -109621 -79964 -184420 -339207 -48271 -152962 -308818 -356704 -151118
2762 -151118 -7412 60261 21776 -312366 -361495 -216466 -297478 -476936 -529549 -309805 -257489
2751 -257489 -367534 -244101 -202997 -449493 -457087 -481716 -608081 -516090 -295677 -291470 -326552
2740 -326552 34466 99372 -123534 -317060 -348245 -135115 -138188 -148242 -134308 -99373 -118350
2729 -118350 -305811 -249466 -243622 -410280 -480281 -226528 -28404 -281870 -242884 -41557 -219901
2718 -219901 -188120 -227337 -272900 -160274 -170746 -321803 -399327 -562054 -628322 -423809 -167296
2707 -167296 -234363 -241590 -133492 -248457 -185569 -436470 -362391 -187549 -133568 -99481 -299949
2696b99949J88177K58599j03722k35955k85832K73185k9442K7708J13161l00983
2686c95053o0059J27100L82238m5045j70043J10437j1305O6800p6170k983k28226
2675c02309k02258J15802J45259M8667j55373n0984J19214n6459R577P3251J01928
2664a53685j45952q466R7065q8277Q6599m5298o7063j38408K81774K44987l34711
2653b71435p7041J71430j13876J92972o2422n7903j05469J52876m5083N8453j59447
2642c16945q1042R7915K96381J32097k73872m5850J00472j52508l49676J77987
2632d15041Q34L24071J08470p5905R0361k9585j54887K09704k65327Q1016j8854
2621a45143j85055J98086j00818j16942M909Q7635j10857r164J34912J20044R7732
$$ plain form
2696 -299949 -111772 146827 43105 -192850 -478682 -205497 -234939 -207231 -94070 -395053
2686 -395053 -455112 -328012 54226 9181 -160862 -50425 -61730 5070 -71100 -74083 -302309
2675 -302309 -504567 -388765 -243506 -194839 -350212 -401196 -281982 -338441 -328864 -255613 -153685
2664 -153685 -299637 -308103 -211038 -299315 -212716 -258014 -325077 -463485 -181711 63276 -271435
2653 -271435 -348476 -177046 -290922 -97950 -160372 -218275 -323744 -170868 -215951 -157498 -316945
2642 -316945 -397987 -300072 -3691 128406 -145466 -191316 -90844 -243352 -593028 -415041
2632 -415041 -414207 -90136 18334 -57571 32790 3205 -151682 58022 -207305 -126289 -145143
2621 -145143 -330198 -132112 -232930 -349872 -344963 -257328 -368185 -377349 -242437 -122393 -24661
2610b4661J59572N7922k15264k62741n8049K05992k0o7586J93266J42375O4383
2599A95189l12111l8543k32566P251K64297J82242n8605R904p9161j0786J3512
2588e9377J02131m7208j17441J68214P8592M4232n9133N0330m5201k86401J40559
2577c0703J8254j66265K75364j25823O7869k65382l4377J96879q8133l7060J47594
2566d1783K79090p269k72944j72135r2013m1068j05062M26890M7978m3740J40202
2555A18146Q2317j65451j15347o7692P910J71693m8072k25294p946N37024j72000
2544A15288k76066j99110J58502K08367J09325j15585j69293j27256J05629K49119
2534E8920q7779p5463k63032J50063j0028J87437P6544R4989r5867l01710K14774
$$ plain form
2610 -24661 134911 192833 -22431 -285172 -343221 -137229 -137249 -204835 -11569 130806 195189
2599 195189 -116922 -155465 -388031 -380780 -116483 65759 7154 17058 -62103 -72889 -59377
2588 -59377 42754 -4454 -121895 46319 124911 169143 110010 160340 115139 -171262 -30703
2577 -30703 -12449 -178714 96650 -29173 38696 -226686 -261063 -64184 -152317 -189377 -41783
2566 -41783 237307 230038 -42906 -215041 -307054 -348122 -453184 -26294 21684 -22056 118146
2555 118146 200463 35012 -80335 -148027 -140117 31576 -16496 -241790 -249736 287288 115288
2544 115288 -160778 -359888 -201386 6981 116306 721 -168572 -295828 -190199 58920
2534 58920 -28859 -104322 -367354 -217291 -227319 -39882 36662 131651 35784 -265926 -51152
2523e1152J99451j95749j36374K68246j89832q1239j12776j04702M36446J58829
2513A91148j65673k53287p383J05258Q1490r0669J94195j54934m5541m656l18238
2502d68290J41833J44627L55933j9119k18037K54591L5682K5492j47553j03415
2492A744j0j51184Q4323p7443L95373J21617j84377J59769n4689l58581k1192
2481h4650L28446k70823p7928J59158j64797K88502n5177J08694k19544J24980
2471A36861m3467k12123K98562J11808Q0864j34396j51188J10606J42546n5093
2461B84980J48191N0312j86309p3325l1879O7045K6364j38896K49309n7818l26197
2450A1777J82327K68730k6039k2933m8851J45021K29424k53810k27097l7354J74992
$$ plain form
2523 -51152 148299 -47450 -183824 84422 -105410 -186649 -299425 -404127 32319 191148
2513 191148 25475 -227812 -235195 -129937 -48447 -139116 55079 -99855 -145396 -150052 -468290
2502 -468290 -326457 -181830 174103 154984 -63053 191538 227220 252712 105159 1744
2492 1744 1734 -149450 -65127 -142570 252803 374420 190043 349812 295123 -63458 -84650
2481 -84650 243796 -27027 -104955 54203 -110594 177908 122731 231425 11881 136861
2471 136861 93394 -118729 179833 291641 372505 238109 86921 197527 340073 284980
2461 284980 433171 483483 297174 223849 191970 259015 285379 146483 395792 337974 11777
2450 11777 194104 462834 436795 413862 365011 510032 739456 485646 258549 221195 396187
2439C96187j99462j45787J16247L04057q975j19150j71310q4089k553K6153K12899
2428C24217K43919J1238J53737l8278k08991k02369J14908J24633k4970j8003
2418D80041o8530r4178O7215j1996P4423J26308N722K19706J86931j74411o2484
2407G48747P0458j16792k8690N1768K42667k49101l07819J37940J31528P4420
2397G55126K5948j92576K60317N3471O1834K58900j48957j6277K17961q3981R315
2386A201081J26643L99685k38645r6507M09778J58025l1420N7454J3342J53507
2376B152943k01996k05771j31163M38137K11146j04114j18223N0190K74612O0021
2366B425782Q8388o9280J05219M39044J88513k3553j42556K58869M94225N7140
$$ plain form
2439 396187 196725 50938 167185 471242 462267 343117 171807 87718 85165 111318 324217
2428 324217 568136 579374 733111 694833 485842 283473 398381 523014 498044 480041
2418 480041 411511 317333 384548 372552 446975 573283 579005 798711 985642 811231 748747
2407 748747 819205 702413 673723 725491 968158 719057 411238 549178 680706 755126
2397 755126 781074 588498 848815 902286 964120 1223020 1074063 1057786 1275747 1191766 1201081
2386 1201081 1327724 1727409 1488764 1392257 1802035 1960060 1928640 1986094 1999436 2152943
2376 2152943 1950947 1745176 1614013 2052150 2263296 2159182 2040959 2091149 2365761 2425782
2366 2425782 2514170 2444890 2550109 2989153 3177666 3154113 3011557 3270426 3764651 3821791
2356C821791j49187M83661J49400N16167J92670R5910P3064L94609N44156M39140
2346F561381K80473N32981L55210P07940N99076L05305N49726M78261P62073J043890
2336A2176316J226868J159331J379952J499719J679052K036976K291950J977866
2328B5428030J775198J962186K687035L187998L720713M696731N972264P002800
2320E6432955P426691P195022R598159J4125761J7941240J6779113J547227k3036393
2312A08009775k5306227j7185077j1660868q092021o214949m770771l680134k786614
2304B8313114k419526k112128j749812j167564r99618j438061j580046j296860
2296A5549499j693031r47848j153301r74877q28409p40811p19413m32661o95133
$$ plain form
2356 3821791 3672604 4156265 4305665 4821832 5014502 5110412 5183476 5578085 6122241 6561381
2346 6561381 6841854 7374835 7730045 8437985 9037061 9342366 9892092 10370353 11132426 12176316
2336 12176316 13403184 14562515 15942467 17442186 19121238 21158214 23450164 25428030
2328 25428030 27203228 29165414 31852449 35040447 38761160 43457891 49430155 56432955
2320 56432955 63859646 71054668 80652827 94778588 112719828 129498941 131046168 108009775
2312 108009775 82703548 65518471 53857603 45765582 39550633 34779862 31099728 28313114
2304 28313114 25893588 23781460 22031648 20864084 19864466 18426405 16846359 15549499
2296 15549499 13856468 12908620 11755319 10780442 9952033 9211222 8491809 8059148 7364015
2287G364015l42354m16495p50739o6209k05575p5974j62161k98710m84836m61964
2277D098998l05835P6348l69736j03424l13294k77905n2875l7737K31336l70982
2267B574894l3878o3114L4943m20353j22416j34551O122j67512L0188k10567j18002
2256A375754M8048k47702j7705K80141K9465j94054K90287K1070l96169r917k23553
2245I55665K16253K7285K6896j56432p2325k30693K38528j65946j65673L25690
2235I99248m16500j91960J64590L06761j55008P615k83657Q1349M1609r6165K17236
2224F75118q732l29161O8433J49071J39716j46367q1551K21650q1639m703P8789
2213F80624l3605L6875j6396j41959L6761K26437k6623q1254j18153j19464K6176
$$ plain form
2287 7364015 7021661 6605166 5854427 5788218 5582643 5506669 5344508 5045798 4560962 4098998
2277 4098998 3793163 3869511 3499775 3396351 3083057 2805152 2752277 2714540 2945876 2574894
2267 2574894 2541016 2477902 2512845 2092492 1970076 1835525 1841647 1674135 1704323 1493756 1375754
2256 1375754 1423802 1176100 1158395 1438536 1468001 1273947 1564234 1585304 1189135 1179218 955665
2245 955665 1171918 1199203 1226099 1069667 997342 766649 1005177 839231 673558 999248
2235 999248 582748 390788 555378 862139 707131 714746 431089 512438 554047 457882 675118
2224 675118 666386 337225 405658 554729 694445 548078 466527 688177 606538 601835 680624
2213 680624 647019 683894 667498 525539 562300 788737 762114 680860 562707 443243 469419
2202D69419R255J78083l50829r4076R0155R2909l9425l47284J06144L04655J2260
2191D31266j22725M3720J69691n7231l21961m64763J51029P4905K86998j6495
2181A74434o7890J45053o0151p3249M410P0370j99469J99910m674k295J30944
2170C17393j61640k9560j04953j37908j58295L8189O9398K20001j28311j87441
2160b63127M1708K62170K12848j31446n7076k84080O780K34474j82888J12428
2150d8209K4443k1460p578K1504k2925k13096L17956J2642K12708N0010K1990
2139C47985k56194L02396o460l75526k85036J95173M6313P3191j59131r7714L80062
2128A65059k21580j26239J86635l7123J91036K0286j30083j83050k08802J91518
$$ plain form
2202 469419 478674 656757 305928 211852 302007 394916 355491 8207 114351 419006 431266
2191 431266 308541 352261 521952 464721 142760 -322003 -170974 -96069 190929 174434
2181 174434 106544 251597 191446 118197 122607 192977 -6492 193418 188744 186449 317393
2170 317393 155753 126193 21240 -116668 -274963 -236774 -167376 52625 -75686 -263127
2160 -263127 -221419 40751 253599 122153 65077 -219003 -212223 22251 -160637 -48209
2150 -48209 -23766 -45226 -52804 -31300 -54225 -267321 50635 63277 275985 325995 347985
2139 347985 91791 394187 387727 12201 -272835 -77662 -31349 41842 -117289 -215003 165059
2128 165059 -56521 -182760 3875 -33248 157788 178074 47991 -135059 -343861 -152343
2118a52343K03056j71744L8379q8828N52p8846K02196L15849j05785l13571J9912
2107a31173J86381j16269L6148J80774j8789L8081Q0567m06122k24899L7455J73598
2096a64248N646L5563K005J87047J4089J14060j70288q8216m8761j8866J3884
2085a18085K02716m00136J52508K07566k09555J42160j88750j71298k7982j3532
2075d24388J67670R3154P841J21923r8784O2679J00321K00447J37949n6403k59142
2064E3267j16795K35383L6270J78311j63337k72596j67470k14174K74175K28292
2054G1326j96357o3628K54204R6505N8815J95353j1822j7375j93785J18013L89353
2043G00602j25319l49819J07736p8214j07627o8551j12867j3918P4994l6548J3614
$$ plain form
2118 -152343 50713 -121031 -82652 -171480 -170928 -249774 -47578 268271 162486 -151085 -131173
2107 -131173 55208 -61061 -24913 155861 137072 175153 255720 -150402 -375301 -337846 -164248
2096 -164248 -158602 -123039 -121034 66013 80102 194162 23874 -64342 -113103 -131969 -118085
2085 -118085 84631 -315505 -162997 44569 -164986 -22826 -211576 -382874 -410856 -424388
2075 -424388 -256718 -163564 -155723 -33800 -132584 -69905 30416 230863 368812 312409 53267
2064 53267 -63528 171855 208125 386436 223099 -49497 -216967 -431141 -156966 71326
2054 71326 -125031 -188659 65545 162050 220865 416218 404396 387021 193236 311249 700602
2043 700602 575283 225464 333200 254986 147359 78808 -34059 -47977 27017 -9531 4083
2032D083k30101r9180J74488J65399P0731j09500k63825j22667J82861Q7462J22437
2021a7812Q0345k4968j70500j13272J54473Q0168k87070J77989r7249k06815K06523
2010b18188J91803p613L54801J39473o3574k10484k28629r6423l8457j91418L16535
1999e2174j16054o9970Q4703k58442J28825m8276l1424N436J02704M76827j16322
1988A05833j53307o9917O0481k5809j22940k59515J99056J61732k98659K398k6880
1977d27527K6080Q1154L6249O5412P6509j20434j94611j19385J26674K20165J12874
1966a16840j23525L3402L8534K8220k3586J66139K95093l28347N293j306l51746
1955c78669O2591j36776R6153J94488M7782j21745R8476j20515n9362L6789J08262
$$ plain form
2032 4083 -226018 -325198 -150710 14689 85420 -24080 -287905 -410572 -227711 -140249 -17812
2021 -17812 62533 37565 -132935 -246207 -91734 -11566 -298636 -120647 -217896 -424711 -218188
2010 -218188 -26385 -33998 320803 460276 396702 186218 -42411 -138834 -177291 -368709 -52174
1999 -52174 -168228 -238198 -153495 -411937 -283112 -331388 -362812 -357376 -254672 222155 105833
1988 105833 -47474 -117391 -56910 -82719 -205659 -465174 -266118 -104386 -403045 -400647 -427527
1977 -427527 -401447 -320293 -284044 -218632 -142123 -262557 -457168 -576553 -449879 -229714 -116840
1966 -116840 -240365 -206963 -168429 -140209 -163795 2344 297437 -30910 -25617 -26923 -378669
1955 -378669 -316078 -452854 -356701 -162213 -114431 -236176 -137700 -258215 -317577 -280788 -172526
1944a72526K048j0518j10204J95422J76287J54674l29908p8393L6360n2369r9254
1933b88381J05620k97498J9922J69607r3051K57046J54299K7225j12476m1962
1923i9649k38412j20075K12943K90029r5348r3709J9442k49455K60058K01028
1913H6852j75111K83672j28843Q6254l41206Q4751O1500J00243J01303m63372
1903c03957J16596J6384P9402K1290k7111n9324j82604j03928N3236K96741p1614
1892a64889J32550j17342O4632j61714J42094n4534N4917R7245k83737J21565
1882a69213m98J10499Q5037r4732p0825L4629j12259K0010K1041p8154K62421
1871G956j96414k36323J8991J39617O9608j80597N1131K35997n6024j61439O2006
$$ plain form
1944 -172526 -170478 -180996 -291200 -95778 80509 235183 -94725 -173118 -136758 -189127 -288381
1933 -288381 -182761 -480259 -460337 -290730 -383781 -126735 27564 54789 -57687 -99649
1923 -99649 -338061 -458136 -245193 44836 -50512 -144221 -124779 -374234 -114176 86852
1913 86852 -88259 195413 66570 152824 -188382 -103631 -42131 58112 159415 -303957
1903 -303957 -187361 -170977 -91575 -70285 -97396 -156720 -339324 -443252 -390016 -93275 -164889
1892 -164889 -32339 -149681 -85049 -246763 -104669 -159203 -104286 -7041 -290778 -169213
1882 -169213 -169711 -59212 25825 -68907 -139732 -105103 -217362 -197352 -176311 -254465 7956
1871 7956 -188458 -424781 -405790 -266173 -196565 -377162 -326031 -90034 -146058 -307497 -245491
1860b45491L5459j59627l0261J97734J35285K06616j37731n1706K36306J19711
1850C06295j18987j0236k46692J4032j23645N2935k0694l7214K9730J18595J49405
1839A13524k08163r0131o3898r6124L4641K01917j24693J99627j8121o2613r9911
1828b13945j87004K28158L0434K52930Q4177p9589j94185k58687K5834K35853
1818g6024l3754J01027n6456l37098J37054Q6679Q1824k52902p8648K31406J70423
1807b6469q2186k7021L6258l48272j86291K62744n4131j7352K55969J00220j27542
1796b14073N3756k1891l11891K36857J29080j38598l13087K41812K13653j37646
1786b62028J7331n6017j10115l1503J12058K5536K30689l1207l04859K56342J60897
$$ plain form
1860 -245491 -210032 -369659 -399920 -202186 -66901 139715 1984 -49722 186584 306295
1850 306295 187308 177072 -69620 -55588 -179233 -126298 -146992 -184206 -154476 -35881 113524
1839 113524 -94639 -184770 -248668 -344792 -310151 -108234 -232927 -33300 -51421 -114034 -213945
1828 -213945 -400949 -172791 -142357 110573 194750 115161 -79024 -337711 -311877 -76024
1818 -76024 -109778 -8751 -65207 -402305 -265251 -178572 -96748 -349650 -428298 -196892 -26469
1807 -26469 -108655 -135676 -99418 -447690 -633981 -371237 -425368 -442720 -186751 -86531 -214073
1796 -214073 -160317 -182208 -494099 -257242 -128162 -266760 -579847 -338035 -124382 -262028
1786 -262028 -244697 -300714 -410829 -442332 -330274 -304738 -74049 -105256 -410115 -153773 7124
1775G124M2144j35439k41299j62028j12321K77426M6821J7258J40685m2771j83649
1764c46049J91499L4882K2971M247q6201O8474j96652j8258R5901N5010j20489
1753b94665J19935J8879K25786j06784M9960Q0955j84173J01576p0756j90306
1743b49593L0034J01083j26214k0346O8164L03955p6825J29121j4440m8210k27089
1732a30360j53876O5552m271n9682L99057o4187j98846J10026K18419M3834j27260
1721I8406j2897j97894m5528J94280k5940k7271j9929J70599J66206j42016j90465
1710c2449j5468K52656m43012J6129P6632j2773P2898J59153j22969j82811J01716
1699a30298k6879K71786q0030M607J72238m35978l02599J02754K11246j87935
$$ plain form
1775 7124 49268 -86171 -327470 -489498 -601819 -324393 -277572 -260314 -119629 -162400 -346049
1764 -346049 -154550 -119668 -96697 -92450 -178651 -110177 -306829 -325087 -229186 -174176 -294665
1753 -294665 -174730 -155851 69935 -36849 13111 94066 -90107 11469 -59287 -249593
1743 -249593 -219559 -118476 -244690 -265036 -196872 107083 30258 159379 144939 96729 -130360
1732 -130360 -284236 -218684 -222955 -282637 116420 52233 -146613 -36587 181832 225666 98406
1721 98406 85509 -112385 -157913 36367 10427 -16844 -36773 133826 300032 158016 -32449
1710 -32449 -47917 204739 -238273 -222144 -145512 -158285 -85387 73766 -49203 -232014 -130298
1699 -130298 -157177 114609 34579 39186 211424 -224554 -527153 -424399 -213153 -401088
1689d01088m5551L34149n2568k23624R7696J2611j72224k5113K86709m5723l254
1678b37980Q3104m9935L0852O3076M2137L174j68629J23368P3555j92647l12924
1667e42849J00435K09878N5096k3128K5607J5322p37o0708m3678j08443j9275
1656c92480K12068N3585j3930m2865p8200j25611K75417O6144J37122k45208r0969
1645b44927J61110K72047Q0339J0314l84311n8725J97982m69965K49407J03343
1635h3386n3051O8166Q4743M6798j93861k59355R1350L03670J30789K28803k987
1624C61679k73659j00381J50526k34005j10433l8816l15939O7695K17950J05269
1614a70114O6545K42734J17829k66580k97159q2954J72900J24069k7370R4037
$$ plain form
1689 -401088 -446639 -112490 -165058 -388682 -290986 -278375 -450599 -475712 -189003 -234726 -237980
1678 -237980 -154876 -204811 -173959 -110883 -68746 -65572 -234201 -110833 -37278 -229925 -542849
1667 -542849 -442414 -232536 -177440 -200568 -174961 -159639 -160376 -221084 -264762 -373205 -392480
1656 -392480 -180412 -126827 -140757 -183622 -261822 -387433 -112016 -45872 91250 -153958 -244927
1645 -244927 -83817 188230 268569 278883 -105428 -164153 33829 -436136 -186729 -83386
1635 -83386 -136437 -68271 16472 63270 -130591 -389946 -298596 5074 135863 364666 361679
1624 361679 88020 -12361 138165 -95840 -206273 -245089 -561028 -493333 -275383 -170114
1614 -170114 -103569 139165 256994 -9586 -306745 -389699 -216799 -92730 -120100 -26063
1604b6063k23622p5560J66288J25002l6735Q2485J23197j93483k7256o3830L6391
1593a13186j05434J38346l9449n1055N1736j32824m5388J78251J66424k44411
1583a96990j7952K05936N6973J3715k5247J67432l03050j44825L10566R1377j65307
1572g372q2713j82095J15762J918l8239L3995N9155p3605N0199l4734l8131j90509
1560c86369K91689K52094m8275j79276J49673K89627m0245n597j43891k00250
1550b0820j7328J0090L27J95245n1718J6025j20380P0311m47235L53858O7795
1539E6170k94654r6578M81644J50869k8476j78715q2527j36458k59463N8587K24286
1528a05315J18752l03042J89393K46128o2017N2818j43353J9593O3765k99726
$$ plain form
1604 -26063 -249685 -325245 -158957 -33955 -70690 11795 134992 -58491 -85747 -149577 -113186
1593 -113186 -218620 -80274 -119723 -170778 -119042 -251866 -297254 -119003 47421 -196990
1583 -196990 -214942 -9006 47967 61682 36435 203867 -99183 -244008 66558 157935 -7372
1572 -7372 -90085 -272180 -156418 -154500 -192739 -158744 -99589 -173194 -122995 -157729 -195860 -386369
1560 -386369 -94680 157414 109139 -70137 79536 369163 328918 323321 179430 -20820
1550 -20820 -38148 -28058 -27731 167514 115796 131821 11441 81752 -365483 -11625 56170
1539 56170 -238484 -335062 146582 297451 268975 90260 7733 -128725 -388188 -329601 -105315
1528 -105315 13437 -289605 -100212 145916 83899 136717 -6636 12957 76722 -223004
1518b23004O3031o584j36737P8360n4826J20639N0627L0340o2632J52141K97342
1507C08697p1668k23303k2409j34581K65052j13657j25361K83530J41114l38546
1497c1132P6143J81748N5278k02545q1523K41519q0433J45015j39297j04827k44118
1486a84172P2205K7530K01904K46078l17587j00530K20838j56228j8980p0374
1476g9316K2151K37148M4311j44117m1673J15631m4612r8907O5361J65668j9752
1465B21893j22957M0290J1142j89965j51672K87298P0462J49300n1656r7156l81865
1454b14886q2649L0645J58143K00836J5320k06586J29981M7497o0524k7568k25076
1443b34867j97897J81800J03490J34119j9163M1758Q3931p9002o1257m3635m3663
$$ plain form
1518 -223004 -159973 -166557 -303294 -224934 -279760 -159121 -108494 -78154 -140786 11355 308697
1507 308697 237029 13726 -8683 -143264 121788 8131 -117230 166300 307414 -31132
1497 -31132 45011 226759 282037 79492 -2031 239488 159055 304070 164773 59946 -184172
1486 -184172 -111967 -84437 117467 363545 45958 -54572 166266 10038 -8942 -79316
1476 -79316 -57165 179983 224294 80177 38504 154135 109523 10616 75977 241645 221893
1465 221893 98936 139226 150368 -39597 -191269 96029 166491 315791 264135 166979 -214886
1454 -214886 -297535 -266890 -108747 92089 107409 -99177 30804 78301 17777 -9791 -234867
1443 -234867 -432764 -250964 -147474 -13355 -32518 9240 93171 14169 -47088 -90723 -134386
1432a34386N1710K01420K4112k84425p4925K21631Q6966L5396M518n9457l69929
1421b97369K14828J43657o797P2434j55290j93076K68567J99850J5845Q529q1003
1410A90175j71400n0260J03049j81328r2089Q8817j0721k3965l6662Q1414P080
1399i5890K41397N4676j84086N9931j83318k1407K29463o7717L5422K07384k03884
1388G1971n0487K74259j67417J86047o6974k4791q0819j57870O4713O1964j40633
1377c0037q0236n9656J2357Q3519J0310O9506l8958O6866j93272j32679J21757
1366a70523J29330J44114J21530K5035j64470m6978R7638j40189k48055Q9979
1356a62589l7762J12328j09843J27175K66769R0125R890l46861k46724P5302L00176
$$ plain form
1432 -134386 -82676 118744 142856 -141569 -216494 5137 92103 127499 132017 72560 -297369
1421 -297369 -82541 61116 54319 126753 -28537 -221613 46954 246804 262649 271178 190175
1410 190175 18775 -31485 71564 -109764 -201853 -113036 -123757 -147722 -184384 -102970 -95890
1399 -95890 145507 200183 16097 76028 -107290 -128697 100766 33049 68471 275855 71971
1388 71971 21484 295743 128326 314373 247399 222608 141789 -16081 48632 110596 -30037
1377 -30037 -110273 -169929 -157572 -74053 -63743 5763 -33195 33671 -159601 -292280 -170523
1366 -170523 -41193 102921 224451 249486 85016 38038 135676 -4513 -252568 -162589
1356 -162589 -200351 -88023 -197866 -70691 196078 286203 296093 -50768 -297492 -222190 77986
1345G7986n8221r1194K69481K1504r6710L4519L2553k16060j71836p468J31022
1334g4424m1428k76571J61680K42562r600j57531Q5253j86903r5992M611J04538
1323b43805M17057j26838j26081J80626p2616j15343k99104Q0753K11112L7058
1313e7181J22677Q7922l190l40360j66755K57002K923K14725K78402J35760l42491
1302A89434n3697K02008j74660l29324O1160l171k49810M1289J59736J91735O6891
1291A01591j41770j25131J42472J16869O054k07106k76560K36988K96831J14845
1281B65083k42081l01818m8999o4407J82574j5343O340K88277K07303l2278j66685
1270G7966o8826N5368O1770K63986P2357r2970j66438j08434k304P7839n32602
$$ plain form
1345 77986 19765 -71429 198052 219556 122846 157365 189918 -26142 -197978 -205446 -74424
1334 -74424 -115852 -392423 -230743 11819 2219 -155312 -70059 -256962 -352954 -348343 -243805
1323 -243805 173252 46414 -79667 100959 28343 -87000 -386104 -305351 -94239 -57181
1313 -57181 65496 153418 150228 -190132 -356887 -99885 -96962 117763 396165 531925 189434
1302 189434 135737 337745 163085 -166239 -105079 -108250 -358060 -316771 -157035 34700 101591
1291 101591 -40179 -165310 -22838 94031 100085 -107021 -383581 -146593 150238 265083
1281 265083 23002 -278816 -327815 -392222 -209648 -224991 -218651 69626 276929 244651 77966
1270 77966 9140 64508 126278 390264 462621 369651 203213 94779 92475 170314 -362288
1259c62288K9405K79927j11192J00042J65359j31704k75634J49314J61546k35584
1249b30809J09581m8560J76240r9413N2927K7412K4781L9895j90333Q6787j05630
1238a57122j08716k18529K38380M4252j31615j5748K63172L6453Q9093j015n123
1227C3482j31174k9581j97017J35927J82953J1008N5276j28344r6799K76391j18763
1216f641L3213k6324K5873m7843n257L611J42181J35782j18287l6605k38328q3651
1204b22276L11372j25885j44981K05615Q5262n9767m7155j62678J52314M1918
1194C3739m00429Q5390K64271K5988j51131J43287L01060k14794k04204O6802
1184e0021k57788M31352J59157N8048j8018j57245J33231q5099j82384m401p3403
$$ plain form
1259 -362288 -332883 -52956 -164148 -64106 101253 -30451 -306085 -156771 4775 -230809
1249 -230809 -121228 -169788 6452 -92961 -40034 -12622 12159 52054 -138279 -51492 -157122
1238 -157122 -265838 -484367 -245987 -201735 -333350 -349098 -85926 -49473 39620 38605 33482
1227 33482 -97692 -127273 -324290 -188363 -5410 5598 60874 -67470 -164269 112122 -6641
1216 -6641 26572 248 26121 -21722 -26979 -23368 118813 254595 136308 99703 -138625 -222276
1204 -222276 89096 -36789 -181770 23845 109107 49340 2185 -160493 -8179 33739
1194 33739 -366690 -281300 -17029 8959 -142172 1115 302175 87381 -116823 -50021
1184 -50021 -307809 123543 282700 340748 322730 165485 298716 213617 31233 26832 -46571
1173d6571k1081j0690O0926K38211J93769j40132k77574O1344j72246m5253j59061
1162c18358P9959J39288L6520L87541l41614j81075J04884J60948L1747J51712
1152B51552j16686P5530m6236J60525r5570j04824q2533j337j41940N3178l4564
1141h2905j38619q9335L01465J0339N5607j33680J22833j8144q3663P9145j08972
1130h5929n6724r4021k02962j45642L85751J97962j74297L18771J71607l00198
1120A4318j11047K0447J09334N682N1140k73361K1490k13409K3881J50196j50261
1109c51590j474K53756Q4553J86882k79967J91712j07219k7576j1973J81870k09994
1098i1020K10583N9378j91617K24553K0946J61376K1582m7610J05600j14029j65375
$$ plain form
1173 -46571 -67652 -78342 -17416 220795 414564 274432 -3142 58202 -114044 -159297 -318358
1162 -318358 -238399 -99111 -62591 324950 -16664 -197739 -92855 68093 99840 251552
1152 251552 134866 210396 164160 324685 229115 124291 41758 40421 -101519 -48341 -82905
1141 -82905 -221524 -310859 -9394 945 56552 -77128 45705 27561 -56102 23043 -85929
1130 -85929 -142653 -236674 -439636 -585278 -199527 -1565 -175862 142909 314516 14318
1120 14318 -96729 -76282 33052 38734 89874 -183487 -161997 -375406 -351525 -201329 -351590
1109 -351590 -353064 -99308 -14755 172127 -107840 83872 -23347 -50923 -62896 118974 -91020
1098 -91020 119563 178941 -12676 211877 232823 394199 415781 368171 473771 359742 194367
1087A94367q7001j60843J50209P3838j85731q9654J56332l15043l0647M87001
1077A92828O7740q1017j34337J22090M6848k40563j63873J62722M5782N5067R185
1066H2472J05100p4360l48059Q650K10212l438j71437J54725K78019n2758r5691
1055I3435n908O1378o9514j17062N0736L5010j53999j39506J69786p2962K38079
1044H9473J28349k51729J68371K9249Q9474q1886p2096j44184k71406L42128J28025
1033A53768N6333l28337n4563m2225m3104R4745j08863J87636j16131R470K65739
1022G4468k27843K18082p9763J26858j27786k12385K28372L7744K42014O9222
1012C48983l45560k12446K57566l26083J74058K52581j3724j95433n6564L21575
$$ plain form
1087 194367 107366 -53477 96732 170570 -15161 -104815 51517 -263526 -294173 192828
1077 192828 260568 179551 45214 167304 214152 -26411 -190284 -27562 18220 73287 82472
1066 82472 187572 113212 -234847 -226197 -15985 -19423 -190860 -36135 241884 189126 93435
1055 93435 87527 148905 79391 -37671 13065 48075 -105924 -245430 -75644 -148606 89473
1044 89473 217822 -33907 134464 163713 253187 171301 99205 -44979 -316385 25743 153768
1033 153768 210101 -118236 -172799 -215024 -258128 -163383 -272246 -84610 -200741 -191271 74468
1022 74468 -153375 64707 -15056 111802 -15984 -228369 3 37747 279761 348983
1012 348983 3423 -209023 48543 -277540 -103482 149099 135375 -60058 -116622 204953
1002B04953o9879r4728L08978k63149J73491M1570l04261P7656o3642K17826j64022
991F4793p2378L26800j8604k04273J6770m3549j45605J17449N2011p728J34833
980B20519k4204O4789j05300k8337p1986j68885Q0411Q8159m5738O1912k02525
969a31185J04214J21980r2514L9952J07335R759J02875m9419l38864j49479K40459
958c4887j66152M9903L4600J75449J08432k30036K2709M0656K12016o6087k35370
947h8767M8436l9345M3219j54849K52592R6315j84126P5626J7857l91888k54127
936e79057K77818K27431k25847J56135J16862j07096J87117K06540L7405j67712
926A29596j26610k64280J92574K42487j81146J55334k62709r9956K33533q1294
$$ plain form
1002 204953 135074 40346 349324 86175 259666 301236 -3025 74631 10989 228815 64793
991 64793 -7585 319215 300611 96338 113108 69559 -76046 41403 93414 85686 220519
980 220519 196315 261104 155804 127467 55481 -113404 -32993 55166 9428 71340 -131185
969 -131185 -26971 95009 2495 42447 149782 159541 262416 212997 -125867 -275346 -34887
958 -34887 -201039 -151136 -116536 58913 167345 -62691 -39982 674 212690 146603 -88767
947 -88767 -40331 -79676 -36457 -191306 61286 157601 -26525 49101 66958 -324930 -579057
936 -579057 -301239 -73808 -299655 -143520 -26658 -133754 53363 259903 297308 129596
926 129596 2986 -261294 -68720 173767 -7379 147955 -114754 -214710 18823 -62471
916f2471J65663j83j27811K0714L19043j98100n5193o7174j46347j84402N3448
905b82813M8069K46681m459J64521o38l6711j75287j2798p597k8437M6261j72132
893b15340J04298K01589j78893k25351J70149j22260m9382L46585K57582j27431
883A61546k92630j62430K09171O0821N2294P3454j14089J66361J69076j04409
873B19165J00956K42918k25013k55418k05054k01423K08421L29072j64933n5594
863f903P4763l3774j15174n3532J25512J00386o8064k40415J44832O8158K0915
852A6704j48250q06k8403j9544L99418m9058j39466j01829J8471J52937j45760
841d5586J79327K58096j39324m4400q6367K2185j12912k0444J10831J8349L5966
$$ plain form
916 -62471 103192 103009 -24802 -4088 314955 116855 61662 -5512 -151859 -336261 -282813
905 -282813 -234744 11937 7478 171999 171361 134650 -40637 -53435 -61032 -89469 -43208 -215340
893 -215340 -111042 90547 -88346 -313697 -143548 -265808 -315190 31395 288977 161546
883 161546 -131084 -293514 -84343 -23522 28772 102226 -11863 154498 323574 219165
873 219165 320121 563039 338026 82608 -122446 -323869 -115448 213624 48691 -6903
863 -6903 67860 34086 -81088 -134620 -9108 91278 23214 -217201 -72369 -4211 16704
852 16704 -131546 -132352 -160755 -180299 219119 170061 30595 -71234 -52763 100174 -45586
841 -45586 133741 391837 252513 208113 121746 143931 31019 10575 121406 139755 175721
830A75721m9025J42063j91624Q5347k21674j55822L60425K4487l47994J46178
820c1918M74763j23901r4704m18348R8580q0180J63121q7802j78586J87235J56954
809F5214j82445R4235J90833j28585k22363j06219K1544J62576J58414K9089P4721
798A57014j97979K4057j24499J60309Q2720j65906P5081n7448k08776L18723j82793
787a19497j18929j2545J35354K02488K17321L9374j43415k02517J2864m2812j8270
776e0584r966R8022k29176n5079K56061K2328j16433k428j30233k6625J88414
765e5699J5357j098j21042J84791j3269j89579j04538K93913J56976j79046J01142
754H7908p573N05928m8969m23465j23134l6657O2264L0081j91060P2474J91120
$$ plain form
830 175721 126696 268759 77135 162482 -59192 -215014 145411 169898 -178096 -31918
820 -31918 442845 318944 224240 -194108 -95528 -175708 -12587 -100389 -278975 -91740 65214
809 65214 -117231 -22996 167837 39252 -183111 -289330 -267786 -105210 53204 82293 157014
798 157014 -40965 -16908 -141407 18902 101622 -64284 10797 -46651 -255427 63296 -119497
787 -119497 -238426 -250971 -115617 86871 304192 343566 200151 -2366 10498 -32314 -50584
776 -50584 -60550 37472 -191704 -246783 9278 31606 -84827 -87255 -217488 -244113 -55699
765 -55699 -40342 -41440 -162482 22309 9040 -180539 -285077 8836 165812 -13234 87908
754 87908 80335 586263 537294 113829 -9305 -45962 16302 46383 -144677 -72203 118917
743A18917m1731J42401Q2668k4080L1348p2192k2469l01495o3007O30903k28293
732B52970m02043k123J16398J28208o6272q3428K56685j9901r7271k2971q0783
721b0531j07162k7797J84654k3076o9834j7924j007M25716q0694l9840r724j45722
709F7059J86173q1401k40807o3251J86399r7259j95479P0512J46038j32579j5276
698a69871J43224N8230j8683o3145k96529J07396L22288j70650J89996K62528
688C64784P0177l3979l19863j13276r5218J53707J51917j01577l31769k8270J34302
677a49065p1909Q0543r1941j22627k12195M9613L09864K77439n2889j71891k12478
666c67536J88236J79629K5321l42638q5752J25973K46090M87274j04992k76142
$$ plain form
743 118917 77186 219587 302255 278175 309523 237331 214862 -86633 -149640 481263 252970
732 252970 -149073 -151196 -34798 93410 27138 -56290 200395 180494 83223 60252 -20531
721 -20531 -127693 -155490 29164 6088 -63746 -81670 -82677 343039 262345 222505 212781 67059
709 67059 253232 171831 -68976 -132227 54172 -43087 -238566 -168054 -22016 -154595 -169871
698 -169871 -26647 31583 12900 -50245 -346774 -239378 82910 -87740 102256 364784
688 364784 434961 400982 81119 -32157 -127375 26332 178249 76672 -255097 -283367 -149065
677 -149065 -220974 -140431 -232372 -354999 -567194 -517581 -207717 69722 16833 -155058 -367536
666 -367536 -179300 329 25650 -316988 -402740 -276767 -30677 456597 351605 75463
656G5463k21729L7326K50272m12345l7271Q5002k15305K03438N7400M14214j27386
645A09079l40338J09991K93419J00262k95002J52018J4435n3623j76405m5315
635a31479M9508M0608k10360K09605j6105J25047k68428J25205Q7567K5613M29812
624D66593K8927j46562l70667K48246j18061k6781Q1936j38690K9914j43963j68755
613b57863K33252J68629J59705M934j96913j22918j05987J5804R3297j58347j21037
602b87444K74387J31990l4972O0504p8465j20231r0233m4175K24658R1457k29849
591a02373M486O0539M8863j50477n4566Q2292J93r4349p949P3994J60606L7206
579E8465L31415k03845n4916j8319K446j04664K10925j09284j82925J17047l3185
$$ plain form
656 75463 -146266 -108940 141332 -271013 -308284 -223282 -438587 -235149 -177749 236465 109079
645 109079 -231259 -121268 172151 272413 -22589 129429 143864 90241 -86164 -131479
635 -131479 -81971 -41363 -251723 -42118 -58223 66824 -201604 -76399 11168 36781 466593
624 466593 495520 348958 -21709 226537 108476 81695 163631 24941 54855 -89108 -257863
613 -257863 -24611 144018 303723 308657 111744 -11174 -117161 -101357 -8060 -166407 -287444
602 -287444 -13057 118933 83961 144465 66000 -54231 -144464 -188639 36019 127476 -102373
591 -102373 -97887 -37348 11515 -138962 -193528 -111236 -111043 -205392 -213341 -139347 21259 58465
579 58465 389880 186035 131119 112800 115246 10582 221507 112223 -70702 46345 13160
568A3160j02573k6367L37785L3777p2144j19818L0176P0854q715j21947r5377
557f1189K36767m6211j19706J20057k22643o4419J86901P8322J09455P8959j38070
546A58223J24042k07902J3067J50563J52078j58488k05115N7594J29757L356j7662
535A99513J57506R5413k26586j63045N9846Q4343N9122j54076J58196J66173j33217
524C03188j29480o9777p27q1220K116O9191P9808O6637k19059K70131J07440j37424
512B60824L2996q3454m15032n4232K84105J46875k74521l3253N0507R1421J37185
501A43421k25749J8346J83223J24298O9387j8596K24214l70603j88946L00442
491B59437q3494j28243R1906O3313l6107j02424l64154n4633L04521N3100j34211
$$ plain form
568 13160 -89413 -115780 222005 255782 183638 63820 93996 164850 156135 34188 -61189
557 -61189 175578 129367 9661 129718 -92925 -157344 29557 107879 217334 296293 158223
546 158223 282265 74363 87430 237993 390071 231583 26468 84062 213819 217175 199513
535 199513 357019 452432 225846 62801 122647 206990 266112 112036 270232 436405 303188
524 303188 173708 103931 103204 21984 24100 93291 173099 239736 20677 290808 398248 260824
512 260824 293820 210366 -204666 -258898 25207 172082 -102439 -135692 -85185 6236 143421
501 143421 -82328 -63982 119241 243539 312926 294330 518544 147941 -41005 259437
491 259437 175943 47700 139606 202919 166812 64388 -299766 -354399 -49878 3222 -130989
480a30989J55675j70273r2679Q6633J61952K28793q6419n7548O4374j68647j89059
469a98187m0284K76083Q7577k13246J55235j78035q3097j08477O9132R9065J3556
458a20678L1744L8359K98002l0941p2689J74259N7260R374J72401m47745r3462
447A5884k62856k9568K60928m79854J52205K75706j5561M57144N5705k52094l18377
436a40738K3929n4437J12126K42221r4870j39287j11754P1670J27118m2417K2715
425A6276K2428J97762j34314l1901Q5683n7223L0302J96237o5215k12482N5487
414A03040L3150L764j07759K3745L19431P6277J61177k90953l30687n8160Q7833
403B0858J66405J3601K31090P0384j87104Q7864N744k52127j98292M06842J17737
$$ plain form
480 -130989 24686 -145587 -238266 -151633 10319 239112 152693 95145 159519 -9128 -198187
469 -198187 -238471 37612 125189 -88057 67178 -110857 -193954 -302431 -233299 -134234 -120678
458 -120678 -88934 -50575 247427 216486 143797 318056 375316 384690 557091 109346 15884
447 15884 -246972 -276540 -15612 -495466 -343261 -67555 -83116 374028 429733 177639 -140738
436 -140738 -116809 -171246 -59120 183101 88231 -51056 -162810 -91140 35978 -6439 16276
425 16276 38704 236466 102152 70251 155934 98711 129013 325250 260035 47553 103040
414 103040 136190 139954 32195 55940 375371 451648 612825 321872 -8815 -66975 20858
403 20858 187263 200864 431954 502338 315234 403098 408842 156715 -41577 365265 483002
392D83002o1222k03173j25276J40288o6055k8899J91856J16243k98017j4890N8382
381A92239j42438J17775O7601l83609K15227J2305j6496L35069j96510p7849N7344
370A80658l1161K04090J77954k68050l23761j69294q7330L21676J7660l8641j06620
359a22819J3086m0125j7632Q8782K21131R4628j90665k49864j51444j93514L20285
348b28151J82231K82513R890K91946j76699k67703j62691J38328J01139k6160
338A44643k89312Q0437k47526J63913Q1760o6215Q9127q5578K90910l3396R0259
327B19022M8073R2569J52210k28920k04955P5792k1199K71821l88685j49763O4941
316f9094k1965L4130O8709p7236p6673j98768N31082K05540O6128R7377j97785
$$ plain form
392 483002 421780 218607 93331 233619 167564 138665 330521 446764 148747 133857 192239
381 192239 49801 167576 235177 -148432 66795 79100 62604 397673 201163 123314 180658
370 180658 149497 353587 531541 263491 -60270 -229564 -316894 4782 22442 -16199 -122819
359 -122819 -109733 -149858 -167490 -78708 142423 237051 46386 -203478 -354922 -548436 -228151
348 -228151 -45920 236593 246483 538429 361730 94027 -68664 69664 170803 144643
338 144643 -144669 -64232 -311758 -147845 -66085 -132300 -43173 -128751 162159 128763 219022
327 219022 267095 359664 511874 282954 77999 153791 132592 404413 15728 -134035 -69094
316 -69094 -91059 -56929 11780 -65456 -142129 -340897 190185 395725 461853 559230 361445
305C61445k40904J745p1655j44534J61951L7575l14j89707R716J89433L18044
294D32795M1722m9106k03199j63998J64291l9751j67704n2347M495O4952N0834
283H2984k51919r5971l45738M44745L23217l68917q2068O6927R5468k3791n4736
272b09799J78125J143o6478O699L0212o6743j42092J95898J22623Q727j74227
261a15912J40981L5169n0892J65329P9799P7708p223k21321j79985O1494J08386
250I3533k79119J58779P7669m6692k3710j0198r7521j28165K35231P1335K97187
239C48329j98326k59512n010J20097K15537O0728N1001j41223R3694j35703k6629
228A22983j16018l61884K59312K74796j07094q4140J26473M7362k7538j26292
$$ plain form
305 361445 120541 122286 50631 -93903 68048 105623 105309 -84398 -74682 114751 432795
294 432795 474517 425411 222212 58214 222505 182754 15050 -37297 -32802 32150 82984
283 82984 -168935 -264906 -610644 -165899 157318 -211599 -293667 -226740 -131272 -155063 -209799
272 -209799 -31674 -30531 -97009 -90310 -60098 -126841 -268933 -73035 49588 58315 -115912
261 -115912 25069 60238 9346 174675 254474 332182 324959 103638 -76347 -14853 93533
250 93533 -185586 -26807 50862 4170 -19540 -29738 -127259 -255424 -20193 51142 348329
239 348329 150003 -109509 -114519 5578 221115 281843 332844 191621 285315 149612 122983
228 122983 6965 -354919 -95607 179189 72095 -12045 114428 161790 134252 7960
218G960J29079l1160P248J354p410j55350r1232J4332J08188n5991j06460Q8478
206i0964J1293K51488M9452j87630O5765j05444K9883j36310J76390m7211k7774
195a1062J67638j25240L5070j71572j51344K43676j33049O6548p7435Q4370q7270
184a59670q5973K17567J43541j68421k7500K63880k00038j04417m2204K74701
174A11466j07358j26650j99258K34884L45362L4638k30828P5435q657j07511R2849
163A14372J2042o8410k73115M8197J50098q3578L0402R7394M3656l32807l08304
152e70053O3995L56384K33177j95546J06850J54195j07056P0408r3498O51M0593
141F0100O0074j03731K0500N8672J61377j01331r4049j12646o6831o1745P6353
$$ plain form
218 7960 137039 105879 113127 114481 107071 -48279 -139511 -125179 -16991 -72982 -179442 -90964
206 -90964 -79671 171817 221269 33639 99404 -6040 23843 -112467 63923 16712 -11062
195 -11062 156576 31336 66406 -105166 -256510 -12834 -145883 -79335 -156770 -72400 -159670
184 -159670 -245643 -28076 115465 -52956 -80456 183424 -16614 -121031 -163235 111466
174 111466 4108 -122542 -321800 -86916 258446 293084 62256 137691 129034 21523 114372
163 114372 126414 58004 -215111 -166914 -16816 -100394 -69992 27402 71058 -261749 -570053
152 -570053 -506058 -149674 83503 -112043 -5193 149002 41946 112354 18856 19507 60100
141 60100 120174 16443 36943 95615 256992 155661 61612 -51034 -117865 -179610 -103257
130a03257K44986k50239m7336J82287Q8452J8469R0127n5148j34202m7507q7261
119a00629p2807q1749k9132k09724K58529J38476n052N3274l5864o76J49533K96551
107C60730J151q5289j32540L1350J413q7163J88001j61075j81352J67020K1283
96A23529K5960J35487K6979j42069k84882J0673N6306J67213l4243j93887J27069
85A8135M3738J73091k70579n5985Q988j13347J60387L1471r2042k3608J94280
$$ plain form
130 -103257 141729 -108510 -155846 26441 114893 133362 223489 168341 34139 -13368 -100629
119 -100629 -173436 -255185 -284317 -494041 -235512 -97036 -102088 -48814 -84678 -85354 64179 360730
107 360730 361881 276592 144052 175402 176815 89652 277653 116578 -64774 102246 123529
96 123529 149489 284976 311955 169886 -114996 -104323 -48017 119196 84953 -108934 18135
85 18135 61873 234964 -35615 -91600 -82612 -195959 -35572 -4101 -96143 -119751 74529
$$ [...]
##END NTUPLES=NMR SPECTRUM
##END=
