##TITLE=1H_DE-80H_X3
 200.13MHz, d2o
 8 sc
 
 19ns.26.2.2025
##JCAMPDX= 6.0         $$ Bruker NMR JCAMP-DX V2.0
##DATA TYPE= NMR SPECTRUM
##DATA CLASS= NTUPLES
##ORIGIN= UXNMR, Bruker Analytische Messtechnik GmbH
##OWNER= pz
$$ XWIN-NMR		Version 3.5
$$ Tue Jun 24 09:59:15 2025 Russian Standard Time (UT+4h)  Yarkov@DPX200
##.OBSERVE FREQUENCY= 200.1313
##.OBSERVE NUCLEUS= ^1H
##.ACQUISITION MODE= SIMULTANEOUS
##.ACQUISITION SCHEME= undefined
##.AVERAGES= 8
##.DIGITISER RES= 18
##SPECTROMETER/DATA SYSTEM= spect
##.PULSE SEQUENCE= zg30
##.SOLVENT NAME= CDCl3
##.SHIFT REFERENCE= (INTERNAL, CDCl3, 0, 15.4935)
##AUDIT TRAIL= $$ (NUMBER, WHEN, WHO, WHERE, WHAT)
$$ ##TITLE= Audit trail, XWIN-NMR		Version 3.5
$$ ##JCAMPDX= 5.01
$$ ##ORIGIN= Bruker BioSpin GmbH
$$ ##OWNER= Yarkov
$$ C:/Bruker/XWIN-NMR/data/yarkov2/nmr/H-C/1/pdata/1/auditp.txt
$$ ##AUDIT TRAIL=  $$ (NUMBER, WHEN, WHO, WHERE, WHAT)
(   1,<2025-06-24 09:58:07.37 +0400>,<Yarkov>,<DPX200>,
      <created by zg, POWCHK disabled, PULCHK disabled
       configuration hash MD5:
       00 E9 B6 7A A2 85 ED C7 34 08 36 98 17 FE 4E 26
       data hash MD5: 16K
       E1 1B 4F 27 C8 93 97 D8 B1 41 70 E5 DA 7E E6 D0>)
(   2,<2025-06-24 09:58:14.46 +0400>,<Yarkov>,<DPX200>,
      <Start of raw data processing
       efp BC_mod = 2 LB = 0.25 FT_mod = 6 PKNL = 1 PHC0 = -1713.766 PHC1 = 10.1666 SI = 16K 
       data hash MD5: 16K
       E8 CB BF E5 09 A9 6B 7B A2 67 0A BF 12 F6 46 2A>)
(   3,<2025-06-24 09:58:20.12 +0400>,<Yarkov>,<DPX200>,
      <abs ABSG = 5 
       data hash MD5: 16K
       BC B6 CD F6 6F 93 F5 08 0D 77 9A 05 DE 2E 18 68>)
$$ ##END=
$$ 
$$ hash MD5
$$ 31 94 3B 22 D0 6D A7 93 80 70 30 77 DC 9A 8D 17
##$RELAX= 
##$RELAX= 
##$RELAX= 
##$RELAX= 
##$RELAX= 
##$RELAX= 
$$ Bruker specific parameters
$$ --------------------------
##$DU= <C:/Bruker/XWIN-NMR>
##$EXPNO= 1
##$NAME= <H-C>
##$PROCNO= 1
##$TYPE= <nmr>
##$USER= <yarkov2>
##$AMP= (0..31)
100 100 100 100 100 100 100 100 100 100 100 100 100 100 100 100 100 100 
100 100 100 100 100 100 100 100 100 100 100 100 100 100 
##$AQSEQ= 0
##$AQ_mod= 1
##$AUNM= <au_zg>
##$AUTOPOS= <>
##$BF1= 200.13
##$BF2= 200.13
##$BF3= 200.13
##$BF4= 200.13
##$BF5= 200.13
##$BF6= 200.13
##$BF7= 200.13
##$BF8= 200.13
##$BYTORDA= 1
##$CFDGTYP= 0
##$CFRGTYP= 5
##$CHEMSTR= <none>
##$CNST= (0..31)
1 1 145 1 1 1 1 1 1 1 1 1 1 1 1 1 1 1 1 1 1 1 1 1 1 1 1 1 1 1 1 1 
##$CPDPRG= <>
##$CPDPRG1= <>
##$CPDPRG2= <>
##$CPDPRG3= <>
##$CPDPRG4= <mlev>
##$CPDPRG5= <mlev>
##$CPDPRG6= <mlev>
##$CPDPRG7= <mlev>
##$CPDPRG8= <mlev>
##$CPDPRGB= <>
##$CPDPRGT= <>
##$D= (0..31)
0 0.7 0 0 0 0 0 0 0 0 0 0.03 0 0 0 0 0 0 0 0 0 0 0 0 0 0 0 0 0 0 0 0 
##$DATE= 1750744686
##$DBL= (0..7)
120 120 120 120 120 120 120 120 
##$DBP= (0..7)
150 150 150 150 150 150 150 150 
##$DBP07= 0
##$DBPNAM0= <>
##$DBPNAM1= <>
##$DBPNAM2= <>
##$DBPNAM3= <>
##$DBPNAM4= <>
##$DBPNAM5= <>
##$DBPNAM6= <>
##$DBPNAM7= <>
##$DBPOAL= (0..7)
0.5 0.5 0.5 0.5 0.5 0.5 0.5 0.5 
##$DBPOFFS= (0..7)
0 0 0 0 0 0 0 0 
##$DE= 6
$$ [...]
##$SUBNAM3= <"">
##$SUBNAM4= <"">
##$SUBNAM5= <"">
##$SUBNAM6= <"">
##$SUBNAM7= <"">
##$SUBNAM8= <"">
##$SUBNAM9= <"">
##$SW= 18.0517328524113
##$SWIBOX= (0..15)
0 0 2 0 0 0 0 0 0 0 0 0 0 0 0 0 
##$SW_h= 3612.71676300578
##$TD= 16384
##$TD0= 1
##$TE= 0
##$TE2= 300
##$TE3= 300
##$TEG= 300
##$TL= (0..7)
0 120 120 120 120 120 120 120 
##$TP= (0..7)
150 150 150 150 150 150 150 150 
##$TP07= 0
##$TPNAME0= <>
##$TPNAME1= <>
##$TPNAME2= <>
##$TPNAME3= <>
##$TPNAME4= <>
##$TPNAME5= <>
##$TPNAME6= <>
##$TPNAME7= <>
##$TPOAL= (0..7)
0.5 0.5 0.5 0.5 0.5 0.5 0.5 0.5 
##$TPOFFS= (0..7)
0 0 0 0 0 0 0 0 
##$TUNHIN= 0
##$TUNHOUT= 0
##$TUNXOUT= 0
##$USERA1= <user>
##$USERA2= <user>
##$USERA3= <user>
##$USERA4= <user>
##$USERA5= <user>
##$V9= 5
##$VALIST= <valist>
##$VCLIST= <CCCCCCCCCCCCCCC>
##$VD= 0
##$VDLIST= <DDDDDDDDDDDDDDD>
##$VPLIST= <PPPPPPPPPPPPPPP>
##$VTLIST= <TTTTTTTTTTTTTTT>
##$WBST= 1024
##$WBSW= 4
##$XGAIN= (0..3)
0 0 0 0 
##$XL= 0
##$YL= 0
##$YMAX_a= 35748
##$YMIN_a= -37499
##$ZGOPTNS= <>
##$ZL1= 120
##$ZL2= 120
##$ZL3= 120
##$ZL4= 120
##$ABSF1= 15.48245
##$ABSF2= -2.5694
##$ABSG= 5
##$ABSL= 3
##$ALPHA= 0
##$AQORDER= 0
##$ASSFAC= 0
##$ASSFACI= 0
##$ASSFACX= 0
##$ASSWID= 0
##$AUNMP= <proc_1d>
##$AZFE= 0.1
##$AZFW= 0.1
##$BCFW= 0
##$BC_mod= 2
##$BYTORDP= 0
##$COROFFS= 0
##$CY= -3
##$DATMOD= 1
##$DC= 0
##$DFILT= <>
##$DTYPP= 0
##$F1P= 0
##$F2P= 0
##$FCOR= 1
##$FTSIZE= 16384
##$FT_mod= 6
##$GAMMA= 0
##$GB= 0
##$INTBC= 1
##$INTSCL= 3.241238e-09
##$ISEN= 128
##$LB= 0.25
##$LEV0= 0
##$LPBIN= 0
##$MAXI= 10000
##$MC2= 0
##$MEAN= 0
##$ME_mod= 0
##$MI= 1.114404
##$NCOEF= 0
##$NC_proc= -10
##$NLEV= 6
##$NOISF1= 3.799351
##$NOISF2= 2.8
##$NSP= 0
##$NTH_PI= 0
##$NZP= 0
##$OFFSET= 15.49348
##$PC= 1
##$PHC0= -1713.766
##$PHC1= 10.1666
##$PH_mod= 1
##$PKNL= yes
##$PPARMOD= 0
##$PSCAL= 0
##$PSIGN= 0
##$REVERSE= no
##$SF= 200.130005648099
##$SI= 16384
##$SIGF1= 3
##$SIGF2= 2
##$SINO= 0.751879
##$SIOLD= 32768
##$SREGLST= <19F.Aceton>
##$SSB= 0
##$STSI= 16384
##$STSR= 0
##$SW_p= 3612.71676300578
##$SYMM= 0
##$S_DEV= 0
##$TDeff= 16384
##$TDoff= 0
##$TI= <>
##$TILT= no
##$TM1= 0
##$TM2= 0
##$TOPLEV= 0
##$USERP1= <user>
##$USERP2= <user>
##$USERP3= <user>
##$USERP4= <user>
##$USERP5= <user>
##$WDW= 1
##$XDIM= 16384
##$YMAX_p= 376625718
##$YMIN_p= -3503633
$$ End of Bruker specific parameters
$$ ---------------------------------
##NTUPLES= NMR SPECTRUM
##VAR_NAME=  FREQUENCY,     SPECTRUM/REAL,   SPECTRUM/IMAG
##SYMBOL=    X,             R,               I
##VAR_TYPE=  INDEPENDENT,   DEPENDENT,       DEPENDENT
##VAR_FORM=  AFFN,          ASDF,            ASDF
##VAR_DIM=   16384,         16384,           16384
##UNITS=     HZ,            ARBITRARY UNITS, ARBITRARY UNITS
##FACTOR=    0.220516191357247, 1,           1
##FIRST=     3100.71018561318, 0,            0
##LAST=      -512.006577392596, 0,           0
##MIN=       -512.006577392596, -3503633,    0
##MAX=       3100.71018561318, 376625718,    0
$$ Real data points
##PAGE= N=1
##DATA TABLE= (X++(R..R)), XYDATA
$$ [...]
5892I03545k12776m29277n06729L39944M10991J54254k47878m58655L5407J69360
$$ 903545 690769 261492 -245237 94707 505698 659952 412074 -46581 -11174 158186
5882A58186j90615O6309M05918r5154n55794J68369K58957L98126K34505p7031
$$ 158186 -32429 33880 439798 344644 -211150 -42781 216176 614302 848807 771776
5872G71776l57871l13431m06375l5794O45687l28298K2959J00953m92312L16230
$$ 771776 413905 100474 -305901 -341695 303992 -24306 -1347 99606 -392706 -76476
5862g6476Q9278l01434P6173j06194K66623L9501M9977k04547J67840J16884O2007
$$ -76476 12802 -288632 -212459 -318653 -52030 -12529 37448 -167099 741 117625 179632
5851A79632N12036j91737o1523j98488K91894K5778q1363k27946j43530O07085
$$ 179632 691668 499931 438408 239920 531814 557592 476229 248283 104753 711838
5841G11838l84356k66395L15581L8249l18596l49451M98443J90558J39666j14735
$$ 711838 327482 61087 376668 414917 96321 -253130 245313 435871 575537 460802
5831D60802p8120k60574j94136L53185J88627k84440Q2742q3326K05430N9202
$$ 460802 382682 122108 -72028 281157 469784 185344 268086 184760 390190 449392
5821D49392o01347J68472q4306P14693J99388l3051m88671J88770J21727m92039
$$ 449392 -151955 16517 -67789 646904 846292 813241 324570 513340 635067 143028
5811A43028n51661L06788N56580j47866M99864L0705n53811j91338M84060K05099
$$ 143028 -408633 -101845 454735 306869 806733 837438 283627 92289 576349 781448
5801G81448n97325m6177N58779k65921k12450k37027J45788K25937J82611N50344
$$ 781448 184123 137946 696725 430804 218354 -18673 127115 353052 535663 1086007
5791A086007k91881k64173R7090J35056j05376r3945O7523J03843K71235k70279
$$ 1086007 794126 529953 627043 762099 656723 562778 630301 734144 1005379 735100
5781G35100m17820K92622l49216l76990O55207N10256m59867M35401m16663J76119
$$ 735100 317280 609902 260686 -116304 538903 1049159 589292 1024693 608030 784149
5771G84149K97323l47515l54n08752m31414Q3799R35430M19544L0973R3237n50084
$$ 784149 1081472 733957 733603 224851 -206563 -122764 812666 1232210 1263183 1356420 806336
5760H06336l44067J16866M25733N2748m20785K01806L88608m74211k81824O96938
$$ 806336 462269 579135 1004868 1057616 636831 838637 1227245 753034 471210 1168148
5750A168148j40231n12068j29873j36131q8658M5562o5093K51743K77613L74539
$$ 1168148 1027917 515849 385976 249845 161187 206749 141656 393399 671012 1045551
5740A045551k60136O61409n9071l21912K42128j46399p0347J52616o19281l13205
$$ 1045551 785415 1446824 1387753 1065841 1307969 1161570 1091223 1243839 624558 311353
5730C11353O16056m74872l90663K45850L79520k26954p6464P23957o576K49332
$$ 311353 927409 452537 61874 307724 687244 460290 383826 1107783 1101207 1350539
5720A350539j30172j59478J64505L4845l13344n31490q5899J96321P20864k59674
$$ 1350539 1220367 1060889 1225394 1260239 946895 415405 329506 525827 1246691 987017
5710I87017K66477k90183J12142J55802K50269M49807o90864m2497O5930k09736
$$ 987017 1253494 963311 1075453 1231255 1481524 1931331 1240467 1197970 1263900 1054164
5700A054164j38204o9803J38010q4351K39977j43873q4870P5515p9986M6500M34669
$$ 1054164 915960 846157 984167 899816 1139793 995920 911050 986565 906579 953079 1387748
5689A387748m549n5586k7109k23772k9253M67884j03580n17004m75523L5698M19689
$$ 1387748 1383199 1327613 1300504 1076732 1047479 1515363 1411783 894779 419256 454954 874643
5678H74643R2271o2243L71938o8751n36111O72024K46480j01298n82057j55246
$$ 874643 966914 904671 1276609 1207858 671747 1343771 1590251 1488953 906896 751650
5668G51650K93282L7670k94288N95196P6430L89978N5600p2974J83888R4701n64290
$$ 751650 1044932 1082602 788314 1383510 1459940 1849918 1905518 1832544 2016432 2111133 1546843
5657A546843J32198J42462q1441O3509P6299J98513k71421l0977L62478J44864
$$ 1546843 1679041 1821503 1740062 1803571 1879870 2078383 1806962 1775985 2138463 2283327
5647B283327j11895J77271J86211m76913k0045J73734m5462M8784r2143n1344
$$ 2283327 2171432 2348703 2534914 2058001 2037956 2211690 2166228 2215012 2122869 2071525
5637B071525o23600N88052r586m89234N49759O00851j02857N4090L317L03641
$$ 2071525 1447925 2035977 2026391 1537157 2086916 2687767 2584910 2639000 2642317 2945958
5627B945958N60741j09340j15016m24197K99258M46168J44714j25088p4660o25234
$$ 2945958 3506699 3397359 3282343 2858146 3157404 3603572 3748286 3623198 3548538 2923304
5617B923304p8993N12886q3619j6843L4337P0686N16271N8873m51859K64287M23936
$$ 2923304 2844311 3357197 3273578 3256735 3291072 3361758 3878029 3936902 3485043 3749330 4173266
5606D173266l348J8380j85279j58919k06029Q56056O09680k68300J27208J0632
$$ 4173266 4169918 4188298 4003019 3844100 3638071 4494127 5103807 4835507 4962715 4973347
5596D973347L52417K16997L471Q8827P83177K8174L78361l71151o74788j98216
$$ 4973347 5325764 5542761 5546232 5635059 6418236 6446410 6824771 6453620 5778832 5580616
5586E580616N86302O70198M09686l4181O52058j97324o8995L0072L02472L90714
$$ 5580616 6166918 6837116 7246802 7212621 7864679 7667355 7598360 7628432 7930904 8321618
5576H321618N50140j48431K05801N59445j16390J01134Q7054N05060K62446K70030
$$ 8321618 8871758 8723327 8929128 9488573 9372183 9473317 9560371 10065431 10327877 10597907
5566A0597907L4094P40423l12734k62554j98313M21545L93836N30024M34106k87005
$$ 10597907 10632001 11372424 11059690 10797136 10598823 11020368 11414204 11944228 12378334 12091329
5556A2091329j0728P39838N15277Q70392l33678M1390L83056J38618k84503n0458
$$ 12091329 12080601 12820439 13335716 14206108 13872430 13913820 14296876 14435494 14150991 14100533
5546A4100533J5810Q14268R54581J15064k42702M90436P01541j27298r8352j95892
$$ 14100533 14116343 14930611 15885192 16000256 15757554 16247990 16949531 16822233 16723881 16527989
5536A6527989K52083M86896O13446O00662O20028J37045l350k24435l48714J40647
$$ 16527989 16780072 17266968 17880414 18481076 19101104 19238149 19234799 19010364 18661650 18802297
5526A8802297K24232R5309p0668K01389p0124k61892j78950K12615P74337l02115
$$ 18802297 19026529 19121838 19051170 19252559 19182435 18920543 18741593 18954208 19728545 19426430
5516A9426430L3009j76734K81600M2743P58185m13528r5976N23519N17099N35422
$$ 19426430 19459439 19282705 19564305 19607048 20365233 19951705 19855729 20379248 20896347 21431769
5506B1431769J24746j13321K88415M97654J563455P25541O63302j47862m37167
$$ 21431769 21556515 21443194 21731609 22229263 23792718 24518259 25181561 25033699 24596532
5497B4596532j034331r14032n82722q82523n70622l15418k53913P8474o76992
$$ 24596532 23562201 22648169 22065447 21182924 20612302 20296884 20042971 20121445 19444453
5488A9444453o20393m43488n0702k00493J89497L20660p17697k51752K45106L46571
$$ 19444453 18824060 18380572 18329870 18129377 18318874 18639534 17921837 17670085 17915191 18261762
5478A8261762k53570j82468l3642l08673l24764J62444J09441O78460N71906J082058
$$ 18261762 18008192 17825724 17792082 17483409 17158645 17321089 17430530 18108990 18680896 19762954
5468A9762954O57237J95538j076147j336328j209475q91904j598170j82833l00869
$$ 19762954 20420191 20615729 19539582 18203254 16993779 16101875 14503705 14320872 14020003
5459A4020003o79779R2190j40376p47185l95273k89070j29303p03173k10431l91333
$$ 14020003 13340224 13432414 13292038 12544853 12149580 11860510 11731207 11028034 10817603 10426270
5449A0426270o97422R2590K93308m31069m90786k18600M79542n08200L39684J13296
$$ 10426270 9728848 9821438 10114746 9683677 9192891 8974291 9453833 8945633 9285317 9398613
5439I398613m6904J01580L06639l70055l27873k52495n44804j18645Q5276p03383
$$ 9398613 9351709 9453289 9759928 9389873 9062000 8809505 8264701 8146056 8231332 7527949
5429G527949j51823j94897p04967j11427n6792r9354n14156o9445l92649N11160
$$ 7527949 7376126 7181229 6476262 6364835 6308043 6208689 5694533 5625088 5232439 5743599
5419E743599j9066p45782k20460p8949j61995L44511j82193l89294K35424R7732
$$ 5743599 5724533 4978751 4758291 4679342 4517347 4861858 4679665 4290371 4525795 4623527
5409D623527M2267k98610j62120N6584j7602L57892K05269o60334j37222L34779
$$ 4623527 4665794 4367184 4205064 4261648 4244046 4601938 4807207 4146873 4009651 4344430
5399D344430k98701k83584P8871N9955O873L3700k84963J00395l24836m0228K3832
$$ 4344430 4045729 3762145 3841016 3900971 3907844 3941544 3656581 3756976 3432140 3391912 3415744
5388C415744L48036j2230m5074j76072M2678K08625l3159p10985m23764k96972
$$ 3415744 3763780 3751550 3706476 3530404 3573082 3781707 3748548 3037563 2613799 2316827
5378B316827J34651L6696M5382J68163n7647K15437m3137K97825N8289l44751
$$ 2316827 2451478 2488174 2533556 2701719 2644072 2859509 2816372 3114197 3172486 2827735
5368B827735K28912N16193j56527o96199K46020l19437k10860J19415Q99242m97948
$$ 2827735 3056647 3572840 3416313 2720114 2966134 2646697 2435837 2555252 3454494 2956546
5358B956546m87255Q2789j44808m2068j81162L23449n81428M92106O44591l60082
$$ 2956546 2469291 2552080 2407272 2365204 2184042 2507491 1926063 2418169 3062760 2702678
5348B702678n05297M86879l99821l38429K01471K51389K05997m16826L01648L1703
$$ 2702678 2197381 2684260 2284439 1946010 2147481 2398870 2604867 2188041 2489689 2521392
5338B521392k13380k07173L90962J56054M5254n47862r9359J86365k85227J79332
$$ 2521392 2308012 2100839 2491801 2647855 2693109 2145247 2045888 2232253 1947026 2126358
5328B126358k68401L0649M31770r39906K17193Q48137M333j74646J68372j34460
$$ 2126358 1857957 1888606 2320376 1380470 1597663 2445800 2450133 2275487 2443859 2309399
5318B309399n37276J83313N91200L99421k10673l24463L4667q801k62604l81508
$$ 2309399 1772123 1955436 2546636 2946057 2735384 2410921 2445588 2436787 2174183 1792675
5308A792675J44578N87976l89825J86394K95963k18520p49000J53007K94664l20838
$$ 1792675 1937253 2525229 2135404 2321798 2617761 2399241 1650241 1803248 2097912 1777074
5298A777074k89267K77017P07013J82938n11709m2305l10066k29623K52586N27704
$$ 1777074 1487807 1764824 2471837 2654775 2143066 2100761 1790695 1561072 1813658 2341362
5288B341362K75358L9964j87338k15371J6947J1865L33219k64185K6500o4690
$$ 2341362 2616720 2656684 2469346 2253975 2270922 2282787 2616006 2351821 2378321 2313631
5278B313631K71005k52264r6569k14537K93380k10950n2158k8452L03712n3036
$$ 2313631 2584636 2332372 2235803 2021266 2314646 2103696 2051538 2023086 2326798 2273762
5268B273762l16450j50518r8781J85018K91674j64610l9896k77055K14064L20063
$$ 2273762 1957312 1806794 1708013 1893031 2184705 2020095 1980199 1703144 1917208 2237271
5258B237271n30826N69354m71799n0363m73625Q15486n7982k41826k43043J65147
$$ 2237271 1706445 2275799 1804000 1753637 1280012 2095498 2037516 1795690 1552647 1717794
5248A717794M50700l08643l79733P31516O09184l66172l87479l30828n15336N81513
$$ 1717794 2168494 1859851 1480118 2211634 2820818 2454646 2067167 1736339 1221003 1802516
5238A802516J58863J73652l53321M47560Q9208m28714K04577J67258L76178k05161
$$ 1802516 1961379 2135031 1781710 2229270 2318478 1889764 2094341 2261599 2637777 2432616
5228B432616L23179k1768m13615J98992j55729L50L80936n19066l7594K51102
$$ 2432616 2755795 2734027 2320412 2519404 2363675 2364025 2744961 2225895 2188301 2439403
5218B439403L11320k08371m05817n0991j35249J51594J54633M35099R6584l80907
$$ 2439403 2750723 2542352 2136535 2085544 1950295 2101889 2256522 2691621 2788205 2407298
5208B407298l85298O9119M68849n5968p3858K2223J80274O8254L02699q5958K30480
$$ 2407298 2022000 2091119 2559968 2504000 2430142 2452365 2632639 2700893 3003592 2917634 3148114
5197C148114j1543l9254j129j4748m0539m77117M35234K55783k4258L9667J04221
$$ 3148114 3136571 3097317 3096188 3081440 3040901 2563784 2999018 3254801 3230543 3270210 3374431
5186C374431k58596j97395k14872o5958R47304J85368P6261l77005o0424l64549
$$ 3374431 3115835 2918440 2703568 2637610 3584914 3770282 3846543 3469538 3409114 3044565
5176C044565J2173J15919R3480O8978j86519M20538m45453J16494L88114P56561
$$ 3044565 3056738 3172657 3266137 3335115 3148596 3569134 3123681 3240175 3628289 4384850
5166D384850L97423j62780l00920R141P09931L49544l93627m66216M67127K50262
$$ 4384850 4782273 4619493 4318573 4327714 5037645 5387189 4993562 4527346 4994473 5244735
5156E244735O9537n58910N8446R8596N06295K41274J63460N25342J23931j29642
$$ 5244735 5314272 4755362 4813808 4912404 5418699 5659973 5823433 6348775 6472706 6343064
5146F343064J01053n44437J22211J28517j9745Q57451O36967j33932Q3751p614
$$ 6343064 6444117 5899680 6021891 6150408 6130663 6988114 7625081 7491149 7574900 7567286
5136G567286j3262j2297N79486L98569n6633k37720K91337L06493J72920r8110
$$ 7567286 7554024 7541727 8121213 8519782 8463149 8225429 8516766 8823259 8996179 8898069
5126H898069N45206M34309r561M0129O46616n61805j56952Q85546l26007J43691
$$ 8898069 9443275 9877584 9868023 9908152 10554768 9992963 9836011 10721557 10395550 10539241
5116A0539241L95102J2723K26262N39466j11908M53974m43184R07599J10880K30286
$$ 10539241 10934343 10947066 11173328 11712794 11600886 12054860 11611676 12519275 12630155 12860441
5106A2860441R25302j51191o50063M58219O62520M21867J26326k46619K87530
$$ 12860441 13785743 13634552 12984489 13442708 14105228 14527095 14653421 14406802 14694332
5097A4694332J29165k13679L39744J25968O52398O48733q20421l02281K42082
$$ 14694332 14823497 14609818 14949562 15075530 15727928 16376661 15556240 15253959 15496041
5088A5496041k97721K79278j60867R05170M91359J40264M3478q76713m44101N85736
$$ 15496041 15198320 15477598 15316731 16221901 16713260 16853524 16897002 16020289 15576188 16161924
5078A6161924L71242J04655M29979p3759l65985k59535J63519J65429j0703N26468
$$ 16161924 16533166 16637821 17067800 16994041 16628056 16368521 16532040 16697469 16686766 17213234
5068A7213234M16850o37621k68728K70065K2752j08800k8318l34606L03747K0437
$$ 17213234 17630084 16992463 16723735 16993800 17016552 16907752 16879434 16544828 16848575 16869012
5058A6869012m36199j39415q1961R561K42811K49680m45034k45109L33177N2160
$$ 16869012 16432813 16293398 16211437 16220998 16463809 16713489 16268455 16023346 16356523 16408683
5048A6408683l2620k71028q53815m91340L70577J17750o84819j37307L68888O09780
$$ 16408683 16376063 16105035 15251220 14759880 15130457 15248207 14563388 14426081 14794969 15404749
5038A5404749P5697o34141n62728k16833j74968k71610n64329n76562N50503l46777
$$ 15404749 15480446 14846305 14283577 14066744 13891776 13620166 13055837 12479275 13029778 12683001
5028A2683001K33083Q3569K26572l41953l75500r1519O3759l51798p17229L36103
$$ 12683001 12916084 12999653 13226225 12884272 12508772 12417253 12481012 12129214 11411985 11748088
5018A1748088m49470k69569K11761m56247k25109k77885k78918J74608o717j44168
$$ 11748088 11298618 11029049 11240810 10784563 10559454 10281569 10002651 10177259 10170542 10026374
5008A0026374J24988j91046m39304j80471l58306l06617j39073J63765M99169
$$ 10026374 10151362 9960316 9521012 9340541 8982235 8675618 8536545 8700310 9199479
4999I199479j0024m70441n31379m1242J08971m61364m3780o80627O6588L62418
$$ 9199479 9189455 8719014 8187635 8146393 8255364 7794000 7750220 7069593 7136181 7498599
4989G498599k74185k61370n26627j93873M3005L72236J03331m07833j16483Q4026
$$ 7498599 7224414 6963044 6436417 6242544 6285549 6657785 6761116 6353283 6236800 6320826
4979F320826l41547l93242N6540K46585n42142n71375m148L549l11075K20287
$$ 6320826 5979279 5586037 5642577 5889162 5347020 4775645 4771497 4775046 4463971 4684258
4969D684258L76960q48528k70341k50464K67658L64106j45681L46510J69741j48248
$$ 4684258 5061218 4212690 3942349 3691885 3959543 4323649 4177968 4524478 4694219 4545971
4959D545971n06237p57001n4738K72021M00077k53348k40773l6309J25176K6529
$$ 4545971 4039734 3282733 3227995 3500016 3900093 3646745 3405972 3369663 3494839 3521368
4949C521368q767m19169l99536M59236l68454l73585L41866L21221j12675L0070
$$ 3521368 3512601 3093432 2693896 3153132 2784678 2411093 2752959 3074180 2961505 2991575
4939B991575M06978j24451o52274n24063j36476q362J61851K4936M55925P6809
$$ 2991575 3398553 3274102 2621828 2097765 1961289 1952927 2114778 2139714 2595639 2672448
4929B672448O1545l19388j8049k62531l47756O64948K39465J0829l07119r66401
$$ 2672448 2733993 2414605 2396556 2134025 1786269 2451217 2690682 2701511 2394392 1427991
4919A427991q9302M87708l33834L84217l83530O74685j26779L3296j28268l87147
$$ 1427991 1338689 1826397 1492563 1876780 1493250 2167935 2041156 2074452 1946184 1559037
4909A559037R51989k33977k78133j89581o2148K02518O02094l21587o38988P4249
$$ 1559037 2511026 2277049 1998916 1809335 1747187 1949705 2551799 2230212 1591224 1665473
4899A665473J59451j33586R5877Q11924k34546k89123Q1019M59758j44647j9762
$$ 1665473 1824924 1691338 1787215 2599139 2364593 2075470 2156489 2616247 2471600 2451838
4889B451838K18812R75138k19800M7317R95090m27877o37674K6886n31359l60569
$$ 2451838 2670650 3645788 3425988 3473305 4468395 4040518 3402844 3429730 2898371 2537802
4879B537802R5417L0979L2838n17749n40858Q8641K85543M0153Q461k39214J50188
$$ 2537802 2633219 2664198 2697036 2179287 1638429 1727070 2012613 2052766 2061227 1822013 1972201
4868A972201O3406j82664k08463P8157j44194J12892l42728j12541J26591M78269
$$ 1972201 2035607 1852943 1644480 1722637 1578443 1691335 1348607 1236066 1362657 1840926
4858A840926j85753j31053m1463l33708j45472k65311M9076l49028j26168P43814
$$ 1840926 1655173 1524120 1482657 1148949 1003477 738166 787242 438214 312046 1055860
4848A055860J34893K5185K82471j46930j42697M40482J10135n0403Q7651J28132
$$ 1055860 1190753 1215938 1498409 1351479 1208782 1649264 1759399 1708996 1796647 1924779
4838A924779j72169j63083j31869p3844L40343m59858k27122M0449j40892N61125
$$ 1924779 1752610 1589527 1457658 1383814 1724157 1264299 1037177 1077626 936734 1497859
4828A497859l36427J57836L36346o4666j88664k58791l2344K42614m6328l30505
$$ 1497859 1161432 1319268 1655614 1590948 1402284 1143493 1111149 1353763 1307435 976930
4818I76930K88313J7850k32445R9461m275k06688J86465l17511M72916J52584
$$ 976930 1265243 1283093 1050648 1150109 1145834 939146 1125611 808100 1281016 1433600
4808A433600J71545m16678K39161j69089j95646l510k85134L10935q3366m55563
$$ 1433600 1605145 1188467 1427628 1258539 1062893 1059383 774249 1085184 1001818 546255
4798E46255O34210K43936k29281O07440p74544l12900M62359K00545l71689n30642
$$ 546255 1180465 1424401 1195120 1802560 1028016 715116 1177475 1378020 1006331 475689
4788D75689R4625R2866K30017L99066l93333P15326J39194n25744k48782K27364
$$ 475689 570314 663180 893197 1292263 898930 1614256 1753450 1227706 978924 1206288
4778A206288K91054m36526L78525r3355l57973j10606n24063J31270K12758k57068
$$ 1206288 1497342 1060816 1439341 1345986 988013 877407 353344 484614 697372 440304
4768D40304K20200M50151k75627J01682N47002Q6405m56123l59814M95884M16313
$$ 440304 660504 1110655 835028 936710 1483712 1570117 1113994 754180 1250064 1666377
4758A666377j12205k48898n65914K09769n0979o8621J06762J71730J11306N53985
$$ 1666377 1554172 1305274 739360 949129 898150 829529 936291 1108021 1219327 1773312
4748A773312M66810k35607n03103n64629L74103l54077N5077N00341L91802p30947
$$ 1773312 2240122 2004515 1501412 936783 1310886 956809 1011886 1512227 1904029 1173082
4738A173082j61667K0582P4652K36887j60344J84381K0962j19605j85701j07722
$$ 1173082 1011415 1031997 1106649 1343536 1183192 1367573 1388535 1268930 1083229 975507
4728I75507R0113L66201Q8263j43408m35785K20155K82164K1046r66575p68107
$$ 975507 1065620 1431821 1520084 1376676 940891 1161046 1443210 1464256 497681 -270426
4718b70426O08230M04129m00351O7333M21589K58181M0207K10428K4205R8180
$$ -270426 337804 741933 341582 408915 830504 1088685 1128892 1339320 1363525 1461705
4708A461705R465m12218K9183J0226K85149J80191j73492P5867l43517l46405
$$ 1461705 1471170 1058952 1088135 1098361 1383510 1563701 1390209 1466076 1122559 776154
4698G76154L16259K098k3468K22273R2457p418P9125J09881L75849l95734K01553
$$ 776154 1092413 1094511 1071043 1293316 1385773 1378355 1457480 1567361 1943210 1547476 1749029
4687A749029m54682k24856K42638p2191P0999K59308K27507J94546j5441l84709
$$ 1749029 1294347 1069491 1312129 1239938 1310937 1570245 1797752 1992298 1976857 1592148
4677A592148k13810n02086J059772L49615N3167m11588k16154m39991m68488K61179
$$ 1592148 1378338 876252 1936024 2285639 2338806 1927218 1711064 1271073 802585 1063764
4667A063764J3639p6891J65241J05924k9036M08632n30725j5765M84877q6403
$$ 1063764 1077403 1000512 1165753 1271677 1242641 1651273 1120548 1104783 1589660 1503257
4657A503257Q7068o48092M1068K68496K75603J45727r0286l9141K94236j53498
$$ 1503257 1590325 942233 983301 1251797 1527400 1673127 1582841 1543700 1837936 1684438
4647A684438l88090M86132j27973k67404n1368k30550J81295M41659k48273L45431
$$ 1684438 1296348 1782480 1654507 1387103 1335735 1105185 1286480 1728139 1479866 1825297
4637A825297q4151o0667k18268L4265j09544J44277j06779j17958K14241k98493
$$ 1825297 1741146 1680479 1462211 1496476 1386932 1531209 1424430 1306472 1520713 1222220
4627A222220j4777M12606N1874L67371R4288k32355p62142O5771M37696M45083
$$ 1222220 1207443 1620049 1671923 2039294 2133582 1901227 1139085 1204856 1642552 2087635
4617B087635l35037m59324J80681j6374j57093J69948K86367M5557k64600L82184
$$ 2087635 1752598 1293274 1473955 1457581 1300488 1470436 1756803 1802360 1537760 1919944
4607A919944L59967l94343j75185j69878j69833m5005k57497p0035N82160J00441
$$ 1919944 2279911 1885568 1710383 1540505 1370672 1325667 1068170 998135 1580295 1680736
4597A680736M8296L97898l06764m10571L05125m50559J82093k35320M6364r6863
$$ 1680736 1729032 2126930 1820166 1409595 1714720 1264161 1446254 1210934 1257298 1160435
4587A160435O47110J20512m93366p0856R9073K53772J23440k20947Q9096k96458
$$ 1160435 1807545 1928057 1434691 1363835 1462908 1716680 1840120 1619173 1708269 1411811
4577A411811k07348P8622J54752M90721L19773m16832m74307K39389K13987K40495
$$ 1411811 1204463 1283085 1437837 1928558 2248331 1831499 1357192 1596581 1810568 2051063
4567B051063J96655J14279k86547n90471l15853k1517M00325K55405M95842k71070
$$ 2051063 2247718 2361997 2075450 1484979 1169126 1147609 1547934 1803339 2299181 2028111
4557B028111p58208J64608J60K52390o0731j83155m5706q6560P99219l4164k01125
$$ 2028111 1269903 1434511 1434671 1687061 1626330 1443175 1397469 1310909 2110128 2075964 1874839
4546A874839L9692L15144n6203Q8005L15773j7198q3510j36926J86130K38094
$$ 1874839 1914531 2229675 2173472 2261477 2577250 2560052 2476542 2339616 2525746 2763840
4536B763840p6580r8734k48644n5707M20909l74352K81454m4809L8367m970K36142
$$ 2763840 2687260 2588526 2339882 2284175 2705084 2330732 2612186 2567377 2605744 2600774 2836916
4525B836916m14224j76263K86281J57701j46910l81504M28982m91168q4068L66693
$$ 2836916 2422692 2246429 2532710 2690411 2543501 2161997 2590979 2099811 2015743 2382436
4515B382436M26165M3891k14825J57182j03947J3242k13965J05466J9410M33334
$$ 2382436 2808601 2852492 2637667 2794849 2690902 2704144 2490179 2595645 2615055 3048389
4505C048389m40293l83320j90544J95579K78608m3306N20248j34347L46975O6842
$$ 3048389 2608096 2224776 2034232 2229811 2508419 2465113 2985361 2851014 3197989 3264831
4495C264831m91028M04596L74514o66292k96282K06289K85682K48217J34039N95215
$$ 3264831 2773803 3178399 3552913 2886621 2590339 2796628 3082310 3330527 3464566 4059781
4485D059781J1049m15837k31719j83053M58135k2229L38317N38266j33663n2322
$$ 4059781 4070830 3654993 3423274 3240221 3698356 3676127 4014444 4552710 4419047 4366725
4475D366725m38875k04347P8663j52631J08522N01587Q764P7696M21593L73429
$$ 4366725 3927850 3723503 3802166 3649535 3758057 4259644 4268408 4346104 4767697 5141126
4465E141126l24482K31094n10604q7521P20423J49340J33559K11679J18492l87623
$$ 5141126 4816644 5047738 4537134 4449613 5170036 5319376 5452935 5664614 5783106 5395483
4455E395483p95426K61135Q61966O06731L5800L98504K42953R1162J45605N89284
$$ 5395483 4600057 4861192 5723158 6329889 6365689 6764193 7007146 7098308 7243913 7833197
4445G833197J20410J03549L92804J94315J67203K09890L56751N53105N03417M28635
$$ 7833197 7953607 8057156 8449960 8644275 8811478 9021368 9378119 9931224 10434641 10863276
4435A0863276R46319k88031O81410R64524M69667k984M41697l0729P10783N13221
$$ 10863276 11809595 11521564 12202974 13167498 13637165 13634181 14075878 14045149 14755932 15269153
4425A5269153M54768R37022K34603L48308J398583R70861J486005M29415N74018
$$ 15269153 15723921 16660943 16895546 17243854 18642437 19613298 21099303 21528718 22102736
4416B2102736R51684M20631J80734Q1829n70218k59843N25554L61807N67680J006561
$$ 22102736 23054420 23475051 23655785 23737614 23167396 22907553 23433107 23794914 24362594 25369155
4406B5369155R10454J015125J320102J315192L73723k0712k52797q24847j86704
$$ 25369155 26279609 27294734 28614836 29930028 30303751 30283039 30030242 29205395 29018691
4397B9018691n39402p7611k16823j71597l08933m15Q95858O82178R76941K86788
$$ 29018691 28479289 28401678 28184855 28013258 27704325 27703910 28599768 29281946 30258887 30545675
4387C0545675k81821J1768p43217q68765o78469l83641j046402K95237L30898
$$ 30545675 30263854 30275622 29532405 28663640 27985171 27601530 26555128 26850365 27181263
4378B7181263O6867J32780k29562k89668K37152L49507o1278J34110p0995l09010
$$ 27181263 27248130 27380910 27151348 26861680 27098832 27448339 27387061 27521171 27450176 27141166
4368B7141166K34649J48395p40791l88583O02196P65451O72018L31891n3718N31929
$$ 27141166 27375815 27524210 26783419 26394836 26997032 27762483 28434501 28766392 28712674 29244603
4358B9244603Q23684Q94395N36754j58921K36256J340917J029655N35158O21514
$$ 29244603 30068287 30962682 31499436 31340515 31576771 32917688 33947343 34482501 35104015
4349C5104015M98262M67043J459905J569363P09823N77271O88632J180937P60328
$$ 35104015 35602277 36069320 37529225 39098588 39808411 40385682 41074314 42255251 43015579
4340D3015579N41945O24082O83546J151846R21184J295576O21514o7535P21123
$$ 43015579 43557524 44181606 44865152 46016998 46938182 48233758 48855272 48787737 49508860
4331D9508860N51856P37877K41501O31281N02519J046395K17057J00878p6733
$$ 49508860 50060716 50798593 51040094 51671375 52173894 53220289 53437346 53538224 53461491
4322E3461491p24992k54723j48068m41570n34816K93790k22171j060057l23536
$$ 53461491 52736499 52481776 52333708 51892138 51357322 51651112 51428941 50368884 50045348
4313E0045348q56345p03742n14415r04096m24616l60115j025132p64647p62505
$$ 50045348 49189003 48485261 47970846 47066750 46642134 46282019 45256887 44492240 43729735
4304D3729735j417357p69583m69880j033279r37202j094473j005991r62488j107453
$$ 43729735 42312378 41542795 41072915 40039636 39102434 38007961 37001970 36039482 34932029
4295C4932029q30032q23744q94776j171658j108613p62228q10973j073588n56401
$$ 34932029 34101997 33278253 32383477 31211819 30103206 29340978 28530005 27456417 26900016
4286B6900016n35572m48876j008533j060448p66889n108l49406n97278m63592
$$ 26900016 26364444 25915568 24907035 23846587 23079698 23074590 22725184 22127906 21664314
4277B1664314k93725p63163j3339n59404r67012j80125m73489j14715k38032l10199
$$ 21664314 21370589 20607426 20594087 20034683 19067671 18887546 18414057 18299342 18061310 17751111
4267A7751111n40785l21629l64143o96677P6498K6393J69814j97921k87245p46573
$$ 17751111 17210326 16888697 16524554 15827877 15904375 15930768 16100582 15902661 15615416 14868843
4257A4868843K88385K99115l64075n38159k51903l25562j95453l10308L55649
$$ 14868843 15157228 15456343 15092268 14554109 14302206 13976644 13781191 13470883 13826532
4248A3826532K7350j64457l89601k68784k68820j99407l68312K60049k81114j27112
$$ 13826532 13853882 13689425 13299824 13031040 12762220 12562813 12194501 12454550 12173436 12046324
4238A2046324N13499M32404p43498o89497K03259r5245L27541o41194p2213j77283
$$ 12046324 12559823 12992227 12248729 11559232 11762491 11667246 11994787 11353593 11281380 11104097
4228A1104097K89809n79374L01691J30369l04316J31564J28227n90185m12186
$$ 11104097 11393906 10814532 11116223 11246592 10942276 11073840 11202067 10611882 10199696
4219A0199696M35418j45446K38819N50813K86613k65925l18720l97078q54936
$$ 10199696 10635114 10489668 10728487 11279300 11565913 11299988 10981268 10584190 9729254
4210I729254L64794q0712m689P00721L18499n95699j71219L52305Q89551p00476
$$ 9729254 10094048 10013336 10008647 10709368 11027867 10432168 10260949 10613254 11502805 10802329
4200A0802329q087K97349l1959K01907k83770p2421K7760Q3893n36629n4169j31500
$$ 10802329 10794242 11091591 11059632 11261539 10977769 10905348 10933108 11017001 10480372 10426203 10294703
4189A0294703K35764N4515L24340L85350n34038M18861M53031j45343l44083o88976
$$ 10294703 10530467 10584982 10909322 11294672 10760634 11179495 11632526 11487183 11143100 10454124
4179A0454124O0862N34446k25887J5510P83207O28721m91685J1632k4174k12271
$$ 10454124 10514986 11049432 10823545 10839055 11622262 12250983 11759298 11770930 11746756 11534485
4169A1534485M80480k26937k65488M00297K41464M3500O1130K89528Q686l5091
$$ 11534485 12014965 11788028 11522540 11922837 12164301 12207801 12268931 12558459 12567145 12532054
4159A2532054M45806k44093k28519K18597O26646l05994Q5117n410L40689M8236
$$ 12532054 12977860 12733767 12505248 12723845 13350491 13044497 13129614 13124204 13464893 13513129
4149A3513129l8733m7270O01125l20783K2825O17261l5782O5692J72220L98555
$$ 13513129 13474396 13427126 14028251 13707468 13730293 14347554 14311772 14377464 14549684 14948239
4139A4948239j44177k38523K62106L20654K46966N93117J04904N10909L2946J32938
$$ 14948239 14804062 14565539 14827645 15148299 15395265 15988382 16093286 16604195 16637141 16770079
4129A6770079K01685q48894k23592P63250K12915J54758K76062N33406l28245
$$ 16770079 16971764 16122870 15899278 16662528 16875443 17030201 17306263 17839669 17511424
4120A7511424O56796J93641O78174K50475K51456L76092L16900O9994K22442O68526
$$ 17511424 18168220 18361861 19040035 19290510 19541966 19918058 20234958 20304952 20527394 21195920
4110B1195920J05162k62840N56836K94865K65348R03677L33671L67557r0515j72
$$ 21195920 21301082 21038242 21595078 21889943 22155291 23058968 23392639 23760196 23669681 23669509
4100B3669509K5705O71003N68510M12516K35312J79366L31174Q24763N67077k74065
$$ 23669509 23695214 24366217 24934727 25347243 25582555 25761921 26093095 26917858 27484935 27210870
4090B7210870M68067J238845L44928j45184P66707R53177R4854j0047P24699P63404
$$ 27210870 27678937 28917782 29262710 29117526 29884233 30837410 30932264 30922217 31646916 32410320
4080C2410320O88670K86922j58590R23319Q39512R81149R03591L63309L93796
$$ 32410320 33098990 33385912 33227322 34150641 34990153 35971302 36874893 37238202 37631998
4071C7631998M77367O90422J194125M65073R46582P11529J637319J110868J518905
$$ 37631998 38109365 38799787 39993912 40458985 41405567 42117096 43754415 44865283 46384188
4062D6384188R67381J491701J658900J702388J889842J948241K444469K240362
$$ 46384188 47351569 48843270 50502170 52204558 54094400 56042641 58487110 60727472
4054F0727472K689348K400537L037676L020344L539515M356070M332110N091375
$$ 60727472 63416820 65817357 68855033 71875377 75414892 79770962 84103072 89194447
4046H9194447M293372M689602N650578O122500N265865N917980N737293M838054
$$ 89194447 93487819 98177421 103827999 109950499 115216364 121134344 126871637 131709691
4038A31709691M741777L800557L624976K364308J482758R80276K57947r11409
$$ 131709691 136451468 140252025 143877001 146241309 147724067 148704343 148962290 148050881
4030A48050881p59024o24507j236769j768337j566546j470332j808440j815848
$$ 148050881 147291857 146667350 145430581 143662244 142095698 140625366 138816926 137001078
4022A37001078k028746l193851k817886l488139m384787n262580n334703n334827
$$ 137001078 134972332 131778481 128960595 125472456 121087669 115825089 110490386 105155559
4014A05155559n519759n660386n155901n037773n006551m542354l916018m186296
$$ 105155559 99635800 93975414 88819513 83781740 78775189 74232835 70316817 66130521
4006F6130521l242312l491729k874796k636542k436824k285344j663563k135795
$$ 66130521 62888209 59396480 56521684 53885142 51448318 49162974 47499411 45363616
3998D5363616j933476p24536j503883j273756j638559j647274q71505j016050
$$ 45363616 43430140 42705604 41201721 39927965 38289406 36642132 35770627 34754577
3990C4754577j019952j309879j167133o36260j90204l09173o11517p73070q33171
$$ 34754577 33734625 32424746 31257613 30621353 30431149 30121976 29510459 28737389 27904218
3981B7904218J05405p20468n26896p62055n08661m53780J7140j15915p79405J84088
$$ 27904218 28009623 27289155 26762259 26000204 25491543 25037763 25054903 24938988 24159583 24343671
3971B4343671q70087m62740P1730M27475O11225p98329j186196m61781K95315
$$ 24343671 23473584 23010844 23082574 23510049 24121274 23322945 22136749 21674968 21970283
3962B1970283j60205n71457j56584j49580J4394K83202M4144L10248j52370l01912
$$ 21970283 21810078 21238621 21082037 20932457 20946851 21230053 21274197 21584445 21432075 21130163
3952B1130163K91001o07466j97152k2408J23692J18428K05689J30054M47892N73150
$$ 21130163 21421164 20813698 20616546 20594138 20717830 20836258 21041947 21172001 21619893 22193043
3942B2193043J84050J42270K1803O16037R29216K22219L77233N13154N77373J232865
$$ 22193043 22377093 22519363 22541166 23157203 24086419 24308638 24685871 25199025 25776398 27009263
3932B7009263J010856Q05215Q06737M93166J348529J106924J25209N40553j31028
$$ 27009263 28020119 28825334 29632071 30125237 31473766 32580690 32705899 33246452 33115424
3923C3115424R84373j18606J03133k09507R0371n92072p91551l85834k82549o77131
$$ 33115424 34099797 33981191 34084324 33874817 33965188 33373116 32581565 32195731 31913182 31236051
3913C1236051m0163n67735l35872L30914j21679J185063M11913O43052K70294
$$ 31236051 31195888 30628153 30292281 30623195 30501516 31686579 32098492 32741544 33011838
3904C3011838j68739N37383J171880J100725J032298M62188J020212J545234J648009
$$ 33011838 32843099 33380482 34552362 35653087 36685385 37147573 38167785 39713019 41361028
3895D1361028J384887J562107K025136J785259K615305L016193K521105K823568
$$ 41361028 42745915 44308022 46333158 48118417 50733722 53749915 56271020 59094588
3887E9094588L251893M146628M207234M295613M357470M443741N420106M589812
$$ 59094588 62346481 66493109 70700343 74995956 79353426 83797167 89217273 93807085
3879I3807085N053570N513553M371909N287128M786693L968156M144333L008767
$$ 93807085 98860655 104374208 108746117 114033245 118819938 122788094 126932427 129941194
3871A29941194K740928J927958J838360J344956Q27342l65425L25860n3485p21997
$$ 129941194 132682122 134610080 136448440 137793396 138620738 138255313 138581173 138527688 137805691
3862A37805691M8834m94475n66370o93511j40523o30443l41228l14718p14942
$$ 137805691 137854525 137360050 136793680 136100169 135959646 135329203 134987975 134673257 133958315
3853A33958315j235159j443989j494781j375562k556740k949251k336901k710011
$$ 133958315 132723156 131279167 129784386 128408824 125852084 122902833 120565932 117855921
3845A17855921l016621k353386k351561j621817j583220p19563k19111M70505
$$ 117855921 114839300 112485914 110134353 108512536 106929316 106209753 105990642 106461147
3837A06461147J428637J684182K120474K947040L710739K931821K761393K874240
$$ 106461147 107889784 109573966 111694440 114641480 118352219 121284040 124045433 126919673
3829A26919673J610579J150467J401147J152254K89050p71297j249386j513373
$$ 126919673 128530252 129680719 131081866 132234120 132523170 131751873 130502487 128989114
3821A28989114j472958j904359j877205j481615j806322k058851k124881j819629
$$ 128989114 127516156 125611797 123734592 122252977 120446655 118387804 116262923 114443294
3813A14443294j833549k493340k656220k755321l490842m185437l289253l351265
$$ 114443294 112609745 110116405 107460185 104704864 101214022 97028585 93739332 90388067
3805I0388067l760844m036745l428036m045726l647938l474224k756117l042513
$$ 90388067 86627223 82590478 79162442 75116716 71468778 67994554 65238437 62195924
3797F2195924l142910k479929k693519k569371k745786k295850j941432j862159
$$ 62195924 59053014 56573085 53879566 51310195 48564409 46268559 44327127 42464968
3789D2464968j656455k086970j751948q90158j675198j900306j264203q12638
$$ 42464968 40808513 38721543 36969595 36079437 34404239 32503933 31239730 30427092
3781C0427092p46937n90503j069343q28736l10376k44856q57875o52913l1031
$$ 30427092 29680155 29089652 28020309 27191573 26881197 26636341 25778466 25125553 25094522
3772B5094522p2109r4344P6223J24603p80389j93945L46475K43519L76400j26823
$$ 25094522 25022413 24928069 25004292 25128895 24348506 24154561 24501036 24744555 25120955 24994132
3762B4994132n4294l0295r1086k55589l72010q33242p40088l01333m17782o28047
$$ 24994132 24939838 24909543 24818457 24562868 24190858 23357616 22617528 22316195 21898413 21270366
3752B1270366j22269k51872p30921n22710p78024l74515m57746n58221k87783
$$ 21270366 21148097 20896225 20165304 19642594 18864570 18490055 18032309 17474088 17186305
3743A7186305j000671n65987l22934M4443N88250p29414o65333J5396o58950M6091
$$ 17186305 16185634 15619647 15296713 15341156 15929406 15199992 14534659 14550055 13891105 13937196
3733A3937196k44800n51111K02715j16042n29888l51875M65119J24645p63726
$$ 13937196 13692396 13141285 13344000 13227958 12698070 12346195 12811314 12935959 12172233
3724A2172233p24963N30481Q14320N06767l12033o09475j72398k81733j72084
$$ 12172233 11447270 11977751 12792071 13298838 12986805 12377330 12204932 11923199 11751115
3715A1751115N01162k09331o05350j26855J90211K62437j67645n34010k07960
$$ 11751115 12252277 12042946 11437596 11310741 11500952 11763389 11595744 11061734 10853774
3706A0853774j08974R7846k47307P8775K5670n72653M78298K60085j98402m62688
$$ 10853774 10744800 10842646 10595339 10674114 10699784 10127131 10605429 10865514 10667112 10204424
3696A0204424L82627j23412L09108n22872J255O28019m472n92265J36211J18393
$$ 10204424 10587051 10463639 10772747 10249875 10251130 10879149 10874677 10282412 10418623 10537016
3686A0537016J88792l00013k49686J84655L53762P85276l53477m86203j99405
$$ 10537016 10725808 10425795 10176109 10360764 10714526 11499802 11146325 10660122 10460717
3677A0460717K29713j33999N27652L9750L12940P05716J1732k49275M37086k63773
$$ 10460717 10690430 10556431 11084083 11123833 11436773 12142489 12154221 11904946 12342032 12078259
3667A2078259n33588P8412L4681K76279R15958M71711K39398m61993K3085N83437
$$ 12078259 11544671 11623083 11657764 11934043 12850001 13321712 13561110 13099117 13122202 13705639
3657A3705639M11661P36984L95295N20361N35575K00116O76932J102109J089471
$$ 13705639 14117300 14854284 15249579 15769940 16305515 16505631 17182563 18284672 19374143
3648A9374143P5561P88291J004692P58394O77132J016972N17303M74847Q34011
$$ 19374143 19449704 20237995 21242687 22001081 22678213 23695185 24212488 24687335 25521346
3639B5521346P74819R39278R27140J151521N80815O82604L04013J363069J005495
$$ 25521346 26296165 27235443 28162583 29314104 29894919 30577523 30881536 32244605 33250100
3630C3250100L65241j17668N72213K78679k49406J38298O04076K61650L68992
$$ 33250100 33615341 33497673 34069886 34348565 34099159 34237457 34841533 35103183 35472175
3621C5472175q03363k92034N00085k86004K63970M79708M87269J87953j50321
$$ 35472175 34668812 34376778 34876863 34590859 34854829 35334537 35821806 36009759 35859438
3612C5859438K6269M09206N02163L99633N46255M34303J240736J697849J514009
$$ 35859438 35885707 36294913 36797076 37196709 37742964 38177267 39418003 41115852 42629861
3603D2629861J610015J912168K353738K435808L061950L894342M068144L614808
$$ 42629861 44239876 46152044 48505782 50941590 54003540 57897882 61966026 65580834
3595F5580834N229007N832645N851004O079427O368344O608878O021632N953324
$$ 65580834 70809841 76642486 82493490 88572917 94941261 101550139 107571771 113525095
3587A13525095O050710N848863O302734N189150N053897N481668M633986M054087
$$ 113525095 119575805 125424668 131727402 136916552 141970449 147452117 152086103 156140190
3579A56140190M277665L794555L329807K385509J330445J302545O66600l11410
$$ 156140190 160417855 164212410 167542217 169927726 171258171 172560716 173227316 172915906
3571A72915906n88208k064598k029434k160858k821534l753960l865869l938285
$$ 172915906 172327698 170263100 168233666 166072808 163251274 159497314 155631445 151693160
3563A51693160m746972n311785n467609n128103m812028n219181n743525m746403
$$ 151693160 146946188 141634403 136166794 131038691 126226663 121007482 115263957 110517554
3555A10517554m751083l938455l302767l366536k748247k622793k307713j682926
$$ 110517554 105766471 101828016 98525249 95158713 92410466 89787673 87479960 85797034
3547H5797034j761606q69584J65574K88297L73882k42455M91497N54290Q90594
$$ 85797034 84035428 83165844 83331418 83619715 83993597 83751142 84242639 84796929 85687523
3538H5687523J468942O71468Q99180O61191K28075Q22477q8583r15247J0585r0869
$$ 85687523 87156465 87827933 88727113 89388304 89616379 90438856 90350273 89435026 89445611 89354742
3528H9354742l86632l10725k54414r01081q44507n20191j537313j428848j366531
$$ 89354742 88968110 88657385 88402971 87501890 86657383 86137192 84599879 83171031 81804500
3519H1804500k022463j975764k826979k948745k972674k712238k498270k698891
$$ 81804500 79782037 77806273 74979294 72030549 69057875 66345637 63847367 61148476
3511F1148476k446048k483463k190372j965822j577465j546775j713798j993865
$$ 61148476 58702428 56218965 54028593 52062771 50485306 48938531 47224733 45230868
3503D5230868j406602j500187k163773n89054r21512j243600j174943m43883k7509
$$ 45230868 43824266 42324079 40160306 39571252 38649740 37406140 36231197 35787314 35759805
3494C5759805M2702j001761K00848k37830M97741j58594q371J002924k35253N1916
$$ 35759805 35802507 34800746 35001594 34763764 35261505 35102911 35094540 36097464 35862211 35914127
3484C5914127Q50108m1149L10774L41858N8594P28223K51140O03921O67835N30390
$$ 35914127 36764235 36723086 37033860 37375718 37434312 38162535 38413675 39017596 39685431 40215821
3474D0215821K82238P1228l50977K04318M91319N12162N36205P56838J18400M717
$$ 40215821 40498059 40569287 40218310 40422628 40913947 41426109 41962314 42719152 42837552 42842269
3464D2842269P3695L08523J88128O89128K57230L96857L14305N31962O02521k26057
$$ 42842269 42915964 43224487 43412615 44101743 44358973 44755830 45070135 45602097 46204618 45978561
3454D5978561j068624j099451j181268j291095q16278n89288p43022K83267M29529
$$ 45978561 44909937 43810486 42629218 41338123 40521845 39932557 39189535 39472802 39902331
3445C9902331K12092J285910J326009J660412J635778J715845K570296K361779
$$ 39902331 40114423 41400333 42726342 44386754 46022532 47738377 50308673 52670452
3437E2670452J973438J835502J929078L206668L909358M702319N263745N485806
$$ 52670452 54643890 56479392 58408470 61615138 65524496 70226815 75490560 80976366
3429H0976366N681382N332529N087341N265095N835682M756027J973533n02055
$$ 80976366 86657748 91990277 97077618 102342713 108178395 112934422 114907955 114405900
3421A14405900k368888l054791l545154l193113l376574l387784k615524k482115
$$ 114405900 112037012 108982221 105437067 102243954 98867380 95479596 92864072 90381957
3413I0381957j311626r52529j403458j436659j007308j140417l7622m4531o635
$$ 90381957 89070331 88117802 86714344 85277685 84270377 83129960 83092338 83047807 83041172
3404H3041172K21045M70504L92958N40449R77747J223029J16687K71918M54809
$$ 83041172 83262217 83732721 84125679 84666128 85643875 86866904 86983591 87255509 87710318
3395H7710318M84957R78709Q82063M19158l7404j147005j462027q50648j469037
$$ 87710318 88195275 89173984 90056047 90475205 90437801 89290796 87828769 86978121 85509084
3386H5509084j197235j624888j964397j796584k797233l177672l105814l082511
$$ 85509084 84311849 82686961 80722564 78925980 76128747 72951075 69845261 66762750
3378F6762750l126326k956332l085320l401797k986636k797726k489601k296891
$$ 66762750 63636424 60680092 57594772 54192975 51206339 48408613 45919012 43622121
3370D3622121k093724k237818j885101j583302j570584j566995j378064j057588
$$ 43622121 41528397 39290579 37405478 35822176 34251592 32684597 31306533 30248945
3362C0248945j224976j347429o58374j244129r22403j030317m52356n65572q82004
$$ 30248945 29023969 27676540 27018166 25774037 24851634 23821317 23368961 22803389 21921385
3353B1921385j085616k32477m67315q73864L735l89674j03910n56331l15469k33276
$$ 21921385 20835769 20603292 20135977 19262113 19265848 18876174 18772264 18215933 17900464 17667188
3343A7667188o85267l12788K79491k19573o63662k74360L18698M23481q23599
$$ 17667188 16981921 16669133 16948624 16729051 16065389 15791029 16109727 16533208 15709609
3334A5709609Q9906J89302k45104O47129j85210r1849P1166J44813M4483M13432
$$ 15709609 15799515 15988817 15743713 16390842 16205632 16113783 16184949 16329762 16374245 16787677
3324A6787677k63318j085722r98576k8253N1643q49318k33278n45881n5838j28749
$$ 16787677 16524359 15438637 14440061 14411808 14463451 13614133 13380855 12834974 12779136 12650387
3314A2650387o65213n41882J24084l45604l24540o08413j88045P8615J4206O3851
$$ 12650387 11985174 11443292 11567376 11221772 10897232 10288819 10100774 10179389 10193595 10257446
3304A0257446K8777l65485n75895L65325J07027j17731M5897j44651J5692j41653
$$ 10257446 10286223 9920738 9344843 9710168 9817195 9699464 9745361 9600710 9616402 9474749
3294I474749k89587m07960l47704L43476K87758J1322j42957j03589k69759o4057
$$ 9474749 9185162 8777202 8429498 8772974 9060732 9072054 8929097 8825508 8555749 8491692
3284H491692j89222L95262q2857L28985K37452k68256L6725m27235k50042m53829
$$ 8491692 8302470 8697732 8614875 8943860 9181312 8913056 8949781 8522546 8272504 7818675
3274G818675o3486L52213J22495j38361j12628J64871j56630k29516L2791J639
$$ 7818675 7755189 8107402 8229897 8091536 7978908 8143779 7987149 7757633 7790424 7792063
3264G792063o1498j89164p4390j72195l84286M05961M39755N3919k53961r1146
$$ 7792063 7730565 7541401 7467011 7294816 6910530 7316491 7756246 7810165 7556204 7465058
3254G465058K79657M05961K271j73309K49611L81370j92903Q3151J66701l41881
$$ 7465058 7744715 8150676 8152947 7979638 8229249 8610619 8417716 8500867 8667568 8325687
3244H325687P56116J54675n63739l74491N23745N26344M34449n00014j62271M52242
$$ 8325687 9081803 9236478 8672739 8298248 8821993 9348337 9782786 9282772 9120501 9572743
3234I572743o75550L71536K02193K43230M97871O8852L84375J80503l78157J26732
$$ 9572743 8897193 9268729 9470922 9714152 10212023 10280875 10665250 10845753 10467596 10594328
3224A0594328L80347p5222L91540J56474j98424Q5437K74908Q2193O5725K66782
$$ 10594328 10974675 10899453 11290993 11447467 11249043 11334480 11609388 11691581 11757306 12024088
3214A2024088m1427J28696Q28519J58062N06150R2771M06860J90096J99674J316272
$$ 12024088 11982661 12111357 12939876 13097938 13604088 13696859 14103719 14293815 14493489 15809761
3204A5809761P91590Q47374O98262J09327J053509J188192O30486R53648M55081
$$ 15809761 16601351 17448725 18146987 18256314 19309823 20498015 21128501 22082149 22537230
3195B2537230Q36925M36184L54109R85860J092725O70169P87845J206945K051195
$$ 22537230 23374155 23810339 24164448 25150308 26243033 26913202 27701047 28907992 30959187
3186C0959187J180338J728730J310031J746271K089823K612234K793865L140355
$$ 30959187 32139525 33868255 35178286 36924557 39014380 41626614 44420479 47560834
3178D7560834L198014L568415L822764M169129N149170N941863O508219P815846
$$ 47560834 50758848 54327263 58150027 62319156 67468326 73410189 79918408 87734254
3170H7734254Q180076Q962332J0808015J1133587J3829606J5763715J8584339
$$ 87734254 95914330 104876662 115684677 126818264 140647870 156411585 174995924
3163A74995924K2838276K8042232L2370114L4555025K9130402J1647207j0565603
$$ 174995924 197834200 225876432 258246546 292801571 321931973 333579180 323013577
3156C23013577k8270408l4392392l2636056k8102262k2109563j7206245j2842130
$$ 323013577 294743169 260350777 227714721 199612459 177502896 160296651 147454521
3149A47454521j0202178q789611p660500p067200o202907m763103m435964l159482
$$ 147454521 137252343 128462732 120802232 113735032 107532125 102769022 98333058 95173576
3141I5173576k946977k477216j962340j205198j200678n97471m71691m3382P46662
$$ 95173576 92226599 89749383 87787043 86581845 85381167 84783696 84312005 84268623 85015285
3132H5015285K94490L59931M24788J398971J692458K222454L266093L235025L256739
$$ 85015285 85309775 85669706 86094494 87493465 89185923 91408377 94674470 97909495 101166234
3123A01166234M386934N424936N797173O311718P006849Q162588R361409R921200
$$ 101166234 105553168 110978104 116775277 123086995 130093844 138256432 147617841 157539041
3115A57539041J1501513J3281062J4539217J6323089J7625362J9356081K1506386
$$ 157539041 169040554 182321616 196860833 213183922 230809284 250165365 271671751
3108B71671751K2961862K3850757K2526796J8847132J2872421L894999o355559
$$ 271671751 294633613 318484370 341011166 359858298 372730719 376625718 370270159
3101C70270159j4892512k0411397k3754863k4066933k2953243k1718958j9345129
$$ 370270159 355377647 334966250 311211387 287144454 264191211 242472253 223127124
3094B23127124j7312849j5134821j3565555j2370205j1699306j0651687r375518
$$ 223127124 205814275 190679454 177113899 164743694 153044388 142392701 133017183
3087A33017183q831918p528063p378544o949669n913507n154510m726978m791449
$$ 133017183 124185265 116657202 109278658 102328989 96415482 91260972 86533994 81742545
3079H1742545m401440l714614l690328l442075l704963k930208l182513k366283
$$ 81742545 77341105 73626491 69936163 66494088 62789125 59858917 56676404 54310121
3071E4310121k269749k349036k015400j901220j918565j574402j342476k023924
$$ 54310121 52040372 49691336 47675936 45774716 43856151 42281749 40939273 38915349
3063C8915349j190748j867340j124970j350629r11317j387051j320254n39360
$$ 38915349 37724601 35857261 34732291 33381662 32470345 31083294 29763040 29223680
3055B9223680p96126o78182j214564p72103j255891j56665q14704q39395p11536
$$ 29223680 28427554 27749372 26534808 25762705 24506814 24350149 23535445 22696050 21984514
3046B1984514n67257n42944p50959j87180o22383p48545m78312k14174k62700
$$ 21984514 21417257 20874313 20123354 19936174 19313791 18565246 18086934 17872760 17610060
3037A7610060j18549p92521k95630l20035J79835n93498k90075o45565l93409
$$ 17610060 17491511 16698990 16403360 16083325 16263160 15669662 15379587 14734022 14340613
3028A4340613p1780l73955p1616o03026m71124J37454k77851l70158k29038l65466
$$ 14340613 14268833 13894878 13823262 13220236 12749112 12886566 12608715 12238557 12009519 11644053
3018A1644053k44669J43021m93752k47636p99544O62069K67988q42295m0554L5266
$$ 11644053 11399384 11542405 11048653 10801017 10001473 10663542 10931530 10089235 10048681 10083947
3008A0083947O530n12349n34643N01808L28053p639n74311l59541M7606l73959
$$ 10083947 10090477 9578128 9043485 9545293 9873346 9865707 9291396 8931855 8979461 8605502
2998H605502R7005o11681o6944k50105j4289J44842m92124K48648M19624j189740
$$ 8605502 8702507 8090826 8023882 7773777 7759488 7904330 7412206 7660854 8080478 6890738
2988F890738J18964M99131j44956l90073n63488J43126k12384m35677K19662P0947
$$ 6890738 7009702 7508833 7363877 6973804 6410316 6553442 6341058 5905381 6125043 6195990
2978F195990J60506j11924M96081o38693K7612j61309n92489j14110j57375P6231
$$ 6195990 6356496 6244572 6740653 6101960 6129572 5968263 5375774 5261664 5104289 5180520
2968E180520J13241K38161q64k47627n71600J51651L64013J30917J20319j646508
$$ 5180520 5293761 5531922 5531058 5283431 4711831 4863482 5227495 5358412 5478731 3832223
2958C832223K04427K06758k86793L74649m90350K52369J07965p92j93215j44517
$$ 3832223 4036650 4243408 3956615 4331264 3840914 4093283 4201248 4200456 4007241 3862724
2948C862724L3710J37094j13485L81754o38943J41828j51416m6104o7778M05744
$$ 3862724 3896434 4033528 3920043 4301797 3662854 3804682 3653266 3607162 3539384 3945128
2938C945128k10368l27435L52178k46649N7764j04433j32587l27549L30304R9822
$$ 3945128 3734760 3407325 3759503 3512854 3570618 3466185 3333598 3006049 3336353 3436175
2928C436175J02881l72642j70050K72757J84160R9152o88663M07572m88041m27362
$$ 3436175 3539056 3166414 2996364 3269121 3453281 3552433 2863770 3271342 2783301 2355939
2918B355939K08331P8504M659L13649k99293P8388r0449K13126R3860k63658n5563
$$ 2355939 2564270 2642774 2647433 2961082 2661789 2740177 2649728 2862854 2956714 2693056 2637493
2907B637493m3053O49759j24630o65146J80571J55190o04338L89121k85664L7844
$$ 2637493 2594440 3244199 3119569 2454423 2634994 2790184 2185846 2574967 2289303 2327147
2897B327147J44554q9499l96093J63213K75571j03603P5619L60809Q356k75487
$$ 2327147 2471701 2382202 1986109 2149322 2424893 2321290 2396909 2757718 2766074 2490587
2887B490587k67775L43055J46467K26812k36394j66045M67603n971l65020n9740
$$ 2490587 2222812 2565867 2712334 2939146 2702752 2536707 3004310 2998339 2633319 2573579
2877B573579J042281o3048J92618m5203l9333j50633n95855n52582l95088j12561
$$ 2573579 3615860 3552812 3745430 3700227 3660894 3510261 2914406 2361824 1966736 1854175
2867A854175k6331K70376k75161O1133M19477M40597n24857Q1170l19718J767
$$ 1854175 1827844 2098220 1823059 1884192 2303669 2744266 2219409 2300579 1980861 1982628
2857A982628j10681M07842K29486m84033j39997j47148k22947J62574L41303K20544
$$ 1982628 1871947 2279789 2509275 2025242 1885245 1738097 1515150 1677724 2019027 2239571
2847B239571j17378R8564L84724J22329k81817o36321J70419j20881J87330k53063
$$ 2239571 2122193 2220757 2605481 2727810 2445993 1809672 1980091 1859210 2046540 1793477
2837A793477p24233N80197J35379j26861N51923m22636p9367O41851j47618J43863
$$ 1793477 1069244 1649441 1784820 1657959 2209882 1787246 1707879 2349730 2202112 2345975
2827B345975j75017L84271N52468r2796o01642K16831O66888j83685k62154m41283
$$ 2345975 2170958 2555229 3107697 3014901 2413259 2630090 3296978 3113293 2851139 2409856
2817B409856J99612M61672k89157l81546J93660n54253K33456p20581q3146K24385
$$ 2409856 2609468 3071140 2781983 2400437 2594097 2039844 2273300 1552719 1469573 1693958
2807A693958K0931j54208o7969k86695J45835N94080r2709n24009J12611K46001
$$ 1693958 1714889 1560681 1492712 1206017 1351852 1945932 1853223 1329214 1441825 1687826
2797A687826j00628j18649l60043j00080M69176J18249n46305k02182K01629L83894
$$ 1687826 1587198 1468549 1108506 1008426 1477602 1595851 1049546 847364 1048993 1432887
2787A432887j77052p9653R1753J26517k06685k12189K40777O28924k78600j40928
$$ 1432887 1255835 1176182 1267935 1394452 1187767 975578 1216355 1845279 1566679 1425751
2777A425751m4430q55578L20280J04362o23873L20059N93832o44635L46385M31226
$$ 1425751 1381321 525743 846023 950385 326512 646571 1240403 595768 942153 1373379
2767A373379k64181J21857m9639K48229J15542m43630j89694L46585k11977j60717
$$ 1373379 1109198 1231055 1181416 1429645 1545187 1101557 911863 1258448 1046471 885754
2757H85754L89828l40183o0113R3478l81626L08746O6666m10814J80765K6710
$$ 885754 1275582 935399 875286 968764 587138 895884 962550 551736 732501 759211
2747G59211n03667K18743M8877k85305q2399j344R03730J79515m98427K04174
$$ 759211 255544 474287 523164 237859 155460 154116 1057846 1237361 738934 943108
2737I43108k22842l13831M46032J28030m09799J36486k45631J35524m9463Q6992
$$ 943108 720266 406435 852467 980497 570698 707184 461553 597077 547614 634606
2727F34606q1556n8465m51626r2411O46988L9254k1073n8582P05m70438K11733
$$ 634606 553050 494585 42959 -49452 597536 636790 615717 557135 557840 87402 299135
2716B99135j39124R3252k70873m14790p9262O92369N33987J18669l78251l17442
$$ 299135 160011 253263 -17610 -432400 -511662 180707 714694 833363 455112 137670
2706A37670L46005J08650m81884j5804J15399j16838N03673p60173j46838J00265
$$ 137670 483675 592325 110441 94637 210036 93198 596871 -163302 -310140 -209875
2696b09875K26928M39518k11373l69868K43025O3300J6991j05804j91927j7792
$$ -209875 17053 456571 245198 -124670 118355 181655 198646 92842 -99085 -116877
2686a16877J72727L41227J12267J03342l48778O4331K26363o4578j15695o17742
$$ -116877 55850 397077 509344 612686 263908 328239 554602 490024 374329 -243413
2676b43413N03937O39156j49512n03412J77253n47035J36409M9816P73236K59067
$$ -243413 260524 899680 750168 246756 424009 -123026 13383 63199 836435 1095502
2666A095502l10077J19661O4807l56406j77319K46184m08902k11528K87699L30695
$$ 1095502 785425 905086 969893 613487 436168 682352 273450 61922 349621 680316
2656F80316M21843j48769o54603J23353N1893j09275J35823k01804j68348M10354
$$ 680316 1102159 953390 298787 422140 474033 364758 500581 298777 130429 540783
2646E40783j47177J92122n53294j67956K29248m08470M25459L29805N8311l25728
$$ 540783 393606 585728 32434 -135522 93726 -314744 110715 440520 498831 173103
2636A73103J60289M74954k86085l35956j96330l32002j752J88990J74649K47220
$$ 173103 333392 808346 522261 186305 -10025 -342027 -343779 -154789 19860 267080
2626B67080q3718o8160l5225K54757j62347N6197O910j08393R2311L5093m11956
$$ 267080 183362 115202 79977 334734 172387 228584 235494 127101 219412 254505 -157451
2615a57451J19959L71386J02950k74120Q1147R6856M6953l87677k28106O14286
$$ -157451 -37492 333894 436844 162724 243871 340727 387680 3 -228103 386183
2605C86183L03552j23614J43563m51018M14283j16043L33631q5598J18757j77696
$$ 386183 689735 566121 709684 258666 672949 556906 890537 804939 923696 746000
2595G46000j34402N90337q7124M34255o4235k9712P09354n30105m17816J65507
$$ 746000 611598 1201935 1114811 1549066 1484831 1455119 2164473 1634368 1216552 1382059
2585A382059l07281n2622p39711o6052M21583K10377k23784j55669J99891k20422
$$ 1382059 1074778 1022156 282445 216393 637976 848353 624569 468900 668791 448369
2575D48369j00591O84828m5327m62125L84316K8858l99238l69779O56106j19687
$$ 448369 347778 1032606 987279 525154 909470 938328 539090 169311 825417 705730
2565G05730l28379J47381k90589j81336m0875L39466L04103P9069o33286M68542
$$ 705730 377351 524732 234143 52807 11932 351398 655501 734570 101284 569826
2555E69826O2506L5813r1428l79921J20058j25393J40007J18668n17288M5925
$$ 569826 632332 668145 576717 196796 316854 191461 331468 450136 -67152 -21227
2545b1227l15623Q896M53573j7452L7545N3064N36296l40415l86242m52523k69849
$$ -21227 -336850 -327954 125619 108167 145712 198776 735072 394657 8415 -444108 -713957
2534g13957N16904K39832o40150m31650M12303P75803N64481j11688o69054n30725
$$ -713957 -197053 42779 -597371 -1029021 -616718 159085 723566 611878 -57176 -587901
2524e87901M28031J23293J24732J35308j90581L109l24763L0224P09503l04194
$$ -587901 -159870 -36577 88155 223463 32882 35991 -288772 -258548 450955 146761
2514A46761k55771N8910J97212k04565L63586J25163J61382L55996n75833k01344
$$ 146761 -109010 -50100 147112 -57453 306133 431296 592678 948674 372841 171497
2504A71497L05177l13841k56298L40741O02800n20504J23022j23489m76806K73643
$$ 171497 476674 162833 -93465 247276 850076 329572 452594 329105 -147701 125942
2494A25942L36985l7834j17264J24355N822M6959l75706L1790L88173k32576K59878
$$ 125942 462927 425093 307829 432184 438006 484965 109259 141049 529222 296646 556524
2483E56524K41117p5881K54199l56413l00709K54228k12911J24926N21718j8928
$$ 556524 797641 721760 975959 619546 318837 573065 360154 485080 1006798 987870
2473I87870K32226p66254N5082L0749j78811k76523K80652M46549O3577P0954
$$ 987870 1220096 453842 508924 539673 360862 84339 364991 811540 875117 946071
2463I46071m71538j60297J93990K83536l902m65328K40614k08930P0470M08053
$$ 946071 474533 314236 508226 791762 787860 322532 563146 354216 424686 832739
2453H32739K80526J06714p54759k74707L80454J10419M001R6718J47630k45182
$$ 832739 1113265 1219979 465220 190513 570967 681386 685387 782105 929735 684553
2443F84553n463L18647j10635P0169m11663k03990j89109L52604J76253o3206
$$ 684553 679090 997737 887102 957271 545608 341618 152509 505113 681366 618160
2433F18160L22592M4252m31077M19562L03686J4716J48850m4829J51870l79243
$$ 618160 940752 985004 553927 973489 1277175 1291891 1440741 1395912 1547782 1168539
2423A168539k09989l26264L79581M68389J48592j70819l88521j7281N77088l00129
$$ 1168539 958550 632286 1011867 1480256 1628848 1458029 1069508 1052227 1629315 1329186
2413A329186R1309M13682r04010k32845N58440J7386j24239J98103P18802J85552
$$ 1329186 1420495 1834177 930167 697322 1255762 1273148 1148909 1347012 2065814 2251366
2403B251366n08357Q9422j33085M85684j6784n96868K83451L48320q0062k7144
$$ 2251366 1743009 1832431 1699346 2185030 2168246 1571378 1854829 2203149 2123087 2095943
2393B095943L5376K44601m41425K4384K12599m03264K71824O78378J54412L77146
$$ 2095943 2131319 2375920 1934495 1958879 2171478 1768214 2040038 2718416 2872828 3249974
2383C249974J07645m38874K44483l71231J95610M43016l08624L6755P9319J75942
$$ 3249974 3357619 2918745 3163228 2791997 2987607 3430623 3121999 3158754 3238073 3414015
2373C414015K94163L69824J074053L69908p09821j52927l68270R15983N87081
$$ 3414015 3708178 4078002 5152055 5521963 4812142 4659215 4290945 5206928 5794009
2364E794009M50039Q53174l6921N44022R85550K31816l8872R30176K88943N66842
$$ 5794009 6244048 7097222 7060301 7604323 8589873 8821689 8782817 9712993 10001936 10568778
2354A0568778Q03486O75990K18017J103059J085032L08285P80348J062707J380211
$$ 10568778 11372264 12048254 12266271 13369330 14454362 14762647 15542995 16605702 17985913
2345A7985913J765447J961517J556240K007880K665614K779070M031465M730476
$$ 17985913 19751360 21712877 23269117 25276997 27942611 30721681 34753146 39483622
2337C9483622L711183L523827L113260L028160M274939N917887P910982Q454118
$$ 39483622 43194805 46718632 49831892 52860052 57134991 63052878 70963860 79417978
2329G9417978J0284648J3463924J6491022K0587132K8183149L8484754M3853732
$$ 79417978 89702626 103166550 119657572 140244704 168427853 206912607 250766339
2322B50766339J8610443k2166347m2372460l9524565k8847174k1356127j6370266
$$ 250766339 269376782 247210435 204837975 165313410 136466236 115110109 98739843
2315I8739843j2361825r435069p104872n192931m965437m272653l174362k557811
$$ 98739843 86378018 76942949 69838077 64645146 59679709 55407056 52232694 49674883
2307D9674883k773481l402586l979723l679656l379838k337520j592111j920611
$$ 49674883 46901402 43498816 39519093 35839437 32459599 30122079 28529968 26609357
2299B6609357k287338j138335j054199j240862j151618j601889j040938p37486
$$ 26609357 24322019 23183684 22129485 20888623 19737005 18135116 17094178 16356692
2291A6356692j045343j044417k31939J04661o88323r47592q51684l31633r28168
$$ 16356692 15311349 14266932 14034993 14139654 13451331 12503739 11652055 11320422 10392254
2282A0392254l17376j09876n74125n59355q59716j67150K03864K06462j50877
$$ 10392254 10074878 9965002 9390877 8831522 7971806 7804656 8008520 8214982 8064105
2273H064105q44009j93130K5295l18979l26617p72245n04500O60140O1189m68268
$$ 8064105 7220096 7026966 7052261 6733282 6406665 5634420 5129920 5790060 5851249 5382981
2263E382981p04514p2505l84233k1750K00528J16611K22994N18598p96357p34787
$$ 5382981 4678467 4605962 4221729 4199979 4400507 4517118 4740112 5258710 4462353 3727566
2253C727566k98039j19679P10248K0515k23476J3020m44414m29586L29648k71238
$$ 3727566 3429527 3309848 4020096 4040611 3817135 3830155 3385741 2956155 3285803 3014565
2243C014565k84493K25532j01261j00743l22552m1154l33663j62202j44867K43459
$$ 3014565 2730072 2955604 2854343 2753600 2431048 2389894 2056231 1894029 1749162 1992621
2233A992621L81067R2358L56366o39369l1706M00710N15115l81339o7074K36957
$$ 1992621 2373688 2466046 2822412 2183043 2151337 2552047 3067162 2685823 2618749 2855706
2223B855706p34075q3897O8771j29670j67924L3889Q6054K9804j20311j96495
$$ 2855706 2121631 2037734 2106505 1976835 1808911 1842800 1928854 1958658 1838347 1641852
2213A641852l6793r1588N70321m5138m6110K99383m30984l87590j79431M14908
$$ 1641852 1605059 1513471 2083792 2038654 1992544 2291927 1860943 1473353 1293922 1708830
2203A708830q0057l84034O73529j35109k75464m60232K08039q8864K66300j1982
$$ 1708830 1628773 1244739 1918268 1783159 1507695 1047463 1255502 1166638 1432938 1420956
2193A420956K04109m02815p6024L75736j06862l24915J87157p12247j9980J58931
$$ 1420956 1625065 1222250 1146226 1521962 1415100 1090185 1277342 565095 545115 704046
2183G04046j10040K75804l29341L56065J35653k55549p2818K47121O7842L16625
$$ 704046 594006 869810 540469 896534 1032187 776638 703820 950941 1018783 1335408
2173A335408J65037p25912l76063J55524n25413P4495P2649O21573O27885j02605
$$ 1335408 1500445 774533 398470 553994 28581 103076 175725 797298 1425183 1322578
2163A322578M874n21010n20780l55822K51358N45131l51088N1152l42772j03143
$$ 1322578 1327452 806442 285662 -70160 181198 726329 375241 426393 83621 -19522
2153a9522K33159j26881O32271J85570o29953l54030J46110j69710J015148n6493
$$ -19522 213637 86756 719027 904597 274644 -79386 66724 -102986 912162 855669
2143H55669n67953j30628k4400p9972K03645K77960j67772j13869N5434M09971
$$ 855669 287716 157088 132688 52716 256361 534321 366549 252680 308114 718085
2133G18085m26377J79111o8055m99898j93902P81726K85443j35484j65993L66146
$$ 718085 291708 470819 402764 -97134 -291036 490690 776133 640649 474656 840802
2123H40802K05946o69518j68623J81742k67799J34375J8395L99681J1582n20124
$$ 840802 1046748 377230 208607 390349 122550 256925 275320 675001 686583 166459
2113A66459L7005L82298k14725n1398J33009j8350n40621r9511M51880N88699
$$ 166459 203464 585762 371037 319639 452648 434298 -106323 -205834 246046 834745
2103H34745k35431j78473k41106L42544o06984k24658P87280L61460j88340j80161
$$ 834745 599314 420841 179735 522279 -84705 -309363 477917 839377 651037 470876
2093D70876q5613k85474j936K94464m997q5409Q3863m76962m353M19413M54550
$$ 470876 385263 99789 97853 392317 387320 301911 385774 -91188 -95541 323872 778422
2082G78422j48290N8022n85898K79752K4824m09403l38265L00870J14248L18215
$$ 778422 630132 688154 102256 382008 406832 -2571 -340836 -39966 74282 392497
2072C92497l32714m9183L88953L00248n46303N0921L51107P3256n07627K66935
$$ 392497 59783 10600 399553 699801 153498 204419 555526 628782 121155 388090
2062C88090K79811j21957p282j27678K42420K60429j5286o2945L42155M75791
$$ 388090 667901 545944 538662 410984 653404 913833 898547 835602 1177757 1653548
2052A653548m03243k39740Q0627n8686K95027j45412j0836k60249j51387k21652
$$ 1653548 1250305 1010565 1091192 1032506 1327533 1182121 1171285 911036 759649 537997
2042E37997k76778K631r6844k44512P12851k38572P8504L82471P0600j72980K70596
$$ 537997 261219 263850 167006 -77506 635345 396773 475277 857748 928348 755368 1025964
2031A025964L90866o17181n63845Q5129n17458L52275p95j90846l98724P85273
$$ 1025964 1416830 799649 235804 320933 -196525 155750 154955 -35891 -434615 350658
2021C50658M0619o89033J77545J38804J44483j72846r1665j94296j10802N43851
$$ 350658 391277 -297756 -120211 18593 163076 -9770 -101435 -295731 -406533 137318
2011A37318j17267P8748l59549L03456L56072n11336K15252J40647k5117j37051
$$ 137318 20051 98799 -260750 42706 398778 -112558 102694 243341 218224 81173
2001H1173m05853K89961o2724R3032K58052m13418m94123k22097R32675O50787
$$ 81173 -324680 -34719 -97443 -4411 253641 -159777 -653900 -875997 56678 707465
1991G07465q4936n62217O2949n33647n7610K80068N80666p9864l44444k7622M9687
$$ 707465 622529 60312 123261 -410386 -467996 -187928 392738 312874 -31570 -59192 -9505
1980i505J85011M28494k42504N52446q30835j41833J62655J26682j38676j08249
$$ -9505 175506 604000 361496 913942 83107 -58726 103929 230611 91935 -16314
1970a6314j4754K06054P2816o353J16438o38196M32805Q8708M5403N33801M47147
$$ -16314 -31068 174986 247802 241449 357887 -280309 152496 241204 286607 820408 1267555
1959A267555p71397n57790K25657k05092k66300L99556M52937j45405j202941
$$ 1267555 496158 -61632 164025 -41067 -307367 92189 545126 399721 -803220
1950h03220l9021M32444K07686m0299J80809O06702l54773K75464J87926j17237
$$ -803220 -842241 -409797 -202111 -242410 -61601 545101 190328 465792 653718 536481
1940E36481o00004r8235k5540L69511q2927L14719J41669r26198k44236j83422
$$ 536481 -63523 -161758 -187298 182213 99286 414005 555674 -370524 -614760 -798182
1930g98182L3859Q99174l01562o3671K93404j44184J23801O21214k60765q49757
$$ -798182 -764323 134851 -166711 -230382 63022 -81162 42639 663853 403088 -446669
1920d46669j83588m13001N32385M61302K64581J98209m2257q8475J26579k43907
$$ -446669 -630257 -1043258 -510873 -49571 215010 413219 370962 282487 409066 165159
1910A65159P2478l77635o7621K56352L06960l36797Q4662k54456O48150L2834
$$ 165159 237637 -139998 -207619 48733 355693 18896 103558 -150898 497252 530086
1900E30086m02256k31649j43461N30330k61218p06930K07486J48304O43560p14
$$ 530086 127830 -103819 -247280 283050 21832 -685098 -477612 -329308 314252 313538
1890C13538l18630n85196k81125P70684J62058j26317K14702j22818M3914R5643
$$ 313538 -5092 -590288 -871413 -100729 61329 -64988 149714 26896 70810 166453
1880A66453p74797L14030N8000o77882L70702Q8962p7780J43424J76087L70632
$$ 166453 -608344 -294314 -236314 -914196 -543494 -454532 -532312 -388888 -212801 157831
1870A57831m0382J08898n93567K85199R2206l42045j84736L4982p2928k10501
$$ 157831 117449 226347 -367220 -82021 10185 -331860 -516596 -481614 -554542 -765043
1860g65043M43614K41669M0611k37868k30890J17448J94565K71117P4097l78809
$$ -765043 -321429 -79760 -39149 -277017 -507907 -390459 -195894 75223 149320 -229489
1850b29489Q1748j48308J66982j13333k20680j06140J09004M97561L38596m37947
$$ -229489 -147741 -296049 -129067 -242400 -463080 -569220 -460216 37345 375941 -62006
1840f2006o43412J69989M31843m30467l99893K63883M90098O92132k15725j21688
$$ -62006 -705418 -535429 -103586 -534053 -933946 -670063 -179965 512167 296442 174754
1830A74754l00379O0018l25314L9938K7814N26376K95942q4244q8140o2420k59019
$$ 174754 -125625 -65607 -390921 -350983 -323169 203207 499149 414905 326765 264345 5326
1819E326j00877P47441J18671p85734k13984k72984K58969P8936K56613l7164
$$ 5326 -95551 651890 770561 -15173 -229157 -502141 -243172 -164236 92377 55213
1809E5213L90138k05854m88837p408K4858j32897r3410N84266k45748l61980K38600
$$ 55213 445351 239497 -249340 -256748 -231890 -364787 -458197 126069 -119679 -481659 -243059
1798b43059K82972J01152n52617j30191L48445n00547Q29953L09236n69304J17588
$$ -243059 39913 141065 -411552 -541743 -193298 -693845 136108 445344 -123960 -6372
1788f372L57318k87648k7960k82713k38312J56785J01853k53280k49142M23408
$$ -6372 350946 63298 35338 -247375 -485687 -328902 -227049 -480329 -729471 -306063
1778c06063L04310l07290k69259K04769J19148P3685j60343k17874n0250l14992
$$ -306063 -1753 -309043 -578302 -373533 -254385 -180700 -341043 -558917 -609167 -924159
1768i24159J59808K32503P5814j23269K64673n8644l6792L63345l00359p5917
$$ -924159 -764351 -531848 -456034 -579303 -314630 -373274 -410066 -46721 -347080 -422997
1758d22997L46656j48029n19356J92140L11261j82915l0797J53081O50232o2197
$$ -422997 -76341 -224370 -743726 -551586 -240325 -423240 -454037 -300956 349276 287079
1748B87079j40837k92876k88175n0118m9567K12733O47158n92935k05041K08464
$$ 287079 146242 -146634 -434809 -484927 -534494 -321761 325397 -267538 -472579 -264115
1738b64115p67426L19084N38180k70314j80744K013j67280P0735r7399K79902
$$ -264115 -1031541 -712457 -174277 -444591 -625335 -623322 -790602 -719867 -817266 -537364
1728e37364N17555j12498k68841L24325R11205n50401p27480l68008J29587l3724
$$ -537364 -19809 -132307 -401148 -76823 834382 283981 -443499 -811507 -681920 -715644
1718g15644O04070M77138j009204K35045J60718r0587M21509M42200k28722k55534
$$ -715644 -111574 365564 -643640 -408595 -247877 -338464 83045 525245 296523 40989
1708D0989J83625m67080j61427N85194j38220k80712j04340N19748l80693j81563
$$ 40989 224614 -242466 -403893 181301 43081 -237631 -341971 177777 -202916 -384479
1698c84479r1081M01482N08925n19599m11876j79233K91999L19435q4174n3003
$$ -384479 -475560 -74078 434847 -84752 -496628 -675861 -383862 -64427 -148601 -201604
1688b01604k52036j8418j91596L41294L94775J8523k85042J61424J03297m62291
$$ -201604 -453640 -472058 -663654 -322360 72415 90938 -194104 -32680 70617 -391674
1678c91674M65393P9057l24690L00476j26629j6643m7294j74525n9577k639K82129
$$ -391674 73719 152776 -171914 128562 1933 -14710 -62004 -236529 -296106 -298745 -16616
1667a6616L45905N6685j70867o43845m9830J86247m08527K47307Q5553L43658
$$ -16616 329289 385974 215107 -428738 -478568 -292321 -700848 -453541 -367988 -24330
1657b4330K18879j76760j69592j19452k50881k78627L53413J37975M44152J63996
$$ -24330 194549 17789 -151803 -271255 -522136 -800763 -447350 -309375 134777 298773
1647B98773L25800j50162n50394K98382k83167p5238l30768K72896L7605J63513
$$ 298773 624573 474411 -75983 222399 -60768 -136006 -466774 -193878 -156273 7240
1637G240j55345K04902P480P8597j14378j42913L32050j95574j81742l22466M11904
$$ 7240 -148105 56797 64277 142874 28496 -114417 217633 22059 -159683 -482149 -70245
1626g0245k57895p36592J73070J23545L83915o493k07019L67428K84485l76886
$$ -70245 -328140 -1064732 -891662 -768117 -384202 -390695 -597714 -230286 54199 -322687
1616c22687q5469M57171K40048p64394N177k78257l26288P0099J49875M78198
$$ -322687 -408156 49015 289063 -475331 -470154 -748411 -1074699 -1004600 -854725 -376527
1606c76527n0735L38010k93659R6564k93237k73622L66391L53334M02858m938
$$ -376527 -427262 -89252 -382911 -286347 -579584 -853206 -486815 -133481 269377 264439
1596B64439k73826K35373l45506r8968k66439k48078j00648Q04391J26292J2563
$$ 264439 -9387 225986 -119520 -218488 -484927 -733005 -833653 -29262 97030 109593
1586A09593M22872k89298k11342j29220j00166J13204J59155l88463q8529K0473
$$ 109593 532465 243167 31825 -97395 -197561 -84357 74798 -313665 -402194 -381721
1576c81721L50302j30293o9682M19583j58686p40209Q6070O00747j85347N38981
$$ -381721 -31419 -161712 -231394 188189 29503 -710706 -624636 -23889 -209236 329745
1566C29745J48703p51375l08062k553o3467j42230M10905J40962k78766K67798
$$ 329745 478448 -272927 -580989 -583542 -647009 -789239 -378334 -237372 -516138 -248340
1556b48340J86877l26777K90949r2078o09381K41079J17496j49968N8650O8775
$$ -248340 -61463 -388240 -97291 -189369 -798750 -557671 -440175 -590143 -531493 -462718
1546d62718L137j2048L86748K58157j87566j56884K82061L69761k16052M8714
$$ -462718 -459581 -471629 -84881 173276 -14290 -171174 110887 480648 264596 313310
1536C13310K27480j47542m92045l31442M98102k58795m03209L78698K76768N32191
$$ 313310 540790 393248 -98797 -430239 67863 -190932 -594141 -215443 61325 593516
1526E93516j14038k85975j12437m65048K60383K38517k6117j15444L05343J63688
$$ 593516 479478 193503 81066 -383982 -123599 114918 88801 -26643 278700 442388
1516D42388k803K15861p3986K89493n14547m06154N12289l55090K39062K07257
$$ 442388 439585 655446 581460 870953 356406 -49748 462541 107451 346513 553770
1506E53770M6383o46668K02631j53636l13373K4448m6120K47242J71504n95504
$$ 553770 600153 -46515 156116 2480 -310893 -286445 -332565 -85323 86181 -509323
1496e09323M43187q0234l33393N88703p6328o9983K8258k21596j01014L04812
$$ -509323 -66136 -146370 -479763 108940 32612 -37371 -9113 -230709 -331723 -26911
1486b6911k99506j85931j00075M9172j27600L20731O38117l0640l55208O0926
$$ -26911 -326417 -512348 -612423 -563251 -690851 -370120 267997 237357 -117851 -56925
1476e6925l50054j98583L34805P22363o26825J06067O42259l95331n96459L9666
$$ -56925 -406979 -605562 -270757 451606 -175219 -69152 573107 177776 -418683 -379017
1466c79017j56362J46024L64011K63207k8808P3382N94899j71361r18465r6425
$$ -379017 -535379 -389355 -25344 237863 209055 282437 877336 705975 -212490 -308915
1456c08915l27698k65254N58662M04629k15259m6041K44559j62569k75376L95
$$ -308915 -636613 -901867 -343205 61424 -153835 -199876 44683 -117886 -393262 -392867
1446c92867N41909m73944n64918K17375J06813K81068l12715m1061J27295j00042
$$ -392867 149042 -324902 -889820 -672445 -565632 -284564 -597279 -638340 -511045 -611087
1436f11087K06994M23787j606m47973j26239R4088j76016N92641J74051l36369
$$ -611087 -404093 19694 18088 -429885 -556124 -462036 -638052 -45411 128640 -207729
1426b07729K73157K96284j20975m63181Q05503j01560n29857l60608J89448N12788
$$ -207729 65428 361712 240737 -222444 583059 481499 -48358 -408966 -219518 293270
1416B93270R9180m12610J66110o69487J00969M56987q12077J52894M02784K17440
$$ 293270 392450 -20160 145950 -523537 -422568 34419 -777658 -624764 -221980 -4540
1406d540k93682o4149K62943N9550n78668L98086j8623m764J40329L3045n74049
$$ -4540 -298222 -362371 -99428 -39878 -618546 -220460 -239083 -243847 -103518 -70473 -644522
1395f44522q8877K61252J25358r026J35682M08096j03753m02984l8793K85056
$$ -644522 -733399 -472147 -346789 -355815 -220133 187963 84210 -318774 -357567 -72511
1385g2511K97912K69489m2499J32562k07945Q0565l39581l03225m29070k19079
$$ -72511 225401 494890 452391 584953 377008 457573 117992 -185233 -614303 -833382
1375h33382M02250M33461k8796K59769K99887l96473m57184K37135N13297k11662
$$ -833382 -431132 2329 -26467 233302 533189 136716 -320468 -83333 429964 218302
1365B18302m14436K15143l23654P40330j55848l05603M17921Q7580l64726k31481
$$ 218302 -196134 19009 -304645 435685 279837 -25766 392155 479735 115009 -116472
1355a16472p0155k78901K53672J39665k36972K09335o0576L8380m49583l00908
$$ -116472 -186627 -465528 -211856 -72191 -309163 -99828 -160404 -122024 -571607 -872515
1345h72515L13473N72313K08900q78520K50014j16823J10295k57107l21878K01860
$$ -872515 -559042 13271 222171 -656349 -406335 -523158 -412863 -669970 -991848 -789988
1335g89988L18241p9918P62878k4071j16582j11458m48327J79768j84097J62429
$$ -789988 -471747 -551665 211213 187142 70560 -40898 -489225 -309457 -493554 -331125
1325c31125j08994J18523M80378L23176j10040l43085k93828K33187N30252L26344
$$ -331125 -440119 -321596 158782 481958 371918 28833 -264995 -31808 498444 824788
1315H24788l84128j34239k0303l53686j61065J87596l95418L1515L17514j02036
$$ 824788 440660 306421 286118 -67568 -228633 -41037 -436455 -404940 -87426 -189462
1305a89462k8224J86127k63922k89535L6118L48994L88754j43883j95723L04862
$$ -189462 -217686 -31559 -295481 -585016 -548898 -199904 188850 44967 -150756 154106
1295A54106Q2819K4982m68549q6209L35496K67670m38431k0972K35212N5421M03099
$$ 154106 236925 261907 -206642 -292851 42645 310315 -128116 -149088 86124 141545 544644
1284E44644k57014m49507m96013P49065K0222J07082Q4557o52126j0347Q6927
$$ 544644 287630 -161877 -657890 91175 111397 218479 303036 -349090 -359437 -272510
1274b72510k58009M02507n1912j03000M144K8384P8609m24835J39249k700M82343
$$ -272510 -530519 -128012 -179924 -282924 -278780 -250396 -171787 -596622 -457373 -460073 22270
1263B2270J44320l08157J11895j49942N27926j34841j86360R3776l47205K50569
$$ 22270 166590 -141567 -29672 -179614 348312 213471 27111 120887 -226318 24251
1253B4251j60010N74088Q2536n07476J41852L66173j99121K73434j36247k22052
$$ 24251 -135759 438329 520865 13389 155241 521414 322293 595727 459480 237428
1243B37428j93417l42671N3091l80220N91271M9691j55174n53295M31550J35750
$$ 237428 44011 -298660 -245569 -625789 -34518 15173 -140001 -693296 -261746 -125996
1233a25996N10227K3048M1250o0114m65713P1007Q509j71000j1073l8873K27925
$$ -125996 384231 407279 448529 388415 -77298 -6291 2218 -168782 -179855 -218728 9197
1222I197J99142m98238K22014M96513q6249n64614m38806L3284J29801L12842
$$ 9197 208339 -289899 -67885 428628 342379 -222235 -661041 -627757 -497956 -185114
1212a85114k4053R5438j36870K96099J30027m51401j2441L06944J69426m57222
$$ -185114 -209167 -113729 -250599 45500 175527 -275874 -288315 18629 188055 -269167
1202b69167o3269r2123k33003J22241l05937M01337j68433J06221N51373j21170
$$ -269167 -332436 -424559 -657562 -535321 -841258 -439921 -608354 -502133 49240 -71930
1192g1930N61484J12425m87874m90249j22722K18054M69811l20929k56222J17412
$$ -71930 489554 601979 114105 -376144 -498866 -280812 188999 -131930 -388152 -270740
1182b70740O42545q0300j83685P5516j45682K22888n9671K56970M05149L9639
$$ -270740 371805 291505 107820 183336 37654 260542 200871 457841 862990 902629
1172I02629m68819k49090j20540J32917m03908m86045L88003Q501J35571m99056
$$ 902629 433810 184720 64180 197097 -206811 -692856 -304853 -296352 -160781 -659837
1162f59837N0877J80599N41701N32837M5715k81203n81097L82518M3478p26576
$$ -659837 -608960 -428361 113340 646177 691892 410689 -170408 212110 255588 -470988
1152d70988N50440K37414j99880j6153Q3704l55985j80096K15720O15215N6709
$$ -470988 79452 316866 116986 100833 184537 -171448 -351544 -135824 479391 536100
1142E36100m87925l20853K86534j15111m83751K40050L18456k48062K00493J20748
$$ 536100 48175 -272678 13856 -101255 -585006 -344956 -26500 -274562 -74069 46679
1132D6679o0730Q7216Q3516L92986k0546n75102k9885m1354K18690k35585j04200
$$ 46679 -14051 73165 156681 549667 529121 -45981 -75866 -117220 101470 -134115 -238315
1121b38315N10414P6276k91677n58613j46267L27090P9344j4564J41421j25874
$$ -238315 272099 348375 56698 -501915 -648182 -321092 -241748 -256312 -114891 -240765
1111b40765K62958O6253o5635N7870j84503k03893K13539K37620j68232N3548
$$ -240765 22193 88446 22811 80681 -103822 -307715 -94176 143444 -24788 28760
1101B8760j4426L4655j20328M27492M12569o33787m41523k2088J78673K08046
$$ 28760 14334 48989 -71339 356153 768722 134935 -306588 -328676 -150003 58043
1091E8043L6086m1023n0160J9196j48079J38143O067n4163J24732n25244o65870
$$ 58043 94129 53106 2946 22142 -125937 12206 18273 -35890 88842 -436402 -1102272
1080a102272L3839Q90840J93153j70305Q4241J36046j59931J17409J48832J34370
$$ -1102272 -1068433 -177593 15560 -154745 -70504 65542 -94389 23020 171852 306222
1070C06222k93405l1699n45614O14698l774j45095J12829j34551K42203n2283
$$ 306222 12817 -18882 -564496 50202 46428 -98667 14162 -120389 121814 69531
1060F9531l03098j49529m1986k03004m5658M87944K13913j0846k21569M37141
$$ 69531 -233567 -383096 -425082 -628086 -673744 -185800 28113 17267 -204302 232839
1050B32839Q9061m04214O963M71598j95977m3675O7674r6550j15749n3443l12163
$$ 232839 321900 -82314 -75351 396247 200270 156595 224269 127719 11970 -41473 -353636
1039c53636L0145M82617j59161q1935j96124j74566l52179J90711L13111m65073
$$ -353636 -323491 159126 -35 -81970 -278094 -452660 -804839 -614128 -301017 -766090
1029g66090J68394J92407j2304O17507P3924R8626K51348M4710k75185k99697
$$ -766090 -597696 -405289 -417593 199914 273838 372464 623812 668522 393337 93640
1019I3640j18519j46594m1697m87095M8938M84473M92750n82789m02635L27340
$$ 93640 -24879 -171473 -213170 -700265 -651327 -166854 325896 -256893 -659528 -332188
1009c32188J37240p0647K58437K10267l54059Q58804l26617m65263k85463J67251
$$ -332188 -194948 -265595 -7158 203109 -150950 707854 381237 -84026 -369489 -202238
999b02238l29407j67019L82521M57891j12037m59798P4343k20709Q3086J95226
$$ -202238 -531645 -698664 -316143 141748 29711 -430087 -355744 -576453 -493367 -298141
989b98141M17576J74399q00722M55793k78200k81321j41629M78859J56607k93066
$$ -298141 119435 293834 -506888 -51095 -329295 -610616 -752245 -273386 -116779 -409845
979d09845J06134j54228k32449J49286m4755K02224L44311O8519J15526n99977
$$ -409845 -303711 -457939 -690388 -541102 -585857 -383633 -39322 29197 144723 -455254
969d55254L92567L18141M1763k43799l23796J53121n1165M4422r3234K36557j47251
$$ -455254 -62687 255454 297217 53418 -270378 -117257 -168422 -124000 -217234 19323 -127928
958a27928L4151Q9874l11274P9547J90635K6052j05227m38078P4871O47957L50845
$$ -127928 -93777 -3903 -315177 -235630 -44995 -18943 -124170 -562248 -487377 160580 511425
947E11425m97650k31445L84290K04269K5837l26242M18208n45992m643J43174
$$ 511425 13775 -217670 166620 370889 396726 70484 488692 -57300 -61943 81231
937H1231J56339m84287j98601M13740l77260M45486K17389m55818N8744N61063
$$ 81231 237570 -246717 -445318 -31578 -408838 36648 254037 -201781 -143037 418026
927D18026K87812l96026m67929k8122N8012l9427J92312N5739o07717M56616J020357
$$ 418026 705838 309812 -158117 -186239 -128227 -167654 24658 80397 -527320 -70704 949653
916I49653J18277j24901n04542k02932j35334k90461K42199J3094N81972k66441
$$ 949653 1067930 943029 438487 235555 100221 -190240 51959 65053 647025 380584
906C80584l95740n6527k4256m0266k13442K86888l26963K09975L27274L44302
$$ 380584 -15156 -71683 -95939 -136205 -349647 -62759 -389722 -179747 147527 491829
896D91829M5086j47622k59224m03081J06972M55674j65180M7897k02623k1853
$$ 491829 536915 389293 130069 -273012 -166040 289634 124454 172351 -30272 -52125
886e2125K0363l23784Q708L4741M44738K77793M8540R2695p23922O85811O86181
$$ -52125 -31762 -355546 -346838 -312097 132641 410434 458974 551669 -172253 513558 1199739
875A199739m90279K20666j76974j87707m86702o41528J38062k28286J09918L88299
$$ 1199739 709460 930126 753152 565445 78743 -562785 -424723 -653009 -543091 -154792
865a54792m19235J04259K39212M99491j62039k59693P07531K2038m96849o23841
$$ -154792 -574027 -469768 -230556 268935 106896 -152797 554734 576772 79923 -543918
855e43918J73321K79051M73632j10939k91878O390k69974L63639L5951k66312
$$ -543918 -370597 -91546 382086 271147 -20731 -14341 -284315 79324 115275 -151037
845a51037k42888K65495R3782N83145l67514j02761k75411o4022J8636K4271J51315
$$ -151037 -393925 -128430 -34648 548497 180983 78222 -197189 -261211 -242575 -218304 -66989
834f6989M65074K5888l80771o5291l42526M5761q9306k7744P6379p6478l31657
$$ -66989 398085 423973 43202 -22089 -364615 -318854 -408160 -435904 -359525 -436003 -767660
823g67660K25491r0379Q54710q3299k21624m48613m6230O8491k68332O03300O1101
$$ -767660 -542169 -632548 222162 138863 -82761 -531374 -577604 -509113 -777445 -174145 -113044
812a13044o62306Q2621O72139K71335K49498M5681l08203k05227N51429l30177
$$ -113044 -775350 -692729 -20590 250745 500243 545924 237721 32494 583923 253746
802B53746m37194r0954k00354K08954M81022m95969L75002J64270K5961n91388
$$ 253746 -183448 -274402 -474756 -265802 215220 -280749 94253 258523 284484 -306904
792c06904k04642J103584l03958J24872q6743m56823j83124L37978M01563k97598
$$ -306904 -511546 592038 288080 412952 326209 -130614 -313738 24240 425803 128205
782A28205q44327l44516Q89024o3936j96898L91742M853o596K4179m7682k19675
$$ 128205 -716122 -1060638 -171614 -235550 -432448 -40706 -35853 -42449 -18270 -65952 -285627
771b85627J19925m62j75782K42041L31028r5928J59436Q0470Q7995M2467j82527
$$ -285627 -165702 -166164 -341946 -99905 231123 135195 294631 375101 463096 505563 323036
760C23036k41406J12213M152j72946j9872m29015M71643K80555k68903L51723
$$ 323036 81630 193843 197995 25049 5177 -423838 47805 328360 59457 411180
750D11180p1198J23030p1947k96714k92933j36238k47534O17108O76298l52057
$$ 411180 339982 463012 391065 94351 -198582 -334820 -582354 34754 711052 358995
740C58995J4054l86474N8764l45998n4290K32136k412R0896M33114N75534k02625
$$ 358995 373049 -13425 45339 -300659 -354949 -122813 -125225 -34329 398785 974319 771694
729G71694o4010m20350n08558J32612L92066M95675l09666r4246K23923R3643
$$ 771694 707684 287334 -221224 -88612 303454 799129 489463 395217 619140 712783
719G12783j94911k90044j02656k83057K85717O52863k77780m83571q4813N30104
$$ 712783 517872 227828 125172 -157885 127832 780695 502915 19344 -65469 464635
709D64635J02424p16430L45933j60843j90637N8058J80199M2970J60802k90929
$$ 464635 567059 -149371 196562 35719 -154918 -96860 83339 126309 287111 -3818
699c818j82259L39838J40247o53852j91264Q42582P0361j85500J44052n04129
$$ -3818 -186077 153761 294008 -359844 -551108 291474 361835 176335 320387 -183742
689a83742n4937j5007l3644L70457K40449K18602p06067j34865L21609m38153
$$ -183742 -238679 -253686 -287330 83127 323576 542178 -163889 -298754 22855 -415298
679d15298l47415M6280M49733L73339K59681K41251m30437j87217K14525J52614
$$ -415298 -762713 -716433 -266700 106639 366320 607571 177134 -10083 204442 357056
669C57056k06074P7844q39042M87269L33085K279j09841j34477Q2856K34900n78010
$$ 357056 150982 228826 -610216 -122947 210138 212417 102576 -31901 50955 285855 -292155
658b92155l23394K98859k5355L19816k00065J08073o9500l6564J45075J09647
$$ -292155 -615549 -316690 -342045 -22229 -222294 -114221 -183721 -220285 -75210 34437
648C4437K82969k51378o05836M22315J46216J2836N8801k8057L09578J53158k72348
$$ 34437 317406 66028 -539808 -117493 28723 41559 100360 72303 381881 535039 262691
637B62691L88985O7994n4962n84143J10385l0930j62409J09275p9871p2264P2278
$$ 262691 651676 719670 664708 80565 190950 160020 -2389 106886 27015 -45249 27029
626B7029j60648j7592J75978J48013J07690j1256k3900J37320k66185n24710K79496
$$ 27029 -133619 -151211 24767 172780 280470 269214 245314 382634 116449 -408261 -128765
615a28765J38433j59581L4025j67907j60133L59514l4155O1324k07517M03997
$$ -128765 9668 -149913 -115888 -283795 -443928 -84414 -118569 -57245 -264762 139235
605A39235l7359m63693k4389K10061n2595J3996K98730L82597R1172J47746l97095
$$ 139235 101876 -361817 -386206 -176145 -228740 -214744 83986 466583 557755 705501 308406
594C08406k20547o65483m1360J051686K4445j42018J48143k68879J81317j5657
$$ 308406 87859 -577624 -618984 432702 457147 315129 463272 194393 375710 360053
584C60053j56657l32775L70340R6681j60707n558q4438K52233n40433K62378j79833
$$ 360053 203396 -129379 240961 337642 176935 171377 86939 339172 -201261 61117 -118716
573a18716J72488L13672j65335l52588j68459K98218L64982O2081k83894N7706
$$ -118716 53772 367444 202109 -150479 -318938 -20720 344262 406343 122449 180155
563A80155j29050q1958N17604J50350R6407l33371K74394j49027q33842Q1463
$$ 180155 51105 -30853 486751 637101 733508 400137 674531 525504 -308338 -226875
553b26875P0582j62694J76817j06680N80995j47586o0065N76366j08376K9147
$$ -226875 -156293 -318987 -142170 -248850 332145 184559 124494 700860 592484 621631
543F21631n53110j53827L02586k827n39732R4571j81050k7971q9778j6759J28331
$$ 621631 68521 -85306 217280 214453 -325279 -230708 -411758 -439729 -529507 -546266 -417935
532d17935k32521L63953N50466K67835m57248j20904j04264R3401M59424p0466
$$ -417935 -650456 -286503 263963 531798 74550 -46354 -150618 -57217 402207 331741
522C31741l2882O7243m26706M61681j67489l46645J79446l53127J60868l10750
$$ 331741 298859 366102 -60604 401077 233588 -113057 66389 -286738 -125870 -436620
512d36620l11178N59026J85922j44774j7913M50133P61069K0309p43032J99672
$$ -436620 -747798 -188772 -2850 -147624 -165537 284596 1045665 1065974 322942 522614
502E22614k780n96788K0860J62019P17124n3623m1566l53456q312m41008l11911
$$ 522614 519834 -76954 -56094 105925 823049 769426 727860 374404 366092 -74916 -386827
491c86827M23524m37628p98926J58829R24544M28656k97966n08544L83003k87301
$$ -386827 36697 -400931 -1199857 -1041028 -116484 312172 14206 -494338 -111335 -398636
481c98636K38625N5804k71069L09232R955n0281O2991R3300M59930J57219m84846
$$ -398636 -160011 -104207 -375276 -66044 -56089 -106370 -43379 49921 509851 667070 182224
470A82224l76735M1663K62646m43495J05460P27762l7032R4263j4890l04694n64623
$$ 182224 -194511 -152848 109798 -333697 -228237 499525 462493 556756 541866 237172 -327451
459c27451N66885J69974m12684J89486J2577N0457p8138P5573j93789q5815L58228
$$ -327451 239434 409408 -3276 186210 198787 249244 171106 246679 52890 -32925 325303
448C25303q8616k13067J76497L55052k64404J80238k67176r5475J24557n27310
$$ 325303 236687 23620 200117 555169 290765 471003 203827 108352 232909 -294401
438b94401j46912j68534j58776J02585M01967q0424L44102K19452R1440k90456
$$ -294401 -441313 -609847 -768623 -666038 -264071 -344495 -393 219059 310499 20043
428B0043o87412j53334J038846J84582m63977L87660j52884J53037k17179P4034
$$ 20043 -667369 -820703 218143 402725 -61252 326408 173524 326561 109382 183416
418A83416j48343l40087K76341l05031K53773J50788J514M06742K81847j2562
$$ 183416 35073 -305014 -28673 -333704 -79931 70857 72371 479113 760960 748398
408G48398m61728k08077k41771q04807M49552K57850Q6747K68685J26390k48515
$$ 748398 286670 78593 -163178 -967985 -518433 -260583 -173836 94849 221239 -27276
398b7276M0071M64904K31636o24895M69660J0472k38929j93447j1829K39142J73343
$$ -27276 12795 477699 709335 84440 554100 564572 325643 132196 120367 359509 532852
387E32852o94138k05749L76882j9107J05338J18263K71291m33614j57263L37875
$$ 532852 -161286 -367035 9847 -9260 96078 214341 485632 52018 -105245 232630
377B32630K92251j99753J29867j06359k09527m8213l1571P9673L29905m9967l75595
$$ 232630 524881 325128 454995 348636 139109 90896 59325 138998 468903 418936 43341
366D3341j0402k77379j96845j47042N94902K63065J03902R364l48068k10952M42766
$$ 43341 32939 -244440 -441285 -588327 6575 269640 373542 382906 34838 -176114 266652
355B66652N46614j19082p85789k10065L17102k83380P89933K17711k78402l61584
$$ 266652 813266 694184 -91605 -301670 15432 -267948 521985 739696 461294 99710
345I9710j77830m36268J06576J144748j14988m85092k2829o7029l72879L09415
$$ 99710 -78120 -514388 -407812 736936 621948 136856 114027 46998 -325881 -16466
335a6466K04288m99740K48840K87529O21125o52910K04095J24501O4205o46892
$$ -16466 187822 -311918 -63078 224451 845576 192666 396761 521262 585467 -61425
325f1425j32993K5034l06593M68472K84521j29632J44306j67658L37198l46139
$$ -61425 -194418 -169384 -475977 -7505 277016 147384 291690 124032 461230 115091
315A15091R4169K41187M9691o2930K90411k96371m62568N5543J18101M2726l56019
$$ 115091 209260 450447 500138 437208 727619 431248 -31320 24223 142324 185050 -170969
304a70969O1692p4216L55410N22816n25808j2550J76508l10847K47610l02357
$$ -170969 -109277 -183493 171917 694733 168925 156375 332883 22036 269646 -32711
294c2711K0310O4322N8531m09825j96303K6762M32151J92652j71386j02780J42915
$$ -32711 -12401 51921 110452 -299373 -495676 -468914 -36763 155889 -15497 -118277 24638
283B4638O84816K48548l95778J83282k16891m04418m36295M4465O94753J33047
$$ 24638 709454 958002 562224 745506 528615 124197 -312098 -267633 427120 560167
273E60167q21125m284K52840R7907n2088K46822j68128j48491j33735M92632K50529
$$ 560167 -260958 -265242 -12402 85505 33417 280239 112111 -36380 -170115 322517 573046
262E73046r4536j84442k50842j39528J07704M97261k75476j17780l3751j03743
$$ 573046 478510 294068 43226 -96302 11402 508663 233187 115407 81656 -22087
252b2087o5280K33654q4431m56964K20049j88492R2295N06610l02649j13371p5527
$$ -22087 -87367 146287 61856 -395108 -175059 -363551 -271256 235354 -67295 -180666 -256193
241b56193Q4504L22557Q66171n6483o89612j09934k40219J12308L17808m32966
$$ -256193 -171689 150868 1017039 960556 270944 161010 -79209 33099 350907 -82059
231h2059n6299Q81882K89181j04124k71522n70157o7212M50165j79123J22240
$$ -82059 -138358 743524 1032705 928581 657059 86902 19690 469855 290732 412972
221D12972R5305J61258J02m59787l69902j44822K88346m5114o3116K52012R9361
$$ 412972 508277 669535 669637 209850 -160052 -304874 -16528 -61642 -124758 127254 226615
210B26615k20491J1952L77071l62863q7761P1099j26163o4642Q0113N1551J1266
$$ 226615 6124 18076 395147 32284 -55477 15622 -110541 -175183 -95070 -43519 -32253
199c2253k8285n2958N9394P7139K28444k02134J25577O4619r4890K93721m54157
$$ -32253 -60538 -113496 -54102 23037 251481 49347 174924 239543 144653 438374 -15783
188a5783K17618M97625k02085J69147j44762l13118N0694p5007r4936j16348m3871
$$ -15783 201835 699460 497375 666522 521760 208642 259336 184329 89393 -26955 -70826
177g0826p0823J70667q4800P6309K40918j17187j76510L41158K79532J1846m03546
$$ -70826 -141649 29018 -55782 20527 261445 144258 -32252 308906 588438 600284 196738
166A96738R918r5586P1798p898J50429P617l29031l6986M13759L81938q28507
$$ 196738 206656 111070 182868 174970 325399 333016 3985 -33001 380758 762696 -65811
155f5811J68764k06611l40330K79923L95989j26705M70206j23668J9678l70080
$$ -65811 102953 -103658 -443988 -164065 231924 105219 575425 451757 471435 101355
$$ [...]
##END NTUPLES=NMR SPECTRUM
##END=
