##TITLE=1H_DE-80H_X3
 200.13MHz, d2o
 8 sc
 
 19ns.26.2.2025
##JCAMPDX= 6.0         $$ Bruker NMR JCAMP-DX V2.0
##DATA TYPE= NMR SPECTRUM
##DATA CLASS= NTUPLES
##ORIGIN= UXNMR, Bruker Analytische Messtechnik GmbH
##OWNER= pz
$$ XWIN-NMR		Version 3.5
$$ Mon Jun 23 10:05:11 2025 Russian Standard Time (UT+4h)  Yarkov@DPX200
##.OBSERVE FREQUENCY= 200.1313
##.OBSERVE NUCLEUS= ^1H
##.ACQUISITION MODE= SIMULTANEOUS
##.ACQUISITION SCHEME= undefined
##.AVERAGES= 8
##.DIGITISER RES= 18
##SPECTROMETER/DATA SYSTEM= spect
##.PULSE SEQUENCE= zg30
##.SOLVENT NAME= CDCl3
##.SHIFT REFERENCE= (INTERNAL, CDCl3, 0, 15.5353)
##AUDIT TRAIL= $$ (NUMBER, WHEN, WHO, WHERE, WHAT)
$$ ##TITLE= Audit trail, XWIN-NMR		Version 3.5
$$ ##JCAMPDX= 5.01
$$ ##ORIGIN= Bruker BioSpin GmbH
$$ ##OWNER= Yarkov
$$ C:/Bruker/XWIN-NMR/data/yarkov2/nmr/H-C/1/pdata/1/auditp.txt
$$ ##AUDIT TRAIL=  $$ (NUMBER, WHEN, WHO, WHERE, WHAT)
(   1,<2025-06-23 10:02:29.15 +0400>,<Yarkov>,<DPX200>,
      <created by zg, POWCHK disabled, PULCHK disabled
       configuration hash MD5:
       00 E9 B6 7A A2 85 ED C7 34 08 36 98 17 FE 4E 26
       data hash MD5: 16K
       91 16 37 62 62 7C C9 2E F8 43 76 10 79 BB 13 AF>)
(   2,<2025-06-23 10:02:37.00 +0400>,<Yarkov>,<DPX200>,
      <Start of raw data processing
       efp BC_mod = 2 LB = 0.25 FT_mod = 6 PKNL = 1 PHC0 = -1706.187 PHC1 = -10.8334 SI = 16K 
       data hash MD5: 16K
       09 0F 99 0A 88 84 93 10 52 EF 2C 5E E2 D8 E2 00>)
(   3,<2025-06-23 10:02:58.81 +0400>,<Yarkov>,<DPX200>,
      <pk PHC0 = -7.579189 PHC1 = 21 
       data hash MD5: 16K
       51 DB 4D E7 98 0D B9 BE E8 DE A9 00 1B FD 93 38>)
(   4,<2025-06-23 10:03:38.17 +0400>,<Yarkov>,<DPX200>,
      <abs ABSG = 5 
       data hash MD5: 16K
       63 ED 53 60 50 67 2D 4E CA C9 13 E8 C4 59 B7 16>)
$$ ##END=
$$ 
$$ hash MD5
$$ D6 9B 6D B5 10 F7 B4 8C A7 35 A6 C8 40 8A 37 37
##$RELAX= 
##$RELAX= 
##$RELAX= 
##$RELAX= 
##$RELAX= 
##$RELAX= 
$$ Bruker specific parameters
$$ --------------------------
##$DU= <C:/Bruker/XWIN-NMR>
##$EXPNO= 1
##$NAME= <H-C>
##$PROCNO= 1
##$TYPE= <nmr>
##$USER= <yarkov2>
##$AMP= (0..31)
100 100 100 100 100 100 100 100 100 100 100 100 100 100 100 100 100 100 
100 100 100 100 100 100 100 100 100 100 100 100 100 100 
##$AQSEQ= 0
##$AQ_mod= 1
##$AUNM= <au_zg>
##$AUTOPOS= <>
##$BF1= 200.13
##$BF2= 200.13
##$BF3= 200.13
##$BF4= 200.13
##$BF5= 200.13
##$BF6= 200.13
##$BF7= 200.13
##$BF8= 200.13
##$BYTORDA= 1
##$CFDGTYP= 0
##$CFRGTYP= 5
##$CHEMSTR= <none>
##$CNST= (0..31)
1 1 145 1 1 1 1 1 1 1 1 1 1 1 1 1 1 1 1 1 1 1 1 1 1 1 1 1 1 1 1 1 
##$CPDPRG= <>
##$CPDPRG1= <>
##$CPDPRG2= <>
##$CPDPRG3= <>
##$CPDPRG4= <mlev>
##$CPDPRG5= <mlev>
##$CPDPRG6= <mlev>
##$CPDPRG7= <mlev>
##$CPDPRG8= <mlev>
##$CPDPRGB= <>
##$CPDPRGT= <>
##$D= (0..31)
0 0.7 0 0 0 0 0 0 0 0 0 0.03 0 0 0 0 0 0 0 0 0 0 0 0 0 0 0 0 0 0 0 0 
##$DATE= 1750658548
##$DBL= (0..7)
120 120 120 120 120 120 120 120 
##$DBP= (0..7)
150 150 150 150 150 150 150 150 
##$DBP07= 0
##$DBPNAM0= <>
##$DBPNAM1= <>
$$ [...]
##$SUBNAM3= <"">
##$SUBNAM4= <"">
##$SUBNAM5= <"">
##$SUBNAM6= <"">
##$SUBNAM7= <"">
##$SUBNAM8= <"">
##$SUBNAM9= <"">
##$SW= 18.0517328524113
##$SWIBOX= (0..15)
0 0 2 0 0 0 0 0 0 0 0 0 0 0 0 0 
##$SW_h= 3612.71676300578
##$TD= 16384
##$TD0= 1
##$TE= 0
##$TE2= 300
##$TE3= 300
##$TEG= 300
##$TL= (0..7)
0 120 120 120 120 120 120 120 
##$TP= (0..7)
150 150 150 150 150 150 150 150 
##$TP07= 0
##$TPNAME0= <>
##$TPNAME1= <>
##$TPNAME2= <>
##$TPNAME3= <>
##$TPNAME4= <>
##$TPNAME5= <>
##$TPNAME6= <>
##$TPNAME7= <>
##$TPOAL= (0..7)
0.5 0.5 0.5 0.5 0.5 0.5 0.5 0.5 
##$TPOFFS= (0..7)
0 0 0 0 0 0 0 0 
##$TUNHIN= 0
##$TUNHOUT= 0
##$TUNXOUT= 0
##$USERA1= <user>
##$USERA2= <user>
##$USERA3= <user>
##$USERA4= <user>
##$USERA5= <user>
##$V9= 5
##$VALIST= <valist>
##$VCLIST= <CCCCCCCCCCCCCCC>
##$VD= 0
##$VDLIST= <DDDDDDDDDDDDDDD>
##$VPLIST= <PPPPPPPPPPPPPPP>
##$VTLIST= <TTTTTTTTTTTTTTT>
##$WBST= 1024
##$WBSW= 4
##$XGAIN= (0..3)
0 0 0 0 
##$XL= 0
##$YL= 0
##$YMAX_a= 97389
##$YMIN_a= -102745
##$ZGOPTNS= <>
##$ZL1= 120
##$ZL2= 120
##$ZL3= 120
##$ZL4= 120
##$ABSF1= 15.53535
##$ABSF2= -2.516501
##$ABSG= 5
##$ABSL= 3
##$ALPHA= 0
##$AQORDER= 0
##$ASSFAC= 0
##$ASSFACI= 0
##$ASSFACX= 0
##$ASSWID= 0
##$AUNMP= <proc_1d>
##$AZFE= 0.1
##$AZFW= 0.1
##$BCFW= 0
##$BC_mod= 2
##$BYTORDP= 0
##$COROFFS= 0
##$CY= -3
##$DATMOD= 1
##$DC= 0
##$DFILT= <>
##$DTYPP= 0
##$F1P= 0
##$F2P= 0
##$FCOR= 1
##$FTSIZE= 16384
##$FT_mod= 6
##$GAMMA= 0
##$GB= 0
##$INTBC= 1
##$INTSCL= 3.241238e-09
##$ISEN= 128
##$LB= 0.25
##$LEV0= 0
##$LPBIN= 0
##$MAXI= 10000
##$MC2= 0
##$MEAN= 0
##$ME_mod= 0
##$MI= 1.114404
##$NCOEF= 0
##$NC_proc= -8
##$NLEV= 6
##$NOISF1= 3.799351
##$NOISF2= 2.8
##$NSP= 0
##$NTH_PI= 0
##$NZP= 0
##$OFFSET= 15.53535
##$PC= 1
##$PHC0= -1713.766
##$PHC1= 10.1666
##$PH_mod= 1
##$PKNL= yes
##$PPARMOD= 0
##$PSCAL= 0
##$PSIGN= 0
##$REVERSE= no
##$SF= 200.129997269525
##$SI= 16384
##$SIGF1= 3
##$SIGF2= 2
##$SINO= 0.751879
##$SIOLD= 32768
##$SREGLST= <19F.Aceton>
##$SSB= 0
##$STSI= 16384
##$STSR= 0
##$SW_p= 3612.71676300578
##$SYMM= 0
##$S_DEV= 0
##$TDeff= 16384
##$TDoff= 0
##$TI= <>
##$TILT= no
##$TM1= 0
##$TM2= 0
##$TOPLEV= 0
##$USERP1= <user>
##$USERP2= <user>
##$USERP3= <user>
##$USERP4= <user>
##$USERP5= <user>
##$WDW= 1
##$XDIM= 16384
##$YMAX_p= 285925143
##$YMIN_p= -1068227
$$ End of Bruker specific parameters
$$ ---------------------------------
##NTUPLES= NMR SPECTRUM
##VAR_NAME=  FREQUENCY,     SPECTRUM/REAL,   SPECTRUM/IMAG
##SYMBOL=    X,             R,               I
##VAR_TYPE=  INDEPENDENT,   DEPENDENT,       DEPENDENT
##VAR_FORM=  AFFN,          ASDF,            ASDF
##VAR_DIM=   16384,         16384,           16384
##UNITS=     HZ,            ARBITRARY UNITS, ARBITRARY UNITS
##FACTOR=    0.220516191357247, 1,           1
##FIRST=     3109.08952223833, 0,            0
##LAST=      -503.627240767453, 0,           0
##MIN=       -503.627240767453, -1068227,    0
##MAX=       3109.08952223833, 285925143,    0
$$ Real data points
##PAGE= N=1
##DATA TABLE= (X++(R..R)), XYDATA
$$ [...]
6074I16170P9475n0693Q8858J41589j58192k15613P064J14561J38428o1360N2768
6063A053055k2714N4518k27447j9788M9032R7427o9311r5376O7145j10803K5351
6052H01089q7758K2675J47621q2079L1281O2886n4639j56110m7118m2317q716
6041E86815l5243J35995l0778Q5024J14529j33429J4174o4985K0113P022j1642
6030F87595j46288r297j81473J5300J07327j44519M4060J5387L5262j49988j15693
6019A57673o3360O6990L8181k2310j48680J16901L6946l7737p6974q0243N015
6008g598R3063N5694J1214Q71r6664L95J1227L2608r1714J17678O9872j05810
5996I0836M0786J70294n4653m6976j16576j08965K943J12214p066M0271K0225
$$ plain form
6074 916170 995645 944952 1033810 1175399 1017207 801594 808658 923219 1061647 1000287 1053055
6063 1053055 1030341 1084859 857412 837624 886656 984083 914772 819396 886541 775738 801089
6052 801089 713331 736006 883627 801548 832829 895715 841076 684966 637848 595531 586815
6041 586815 551572 687567 656789 741813 856342 722913 737087 672102 692215 699237 687595
6030 687595 541307 532010 350537 365837 473164 328645 372705 388092 423354 273366 157673
6019 157673 94313 161303 199484 177174 28494 145395 182341 144604 67630 -12613 -7598
6008 -7598 85465 141159 152373 153244 56580 56975 68202 100810 9096 126774 196646 90836
5996 90836 131622 301916 247263 200287 83711 -25254 -22311 89903 82837 123108 143333
5985A43333j649J09014J22146j22094j28489k4545q6937J131J39156q9074n9639
5974B353J1395L4175K1743q5445J46030k1411p2767k4277J8867J92857Q1676j70685
5962A34511J3159m734Q2999j3472n7266j18227L1705P9637m2909J30994j280p8628
5950A56489j09619J23283K1067Q0283L6499P9440j1648j22990K0295q4086j00165
5939H8848k3933J15869J25071o8116J1302m2888l8703r5916K8531K9387J25537
5928B54989J08389j67131l0669P620j2085k813m6878Q7741O8832r1351L6434r5247
5916A17831q9997J01482p2315N0477m0064N0936J43082J71616j76210p9898l0828
5905A46112J5759l9885k5467j0906J19516P6751n8914J35646o1912j55132p884
$$ plain form
5985 143333 141684 250698 372844 250750 122261 97716 10779 11910 151066 61992 2353
5974 2353 13748 47923 69666 -15779 130251 108840 36073 11796 30663 223520 305196 134511
5962 134511 147670 142936 225935 212463 155197 36970 68675 148312 105403 236397 235117 156489
5950 156489 46870 170153 191220 271503 308002 387442 375794 252804 273099 189013 88848
5939 88848 64915 180784 305855 237739 249041 206153 167450 71534 100065 129452 254989
5928 254989 363378 196247 165578 173198 161113 158300 111422 199163 267995 176644 213078 117831
5916 117831 27834 129316 57001 107478 67414 118350 261432 433048 256838 176940 146112
5905 146112 161871 121986 96519 85613 205129 281880 222966 358612 296700 141568 133684
5894A33684Q4984O7928p4829l2598l152L3219O3389p5955j05495M3673K4272Q7995
5882B47115o5783o4686N8252n5112j6998k2016P6192n2216N6179m5440o7297N9752
5870A07942J58177p8091j06606j9232R7413j8350N3376l430j4459j11922K381
5859F7199J15032o9235K7956O9696J2265o7296N3690J32186l3162J09129j52162
5848B65298M8097P860j42827L7885n4902J12173K873j32737J30956l1766p6341
5837A66569M8810P3220j31678M775Q4647l1630L9739P1402j45584L0428K4557
5826B35255N0343j30962M4611N9905k15248L3495J41936J583P6687O3491j4619
5815C46477p7440O3822k6930r9352K25j0115j8468N5849j7749n4627J42209K6678
$$ plain form
5894 133684 218668 286596 211767 179169 176017 209236 272625 196670 91175 134848 159120 247115
5882 247115 181332 116646 174898 119786 102788 80772 156964 104748 160927 115487 48190 107942
5870 107942 266119 188028 81422 62190 159603 141253 194629 191199 176740 64818 67199
5859 67199 182231 112996 140952 210648 222913 155617 209307 341493 308331 417460 265298
5848 265298 313395 321255 178428 216313 161411 273584 276457 143720 274676 242910 166569
5837 166569 215379 288599 156921 161696 246343 214713 254452 325854 180270 210698 235255
5826 235255 285598 154636 199247 259152 43904 77399 219335 220918 297605 361096 346477
5815 346477 269037 332859 305929 206577 206802 196687 178219 234068 216319 161692 303901 330579
5803C30579p0350o36K6365p5069R3680L4475r1261m4954N0143J4216R0305m4259
5791C13234m3269k02771K7624J43188L4050j30175k1215r0088L9483J10768n274
5780A75555k6916o224R041R3775j0890O038N5211k11664r875K21781J5341l0071
5768B81102l4671J4971k04740L62K06939p6104q3764m1647Q3259O13m000J48926
5756B91246j28714k9044J8821L1962l8584m944J39759m002o0168m1441R6083l8418
5744B32556L3845Q5532j50881q4184J17237J2081m6671J8928J01299R8836j04623
5733C13955j663j125n9269j78006k9453J31936J72192O2364o2239l8851K1926
5722C31767Q3127j88357o7990N6415N4755O7593M6662j13494J3177M9800J02793
$$ plain form
5803 330579 260229 259593 285958 210889 304569 339044 247783 202829 252972 267188 357493 313234
5791 313234 269965 67194 94818 238006 272056 141881 120666 30578 70061 180829 175555
5780 175555 148639 142415 151456 245231 234341 240379 295590 83926 74051 295832 311173 281102
5768 281102 246431 261402 56662 57024 263963 187859 104095 62448 145707 146320 142320 291246
5756 291246 162532 133488 152309 184271 145687 140743 280502 276500 216332 174891 270974 232556
5744 232556 266401 351933 201052 116868 234105 246186 199515 218443 319742 418578 313955
5733 313955 312292 311167 251898 73892 44439 176375 348567 410931 348692 309841 331767
5722 331767 414894 226537 158547 214962 269717 337310 383972 270478 283655 333455 436248
5711D36248j00507j5144L6420o4402L7383K3372N1130O2256l3490o8520J12906
5700D77652r095J1664j21022J2714J59996o7605p1738J35655O9553m4988p1126
5689D81660Q1273j58591j18806M5110n7541J7759R6691N438k7610j2145k647R2378
5677D42969m9206k2714J13889L8177n8397q1542j38687P6726K00414n672j34151
5666C81806o4862o103P2170l4609O9495o048o4659N1289Q3587K9808j20582P7644
5654D68936J43555j491R1333j12918k8103n3008J15956O4602j47490j07816L833
5643D37389J20424L0797o5444O1773R6204m8532j49122J95386J01350j11586l7451
5632F31188K492J01706l4364N2520n7150j02060J22566J77863l2780P8333O5653
$$ plain form
5711 436248 335741 320597 357017 292615 329998 353370 404500 466756 433266 364746 477652
5700 477652 468557 480221 359199 371913 531909 464304 392566 528221 597774 552786 481660
5689 481660 562933 404342 285536 330646 273105 290864 387555 392993 365383 353238 350591 442969
5677 442969 393763 371049 484938 523115 464718 383176 244489 321215 521629 515957 381806
5666 381806 316944 310841 383011 348402 417897 411849 347190 398479 482066 511874 391292 468936
5654 468936 612491 611000 702333 589415 561312 508304 624260 688862 541372 433556 437389
5643 437389 557813 588610 523166 584939 681143 632611 483489 678875 780225 668639 631188
5632 631188 633680 735386 701022 753542 696392 594332 716898 894761 861981 940314 1005967
5621A005967r0030J7986k6148j7863o8413M2075J35471R0808J71083m8110j10452
5610A102374j45312P7005P9027J0241l3805r5951O3968J24823P2134J18488k6799
5599A346193M7115Q1409r274Q5118m6775J22975O4524j31106J40913J90860J65353
5588B057305N9910L1523N5279O2394K11178J0604Q7177J56577J57054J34622L2765
5577C056388P4384M17801L22152P2067J84887K70481K67235L25611K32919M16211
5567E640136L32101J95744J68172k388J53189J62349O4120K73344J11619l9977
5557G058409J11648K68761K29613R7079L37375K61222K53078J97516L43035L09000
5547I466736L61827M32167M27244L16626K86575M33098M76234L92804M00501K87852
$$ plain form
5621 1005967 915937 933923 907775 889912 821499 863574 999045 1089853 1260936 1212826 1102374
5610 1102374 957062 1034067 1113094 1123335 1089530 993579 1057547 1182370 1254504 1372992 1346193
5599 1346193 1393308 1474717 1465443 1550561 1503786 1626761 1691285 1560179 1701092 1891952 2057305
5588 2057305 2117215 2148738 2204017 2266411 2477589 2488193 2575370 2731947 2889001 3023623 3056388
5577 3056388 3130772 3548573 3870725 3942792 4127679 4398160 4665395 4991006 5223925 5640136
5567 5640136 5972237 6167981 6336153 6333765 6486954 6649303 6713423 6986767 7098386 7058409
5557 7058409 7170057 7438818 7668431 7765510 8102885 8364107 8617185 8814701 9157736 9466736
5547 9466736 9828563 10260730 10687974 11004600 11291175 11724273 12200507 12593311 12993812 13281664
5537A3281664K23381J54603J14384J91267n6779M3719P5703K20099J36381N5952
5527A4440374L12732J58257K26593K91053K26588L42431N73377N97590M73758
5518A7642753N04856M28946M39741M54649K49828K97133K31463J87799K64671
5509B0701839j67913l35686l62219l50117k30032k60950J585L2893k0998L1265
5499A9039667O8025J96303J63034K66328L52116K87936K48582K57654K89646K54583
5489B1423874L59590K22578K51015J95112M5293J7138L6733o7089j7996K69255
5479B2735503P9818j54359o01075r46906r47887o21310l50457k36980o3545k86195
5469A8606607o9762J18264O8349J2862j76210J8963p7722k97097k21062q8200
$$ plain form
5537 13281664 13505045 13659648 13774032 13965299 13908520 13952239 14027942 14248041 14384422 14440374
5527 14440374 14753106 14911363 15137956 15429009 15655597 15998028 16571405 17168995 17642753
5518 17642753 18147609 18576555 19016296 19470945 19720773 20017906 20249369 20437168 20701839
5509 20701839 20533926 20198240 19836021 19485904 19255872 18994922 18996507 19029400 19008402 19039667
5499 19039667 19107692 19303995 19467029 19733357 20085473 20373409 20621991 20879645 21169291 21423874
5489 21423874 21783464 22006042 22257057 22452169 22497462 22514600 22551333 22484244 22466248 22735503
5479 22735503 22815321 22660962 22059887 21112981 20165094 19543784 19193327 18956347 18892802 18606607
5469 18606607 18536845 18655109 18723458 18736320 18560110 18579073 18501351 18204254 17983192 17894992
5459A7894992l18865l71775l49280m26500m06817m38498k70398l55904j61622
5450A4795333k7985J3842M1503J40962m5605p60136q40832p26640o12619m15131
5440A1562692k83529k88287p4472l53197k92882j76705k25535l00046k53527k39344
5430I075168l17979j87143n82592n24677k41094k97714l22884l42796k90212j72433
5420E795644j73279r9982k55462q6341J05919J10026j27709k60879k36490l36960
5410D434487k18461k89492k86963l3350j70425j33292l15j61953j57945k6412
5400B955879k06976j44429m8452j3587j9126j05551l8202j40720j64539m0831
5390B033466R134k819K0218N8692K0915o5722k15124j41405J31329j29428j26391
$$ plain form
5459 17894992 17576127 17204352 16855072 16428572 16021755 15583257 15312859 14956955 14795333
5450 14795333 14767348 14781190 14822693 14963655 14918050 14157914 13317082 12590442 11977823 11562692
5440 11562692 11279163 10990876 10916404 10563207 10270325 10093620 9868085 9568039 9314512 9075168
5430 9075168 8757189 8570046 7987454 7462777 7221683 6923969 6601085 6258289 5968077 5795644
5420 5795644 5622365 5522383 5266921 5180580 5286499 5396525 5268816 5007937 4771447 4434487
5410 4434487 4216026 3926534 3639571 3606221 3435796 3302504 3302189 3140236 2982291 2955879
5400 2955879 2748903 2604474 2556022 2542435 2523309 2417758 2379556 2238836 2074297 2033466
5390 2033466 2042600 2039781 2059999 2118691 2139606 2073884 1858760 1717355 1848684 1719256 1592865
5379A592865j3242N3412J8175j00594L3121M4432m9868l3391l3927k293j59142
5368A349548j190k1192m4816l5101j07205M8709R4392j01949j9183n7278n9158
5357A045577P2885m1278K7200J30296j74591j45638J24590P4922q020l6868l7581
5346A031494j33301R5395J07059P969o2528l091K5197p726j1038j297q3036o0125
5334I04972j9347q0861J61000M7429K595r2608j01086R0231N7220j56921p1042
5323G41582L8255M9883j684m9827M0956n2769q4618J3646J0388m0095O6208L9776
5311G71701o640Q7581K0842n5228J1283q7034M4949l2133M1383k4498m2770L6710
5299G66146k2249J11454j17511n6587n4829p0923K12059N7542r7133j9792M56
$$ plain form
5379 1592865 1579623 1633035 1651210 1550616 1583737 1628169 1578301 1544910 1510983 1508690 1349548
5368 1349548 1348358 1327166 1282350 1247249 1140044 1188753 1283145 1181196 1162013 1104735 1045577
5357 1045577 1118462 1077184 1104384 1234680 1060089 914451 1039041 1113963 1105943 1069075 1031494
5346 1031494 898193 993588 1100647 1108616 1046088 1042997 1068194 1060468 1049430 1048133 965097 904972
5334 904972 885625 804764 965764 1013193 1015788 923180 822094 912325 969545 812624 741582
5323 741582 779837 829720 828036 778209 819165 766396 681778 695424 705812 665717 731925 771701
5311 771701 765061 852642 873484 818256 829539 742505 787454 755321 796704 772206 729436 766146
5299 766146 743897 855351 737840 681253 626424 555501 767560 825102 727969 708177 708633
5288G08633o5057l2145o2826J46040K6236j34107r2837O2997j54948P2288N2040
5277E26314j70549m3806J51336P8354M6273N3352j61820J14761J7571l4381N7363
5266F34768j1784n7258J9376K8713m4583M6865K1550J15106n4931p1664j9031
5255F07127K8421J1929n6250k9194M1831O2342l8083k0825r6585O1849Q6405O3859
5243G22826J621J4540j56778p513K05664m4088k41192J51638L0118l4462j3238
5232F29136n8811L0500k136J7580J30054j5500j3402L308k5725K9308o957l7448
5220F79907P0219P774j07906q9855J13332J00288o0663R7429P609k0467p141K9908
5208H20434p8136P5736q6412j6025N8675o9328K1314R9119n8364m1076m449R2310
$$ plain form
5288 708633 643576 611431 548605 694645 720881 586774 493937 556934 401986 474274 526314
5277 526314 355765 311959 463295 541649 587922 641274 479454 594215 611786 577405 634768
5266 634768 622984 565726 585102 613815 569232 616097 637647 752753 697822 626158 607127
5255 607127 635548 647477 591227 562033 603864 666206 628123 607298 510713 572562 658967 722826
5243 722826 724447 738987 582209 574696 780360 736272 495080 646718 676836 642374 629136
5232 629136 570325 600825 598689 616269 746323 730823 717421 720729 695004 724312 717355 679907
5220 679907 750126 757900 649994 560139 673471 773759 713096 810525 818134 797667 790526 820434
5208 820434 742298 818034 731622 715597 774272 704944 726258 825377 767013 725937 721488 813798
5196H13798J9884l1115K6511q4386l9891k7791J75227p687K6067K1452p4244k9284
5184G88541n0821J13094J31352r2153R3561M7246J8448l2249q8334J7223P5111
5173A021019p0538J20276J25458K503k8240p7696R8227M1282N6417L5161P4132
5162A398001j11618K2115J69107L5594O4667P0201q1707K074J58148P4729J32360
5151A933671K0146o6926O7427R9534J91011J18422L3336J37689R3164J99137Q8205
5140B914816J26795K36655J72685K92047J36194J01700J43988K74811L47475K93508
5130E040674K01804K73121K53030M24654J58951N5503r5119J06630J21958k0013
5120F521193J05899L3431n2197J35926R7109n6388K22824J12389J42742J93425
$$ plain form
5196 813798 833682 802567 829078 744692 704801 677010 852237 844550 870617 892069 817825 788541
5184 788541 737720 850814 982166 890013 983574 1030820 1049268 1017019 928685 945908 1021019
5173 1021019 950481 1070757 1196215 1198718 1170478 1092782 1191009 1232291 1288708 1323869 1398001
5162 1398001 1286383 1308498 1477605 1513199 1577866 1648067 1566360 1568434 1726582 1801311 1933671
5151 1933671 1953817 1886891 1954318 2053852 2244863 2363285 2396621 2534310 2627474 2826611 2914816
5140 2914816 3041611 3278266 3450951 3742998 3879192 3980892 4124880 4399691 4747166 5040674
5130 5040674 5242478 5515599 5768629 6193283 6352234 6407737 6312618 6419248 6541206 6521193
5120 6521193 6627092 6660523 6608326 6744252 6841361 6784973 7007797 7120186 7262928 7456353
5110G456353K33916K02980L33069N18242L58671K85831L16630L61747N08542M95082
5100A1071063M39499N79646M79489M82269O20327M75827L93333L32306J08041
5091A4981800j4503K7042L0460m9492j80640m1892j00213j20413J56247r854j5024
5080A4663518J60987K505J35703K12120L30523p5347O3507K16383R1997K37300
5070A6039196K36795K88487M48414K39819M98877L95460K88591L20049J98413
5061A8954101K42863J14401J04954L1348l6889k44261j95474l32879j90701n819
5051A8441644p3239j82702O4514J30128J20184j7945l3448j15162k15108k7197
5041A8091669k23966k75871r0520k87561l56881j69518j69814j55453k62943j14154
$$ plain form
5110 7456353 7690269 7893249 8226318 8744560 9103231 9389062 9705692 10067439 10575981 11071063
5100 11071063 11510562 12090208 12569697 13051966 13672293 14148120 14541453 14873759 14981800
5091 14981800 14967297 14994339 15024799 14975307 14794667 14752775 14652562 14532149 14688396 14678542 14663518
5080 14663518 14824505 14827010 14962713 15174833 15505356 15430009 15493516 15709899 15801896 16039196
5070 16039196 16275991 16564478 17012892 17252711 17751588 18147048 18435639 18755688 18954101
5061 18954101 19196964 19311365 19416319 19447667 19410778 19166517 18971043 18638164 18447463 18441644
5051 18441644 18368405 18185703 18250217 18380345 18500529 18482584 18449136 18333974 18118866 18091669
5041 18091669 17867703 17591832 17501312 17213751 16856870 16687352 16517538 16362085 16099142 15984988
5031A5984988j03734j34950j67146j26413j53028k65278j66946p594k33751k729
5021A4623419j01004k13647q3800Q2113p1127m9666Q2324M125P1990R2299m5451
5010A4391575k12977l30239l73272m59752l39125n14610n93499j89182m85631
5001A0893288m77619l44097k51788m82701l95056k75128k93412k97061j11314
4992G965112q7549j35913j02207o8850J5722k1549j11766o2190o8354l2280k53220
4981G036956n3776o184p1029j34827j10908j41566k04480j88690r6240k79320
4971E749936l83898k40575q7857k33657j93338k89732j78381j25236r489j61987
4961C845786r0977J6143j02965r9904r8078r3480j04323j6315j05030M1034O8731
$$ plain form
5031 15984988 15881254 15746304 15579158 15452745 15299717 15034439 14867493 14859899 14626148 14623419
5021 14623419 14522415 14308768 14224968 14307081 14235954 14186288 14268612 14272737 14344727 14437026 14391575
5010 14391575 14178598 13848359 13475087 13015335 12676210 12161600 11568101 11378919 10893288
5001 10893288 10415669 10071572 9819784 9337083 8942027 8666899 8373487 8076426 7965112
4992 7965112 7877563 7741650 7639443 7570593 7586315 7564766 7453000 7390810 7322456 7290176 7036956
4981 7036956 6983180 6976996 6905967 6771140 6660232 6518666 6314186 6125496 6029256 5749936
4971 5749936 5366038 5125463 5037606 4803949 4610611 4320879 4142498 4017262 4007773 3845786
4961 3845786 3754809 3770952 3667987 3568083 3470005 3376525 3272202 3255887 3150857 3191891 3260622
4950C260622p817j67920r5042j15680k9511M5745m741r0472r8399k1173n3172
4939B622440j11409o0151j47742n2154J48286J05310k4942J35220r3926L392j09439
4928B414885j89549k2430M575L9618Q5141L8528r9920j7527K3604m7392N2254
4917B281787K8275k13480K7689J2573l1188N2550r5766m3730m6655l1819k7040
4906A913196K08770L014K7154j74891m2803J7423J66850m7893j79241L0582j8013
4895A904148P6033J8462J1041Q8719L1814J18672n261J31984J49741J61727R7083
4884B784163J9495N0575J07978K60712L74529K07371k5493J4354j10887j97136
4874C485661m57155k18059j68827k22932j01964j74317j81107N339J61249m7504
$$ plain form
4950 3260622 3252805 3084885 2989843 2874163 2844652 2890397 2885656 2795184 2696785 2675612 2622440
4939 2622440 2511031 2450880 2303138 2250984 2399270 2504580 2479638 2614858 2520932 2524324 2414885
4928 2414885 2225336 2202906 2207481 2247099 2332240 2370768 2270848 2253321 2276925 2229533 2281787
4917 2281787 2310062 2096582 2124271 2136844 2105656 2158206 2062440 2018710 1972055 1940236 1913196
4906 1913196 2121966 2124980 2152134 1977243 1934440 1951863 2118713 2070820 1891579 1922161 1904148
4895 1904148 1980181 1998643 2009684 2098403 2130217 2248889 2243628 2375612 2525353 2687080 2784163
4884 2784163 2803658 2854233 2962211 3222923 3597452 3804823 3779330 3793684 3682797 3485661
4874 3485661 3028506 2810447 2641620 2418688 2316724 2142407 1961300 1966639 2127888 2080384
4864B080384q2050m5582k1876R4969q0546o7300p8104m7557n7389K1450m4236
4853A672163P0517l1906j0887l2010J8300R4176n0895k4109o4351k3656m6972
4842A570370L4019J50127J40537M497n4592L3550j4370L6288k6749J6214q263
4831A881628p7579o9817P1611J75968J20260m5342n2911j1061J82357j19198j60530
4820A895386Q9023J30611M0833m7045J6634Q9658M4492Q61j842J19447m3870p041
4808B327147O6732O6934Q6794o2455N1827J5050L3855J15605J20906m2823p3051
4797B706521P383m1224Q4639K60816l2889Q5762K7403P4161J54017j1869J50422
4786C465142M3260Q4157k0105J0081Q7018N4761O7168n40K6791J05734J55949
$$ plain form
4864 2080384 1998334 1952752 1930876 2025845 1945299 1877999 1799895 1752338 1694949 1716399 1672163
4853 1672163 1742680 1710774 1699887 1667877 1686177 1780353 1729458 1705349 1640998 1617342 1570370
4842 1570370 1604389 1754516 1895053 1899550 1844958 1878508 1864138 1900426 1873677 1889891 1881628
4831 1881628 1804049 1734232 1805843 1981811 2102071 2056729 2003818 1992757 2175114 2055916 1895386
4820 1895386 1984409 2115020 2155853 2108808 2125442 2215100 2259592 2260453 2258611 2378058 2334188 2327147
4808 2327147 2393879 2460813 2547607 2485152 2536979 2552029 2585884 2701489 2822395 2779572 2706521
4797 2706521 2713904 2672680 2757319 3018135 2985246 3071008 3098411 3172572 3326589 3314720 3465142
4786 3465142 3508402 3592559 3572454 3582535 3669553 3724314 3791482 3790942 3817733 3923467 4079416
4775D079416L7505R1429J55354M5485N7073J03730O3060K01859J04570J16141
4765E055622J09812N9014J74927J59043J64418M2250J74038K44878J12383J42898
4755F439283J26208P4888Q2371J04080J93446K83219J60957O3881K07576J84766
4745G920675J15997K04892K45069J34205J71516K43179K14314K05928J91138Q9878
4735I736791J80342K15382J47694K21854J83244K43854K69276K26958k289K74363
4725A1697469J75339P2971Q6911K41774K61025L74792J90077J19276Q2066P1756
4715A3373456K33027J57926j02924J27743J25676K1994R9974L3852j13304j61853
4705A3795567L5110M3484P8250j01046n5521p3108m6847j97374j56224n7495p3716
$$ plain form
4775 4079416 4116921 4208350 4363704 4409189 4466262 4569992 4633052 4834911 4939481 5055622
4765 5055622 5165434 5224448 5399375 5558418 5722836 5765086 5939124 6184002 6296385 6439283
4755 6439283 6565491 6640379 6722750 6826830 7020276 7303495 7464452 7528333 7735909 7920675
4745 7920675 8036672 8241564 8486633 8620838 8792354 9035533 9249847 9455775 9646913 9736791
4735 9736791 9917133 10132515 10280209 10502063 10685307 10929161 11198437 11425395 11423106 11697469
4725 11697469 11872808 11945779 12032690 12274464 12535489 12910281 13100358 13219634 13301700 13373456
4715 13373456 13606483 13764409 13661485 13789228 13914904 13936898 14036872 14070724 13957420 13795567
4705 13795567 13830677 13874161 13952411 13851365 13795844 13722736 13675889 13478515 13322291 13264796 13191080
4694A3191080j87287r0315r8421j04137j98548k10802j54264j19700j06151j37231
4684A1784224k34575j47795j57678j23252k19619k66089j74177k48689j92558
4675A0019792j64858k08714j69608j80027k05243k03176j45697k29047j27739
4666H385683j67934l84213k16209p4062j25598j40707q7089j21384k00916j79517
4656F688054k33942m4991P0642j73811j62387k77363j39627n356p3282j40925
4646E507012M89q0545o7783r0563j3012k72934j76248o5278j74499J61002Q279
4635D735920j88817j44307j19116k0449j4151p7965j25043k2674P3027l0222j30901
4624C935302l9892j43628j26010J25746n2707j25617K927o9485N6872j00528j21192
$$ plain form
4694 13191080 13003793 12913478 12815057 12710920 12512372 12301570 12147306 12027606 11921455 11784224
4684 11784224 11549649 11401854 11244176 11120924 10901305 10635216 10461039 10212350 10019792
4675 10019792 9854934 9646220 9476612 9296585 9091342 8888166 8742469 8513422 8385683
4666 8385683 8217749 7833536 7617327 7543265 7417667 7276960 7189871 7068487 6867571 6688054
4656 6688054 6454112 6409121 6479763 6305952 6143565 5866202 5726575 5721219 5647937 5507012
4646 5507012 5507501 5426956 5359173 5268610 5255598 4982664 4806416 4741138 4566639 4727641 4735920
4635 4735920 4547103 4402796 4283680 4263231 4249080 4171115 4046072 4023398 4096425 4066203 3935302
4624 3935302 3895410 3751782 3625772 3751518 3698811 3573194 3576121 3506636 3563508 3462980 3341788
4613C341788j48145m3580q4731m0981J89003j63165q622m9979n9695j51469M4909
4602B825333J65585j00622j37672P9722p3184q1465m105J6715r6450j19171O4301
4591B538987l3763p5466K5292M6058K309j9310j00703q4078j03308o2609P3547
4580B206956j384q7812j1476K1511l9092p0777o0626J02300n3936n0117K6360
4569A981907j34783k0118J18132K8407N077o9191m0043K9064J6241n7283j42963
4558A714447L8236L6104j36107K1045r363j22204j227O5810O4515m6793J2909
4547A637372J4384p8873m0864J31655J09484m4906j28866m8666k4518M712j51999
4536A378915o0009J06884J05974O1993q1628j04109J35652r90r1761M5123m3760
$$ plain form
4613 3341788 3193643 3150063 3065332 3024351 3213354 3050189 3041567 2991588 2931893 2780424 2825333
4602 2825333 2990918 2890296 2752624 2832346 2759162 2677697 2673592 2690307 2593857 2474686 2538987
4591 2538987 2505224 2429758 2455050 2501108 2503417 2484107 2383404 2299326 2196018 2133409 2206956
4580 2206956 2205572 2117760 2106284 2127795 2088703 2017926 1957300 2059600 2005664 1955547 1981907
4569 1981907 1847124 1827006 1945138 1973545 1978622 1909431 1869388 1898452 1914693 1857410 1714447
4558 1714447 1752683 1788787 1652680 1673725 1664362 1542158 1540931 1606741 1671256 1624463 1637372
4547 1637372 1651756 1572883 1532019 1663674 1773158 1728252 1599386 1550720 1526202 1530914 1378915
4536 1378915 1318906 1425790 1531764 1593757 1512129 1408020 1543672 1542682 1450921 1496044 1452284
4525A452284J1108q027L1827K1431m4992m3897P5088k2309J3809P9156N6429l4651
4513A587256K6360q7471o0775J30924p5498K5187p1295K3617J11320p0843J44339
4502A683121P9719l5773j64440k2287k6657L8952R0275l8435m9760J2260N1203
4491A618178k4862O2305r36M8029L9101R1142o345k6902j01893P3113P6251P1967
4479A919148j8297M9190K5789o7343n6818j3358p0324M0285P7662l559N1532N0594
4467A984501K0651M4396p0783j24666O7804J02235o4028m4783J15050m3089j07096
4456A880192m906O0620J38433J32331O1330r9159J17029L7947r2296J95420M2312
4445B469253M8491n9023P2530J14072P6151Q0920O3011o259P3927J89863J45113
$$ plain form
4525 1452284 1463392 1455365 1487192 1508623 1463631 1419734 1494822 1472513 1486322 1565478 1621907 1587256
4513 1587256 1613616 1526145 1465370 1596294 1520796 1545983 1474688 1498305 1609625 1538782 1683121
4502 1683121 1762840 1727067 1562627 1540340 1513683 1552635 1642910 1604475 1554715 1566975 1618178
4491 1618178 1593316 1655621 1654685 1702714 1741815 1832957 1826612 1799710 1697817 1770930 1847181 1919148
4479 1919148 1900851 1950041 1975830 1908487 1851669 1838311 1767987 1808272 1885934 1882375 1933907 1984501
4467 1984501 2005152 2049548 1978765 1854099 1921903 2024138 1960110 1915327 2030377 1987288 1880192
4456 1880192 1875286 1935906 2074339 2206670 2268000 2168841 2285870 2323817 2231521 2426941 2469253
4445 2469253 2517744 2458721 2531251 2645323 2721474 2802394 2865405 2859146 2933073 3122936 3268049
4434C268049Q4020R1329J92324K66057Q0333J07517J53858K98520J34753K78631
4424D955391L98650J50528L37733L11115K66904L07519L43579L53587N32317N36913
4414H494236N84232O59072M03677L13755L62826M43361M03709K73147M12555M36895
4404A2787465M07815N76737P26620P82350P57272Q02516P49145O80158N71401
4395A8841479K84086J65327L514J11056Q1178K32734M76543N94637N82030O44014
4385B2016598P23421P24581O37349K63893R2253k15574l03146l97774m19701l39446
4375B2782454k03538r605L52480K87485M21470M92386L43385K49975J16052j22048
4365B4710496l41326m05093n76935l23039k70095k38473j54056j17392p6771K05652
$$ plain form
4434 3268049 3352069 3443398 3635722 3901779 3982112 4089629 4243487 4542007 4676760 4955391
4424 4955391 5354041 5504569 5842302 6153417 6420321 6727840 7071419 7425006 7957323 8494236
4414 8494236 9078468 9737540 10141217 10454972 10817798 11261159 11664868 11938015 12350570 12787465
4404 12787465 13195280 13772017 14498637 15280987 16038259 16840775 17589920 18270078 18841479
4395 18841479 19125565 19290892 19294406 19405462 19486640 19719374 20195917 20790554 21372584 22016598
4385 22016598 22740019 23464600 24101949 24365842 24458095 24242521 23939375 23541601 23121900 22782454
4375 22782454 22578916 22569311 22921791 23209276 23630746 24123132 24466517 24716492 24832544 24710496
4365 24710496 24369170 23964077 23387142 23064103 22794008 22555535 22401479 22284087 22207316 22412968
4355B2412968K46526J34969M4300o2726p2281k24350j49988j29846j47652m4480
4345B2007440J22359J51958J90988M82553L84141M39205O66107N42313N29166
4336B5516230O50576N82176N94801M93087M50295M86194L42722J75331J05900
4327B9397312R0168J77878J80522K92610M77512N18123M05726L96922O24765P11444
4317C3272982P74355O64892O32228N82378P14831N91394M29288L12536J98099
4308C8172983J08820K680M183m2999j30037J12364j59980j27893l68053l05793
4298C7266275l37848m65651m60299o76380l77364o26237n16147o19656m49034
4289C2737659m17772m55407l60005l60879n74154m21625k86774k70719m15317
$$ plain form
4355 22412968 22659494 22794463 22838763 22776037 22703756 22479406 22329418 22199572 22051920 22007440
4345 22007440 22129799 22281757 22472745 22955298 23339439 23778644 24444751 24987064 25516230
4336 25516230 26166806 26748982 27343783 27836870 28287165 28773359 29116081 29291412 29397312
4327 29397312 29487480 29665358 29845880 30138490 30616002 31134125 31539851 31936773 32561538 33272982
4317 33272982 34047337 34712229 35344457 35926835 36641666 37233060 37662348 37974884 38172983
4308 38172983 38281803 38284483 38288666 38245667 38115630 38227994 38068014 37940121 37572068 37266275
4298 37266275 36928427 36462776 36002477 35326097 34948733 34322496 33806349 33186693 32737659
4289 32737659 32319887 31864480 31504475 31143596 30569442 30147817 29861043 29590324 29175007
4280B9175007n05013m28276m36917p39135q45845p77548q38677r03534r71376
4271B2728686j070150r36917p43658q51891q53978p10505n07470n82787m85939
4262A5985391m47220m24262n80142l92961m26458m95552l47392m26981k73417
4253A2171006l81333m05671k31527k13999j92061j37613j88119j58664p4041j62449
4243A0025529j86783r4163r1589j43811q2106k60880k05278j90365k09743k01191
4233H359620j14661j08088k16644n7837P415N0108j10844k23029k9285k18263
4223G338492k92642l68659j83263j40741k18326j78524k42180j02387k06082j03166
4213E302522j37097k45734j18034j23642M2359o3054j26732N7943n6099o8504
$$ plain form
4280 29175007 28669994 28241718 27804801 27065666 26219821 25442273 24603596 23700062 22728686
4271 22728686 21658536 20721619 19977961 19126070 18272092 17561587 17054117 16471330 15985391
4262 15985391 15538171 15113909 14533767 14140806 13714348 13218796 12871404 12444423 12171006
4253 12171006 11789673 11384002 11152475 10938476 10746415 10608802 10420683 10262019 10187978 10025529
4243 10025529 9838746 9744583 9652994 9509183 9427077 9166197 8960919 8770554 8560811 8359620
4233 8359620 8244959 8136871 7920227 7862390 7869805 7919913 7809069 7586040 7556755 7338492
4223 7338492 7045850 6677191 6493928 6353187 6134861 5956337 5714157 5611770 5405688 5302522
4213 5302522 5165425 4919691 4801657 4678015 4720374 4657320 4530588 4588531 4532432 4463928
4203D463928N3589p8688m7213m5734J19569J32189j98301j4530J7005J8447j92232
4192D228029N2788n8988M5944J54950R8296K253j14553M7160K739J37539o9519
4181D526638j24266R8744Q0465P2084o4507M1681J86021J6470M0395J8630j65157
4170D727198J776o8722Q6755M1388M1616M8468j823O1798m3478M3160j04977l4950
4158D798209o9490P6253J7556j04649j3150R9583O7107p3517k5844m8839J9055
4147D742274J47240K2686k14811R3386J44022L6428J49140P9410Q7293J16063
4137E403131L7780P1332K15448N8815J62193K20916K66145J64739K37352J86592
4127G024443K29446K45806K86432J43968M9950M9820M3675K49403J01629Q8114
$$ plain form
4203 4463928 4517517 4438829 4391616 4345882 4465451 4597640 4399339 4384809 4401814 4420261 4228029
4192 4228029 4280817 4221829 4267773 4422723 4521019 4523272 4408719 4455879 4458618 4596157 4526638
4181 4526638 4402372 4501116 4581581 4653665 4589158 4630839 4816860 4833330 4873725 4892355 4727198
4170 4727198 4728974 4660252 4747007 4788395 4830011 4878479 4876656 4938454 4894976 4938136 4833159 4798209
4158 4798209 4728719 4804972 4822528 4717879 4704729 4804312 4871419 4797902 4772058 4723219 4742274
4147 4742274 4889514 4912200 4697389 4790775 4934797 4971225 5120365 5199775 5287068 5403131
4137 5403131 5440911 5512243 5727691 5786506 5948699 6169615 6435760 6600499 6837851 7024443
4127 7024443 7253889 7499695 7786127 7930095 7980045 8029865 8073540 8322943 8424572 8512686
4117H512686J64032M2597O5032J2051L2997K35161J91271K20839J90085J35588
4107I802339K93865J58068K17536K59356J92196L96989J38470J82801J53319J57399
4097A1952338K14514q383J15410J42818K89973M79775M17390L73636N60266M68888
4087A5006625L81802M24531L39412P20791P16512M48153L89252M59527N52326
4078A9438931P12714O63701L64281M03780M15218K58141M19386L18418K38434
4069B3233004K11908J84589K20618O1227J78803L04270K86758L49735L43830M46797
4059B5821539M62138M84535P38149O31320N65257P25363P35054P69978R03563
4050C1836896R10748R34958J013918R39942R94242J134691J142300J079814J052260
$$ plain form
4117 8512686 8676718 8719315 8784347 8796398 8829395 9064556 9255827 9476666 9666751 9802339
4107 9802339 10096204 10254272 10471808 10731164 10923360 11320349 11458819 11641620 11794939 11952338
4097 11952338 12166852 12158469 12273879 12416697 12706670 13186445 13603835 13977471 14537737 15006625
4087 15006625 15388427 15812958 16152370 16873161 17589673 18037826 18427078 18886605 19438931
4078 19438931 20151645 20815346 21179627 21583407 21998625 22256766 22676152 22994570 23233004
4069 23233004 23444912 23629501 23850119 23911346 24090149 24394419 24681177 25030912 25374742 25821539
4059 25821539 26283677 26768212 27506361 28137681 28702938 29428301 30163355 30933333 31836896
4050 31836896 32747644 33682602 34696520 35636462 36630704 37765395 38907695 39987509 41039769
4041D1039769J296375J400374J428512J230925J415289J526740J773479K018528
4033E3129991K193920K380355K540931K621524K691087K717656K850970L028176
4025G4154610K809295K823862K658047K540106K553454K428817K398920K397691
4017I4764802K091240J835075J453332J089432N69854J25611k92033q29183j273805
4008I9534325j502571j653420j750200k018812k008017j714522j607101j859428
4000H5420254k062789k345378k673501k674218k886292l175942l444274l528234
3992F2629626l752729l553937l346852l270352l159751k805382k517242k298176
3984C7925205k025841j890585j638394j616002j448462j290581j064965j093012
$$ plain form
4041 41039769 42336144 43736518 45165030 46395955 47811244 49337984 51111463 53129991
4033 53129991 55323911 57704266 60245197 62866721 65557808 68275464 71126434 74154610
4025 74154610 76963905 79787767 82445814 84985920 87539374 89968191 92367111 94764802
4017 94764802 96856042 98691117 100144449 101233881 101803735 101929346 101637313 100808130 99534325
4008 99534325 98031754 96378334 94628134 92609322 90601305 88886783 87279682 85420254
4000 85420254 83357465 81012087 78338586 75664368 72778076 69602134 66157860 62629626
3992 62629626 58876897 55322960 51976108 48705756 45546005 42740623 40223381 37925205
3984 37925205 35899364 34008779 32370385 30754383 29305921 28015340 26950375 25857363
3976B5857363j076752r61385q46115q22977o35842o94898n66210m79385m63058
3967A9310741n93961o06951m52421m29428l42117m58439l97639k85211k67181
3958A5477393l06010l62717k53434k68865l68690j33541k07403k79811j00153
3949A3196769k10498p0366l9412q9814J0393j93899p4926q4221j62240j70696
3939A2111090k1137L9275j30042M2960m9863j99107r2170P8396Q6811M3243K1285
3928A1930741K00055J71232O947K01864J30342J38251M21143K05399K35400L94428
3918A4035802M01954N16253L47416M18625M88018M90047M74847M89565K66000
3909A7928527K70749K72697J93277J14194j17509j43746j17389j11519j30040
$$ plain form
3976 25857363 24780611 23819226 22973111 22150134 21514292 20819394 20253184 19773799 19310741
3967 19310741 18716780 18109829 17657408 17227980 16885863 16427424 16029785 15744574 15477393
3958 15477393 15171383 14808666 14555232 14286367 13917677 13784136 13576733 13296922 13196769
3949 13196769 12986271 12915905 12876493 12786679 12797072 12603173 12528247 12444026 12281786 12111090
3939 12111090 12089953 12129228 11999186 12042146 11992283 11793176 11701006 11779402 11866213 11909456 11930741
3928 11930741 12130796 12302028 12308975 12510839 12641181 12779432 13200575 13405974 13641374 14035802
3918 14035802 14437756 14954009 15301425 15720050 16208068 16698115 17172962 17662527 17928527
3909 17928527 18199276 18471973 18665250 18779444 18661935 18518189 18400800 18289281 18159241
3900A8159241j90496k00124k30667l90p5861j98603J10428J80554J45647J75808
3890A7875537K36086L45462L73178L67590M06802N67974N06409P80380P39240
3881B2198658P25977R23765R23331J034145J238979J283988J339044J465736J789442
3872C2923065J762253K061744K324787K306674K629979K792427K733359L168126
3864E2702414L270643L261148L362269L220297L180583K781536K482701K275737
3856G6537328J744868J451157R64278N32833M60614j17800k23849k02363n18604
3847H0628462n75647k54079k08149m10453l41682j86351k81775m00444m26681
3838G7543201n59445p73676o81738r57273j435183j430111j381089j342304j430720
$$ plain form
3900 18159241 17968745 17768621 17537954 17537564 17461703 17263100 17373528 17554082 17699729 17875537
3890 17875537 18111623 18457085 18830263 19197853 19604655 20172629 20679038 21459418 22198658
3881 22198658 22924635 23848400 24771731 25805876 27044855 28328843 29667887 31133623 32923065
3872 32923065 34685318 36747062 39071849 41378523 44008502 46800929 49534288 52702414
3864 52702414 55973057 59234205 62596474 65816771 68997354 71778890 74261591 76537328
3856 76537328 78282196 79733353 80697631 81230464 81691078 81573278 81349429 81147066 80628462
3847 80628462 80052815 79798736 79590587 79180134 78838452 78652101 78370326 77969882 77543201
3838 77543201 76983756 76210080 75528342 74571069 73135886 71705775 70324686 68982382 67551662
3829F7551662j464752j392448j296524j030283r22742n68890l87605N8328L83942
3820F0930688P13655J035090J773234K064614K404350K867622L276416L664078
3812G8729747L806972L691548L420619L116532K747734K299118J822964J415539
3804A01050773R91139M29474j32297m57522p98757j053964j168749j376642j511509
3795I5971946j521714j610974j912748k078036k139565k390700k879052k951777
3787G8487380l139514l442965l448679l501721l552402l477760l384599l318252
3779E1221488l086893k936634k682888k602140k297949k200133j830940j739690
3771C1844221j791356j538446j435434j316520j141403j101735q70707p41637
$$ plain form
3829 67551662 66086910 64694462 63397938 62367655 61444913 60876023 60488418 60546746 60930688
3820 60930688 61644343 62679433 64452667 66517281 68921631 71789253 75065669 78729747
3812 78729747 82536719 86228267 89648886 92765418 95513152 97812270 99635234 101050773
3804 101050773 102041912 102471386 102339089 101881567 101082810 100028846 98860097 97483455 95971946
3795 95971946 94450232 92839258 90926510 88848474 86708909 84318209 81439157 78487380
3787 78487380 75347866 71904901 68456222 64954501 61402099 57924339 54539740 51221488
3779 51221488 48134595 45197961 42515073 39912933 37614984 35414851 33583911 31844221
3771 31844221 30052865 28514419 27078985 25762465 24621062 23519327 22648620 21906983
3763B1906983q80846q79330n72780n59425o06869n69412k85104l05631l68077
3754A6879509k27527j68423l4815o0722l9725L4397J26855Q335p313K00110K52195
3743A6962876J23066m7861P3934N132o2174j21786l60983l28415j34933l26981
3733A5781875n54613m17317m49627o25792o69668l95058l30774l84090m40660
3724A1514276l34266l57877l92135j32162m06113l64615j68773k89408k51009
3715H817918j67128j51810k43619k62698j22900j9608q9007M497j52855r9734
3705G513056N514j83723J3642j02131j44620j04892l6366k0333J24132j09717
3695F954562j44288Q1130r0309M698m5070J4938p7094q8182m9498n6078l7953
$$ plain form
3763 21906983 21026137 20146807 19574027 19014602 18407733 17838321 17553217 17247586 16879509
3754 16879509 16651982 16483559 16448744 16388022 16348297 16382694 16509549 16517884 16510571 16710681 16962876
3743 16962876 17085942 17038081 17112015 17117147 17054973 16933187 16572204 16243789 16108856 15781875
3733 15781875 15227262 14809945 14360318 13734526 13064858 12669800 12339026 11954936 11514276
3724 11514276 11180010 10822133 10429998 10297836 9891723 9527108 9358335 9068927 8817918
3715 8817918 8650790 8498980 8255361 7992663 7869763 7850155 7761148 7765645 7612790 7513056
3705 7513056 7518570 7334847 7348489 7246358 7101738 6996846 6960480 6940147 7064279 6954562
3695 6954562 6810274 6891404 6801095 6805793 6760723 6775661 6698567 6610385 6560887 6504809 6466856
3684F466856j35698j00618l0840j17075J827P2629j83530q0367l4880N68k8269
3673E830603o9953R5813j609p307L6143o857o749r1523q6344K5500l6738R2220
3661E773199L1546N1891P1665J41944P2333l6327p0480K88756J01717l5783Q4392
3650F474853o3420N6460K59847K24496Q8278m2806Q673L15324K59737K31112L74328
3639H186882J79845Q0914K78883M27741L32397M27497L67388L81227M51395N61341
3629A1675510N75098M76570O52082N85235M82443M77815N22168L35689N84369
3620A6366979N43924N72138N75263N49064O59464L76686N32794M47501L15021
3611B0938834M86710K85899K36678R9410J97487J35100l6172n8631O3841O4336
$$ plain form
3684 6466856 6331158 6230540 6199700 6082625 6084452 6157081 5973551 5893184 5858304 5858872 5830603
3673 5830603 5760650 5856463 5854854 5847547 5883690 5876833 5870084 5778561 5692217 5717717 5680979 5773199
3661 5773199 5804745 5856636 5928301 6070245 6142578 6106251 6035771 6324527 6426244 6390461 6474853
3650 6474853 6411433 6467893 6727740 6952236 7040514 6997708 7006381 7321705 7581442 7812554 8186882
3639 8186882 8366727 8447641 8726524 9154265 9486662 9914159 10281547 10662774 11114169 11675510
3629 11675510 12250608 12727178 13379260 13964495 14446938 14924753 15446921 15782610 16366979
3620 16366979 16910903 17483041 18058304 18607368 19266832 19643518 20176312 20623813 20938834
3611 20938834 21425544 21711443 21948121 22047531 22245018 22380118 22343946 22285315 22349156 22413492
3601B2413492J76124J52112K55008J01668K8442J51803K38267K31043J01002L26027
3591B4174988M65086M80223N72936O59833P87573J102965J318124J237983J572481
3582C2372192J768559J918459K282881K688527K830651L299454L675454L972090
3574E4808267M266314M475150M706657N059265N205163N058134N020203M795901
3566I3395054M362374M274060M106548M072200L596426L318386L443994L066825
3558A23635867K600506K069468J628089J119460O00842l42896p50515j216882
3550A29343939j705165k196985k320140k575398l018057l349161l562127l947722
3542A06669184l902269m136973m384380m522098m265151m127919l943254l864598
$$ plain form
3601 22413492 22589616 22741728 22996736 23098404 23126846 23278649 23516916 23747959 23848961 24174988
3591 24174988 24640074 25120297 25693233 26353066 27140639 28243604 29561728 30799711 32372192
3582 32372192 34140751 36059210 38342091 41030618 43861269 47160723 50836177 54808267
3574 54808267 59074581 63549731 68256388 73315653 78520816 83578950 88599153 93395054
3566 93395054 97757428 102031488 106138036 110210236 113806662 117125048 120569042 123635867
3558 123635867 126236373 128305841 129933930 131053390 131654232 131311336 130560821 129343939
3550 129343939 127638774 125441789 123121649 120546251 117528194 114179033 110616906 106669184
3542 106669184 102766915 98629942 94245562 89723464 85458313 81330394 77387140 73522542
3534G3522542l597891l278617k743220k404747k309814j844193j509533j312612
3526E4521915j146502o99144l76147k48253q9203j34046K46746R6696L16483M99347
3516E2987892K45958M25210M76312J27662R6103J7679M4068q1921r5817n3717
3506E4189429k83369l02212l39370l64843n13930n67146p19555q31611j073772
3497D9193621j070546j197842j099082j242753j245519j717080j906651k044517
3489C7669631j861468j617144j489411j273071j143586j174310j120746p50078
3481B7239817p81758p91736p95050o59790m54068m34510k13765k00816N0250n7587
3471B2900987j02229K3378J12986L87296M97066L65207M47124M39124K501j99407
$$ plain form
3534 73522542 69924651 66646034 63902814 61498067 59188253 57344060 55834527 54521915
3526 54521915 53375413 52676269 52300122 52051869 51962666 51828620 52075366 52172062 52488545 52987892
3516 52987892 53233850 53659060 54135372 54263034 54359137 54376816 54420884 54338963 54243146 54189429
3506 54189429 53906060 53603848 53264478 52899635 52385705 51818559 51099004 50267393 49193621
3497 49193621 48123075 46925233 45826151 44583398 43337879 41620799 39714148 37669631
3489 37669631 35808163 34191019 32701608 31428537 30284951 29110641 27989895 27239817
3481 27239817 26458059 25666323 24871273 24211483 23757415 23322905 23109140 22908324 22958574 22900987
3471 22900987 22798758 22822136 22935122 23322418 23819484 24184691 24631815 25070939 25073440 24874033
3461B4874033l24525o1683Q7351O0645J19720J50808J94750R6557n8206J5629
3451B5155079J34391Q1219J8180J11477K63176Q6577L1038J89737J88026J88481
3441B6447381j0329j3757J26480n3536p785K39485R3771K33620M58269p6716n75010
3430B6861873p34393m60564m4409K57017L34586M74306N33812R10716J152310
3421B9285254J394175J477098J573908J598056K066826K130643K396776K738093
3413D4660829L241939L528383L765211M338502M378149M591790M344563M056594
3405G6905960L685967L226328K790823J888314O81540j098770k886367l579729
3397H1614066l889097l758944l583722l362247k864641k476696k236497j779275
$$ plain form
3461 24874033 24549508 24487825 24575176 24635821 24755541 24906349 25101099 25197656 25139450 25155079
3451 25155079 25289470 25370689 25388869 25500346 25763522 25850099 25881137 26070874 26258900 26447381
3441 26447381 26437052 26423295 26549775 26496239 26488454 26727939 26821710 27055330 27513599 27436883 26861873
3430 26861873 26127480 25666916 25622507 25879524 26214110 26688416 27222228 28132944 29285254
3421 29285254 30679429 32156527 33730435 35328491 37395317 39525960 41922736 44660829
3413 44660829 47902768 51431151 55196362 59534864 63913013 68504803 72849366 76905960
3405 76905960 80591927 83818255 86609078 88497392 89178932 88080162 85193795 81614066
3397 81614066 77724969 73966025 70382303 67020056 64155415 61678719 59442222 57662947
3389E7662947j401098r93145p47100m61011l38486j83705m3441r1785J8348J6448
3379E3437972M2165K52493M7309K7281o9657j13066k66313k01835o4641j0362
3369E3081346m1048o37484j212634j091167j005358j169518j242881j127959j326764
3360D4226533j559170j725045j626901j520815j606462j611235j311323j512907
3352C1752675j681514j573429j336359j107751j162604j011082j036734j066177
3344B1777025j007697r92090q17088p60837p85932n80891m84488n10018m81904
3335A5356080n09029m54160m61679l18401k91965l13585q4918k27259j33762k26726
3325A2334596k68775m10713l75231l25042k21821k69147j01121o5012p1321n0483
$$ plain form
3389 57662947 56261849 55268704 54521604 54060593 53722107 53538402 53494961 53403176 53421524 53437972
3379 53437972 53480137 53732630 53779939 53807220 53737563 53624497 53358184 53156349 53091708 53081346
3369 53081346 53040298 52402814 51190180 50099013 49093655 47924137 46681256 45553297 44226533
3360 44226533 42667363 40942318 39315417 37794602 36188140 34576905 33265582 31752675
3352 31752675 30071161 28497732 27161373 26053622 24891018 23879936 22843202 21777025
3344 21777025 20769328 19777238 18960150 18199313 17413381 16832490 16348002 15837984 15356080
3335 15356080 14847051 14392891 13931212 13612811 13320846 13007261 12922343 12695084 12561322 12334596
3325 12334596 12065821 11655108 11279877 10954835 10733014 10463867 10362746 10297734 10226413 10175930
3315A0175930M0407R0482j0436j01138M3861j4733m8730P5120j3201M6847j12645
3304A0171764k11415k47965j74696k24478k61016l32139j32787l11913k21580
3295H053775k19175j91833k21938l2318j10310j93034j70624p1584j4952j27039
3285F700968q6124j1410j00549q6627j49047k28481o5840J6066j6553j07199k480
3274E862724o2320q6047n5455J12523n6620j6612J1381k1507j07957j4703r6174
3263E469233l8839K1846o6650N3105Q8645l6469k8168j14658l1289k1387q4465
3252E210904m5910j32175q990M9548p9801J408j23018N2138l7805M2691j12602
3241D816388P830J6635J06579J02985j37836L1694n1033j7996q583P0388L356
$$ plain form
3315 10175930 10216337 10306819 10296383 10195245 10239106 10224373 10175643 10250763 10237562 10284409 10171764
3304 10171764 9960349 9712384 9537688 9313210 9052194 8720055 8587268 8275355 8053775
3295 8053775 7834600 7642767 7420829 7388511 7278201 7085167 6914543 6842959 6828007 6700968
3285 6700968 6614844 6603434 6502885 6416258 6267211 6038730 5972890 5988956 5972403 5865204 5862724
3274 5862724 5800404 5714357 5658902 5771425 5714805 5698193 5709574 5688067 5580110 5565407 5469233
3263 5469233 5430394 5452240 5385590 5438695 5527340 5490871 5462703 5348045 5316756 5295369 5210904
3252 5210904 5164994 5032819 5023829 5073377 4993576 4994984 4871966 4924104 4886299 4928990 4816388
3241 4816388 4824218 4840853 4947432 5050417 4912581 4944275 4893242 4875246 4866663 4937051 4940407
3230D940407J8344R8530L7602J05200R2121m864j6473P7048J80405J11716J88990
3219E829026K16353J30502J35075j01898J52880J72766J59306j2690M9158Q2294
3209F812772J98344J29737L3299K14784J25295J86470J78899N9872J26623K10465
3199H276560J27111L76159N1869K51219K82753K97499K83838L11122J57474L23311
3189A0738915N58658N23001M81537N44792O32587P82814Q08850R10178R49051
3180A6930383Q78617Q08621O47770L61960J68904K29842K44696K37897N16028
3171B1024718O18421P77679R45941J123072J221903J371019J578289J549404J538200
3162C1748646J582988J963010K155472K332428K561189L279369L639965L867844
$$ plain form
3230 4940407 4958751 5057281 5094883 5200083 5292204 5287340 5270867 5347915 5528320 5640036 5829026
3219 5829026 6045379 6175881 6310956 6209058 6361938 6534704 6694010 6681320 6730478 6812772
3209 6812772 7011116 7140853 7174152 7388936 7514231 7700701 7879600 7939472 8066095 8276560
3199 8276560 8403671 8779830 8831699 9082918 9365671 9663170 9947008 10258130 10415604 10738915
3189 10738915 11297573 11820574 12302111 12846903 13479490 14262304 15071154 15981332 16930383
3180 16930383 17809000 18617621 19265391 19627351 19796255 20026097 20270793 20508690 21024718
3171 21024718 21643139 22420818 23366759 24489831 25711734 27082753 28661042 30210446 31748646
3162 31748646 33331634 35294644 37450116 39782544 42343733 45623102 49263067 53130911
3154E3130911M489276M816542N629402O779959P263164Q281599R393035J0369603
3146A10153491J1713549J3096961J4806077J6466369J8244985K0458452K3531562
3139B28471446K5152796K1851313J0449588p633301k3835474l1015773k9952656
3132A93487939k5359159k0309326j5806558j1848077r177448p590613o367803
3125I7028955n696264n166967m777751m115745l603972l037541k466007k015666
3117F6149042j686300j236968q43443q54657o64380m30063k59861o5661K3815
3108F0131524J55488M96439O35364R29341J131641J553386J874572K212222K728751
3099G1848728L361301L783796M337334N123625N772529O345070O921122P886488
$$ plain form
3154 53130911 57620187 62436729 68066131 74846090 82109254 90390853 99783888 110153491
3146 110153491 121867040 134964001 149770078 166236447 184481432 204939884 228471446
3139 228471446 253624242 275475555 285925143 278291842 254456368 223440595 193487939
3132 193487939 168128780 147819454 132012896 120164819 110987371 103396758 97028955
3125 97028955 91332691 86165724 81387973 77272228 73668256 70630715 68164708 66149042
3117 66149042 64462742 63225774 62382331 61527674 60863294 60433231 60173370 60107709 60131524
3108 60131524 60287012 60783451 61418815 62348156 63479797 65033183 66907755 69119977 71848728
3099 71848728 75210029 78993825 83331159 88454784 94227313 100572383 107493505 115379993
3091A15379993Q629980R473523J0171130J0819330J1415484J1490948J1429932
3084A88810320J0345323Q015473M930296O5254n280052r612527j2500240j3884286
3076A70889561j3913674j3050778j1709717j0591286r317591q139853p372872
3069I6793790o863681o306306n513442n128014m760038m313500l844684l409941
3061E6654184l218121l147371k752360k583011k314704k195646j880194j685493
3053C6877284j574615j644492j411009j280891j258501j249212j150803j145928
3045B6161833j059847j021089q91697q72930q25868o37247n96775o87214p76347
3036A8792819m51850n16892o31173n41604m25359n08333n57908l71025l97762
$$ plain form
3091 115379993 124009973 133483496 143654626 154473956 165889440 177380388 188810320
3084 188810320 199155643 207171116 212101412 212166666 206886614 197274087 184773847 170889561
3076 170889561 156975887 143925109 132215392 121624106 112306515 104166662 96793790
3069 96793790 89930109 83623803 78110361 72982347 68222309 63908809 60064125 56654184
3061 56654184 53436063 50288692 47536332 44953321 42638617 40442971 38562777 36877284
3053 36877284 35302669 33658177 32247168 30966277 29707776 28458564 27307761 26161833
3045 26161833 25101986 24080897 23189200 22316270 21490402 20853155 20256380 19569166 18792819
3036 18792819 18340969 17824077 17192904 16651300 16225941 15717608 15159700 14788675 14390913
3027A4390913m86693l47833l72166m57470k01785k90655l71198k25646k33291
3018A1404176k99584k22509l02311k33814j57107k22732k07872r3975k11676k56891
3008I195705j21302j38690j19067k46959l12516l42825J7580q9504l83974k28942
2998G229506K0727n9808k54405r0311j2958k3242r3241p1164k30202q2016j88896
2987F143990j97230J7896J7977o9790j09609m0828m4009k06072j59334J7547j04776
2976E265762k8416p7552J0719j74004j02413n5921Q113k56102k3507n7347r6106
2965D413226r1225j02086J12177j14286j69625n0553o2795L0253q1672j12811
2955C770603l8106l39Q9010j00388q3379q610j28365Q0406k9284q7755m0687j58750
$$ plain form
3027 14390913 13904220 13556387 13184221 12726751 12524966 12234311 11863113 11637467 11404176
3018 11404176 11104592 10882083 10579772 10345958 10188851 9966119 9758247 9664272 9452596 9195705
3008 9195705 9074403 8935713 8816646 8569687 8257171 7914346 7931926 7842422 7458448 7229506
2998 7229506 7250233 7190425 6936020 6845709 6832751 6809509 6716268 6645104 6414902 6332886 6143990
2987 6143990 5946760 5964656 5982633 5912843 5803234 5762406 5718397 5512325 5352991 5370538 5265762
2976 5265762 5237346 5159794 5170513 4996509 4894096 4838175 4846288 4590186 4566679 4509332 4413226
2965 4413226 4322001 4219915 4332092 4217806 4048181 3997628 3934833 3965086 3883414 3770603
2955 3770603 3732497 3732158 3821168 3720780 3637401 3628791 3500426 3580832 3551548 3463793 3423106 3264356
2943C264356j33997J2696M8894r8147k8736N0680q1153q2997m9694K1658J7096
2932B940656j68349p1117J0151j31473o1597R5395j6466J57386m946j45482m1860
2921B562298p6200R7673k6730j67898j995n7681P7742j6526j61623n5007p567
2910B166486K5095L2396j27405J6595o5627l6363P6579N0563K4483k772n8525
2899B101505j0396K9337p1570P9382q4018j60281M6262q3486k8451M9788l7760
2888A830312K1399n9773O7077r0621j1726M8906M5480O3690k9201M257j43501
2877A746299o888O5911L488r74l6231J6694o170n080p072M7487o538J58752O723
2864A976401r9623J28227M8838P006j9026J2262K52606J3890j04436J58980Q9176
$$ plain form
2943 3264356 3130359 3143055 3191949 3093802 3065066 3115746 3034593 2951596 2901902 2923560 2940656
2932 2940656 2772307 2701190 2711341 2579868 2518271 2613666 2597200 2754586 2749640 2604158 2562298
2921 2562298 2486098 2583771 2557041 2389143 2387148 2329467 2407209 2390683 2229060 2174053 2166486
2910 2166486 2191581 2223977 2096572 2113167 2047540 2011177 2087756 2138319 2162802 2160030 2101505
2899 2101505 2091109 2120446 2048876 2128258 2044240 1883959 1930221 1846735 1818284 1868072 1830312
2888 1830312 1851711 1791938 1859015 1768394 1756668 1805574 1851054 1914744 1885543 1889800 1746299
2877 1746299 1739411 1805322 1808810 1807836 1771605 1788299 1782129 1777049 1769977 1817464 1810926 1969678 1976401
2864 1976401 1876778 2005005 2053843 2060849 2041823 2054085 2306691 2320581 2216145 2375125 2464301
2853B464301J95256l857N7007j11410j72786k19990j66251o8880k6446j30282
2843A816662J7183l4901k01696p4882o8460K0974Q6655J66925l9764r5397K9617
2832A622916K928j55062O0207J33233m5073k18611j6084N9291r3172L8349J9470
2821A408392Q7465J3508L2856j15667j8907o2859J7073Q7775M5492P2032P6575
2810A643735l7917l6715k1924l3436L2575O9194K14778J7496r868j48969N4954
2799A743903k0527K6782J00164p6392j43618N8008J19540m6631j11540j45888
2789A503801j11992o4969J54211N8187j34265j38279j21561l0704M7883K6436
2779A188748R2163j09565n9602N0894j21719j28549j7260J15139m5172p4389n4719
$$ plain form
2853 2464301 2659557 2655700 2712707 2601297 2428511 2208521 2042270 1973390 1946944 1816662
2843 1816662 1833845 1798944 1597248 1522366 1453906 1474880 1561535 1728460 1688696 1593299 1622916
2832 1622916 1625844 1470782 1530989 1664222 1619149 1400538 1384454 1443745 1350573 1388922 1408392
2821 1408392 1495857 1509365 1542221 1426554 1407647 1344788 1361861 1449636 1495128 1567160 1643735
2810 1643735 1605818 1569103 1547179 1513743 1546318 1615512 1830290 1847786 1837918 1688949 1743903
2799 1743903 1723376 1750158 1850322 1773930 1630312 1688320 1807860 1761229 1649689 1503801
2789 1503801 1391809 1326840 1481051 1539238 1404973 1266694 1145133 1114429 1162312 1188748
2779 1188748 1280911 1171346 1111744 1162638 1040919 912370 895110 1010249 965077 890688 835969
2768H35969O0268j15271P3317J17396l9880m7007k4865j3802r8894q7703K12184
2757H71712J8661k14958j12312P7821O5809K470K1994j6809J4677p3028p3858
2746E82179N7034Q5443l2612K3014N5905j29897k4185N4636L699m972J6172N160
2734F91576l9372k0030j87708K6988P3288j0600p1532k0105M5375l5811o8084
2723C83985J50521R255R1351M0171o8990o5891j8435l335J9421M2255J1654j78452
2711D13510L2334Q4584n1199l423l0116m0582J4949o3951j0604q1515L5818K00487
2699E00292J04853q5853l5054j5960J2976M1285q1547N9324j4783J4646j05416
2688C94763K8917r6211O6947J9038K0243o184m7170j1898J29827P9455m2983q6555
$$ plain form
2768 835969 896237 780966 854283 971679 931799 884792 859927 846125 747231 659528 871712
2757 871712 890373 675415 563103 640924 706733 709203 731197 714388 729065 656037 582179
2746 582179 639213 724656 692044 715058 770963 641066 616881 671517 675216 670244 686416 691576
2734 691576 652204 632174 444466 471454 544742 534142 462610 442505 487880 452069 383985
2723 383985 534506 543761 635112 675283 606293 540402 521967 518632 538053 580308 591962 413510
2711 413510 445844 530428 479229 475806 445690 405108 420057 356106 345502 263987 299805 500292
2699 500292 605145 519292 484238 468278 481254 522539 440992 500316 485533 500179 394763
2688 394763 423680 327469 394416 413454 433697 427513 380343 368445 498272 577727 534744 448189
2676D48189j2399j2840q4133J12428N7134k1960q0578n8685j2188K8234q3797
2665B79405J02037n8454j9395O7441k6914n6378N5899Q5051r3139K1949K3046
2654C80548L1036p1897n196J1950K9342q4972o7139q4812J25048L4328m5282j06040
2642A46914n2281L14383m4104m6138L6485j43515Q3674p6984j7826L2441J28008
2631C61057L5153K0532p9317j12898Q2081l9326L3155R6376j4832k3337n3603
2620C05041K6995J8970K0314n919r566J49220L1794r0697q4757L8149m4091m6574
2608C08879K8483K9849q4994p7653j6677Q7016k9888J1025J4378n1476L2668M4173
2596B95783q2073K9732k6812r2042J07525Q6101R4223L1237j37746n7996n1842
$$ plain form
2676 448189 435790 422950 338817 451245 508379 486419 405841 347156 334968 363202 279405
2665 279405 381442 322988 303593 371034 344120 287742 343641 428692 335553 357502 380548
2654 380548 411584 339687 334491 346441 375783 290811 223672 138860 263908 298236 252954 146914
2642 146914 94633 409016 364912 318774 355259 211744 295418 218434 200608 233049 361057
2631 361057 396210 416742 337425 224527 306608 267282 300437 396813 381981 358644 305041
2620 305041 332036 351006 371320 365401 355835 505055 536849 446152 361395 399544 355453 308879
2608 308879 337362 367211 282217 204564 187887 274903 245015 256040 270418 218942 251610 295783
2596 295783 213710 243442 216630 124588 232113 318214 412437 443674 305928 247932 196090
2585A96090P6583L3348J9525K3704L3902p2214R3692j23695J02432P3846l7348
2574D19865m5441N0214Q098n4839L6178M464j8943L2447N07J9239J34477j5652
2562E70614p100j20951l1090q6075n2373O283k1321Q5984J9643P778p5833n8157
2550B37402J04665L2896l0681j23716n0324p64p172p8660P392M7275L6749M0247
2538B15309R4351j1489j7639j07974q2317Q1874m7991J65583R1668j32637J1391
2527B60129k3125K471k2506r6014J13174O3258j26292r8094j29784J67964M8752
2516A59933K4030m1073K6936j8803K7332m9946j3749Q9706K4572R2558p7029k6144
2504B18323L6293N6546r1953N568k2768J22935m7289n3411N4518o7845j08240
$$ plain form
2585 196090 272673 306021 325546 349250 383152 310938 404630 280935 383367 457213 419865
2574 419865 374424 424638 432736 377897 414075 418539 399596 432043 432550 451789 586266 570614
2562 570614 563514 442563 411473 325398 273025 279308 257987 343971 363614 371392 295559 237402
2550 237402 342067 374963 344282 220566 170242 169478 162306 83646 91038 138313 175062 215309
2538 215309 309660 298171 280532 172558 90241 172115 124124 289707 381375 248738 260129
2527 260129 237004 239475 216969 120955 234129 297387 171095 73001 -56783 111181 159933
2516 159933 183963 142890 169826 151023 178355 128409 114660 204366 228938 321496 244467 218323
2504 218323 254616 311162 219209 224777 202009 324944 277655 224244 278762 210917 102677
2493A02677J11487J32386m9126M0189p949J6930n3830p7260K7034k1228J8347
2482B39657P1399o2426Q5711J4783p8477l5776J3689n4308j01780J3303N3426
2471A59201J32510J1767k12426j6995r10P7842J36903q581j491k2019K7196J19715
2459D02712p0437l8924o0687N1316j02939M5182L7582k6900M730j008n2134m5495
2447A42998P1825J8345p1168N7173n3676l9936J76411n4273j01982K4164J9132
2436A89013J48135l3147k4535J17516J1844j44551K1088M5462k2849M9897o1552
2425B96321j3548J6747n425o1676O9840J03472m80j72181P455J7705J36044K9103
2413D23377m8733j25365n8529J30838M8646m8944R4105O091K1768q1063p208J27231
$$ plain form
2493 102677 214164 346550 297424 337613 329664 346594 292764 215504 242538 221310 239657
2482 239657 311056 248630 334341 349124 270647 234871 248560 194252 92472 105775 159201
2471 159201 291711 303478 91052 74057 73147 150989 287892 279311 277820 255801 282997 402712
2459 402712 332275 293351 232664 283980 181041 226223 263805 236905 241635 240627 188493 142998
2447 142998 214823 233168 162000 219173 165497 125561 301972 247699 145717 169881 189013
2436 189013 337148 304001 279466 396982 408826 264275 285363 330825 307976 357873 296321
2425 296321 282773 299520 294095 232419 302259 405731 405251 233070 240525 258230 394274 423377
2413 423377 374644 249279 190750 321588 370234 321290 415395 421486 443254 362191 354983 482214
2401D82214o0960j6373k4583k0903M0887j24834M8263K3731L0896m5762l1648
2390C00928k0972K3472J7532L5427K2931J51120j12317p0573R9281k2400k0037
2379D04392J01458P5871M3143k4743K2576K529J13239J1698N2493J27682Q337
2368I38675j80025o5667L6788J5965Q9122P8840j12893J22200O2387n4339J21396
2357A052449j08930j20191O3367J50234l3758J56239J09913r2636L0688K47945
2347A455320m0181j13064J6519J86297l5100O637J68983J10101Q8649J54153R6440
2336B094754J54905J59635J40245j285J91221J09948K71578L66577K44634K74306
2326D006518K54387J83661M18266L45325M07161O70916O56162P04659Q33469R51053
$$ plain form
2401 482214 421254 404881 380298 359395 400282 275448 323711 347442 378338 332576 300928
2390 300928 279956 303428 320960 356387 379318 530438 418121 347548 446829 424429 404392
2379 404392 505850 581721 624864 600121 622697 625226 738465 750163 802656 930338 938675
2368 938675 758650 692983 729771 745736 834858 913698 800805 923005 985392 931053 1052449
2357 1052449 943519 823328 886695 1036929 1003171 1159410 1269323 1176687 1207375 1455320
2347 1455320 1415139 1302075 1318594 1504891 1469791 1476428 1645411 1755512 1844161 1998314 2094754
2336 2094754 2249659 2409294 2549539 2548254 2739475 2849423 3121001 3487578 3732212 4006518
2326 4006518 4260905 4444566 4862832 5208157 5615318 6286234 6942396 7647055 8480524 9431577
2316I431577R63252J042643R43748J060137J480258J380453J773498K326722K862614
2307B3264902L392310L767789L613769M309834N731151Q549710R999764O062439
2299F8691668m949040j3515858j1124402p577754n121673l715959k796778k119496
2291A7770708j498891j235740j119163q67161o22144n24697p03149p68610j072347
2282I358806r86413o67247m06113o30491m95839m14259l03938k28618l36555l35332
2272D554001j91826j15522k05403j33298j2223j42616k60458j84058j30082k09844
2262B968671j61656l10582m5878r8030p0998M4761j53352L092M273j57984O402
2251B028719n2504j54876n5606n4276o5446j25642j76349l8650O8382J4718p5247
$$ plain form
2316 9431577 10394829 11437472 12381220 13441357 14921615 16302068 18075566 20402288 23264902
2307 23264902 26657212 30425001 34038770 38348604 44079755 52629465 62629229 68691668
2299 68691668 63742628 50226770 39102368 31524614 26402941 22686982 19890204 17770708
2291 17770708 16271817 15036077 13916914 13049753 12427609 11902912 11199763 10431153 9358806
2282 9358806 8372393 7705146 7299033 6668542 6172703 5758444 5454506 5225888 4889333 4554001
2272 4554001 4362175 4246653 4041250 3907952 3895729 3753113 3492655 3308597 3178515 2968671
2262 2968671 2807015 2496433 2450555 2352525 2281527 2326288 2172936 2176028 2180301 2022317 2028719
2251 2028719 1976215 1821339 1765733 1711457 1646011 1520369 1344020 1305370 1373752 1388470 1313223
2240A313223m8888o1031L853j02448l94j7480j13786Q0970j19977o9289K35104
2229A099857J44579j76778j03026M173o796o3544j10369m5105R7299j67527J40568
2218H13331l4420n0063Q8393q9695J8469N8956k9501J0443n1457k1130J2405j09060
2206F16671j8777Q8488M154L8039o2154P3885n694N348l6536L9439L9791p3057
2194G09597K6936L4909p7378l8970m99J6364m194j45771k07998j23809J70297
2183C59484R7184O5111m9310j51235K09Q220q1189O3388P3034J19195q3983j06546
2171C13562n0731o2890J08242J94689o5695j87099N0157R5470R8308r2269k5361
2160C76383k3177P064k9854P2670n9465l0195n191P7346l1460m4160M5699L059
$$ plain form
2240 1313223 1264335 1203304 1207157 1104709 1104315 1086835 973049 1054019 934042 864753 1099857
2229 1099857 1244436 1067658 964632 968805 962009 898465 788096 742991 840290 672763 813331
2218 813331 778911 728848 817241 727546 746015 804971 775470 785913 734456 713326 725731 616671
2206 616671 597894 686382 690536 728575 666421 740306 734612 739960 703424 742863 782654 709597
2194 709597 736533 771442 694064 655094 654595 670959 666765 520994 312996 189187 359484
2183 359484 456668 521779 472469 321234 321443 329663 248474 311862 384896 504091 420108 313562
2171 313562 262831 199941 308183 502872 437177 250078 300235 395705 494013 401744 376383
2160 376383 353206 360270 330416 403086 343621 313426 308235 385581 354121 309961 355660 358719
2148C58719O8285k3056N4796m3458j04538L2622L4421o0572m6459l7060J5354
2137B49054L7071k0448J2730r3194r7744J17268q902j32361Q2008R2993j74408
2126F4067m0393j37771J61039L6905r5629L5291K3304J0532J68391M8934j1822
2115B62848q7844j9912o3609k3798j5424k4371K362Q9059R4625J35562j32456
2104B17042m5555R241o4156Q1088M9064j06965N5095J07738n0096q573p9749K4030
2092A88204p501k4643J1939N354O7719L4142j02464r347J01280K3609n1094L2278
2080B69476m3752J6974r3615M943L6578q8372O038J6855j09793k2969P0398R6338
2068A59099l3436j7839K7131P5582l2515j57271M9588O8610j5911p7512N9288
$$ plain form
2148 358719 427004 403948 458744 415286 310748 343370 377791 317219 270760 233700 249054
2137 249054 286125 265677 278407 185213 87469 204737 195835 63474 145482 238475 64067
2126 64067 23674 -114097 46942 83847 -11782 23509 46813 57345 225736 274670 262848
2115 262848 175004 155092 91483 67685 52261 27890 30252 119311 213936 349498 217042
2104 217042 171487 180728 116572 197660 246724 139759 194854 302592 252496 243923 164174 188204
2092 188204 180703 156060 167999 173353 241072 275214 172750 163403 264683 288292 237198 269476
2080 269476 225724 242698 149083 154026 190604 102232 108270 125125 15332 -7637 62761 159099
2068 159099 125663 107824 134955 210537 178022 20751 70339 138949 123038 45526 104814
2057A04814J03992m3884N904j1071P5630K0163o5500M4949j8110J17054j8526
2046C15415j34695J61598m249q5957l8009K2314n5377k5941m4300J39509M0428
2035B90736m5235M7810J03612n8414M3391j5975l7295K6814k00348R734P0226
2024B35056Q899p8579R5833k4678j7669q3420M2104j1850N4575N0095j47554q5719
2012C7093l7577m3678K22088J36738m3229j43542r6484K4892N6778R6246p4421
2001A34904l5133O1185P8238r7598r866K6837m389n0624j038Q9106o0286j25390
1989E946Q8040n5945L3556K5778j8812Q915k9277K3678k6669j40937J16418Q9984
1977A20675j43826K4733M7522o607k0231J00191o4831P1465Q7341o4811n0259
$$ plain form
2057 104814 208806 164922 170826 159755 235385 255548 190048 234997 216887 333941 315415
2046 315415 180720 342318 338069 252112 214103 236417 181040 155099 110799 250308 290736
2035 290736 245501 293311 396923 338509 381900 365925 328630 355444 155096 164830 235056
2024 235056 243955 165376 261209 236531 218862 135442 177546 165696 220271 270366 122812 37093
2012 37093 -484 -44162 177926 314664 271435 127893 31409 56301 113079 209325 134904
2001 134904 99771 160956 239194 141596 131730 158567 154178 103554 102516 191622 131336 5946
1989 5946 93986 38041 71597 97375 78563 87478 58201 81879 55210 -85727 30691 120675
1977 120675 -23151 1582 49104 42497 22266 122457 57626 129091 216432 151621 101362
1966A01362J5994J01686j21711j54745Q1425J49880n7689J1801k6113L1901L396
1955A37187r4209j8779J3314N3903m1283j9239o7112k7974r737k0776q011J22412
1943A9696k1362q6522R7723r6627O965q502L1051k3453J01484J22154j25165j05936
1931h8494M6973L0022N2595l3649m7294q9111K183J30200j9565q7771K2752P294
1919g3865O1774L1046l6750m624N500J48160o8523K2384n5507Q8207N5656q0262
1907I3196K9502l7841j6444J5118K2965J58247P6137o5834j16931r8699q8386
1896b8970K8318J86498l199j24777r5747k5797P9379l2369m278R3793o9316j16795
1884a13260N3065R4874K6492m097q1375j5964J42834n2312K6447j05043M6194
$$ plain form
1966 101362 117356 219042 97331 -57414 24011 173891 116202 128003 101890 133791 137187
1955 137187 42978 24199 37513 91416 50133 30894 -36218 -64192 -73929 -94705 -102716 19696
1943 19696 -1666 -88188 9535 -87092 -80127 -88629 -57578 -81031 20453 142607 17442 -88494
1931 -88494 -41521 -11499 41096 7447 -39847 -128958 -126775 3425 -16140 -103911 -81159 -73865
1919 -73865 -12091 18955 -17795 -22419 -16919 131241 62718 85102 29595 117802 173458 93196
1907 93196 122698 84857 68413 83531 106496 264743 340880 275046 158115 59416 -28970
1896 -28970 -652 185846 182647 57870 -37877 -63674 15705 -16664 -20942 72851 3535 -113260
1884 -113260 -60195 34679 61171 57074 -24301 -40265 102569 50257 76704 -28339 17855
1873A7855j1679J05171L4679j2894j04685o3898K09161j70523r782l1603Q1380
1862D3182L8123p1840j42691O4897J94305j2070m5668o6473O8244k0247n9913
1851a0151l1586M0746J10148l8805J2069n8443K4452J13510p9544k5326N7878
1840A14948K5243o5546j94210j04674P9506n0341J60080J7406m6183N0387p4921
1829h8305m151J54584n8675L6391r3879n7524J3565O9144J36121j39222Q2600
1818E0649n26J1073M1350L3436J9482p1427m7589Q2129n116q2844j4051R1028
1806A07594j0842n2969k3434O8343o8327m1628n0434k6675J5595N490J04206L8881
1794F5800j3040m4859m8999j2847N0304N3413L1976j7172M9016m8606q1421L4698
$$ plain form
1873 17855 6176 111347 146026 133132 28447 -35451 173710 3187 -6595 -38198 43182
1862 43182 81305 9465 -133226 -68329 125976 113906 68238 1765 70009 49762 -10151
1851 -10151 -41737 -991 109157 70352 82421 23978 48430 161940 82396 57070 114948
1840 114948 140191 74645 -119565 -224239 -144733 -195074 -34994 -17588 -63771 -13384 -88305
1829 -88305 -92456 62128 3453 39844 -54035 -111559 -97994 -28850 107271 -31951 50649
1818 50649 50123 61196 102546 135982 155464 84037 36448 118577 113461 30617 16566 107594
1806 107594 96752 43783 20349 88692 20365 -21263 -71697 -98372 -82777 -77287 26919 65800
1794 65800 52760 7901 -41098 -53945 -3641 49772 81748 64576 113592 64986 -16435 18263
1782A8263l4270L35m3038L1316J40548j57587k2604k0840q72J83548J2321j7654
1770H9466m575j68764l7995J06566L4597J03672q5806j16782k9416J63798n3587
1759A174R0492q9940p4119M0113O5350o7275N9719j03506o3075P5724L5002M1061
1747A0720J8399J2279m0648K8976l2834k16534J19812R6500J133R9430q2644N290
1735A9879N0012n5046p7042p4856J37770P0098j81552J28811Q655J12522M7492
1724A86743j03179j8775K2458J05854J5047m6261m3095j99222J24916r2644o9275
1713a17433j6709J26383K0504j09537N2136N9375m7908K14903k7409K1328r3365
1702H2268p4858r2092N2525N6316R7419M7566j63849P2761r9251k9332J52695
$$ plain form
1782 18263 -16007 -15672 -58710 -27394 113154 -44433 -67037 -87877 -88749 94799 107120 89466
1770 89466 84891 -83873 -121868 -15302 19295 122967 37161 -79621 -109037 54761 1174
1759 1174 91666 1726 -72393 -32280 33070 -34205 25514 -77992 -141067 -65343 -30341 10720
1747 10720 29119 41398 750 29726 -3108 -219642 -99830 -3330 -2197 97233 14589 19879
1735 19879 69891 14845 -62197 -137053 717 70815 -110737 18074 26729 139251 186743
1724 186743 83564 64789 87247 193101 208148 161887 118792 -80430 44486 -48158 -117433
1713 -117433 -134142 -7759 12745 -96792 -44656 14719 -33189 181714 154305 175633 82268
1702 82268 7410 -84682 -32157 24159 121578 169144 5295 78056 -21195 -50527 102168
1691A02168R2826o6994k17286k9615R8914n934J4650L9665M4160j09337M6808
1680A0025m6080k7931Q0563N2948m2858k8503Q8155o7295o133k1206m1790n855
1668e5960O2604J68515j18222M1554P0828j07331j00440L0138J8841M7026L5324
1657I2877j17220L7995L3001k797K3413j06453K7215j27586R3184J45860r5230
1646D259J15476N6288l4555o5603j05858p3730O1256J46694q4495j16245j11324
1635b07837K5496K01732J15627q4610p8958L196Q8798R3399K5347o7217j13955
1624A018J30689L8185o1440n3118L0486m1622n6933p9134k603m059o9960R6595
1612g1896N6532l8071O4366l2070n8736J4988O5564M8711j06825J02693l5299
$$ plain form
1691 102168 194994 128000 -89286 -118901 -19987 -25921 -11271 28394 72554 -36783 10025
1680 10025 -36055 -63986 16577 69525 26667 -1836 86319 19024 12891 -8315 -50105 -55960
1668 -55960 6644 175159 56937 98491 169319 61988 -38452 -8314 10527 57553 92877
1657 92877 -24343 13652 46653 43856 67269 -39184 -11969 -139555 -46371 99489 4259
1646 4259 119735 176023 141468 75865 -29993 -103723 -42467 104227 19732 -96513 -207837
1635 -207837 -182341 19391 135018 50408 -28550 -25354 63444 156843 182190 114973 1018
1624 1018 131707 169892 108452 55334 85820 44198 -12735 -91869 -94472 -98531 -168491 -71896
1612 -71896 -15364 -53435 10931 -21139 -79875 -64887 677 49388 -57437 45256 9957
1601I957l1572l3613R9499o0725J08037K2025q6742m3066J27611p0338o3492j7142
1589c9561j19744k7010L7849R6744o8927O3649O3360K5530n5701j279K7589M4093
1577D6592j62669J5314O969J23868R743R716j078l6850N2101R8643j19498o3876
1565b1025J13749q5765k8177J6131r3248o6732R0560R156L3695N234n8204M8438
1553c6188L82j00366Q0527J00415m9795J54502o7617q9252o3392M4193L3292j03473
1541i6772O3007J69097r8642j9698P7773q4299O3552l048n5551r4938Q0872k5780
1529b4427J7484j22367P8195o7931l2865J93998j0691M7461q3643L1557M1749
1518F8520o5918J2106l3352o98P1812O4736l6734j57168O218J15365P8373p1537
$$ plain form
1601 9957 -21615 -55228 44271 -16454 91583 113608 26866 -16200 111411 41073 -22419 -39561
1589 -39561 -159305 -186315 -148466 -51722 -120649 -57000 6360 31890 -23811 -25090 2499 46592
1577 46592 -116077 -100763 -93794 30074 39817 49533 48455 11605 63706 162349 42851 -21025
1565 -21025 92724 6959 -21218 -5087 -98335 -165067 -74507 -65351 -31656 -26422 -84626 -36188
1553 -36188 -35806 -136172 -55645 44770 -5025 149477 81860 -7392 -70784 -26591 6701 -96772
1541 -96772 -33765 135332 36690 16992 94765 10466 74018 70970 15419 -79519 1353 -24427
1529 -24427 -6943 -129310 -51115 -119046 -151911 42087 31396 78857 -4786 26771 68520
1518 68520 2602 14708 -18644 -19342 52470 117206 80472 -76696 -70478 44887 123260 51723
1506E1723P6925R3699n4878p8312j16574q4740n7512J85642m8410l4846l9369
1495a06652K9233k7477O1546J96428p8012p6619L8556Q642j1795o132k2188m1260
1483c5730m9461m5895m601J5513J09735J43638j48459j16651j00260J47872J59087
1472G4788j4379j51041r9399M1161n2207M0238J57153q3054Q0725n1188J5469
1461d1734J15505p3916L2693N5826J32897j48181j55988M7077L7998L005L2347
1450C7529Q0957m1227K9575q15n8355q1887o7415o7916J43203l2732J80885P6721
1438A98523j38361j2385k0798j3263p0772j09920n4829L7935J11710J00545J8831
1427D7216q1621Q891j174q0302J40468j24599J3929L0529K0239q5272R5258L1952
$$ plain form
1506 51723 128648 222347 167469 89157 -27417 -112157 -169669 15973 -32437 -67283 -106652
1495 -106652 -77419 -104896 -43350 153078 75066 -1553 37003 45645 33850 27718 5530 -35730
1483 -35730 -85191 -131086 -135687 -120174 -10439 133199 -15260 -131911 -232171 -84299 74788
1472 74788 60409 -90632 -190031 -148870 -201077 -160839 -3686 -86740 -6015 -57203 -41734
1461 -41734 73771 -145 32548 88374 221271 73090 -82898 -35821 2177 5182 37529
1450 37529 118486 77259 106834 106019 47664 -34223 -101638 -169554 -26351 -59083 121802 198523
1438 198523 60162 47777 26979 13716 -57056 -166976 -221805 -183870 -72160 28385 47216
1427 47216 -34405 -25514 -26688 -106990 33478 -91121 -77192 -46663 -26424 -111696 -16438 15514
1415A5514r1982n548N2231O2144M1519j8553r359L3828J8224p6593p0849j58784
1403b08208K8807J65173J01511j03301p242P7025K52n2334o0207j20310n6266
1392b35100J13589k422J38530l5586k7398L7213j12788R7198N7534m276M9024
1381G5518j07047N598O231O1117Q8304j10751k6955m7432L5283k2737j28074J01246
1369f9699J00617k6795k08570Q5800P3700K25516m6633j80489n6840J13669M3236
1358E3512m5570R7847m4684l4604q1798j9616R1256j00843o8347R2684r7570M0352
1346a17381N5026m1970J4971L5154j45778K6404J39297l3641L6432j716j09017
1335a42219J19812L6130n6138M1038R7358n7166k1098L089K0697j9849J3522P7955
$$ plain form
1415 15514 -76468 -82016 -29785 32359 73878 55325 45966 79794 98018 21425 -49424 -208208
1403 -208208 -179401 -14228 87283 -16018 -23260 53765 54017 1683 -58524 -178834 -235100
1392 -235100 -121511 -123933 14597 -20989 -48387 -11174 -123962 -26764 30770 26494 75518
1381 75518 -31529 -25931 -19700 41417 129721 18970 -7985 -55417 -20134 -42871 -170945 -69699
1369 -69699 30918 4123 -204447 -118647 -44947 180569 133936 -46553 -103393 10276 53512
1358 53512 7942 105789 61105 26501 -55297 -74913 16343 -84500 -152847 -60163 -157733 -117381
1346 -117381 -62355 -104325 -89354 -54200 -199978 -173574 -34277 -67918 -31486 -33202 -142219
1335 -142219 -22407 13723 -42415 -1377 95981 38815 17717 20806 41503 21654 35176 113131
1323A13131j47693M5726k6862l5382J0171P6867J09217K1102j35612j4638m6686
1312c0659j31424Q0691J54539q9271N5536L3873j84721N094L5893Q77R1783m6017
1300b3806K4278n0633o9895j82297J76200J51561n7636J16017j11981m2344K2698
1289d7838m5496j01944R2466O2940K09129q3697N415m6194o8943o1262K1137m745
1277f9032Q32M1340j651L5572j6420n773k2836M1573P620m7905p0808N5411J49663
1264I7586q9159j37239L2463N0931n4335R0644P724J1692M2563K4508P4523j67800
1252a5899L7724k8443R2915K2701q3227k0646o0018J16626j8625r4960m1845q1382
1240a75079l5375P6780J17170L0685j63574P233l398q3415J56594K1744J05357
$$ plain form
1323 113131 -34562 11164 -15698 -51080 -40909 35958 145175 166277 30665 16027 -30659
1312 -30659 -162083 -81392 73147 -16124 39412 73285 -111436 -106342 -70449 -69572 22211 -23806
1300 -23806 472 -50161 -120056 -302353 -126153 25408 -32228 83789 -28192 -70536 -47838
1289 -47838 -93334 -195278 -102812 -39872 169257 85560 90975 44781 -24162 -85424 -64287 -69032
1277 -69032 -68200 -26860 -28511 7061 -9359 -15132 -37968 3605 11225 -36680 -107488 -52077 97586
1264 97586 8427 -128812 -96349 -45418 -99753 -9109 -1385 10307 52870 77378 151901 -15899
1252 -15899 21825 -6618 86297 108998 25771 5125 -54893 61733 43108 -51852 -93697 -175079
1240 -175079 -210454 -133674 -16504 14181 -149393 -142160 -145558 -228973 -72379 -50635 54722
1229E4722k9968k1683O6944l596m3323q0557o6866n346K0279J2223j5617L4403
1217g8385K8267R5728L789P8042j04043p1768M0436j4718J15960j80185R0989
1206D112M0342K5835l4115m5574L1046m4876o4577M2353K8546k1133J09241j4427
1194E6773q9852j07238j3373N8498J39959k4612n9501J8234K5346m7141l7130
1183h0037J04519r897p206K4822R7045j71699K2926l8277N0598o824p8068M5831
1171d6267j9017P360Q5069J943p2829m3325K0824J12197j27102M2564M7451l8697
1159b9829l3547J0150J8771n6880j21576O4922P6421m3584l3928J69990l504p2907
1147e5501L3281J16289k6852j11910j2065K1723M8041k7259j6664L4850n5666
$$ plain form
1229 54722 24754 3071 70015 66419 23096 -57461 -124327 -129673 -109394 -97171 -112788 -78385
1217 -78385 -50118 45610 49399 127441 23398 -48370 -7934 -22652 93308 -86877 4112
1206 4112 44454 70289 36174 -9400 21646 -23230 -87807 -45454 -16908 -38041 71200 56773
1194 56773 -33079 -140317 -153690 -95192 44767 20155 -39346 -21112 4234 -42907 -80037
1183 -80037 24482 14585 7379 32201 129246 -42453 -19527 -57804 -7206 -14030 -92098 -46267
1171 -46267 -65284 -57924 27145 29088 -43741 -87066 -66242 45955 -81147 -38583 8868 -29829
1159 -29829 -63376 -53226 -34455 -91335 -212911 -147989 -71568 -115152 -149080 20910 17406 -55501
1147 -55501 -22220 94069 67217 -44693 -56758 -35035 13006 -14253 -30917 3933 -51733
1136e1733J4972j5674j350L0620j51114K5281J35458O4063j51454K0692q860J8413
1124g0686P3299j2079N7405j96196n7948N3946O0406j5165J1084O9741J21662
1113I5469j4705l445p8809m5482L4645J90271l3075j35449O7762l6311p3791n3115
1101h6035L918O410p322N5621j01793J6604Q9714N3319k0331q4567J37542j3022
1089E0058k28835m3797J23232K989N2534O0463L2114k0090P3759j76671L8373
1078c5871m9962k5983P4063N3527p8371J9352N0320o5838j857J4120M547O4993
1066B3040J46228m2846m6368J6197j30207o5936J35171K9767j6015K2406p8834
1055g397q7455N3702Q6267k0188M1369j0363N1023J268j30521m8295O6436J4776
$$ plain form
1136 -51733 -36761 -52435 -53785 -23165 -174279 -148998 -13540 50523 -100931 -80239 -89099 -70686
1124 -70686 2613 -9466 47939 -148257 -206205 -152259 -91853 -107018 -95934 -26193 95469
1113 95469 80764 77319 -1490 -46972 -12327 177944 144869 9420 77182 40871 -32920 -86035
1101 -86035 -82117 -75707 -83029 -27408 -129201 -112597 -22883 30436 10105 -74462 63080 50058
1089 50058 -178777 -222574 -99342 -96353 -43819 16644 48758 28668 102427 -74244 -35871
1078 -35871 -85833 -111816 -37753 15774 -62597 -43245 7075 -58763 -60620 -46500 -41953 23040
1066 23040 169268 126422 80054 96251 -33956 -99892 35279 65046 49031 71437 -7397
1055 -7397 -94852 -41150 45117 24929 66298 55935 106958 108226 -22295 -70590 -4154 10622
1043A0622J8708Q7492N5022L2246k41304j49772N2334m837O6956N3945k3474m1278
1031h3340J8439J08074P8356K2811N6324j17760j22652r3667P7313K8215j77780
1020b05667j9627J65188J73494j06093n1463o7050l744j5954L8895J13524r2407
1009g0904m3481K9406J6120M6916M5709R9956k6235j21410J31979O1285j74373
998e032P3429j61927m8973J03644p4616O0868N6701q7917J81577J41338j16415
987A22677q9417K1950L2349o0833n4212N0766o1421l1668J80345l028o0744L1901
975G8665N327n2629m445n1711J8565q8375N1932k141N1596j1315o4719J5625l7270
962i0895K984L0245n3540L4291J5350l3075J00785n0848n63L2261l1470m3970
$$ plain form
1043 10622 29330 116822 171844 204090 -37214 -186986 -134652 -139489 -72533 -18588 -42062 -83340
1031 -83340 -64901 43173 121529 144340 200664 82904 -39748 -133415 -56102 -27887 -205667
1020 -205667 -225294 -60106 113388 7295 -44168 -111218 -114962 -130916 -92021 21503 -70904
1009 -70904 -114385 -84979 -68859 -21943 23766 123722 97487 -23923 108056 169341 -5032
998 -5032 68397 -93530 -142503 -38859 -113475 -52607 4094 -83823 97754 239092 122677
987 122677 33260 55210 87559 26726 -27486 23280 -38141 -69809 110536 107508 46764 78665
975 78665 83992 31363 26918 -24793 -6228 -94603 -42671 -44812 6784 -4531 -69250 -53625 -90895
962 -90895 -87911 -57666 -111206 -76915 -61565 -94640 6145 -44703 -45266 -13005 -44475 -88445
950h8445J4205N6619M0060P9755L6051j58761j01120J6052O1759j60463L3952
939a70336R4496O227M2641j0124k0581L8936j25273L0510Q1835L8453n716j40989
927a39921n932L7663J35209K4084j71050J3658J71831p6039q0719J17650J00037
916A26471K3037q0322J17169m5209r4128o0661j1634o7514J1473L5129N7069K0186
904C1066m3606K770j67350O3439L3372Q7806n8942j3928j63140J04533P0048r046
892f2978N0796J301M0040l9644M404q9519p338O8252R6087j24866p8449J50885
880H971L8403r9418L725p7744r3725J50062N1258m7412j393J09451J2367n5709
868a164q9r8915P460N6173R7284P7444j49070l2594L6633J0776j7739p3701P7803
$$ plain form
950 -88445 -74240 -17621 22439 102194 138245 -20516 -121636 -105584 -43825 -204288 -170336
939 -170336 -75840 -69613 -26972 -37096 -57677 -18741 -144014 -113504 -31669 6784 1068 -139921
927 -139921 -145853 -108190 27019 51103 -119947 -106289 65542 -10497 -91216 26434 126471
916 126471 149508 69186 186355 141146 47018 -13643 -25277 -92791 -81318 -46189 10880 31066
904 31066 -12540 -9770 -177120 -113681 -80309 7497 -51445 -65373 -228513 -123980 -53932 -62978
892 -62978 -12182 -10881 29159 -10485 -6081 -95600 -102938 -34686 61401 -63465 -141914 8971
880 8971 47374 -52044 -48319 -126063 -219788 -69726 -18468 -65880 -67273 42178 54545 -1164
868 -1164 -1253 -100168 -92708 -36535 60749 138193 -10877 -43471 -6838 3938 -13801 -87502 -9699
855i699J2844N2250J5055j0587r5666N0710N8456o6125p1017P0680J9308j25815
843i9606q820q462r2875j875N4544J03318J62091l5654j25631o059L0620o4645
831i3054P1353k6943p6416N5105P2641P8325l0065l0601J09727m2090j72623L1567
819e3074M7638k15L276r8552Q6160M1620N9519K1428J7085q4687J42257j29951
807E2504J8001p2273j15888J19768k6205K8341L6949j14033M4530J4747J10005
796I6446p0496o3074J00843m343J61495P5947j0654r6166j62575q3706M1586K6740
784A2043K383p2787J31504Q3947j09238n7712N7640n697j6477N1841p1891l9710
772c4154J6211O3046n7136j18165J58919k0284J3508L8309m6323l4488p7j17426
$$ plain form
855 -9699 3145 55395 70450 59863 -35803 14907 73363 7238 -63779 6901 26209 -99606
843 -99606 -108426 -116888 -209763 -211638 -157094 -53776 108315 72661 -52970 -59029 -28409 -93054
831 -93054 -21701 -48644 -125060 -69955 2686 81011 50946 20345 130072 87982 -84641 -53074
819 -53074 -5436 -5651 -2375 -100927 -14767 26853 86372 107800 124885 40198 182455 52504
807 52504 70505 -1768 -117656 2112 -24093 4248 41197 -72836 -28306 -13559 96446
796 96446 25950 -37124 63719 59376 220871 296818 286164 189998 27423 -56283 -14697 12043
784 12043 14426 -58361 73143 157090 47852 -9860 47780 42083 25606 77447 5556 -34154
772 -34154 -17943 45103 -12033 -130198 28721 8437 21945 60254 13931 -20557 -20634 -138060
760a38060k0609J6687K5414k2946R1569K3284P0563P4248j6679o6884J5592J14462
748A66641l5558k51443J1903L2994J56872q3356j24514P3007n4324l7528j1489
737a56795n5061q625J34841M0809R3726K8284n6031m9062m8557J9356k922O7322
725G285N6104o6033J8914m811k948K8366n1330j1095L1648m316k2084K1752L0589
712C2041o4754p019L1857l3537L3383j7989j51413r857J27905J18631m1612j78762
700a61126N9493L4961J16444q706P6493k8096q2543k4736l6643L9794O214j8124
688b6575o7451J4065N7346l8021o5762J56553m3702j18360k1384M2324J04900
677f067J26838m3005r1600j1824n8409J06575k2842j64115J32954J91399l8739
$$ plain form
760 -138060 -158669 -141982 -116568 -139514 -47945 -24661 45902 120150 103471 36587 52179 166641
748 166641 131083 -120360 -108457 -75463 81409 -1947 -126461 -53454 -107778 -145306 -156795
737 -156795 -211856 -220481 -85640 -44831 48895 77179 21148 -27914 -76471 -57115 -60037 7285
725 7285 63389 -2644 16270 11459 8511 36877 -14453 -25548 6100 1784 -20300 1452 32041
712 32041 -32713 -39732 -7875 -41412 -8029 -26018 -177431 -187288 -59383 59248 17636 -161126
700 -161126 -101633 -66672 49772 41066 117559 89463 6920 -17816 -54459 -14665 -8451 -26575
688 -26575 -94026 -79961 -22615 -60636 -126398 30155 -13547 -131907 -153291 -110967 -6067
677 -6067 120771 77766 -13834 -25658 -84067 22508 -334 -164449 -31495 159904 121165
666A21165j73623P4385n1057L5482l6010O6886o5099k4336o591n5577O3061j2717
654f4031O2659M0369n5401R1179J5312L231k2223j17433Q0706J10155j4861q5826
642D3836m1341L1040m4531p904r201N9539k8377o869j5227N580N8358J19924j3205
629A51622m9890K3766j35093J0580J4672j18499o0618J01037j5396l1786o715
618a16320j14122K01517N1177q5245J10787M3121p5157j6846l8588j9182M4611
607a4247N4766j8241P378j01230n5095J13358J1676O2o9825m854J32159L2087
595H7994q311p976n0863o9251O0739R2092o7177Q4469n9268q9445O62M6784j54733
582a34284M0268N231p2371K00054P4464J928Q1724O2385j39821j09146n3004J30663
$$ plain form
666 121165 -52458 21927 -29130 6352 -29658 37228 -27871 -52207 -58798 -114375 -51314 -64031
654 -64031 -1372 38997 -16404 74775 90087 93318 71095 -46338 34368 144523 129662 43836
642 43836 2495 33535 -10996 -18900 -28101 31438 3061 -3808 -19035 -13455 44903 164827 151622
629 151622 101732 125498 -9595 985 15657 -102842 -163460 -62423 -77819 -109605 -116320
618 -116320 -230442 -28925 22252 -62993 47794 90915 15758 -1088 -39676 -58858 -14247
607 -14247 40519 22278 29656 -71574 -126669 -13311 -1635 -1573 -71398 -76252 55907 87994
595 87994 79683 71707 20844 -48407 12332 104424 37247 121716 62448 -26997 -26335 20449 -134284
582 -134284 -94016 -88785 -161156 38898 113362 115290 197014 259399 119578 10432 -42572 88091
570H8091J60572j27981J3403j24770p8101R8810l2434O8878k5745j03503j14211
559a76991M9227J02815r0267J0960J13227N5855j59193o1087j44344J76165J31135
548G502M1305l4872p1674l5118P2126K0396j5797K3627p92j6519j1994J1507r3645
535a03948O4339R1562m7382p1403J20798J17232q142m4398j40774J5654k2319
524b8781L7617N7061P8489l9688q9025N811Q0696j12044N735O2039r7726j2847
512e2663O777m6424k7731R1340N8178L1056l6416J2400p8904Q9301j08890j4196
500g6172J08355l928O7101j37850l8627k7978K2524K6171m0049J49589n0849o2746
488f4459K893R447J26406n2631j41825K8198J64776K5487m7998P4515j35502P572
$$ plain form
570 88091 248663 120682 134085 9315 -68786 30024 -2410 66468 40723 -62780 -176991
559 -176991 -127764 -24949 -115216 -104256 8971 64826 -94367 -155454 -299798 -123633 7502
548 7502 48807 13935 -57739 -92857 -20731 -335 -16132 7495 6703 -9816 -21810 -10303 -103948
535 -103948 -39609 51953 4571 -66832 53966 171198 163056 118658 -22116 -6462 -28781
524 -28781 8836 65897 144386 104698 15673 21484 102180 -9864 -4129 57910 -39816 -52663
512 -52663 -45886 -92310 -120041 -28701 29477 60533 24117 36517 -42387 46914 -61976 -76172
500 -76172 32183 28255 95356 -42494 -81121 -109099 -86575 -60404 -100453 49136 -1713 -64459
488 -64459 -61566 -52119 74287 21656 -120169 -91971 72805 98292 50294 124809 -10693 -3121
476c121R6511q8196j04422J03486k23267q351K58903n5823n164L1810k1635K4743
464E474k7679k0128o8984l8618l7358L8992P434J07589P2364J02071m7820j84799
452i1462R143L9802o7544J0978Q1831L0093P9522M3941J09764r8740k63403J0431
440a05644J32111l6538o8750N594N0234J0091j5777J05622j03327n6586O8219
429a4751J52457J8722j63320n4761j5661k5245p4133M8525J08137l8399L9639
418a8790m3018o0770J29435m9590J15069n3598j61512M5651K5767J52664L7975
407A19283j69284j6724K7260k5652K9191J17343K391P8190r4776J3053J36665
396B16940l7666j15429j04472P8995l0375J16836k749j15158J401n9222P8629
$$ plain form
476 -3121 93390 5194 -99228 4258 -219009 -227360 31543 -24280 -29444 2366 -19269 5474
464 5474 -22205 -42333 -111317 -149935 -187293 -148301 -140867 -33278 39086 141157 93337 -91462
452 -91462 -82319 -42517 -110061 -99083 -17252 12841 92363 136304 246068 147328 -116075 -105644
440 -105644 26467 -10071 -78821 -73227 -22993 -12902 -28679 76943 -26384 -82970 -14751
429 -14751 137706 156428 -6892 -61653 -77314 -102559 -176692 -128167 -20030 -58429 -18790
418 -18790 -61808 -122578 6857 -42733 72336 18738 -142774 -97123 -71356 81308 119283
407 119283 -50001 -66725 -39465 -65117 -35926 81417 83808 161998 67222 80275 216940
396 216940 179274 63845 -40627 38368 7993 124829 122080 6922 8323 -50899 27730
385B7730L7393P0618q4995o3872L6724j2569n0257j17233K6408O7698L2594J29748
373I9987P1278P7648k41q0361j36156J05189J5700j01687k0746J87662j15883
362A02390j06069N2202j50476M2087l2870K15891j37945k1539n1763K5790J01558
351C9256P6447l6756o9181P956L7765l6810l3202J11103N6048m3822r9153p2625
339f2974q0468J5846J55973j9455M0765n360k4741P9204n1605M7216l7080O4497
327A21818j52016J22907J9443P3701N189j5149q3858l6479j02011n4549P7082
316b3922R9865k0683K4551k3137j05433J90407L1795j27057k5738p2678J00139
305D8109J58183j35868j27439m9099j0488J48163J69669o3068q1434Q863R7285
$$ plain form
385 27730 65123 135741 50746 -13126 23598 11029 -39228 -156461 -130053 -62355 -29761 99987
373 99987 171265 248913 248672 168311 32155 137344 153044 51357 30611 218273 102390
362 102390 -3679 48523 -101953 -59866 -92736 123155 -14790 -36329 -88092 -62302 39256
351 39256 115703 78947 9766 17722 55487 18677 -14525 96578 152626 108804 9651 -62974
339 -62974 -143442 -127596 28377 8922 49687 44327 19586 98790 47185 94401 57321 121818
327 121818 -30198 92709 112152 185853 191042 175893 92035 55556 -46455 -101004 -23922
316 -23922 75943 55260 79811 56674 -48759 141648 173443 46386 20648 -52030 48109
305 48109 206292 70424 -57015 -106114 -116602 31561 201230 138162 56728 65591 162876
294A62876q8130L0388J06379j07257Q0716n721j48947J44834j3241m6987P3937
283A88847q0294m9385k8020l291j15053k6891Q1800k6184J6528N7361k3927m3835
271e2344J8133M7780N6327J1186r0483j61987R9623Q3032P5800L9033o8288K7944
259H5756l3886j24419P0556J6995p3187Q7625j08724l8366J06550R423J09366
248A07689j03552j44389N9378n0883j0157K02827O4214N446j74130J6089J21039
237I3571q9455l9977M7271N3082K5652q6300O8813O5017N8361j52191J6120j3230
225D6734m336j0856L7545k1429j74609N3275Q4846j70129l7703L04523n1235j61858
213a05232O2068P5944j25452j2843M4715O4284N2378k9111P502K4913j33288k6256
$$ plain form
294 162876 74746 105134 211513 104256 184972 179251 30304 175138 161897 114910 188847
283 188847 108553 59168 31148 27857 -87196 -114087 -32287 -58471 -41943 15418 -8509 -52344
271 -52344 -34211 13569 69896 81082 -9401 -171388 -71765 11267 87067 126100 57812 85756
259 85756 51870 -72549 -1993 15002 -58185 29440 -79284 -117650 -11100 -1677 107689
248 107689 4137 -140252 -80874 -131757 -141914 60913 125127 130573 -43557 -27468 93571
237 93571 4116 -35861 11410 64492 90144 3844 72657 137674 196035 43844 59964 46734
225 46734 42398 31542 69087 47658 -126951 -73676 11170 -158959 -196662 107861 56626 -105232
213 -105232 -43164 32780 -92672 -105515 -60800 3484 55862 26751 34253 59166 -74122 -100378
201a00378P5860p2448P1978J44388J07820j28864q945n8651J0681k2323m1187
190b2069J48609M147N6701j10683J9040N4889O6450n3635l6702k0607r3464l3828
178b1152R2259p565l7291L4270L6213R823J04695m2610o3078p7000r1538R2986
166C0012l8478n820K9391L7068J26953o724n5026j8341J6026n5980p1333R0228
154G7976q975M1302m6334O245R0146q0539l6184k2075k9576L5519M2752K9692
142I9949j28384p190J15285j37622n060M2842K9316J8078K3355j6980k06k3290
130A0093o7630O7649p5491N8043l1092J3948J39414j03662K3493n5464l7499L8752
118a9446J09391o1463M5944j29666J28824r760m1476K1060j7533M9353k5439N7647
$$ plain form
201 -100378 -24518 -96966 -24988 119400 227220 98356 89411 30760 41441 19118 -22069
190 -22069 126540 130687 187388 76705 95745 150634 217084 163449 126747 106140 12676 -21152
178 -21152 71107 63542 26251 60521 96734 106557 211252 168642 105564 28564 -62974 30012
166 30012 -8466 -14286 15105 52173 179126 172402 117376 99035 115061 59081 -12252 77976
154 77976 69001 110303 63969 70214 160360 79821 43637 21562 -8014 27505 70257 99949
142 99949 -28435 -35625 79660 -57962 -63022 -20180 9136 27214 50569 33589 33383 10093
130 10093 -57537 10112 -65379 -7336 -38428 -24480 114934 11272 34765 -20699 -58198 -19446
118 -19446 89945 28482 74426 -55240 73584 63824 22348 43408 25875 75228 49789 107436
106A07436n5467q4591P8218l6068J19492n7410r3200N9789o7916L4747k9351m9373
94g3694M0385l108p1385L9558l2808L5398K6738R7385R636K9819j19869P6395
82E4450n9123n3948m7007J06855L9685q9674Q7519K2117j8756o6061P8524k1569
70C3012q3632J12315k1735n4435K6601L9951O3877J2583n3886O8297J19951p3493
58A89406r7663L3832r6110o4039m1010j7421K373R0633k4551m668p3549O8064
46c4703N7896p1161R9972J1266k7892n9566J5813Q8406j07387P1472j0453K789
34C6452J5228J2365q7443J5281J31217p7286r087K1836k8347j7101M1389J9931
22G4435r597J7752N30j20813Q8304K6385n3035k387N2753m8379M0464q7001l1869
$$ plain form
106 107436 51969 -32622 45596 9528 129020 71610 -21590 38199 -29717 5030 -24321 -73694
94 -73694 -33309 -36417 -107802 -68244 -101052 -65654 -38916 58469 68105 97924 -21945 54450
82 54450 -4673 -58621 -105628 1227 40912 -48762 38757 60874 42118 -23943 54581 33012
70 33012 -50620 61695 39960 -14475 12126 52077 115954 128537 74651 142948 262899 189406
58 189406 91743 125575 29465 -34574 -75584 -93005 -90632 1 -24550 -29218 -102767 -34703
46 -34703 23193 -47968 52004 63270 35378 -24188 -8375 80031 -27356 44116 33663 36452
34 36452 51680 64045 -23398 -8117 123100 45814 36727 58563 30216 13115 54504 74435
22 74435 64838 82590 83120 -37693 50611 76996 23961 21574 74327 25948 66412 -20589 -52458
9e2458P9026N0605r0160j0090J5460Q800N5302j02084M0799
0d800
$$ plain form
9 -52458 26568 77173 -12987 -23077 -7617 1183 56485 -45599 -4800
0 -4800
$$ Imaginary data points
##PAGE= N=2
##DATA TABLE= (X++(I..I)), XYDATA
16383a737762R982O1597O1107M7347o5606O7278N8178K3186j2169O6674M5441
16372a374747N1406l8967n8030K9538Q8990N9382m5621M5386P9101N2408n9487
16361a170641K1963J06472O6998m1972j9552m6397K3768N3512K1260j8690K5647
16350i77632k0316J4378J56589l8009l8942J18213K3291k0815N8875k3315P9074
16339f68609K6167K5260Q6067J41535k7139m9017M6974K8791K979k9703q5304
16328e01999L699J57097Q4657L2899n0136m9890r9917N0681J28760k8543R6456
16317a76236o6612O5556M0569M3535R635P946k5773L7016P0228P7052P423N5311
16305A45650o0803J4977L9317j969R3014n1145L3900k1289P12N4574K8894l0522
$$ plain form
16383 -1737762 -1727780 -1666183 -1605076 -1557729 -1623335 -1556057 -1497879 -1474693 -1486862 -1420188 -1374747
16372 -1374747 -1323341 -1362308 -1420338 -1390800 -1301810 -1242428 -1288049 -1242663 -1163562 -1111154 -1170641
16361 -1170641 -1148678 -1042206 -975208 -1017180 -1036732 -1083129 -1059361 -1005849 -984589 -1003279 -977632
16350 -977632 -997948 -983570 -826981 -864990 -903932 -785719 -762428 -783243 -724368 -747683 -668609
16339 -668609 -642442 -617182 -531115 -389580 -416719 -465736 -418762 -389971 -386992 -416695 -501999
16328 -501999 -498300 -341203 -256546 -223647 -273783 -323673 -423590 -372909 -244149 -272692 -176236
16317 -176236 -242848 -177292 -136723 -93188 -83553 -75607 -101380 -64364 5864 82916 90339 145650
16305 145650 84847 99824 139141 137172 230186 179041 212941 191652 192364 246938 275832 245310
16293B45310J44774R024p727k7022O9760j0961p1653k0197R3574J01040k9495
$$ plain form
16293 245310 390084 399108 391381 364359 434119 423158 351505 331308 424882 525922 496427
$$ [...]
##END NTUPLES=NMR SPECTRUM
##END=
