##TITLE=1H_DE-80H_X3
 200.13MHz, d2o
 8 sc
 
 19ns.26.2.2025
##JCAMPDX= 6.0         $$ Bruker NMR JCAMP-DX V2.0
##DATA TYPE= NMR SPECTRUM
##DATA CLASS= NTUPLES
##ORIGIN= UXNMR, Bruker Analytische Messtechnik GmbH
##OWNER= pz
$$ XWIN-NMR		Version 3.5
$$ Fri Jun 20 14:38:43 2025 Russian Standard Time (UT+4h)  Yarkov@DPX200
##.OBSERVE FREQUENCY= 200.1313
##.OBSERVE NUCLEUS= ^1H
##.ACQUISITION MODE= SIMULTANEOUS
##.ACQUISITION SCHEME= undefined
##.AVERAGES= 8
##.DIGITISER RES= 18
##SPECTROMETER/DATA SYSTEM= spect
##.PULSE SEQUENCE= zg30
##.SOLVENT NAME= CDCl3
##.SHIFT REFERENCE= (INTERNAL, CDCl3, 0, 15.5177)
##AUDIT TRAIL= $$ (NUMBER, WHEN, WHO, WHERE, WHAT)
$$ ##TITLE= Audit trail, XWIN-NMR		Version 3.5
$$ ##JCAMPDX= 5.01
$$ ##ORIGIN= Bruker BioSpin GmbH
$$ ##OWNER= Yarkov
$$ C:/Bruker/XWIN-NMR/data/yarkov2/nmr/H-C/1/pdata/1/auditp.txt
$$ ##AUDIT TRAIL=  $$ (NUMBER, WHEN, WHO, WHERE, WHAT)
(   1,<2025-06-20 14:37:24.81 +0400>,<Yarkov>,<DPX200>,
      <created by zg, POWCHK disabled, PULCHK disabled
       configuration hash MD5:
       00 E9 B6 7A A2 85 ED C7 34 08 36 98 17 FE 4E 26
       data hash MD5: 16K
       5B A9 B7 0B DF 80 65 CC 37 6F C9 4F E7 01 BD C0>)
(   2,<2025-06-20 14:37:39.01 +0400>,<Yarkov>,<DPX200>,
      <Start of raw data processing
       efp BC_mod = 2 LB = 0.25 FT_mod = 6 PKNL = 1 PHC0 = -1717.772 PHC1 = 14.16658 SI = 16K 
       data hash MD5: 16K
       44 34 A5 53 36 6B 3F 81 09 32 EC A8 17 30 58 46>)
(   3,<2025-06-20 14:37:47.28 +0400>,<Yarkov>,<DPX200>,
      <abs ABSG = 5 
       data hash MD5: 16K
       B8 52 35 89 0E C1 C7 43 4B 19 CA F9 EC E4 2B C9>)
$$ ##END=
$$ 
$$ hash MD5
$$ 00 3E 63 C7 78 AC E9 40 62 12 3C 62 3E 11 2C 9A
##$RELAX= 
##$RELAX= 
##$RELAX= 
##$RELAX= 
##$RELAX= 
##$RELAX= 
$$ Bruker specific parameters
$$ --------------------------
##$DU= <C:/Bruker/XWIN-NMR>
##$EXPNO= 1
##$NAME= <H-C>
##$PROCNO= 1
##$TYPE= <nmr>
##$USER= <yarkov2>
##$AMP= (0..31)
100 100 100 100 100 100 100 100 100 100 100 100 100 100 100 100 100 100 
100 100 100 100 100 100 100 100 100 100 100 100 100 100 
##$AQSEQ= 0
##$AQ_mod= 1
##$AUNM= <au_zg>
##$AUTOPOS= <>
##$BF1= 200.13
##$BF2= 200.13
##$BF3= 200.13
##$BF4= 200.13
##$BF5= 200.13
##$BF6= 200.13
##$BF7= 200.13
##$BF8= 200.13
##$BYTORDA= 1
##$CFDGTYP= 0
##$CFRGTYP= 5
##$CHEMSTR= <none>
##$CNST= (0..31)
1 1 145 1 1 1 1 1 1 1 1 1 1 1 1 1 1 1 1 1 1 1 1 1 1 1 1 1 1 1 1 1 
##$CPDPRG= <>
##$CPDPRG1= <>
##$CPDPRG2= <>
##$CPDPRG3= <>
##$CPDPRG4= <mlev>
##$CPDPRG5= <mlev>
##$CPDPRG6= <mlev>
##$CPDPRG7= <mlev>
##$CPDPRG8= <mlev>
##$CPDPRGB= <>
##$CPDPRGT= <>
##$D= (0..31)
0 0.7 0 0 0 0 0 0 0 0 0 0.03 0 0 0 0 0 0 0 0 0 0 0 0 0 0 0 0 0 0 0 0 
##$DATE= 1750415844
##$DBL= (0..7)
120 120 120 120 120 120 120 120 
##$DBP= (0..7)
150 150 150 150 150 150 150 150 
##$DBP07= 0
##$DBPNAM0= <>
##$DBPNAM1= <>
##$DBPNAM2= <>
##$DBPNAM3= <>
##$DBPNAM4= <>
##$DBPNAM5= <>
##$DBPNAM6= <>
##$DBPNAM7= <>
##$DBPOAL= (0..7)
0.5 0.5 0.5 0.5 0.5 0.5 0.5 0.5 
##$DBPOFFS= (0..7)
0 0 0 0 0 0 0 0 
##$DE= 6
$$ [...]
##$SUBNAM3= <"">
##$SUBNAM4= <"">
##$SUBNAM5= <"">
##$SUBNAM6= <"">
##$SUBNAM7= <"">
##$SUBNAM8= <"">
##$SUBNAM9= <"">
##$SW= 18.0517328524113
##$SWIBOX= (0..15)
0 0 2 0 0 0 0 0 0 0 0 0 0 0 0 0 
##$SW_h= 3612.71676300578
##$TD= 16384
##$TD0= 1
##$TE= 0
##$TE2= 300
##$TE3= 300
##$TEG= 300
##$TL= (0..7)
0 120 120 120 120 120 120 120 
##$TP= (0..7)
150 150 150 150 150 150 150 150 
##$TP07= 0
##$TPNAME0= <>
##$TPNAME1= <>
##$TPNAME2= <>
##$TPNAME3= <>
##$TPNAME4= <>
##$TPNAME5= <>
##$TPNAME6= <>
##$TPNAME7= <>
##$TPOAL= (0..7)
0.5 0.5 0.5 0.5 0.5 0.5 0.5 0.5 
##$TPOFFS= (0..7)
0 0 0 0 0 0 0 0 
##$TUNHIN= 0
##$TUNHOUT= 0
##$TUNXOUT= 0
##$USERA1= <user>
##$USERA2= <user>
##$USERA3= <user>
##$USERA4= <user>
##$USERA5= <user>
##$V9= 5
##$VALIST= <valist>
##$VCLIST= <CCCCCCCCCCCCCCC>
##$VD= 0
##$VDLIST= <DDDDDDDDDDDDDDD>
##$VPLIST= <PPPPPPPPPPPPPPP>
##$VTLIST= <TTTTTTTTTTTTTTT>
##$WBST= 1024
##$WBSW= 4
##$XGAIN= (0..3)
0 0 0 0 
##$XL= 0
##$YL= 0
##$YMAX_a= 244814
##$YMIN_a= -245844
##$ZGOPTNS= <>
##$ZL1= 120
##$ZL2= 120
##$ZL3= 120
##$ZL4= 120
##$ABSF1= 15.49128
##$ABSF2= -2.56057
##$ABSG= 5
##$ABSL= 3
##$ALPHA= 0
##$AQORDER= 0
##$ASSFAC= 0
##$ASSFACI= 0
##$ASSFACX= 0
##$ASSWID= 0
##$AUNMP= <proc_1d>
##$AZFE= 0.1
##$AZFW= 0.1
##$BCFW= 0
##$BC_mod= 2
##$BYTORDP= 0
##$COROFFS= 0
##$CY= -3
##$DATMOD= 1
##$DC= 0
##$DFILT= <>
##$DTYPP= 0
##$F1P= 0
##$F2P= 0
##$FCOR= 1
##$FTSIZE= 16384
##$FT_mod= 6
##$GAMMA= 0
##$GB= 0
##$INTBC= 1
##$INTSCL= 3.241238e-09
##$ISEN= 128
##$LB= 0.25
##$LEV0= 0
##$LPBIN= 0
##$MAXI= 10000
##$MC2= 0
##$MEAN= 0
##$ME_mod= 0
##$MI= 1.114404
##$NCOEF= 0
##$NC_proc= -6
##$NLEV= 6
##$NOISF1= 3.799351
##$NOISF2= 2.8
##$NSP= 0
##$NTH_PI= 0
##$NZP= 0
##$OFFSET= 15.51772
##$PC= 1
##$PHC0= -1717.772
##$PHC1= 14.16658
##$PH_mod= 1
##$PKNL= yes
##$PPARMOD= 0
##$PSCAL= 0
##$PSIGN= 0
##$REVERSE= no
##$SF= 200.130000798269
##$SI= 16384
##$SIGF1= 3
##$SIGF2= 2
##$SINO= 0.751879
##$SIOLD= 32768
##$SREGLST= <19F.Aceton>
##$SSB= 0
##$STSI= 16384
##$STSR= 0
##$SW_p= 3612.71676300578
##$SYMM= 0
##$S_DEV= 0
##$TDeff= 16384
##$TDoff= 0
##$TI= <>
##$TILT= no
##$TM1= 0
##$TM2= 0
##$TOPLEV= 0
##$USERP1= <user>
##$USERP2= <user>
##$USERP3= <user>
##$USERP4= <user>
##$USERP5= <user>
##$WDW= 1
##$XDIM= 16384
##$YMAX_p= 295019401
##$YMIN_p= -246272
$$ End of Bruker specific parameters
$$ ---------------------------------
##NTUPLES= NMR SPECTRUM
##VAR_NAME=  FREQUENCY,     SPECTRUM/REAL,   SPECTRUM/IMAG
##SYMBOL=    X,             R,               I
##VAR_TYPE=  INDEPENDENT,   DEPENDENT,       DEPENDENT
##VAR_FORM=  AFFN,          ASDF,            ASDF
##VAR_DIM=   16384,         16384,           16384
##UNITS=     HZ,            ARBITRARY UNITS, ARBITRARY UNITS
##FACTOR=    0.220516191357247, 1,           1
##FIRST=     3105.56136051087, 0,            0
##LAST=      -507.155402494915, 0,           0
##MIN=       -507.155402494915, -246272,     0
##MAX=       3105.56136051087, 295019401,    0
$$ Real data points
##PAGE= N=1
##DATA TABLE= (X++(R..R)), XYDATA
$$ [...]
6219B35487J3078J4761N4044q256q102j260j3465K9717K3731N6027j2168O804
$$ 235487 248565 263326 317370 309114 301012 299752 286287 316004 339735 395762 383594 390398
6207C90398N0741O4552K6198K6183J6360j0591M2130J0494q064k9517m4604p484
$$ 390398 441139 505691 531889 558072 574432 563841 605971 616465 608401 578884 534280 526796
6195E26796M9517n472M7201M1458J4738K2375k4165j0841m0579q412M0728J229
$$ 526796 576313 570841 618042 659500 674238 696613 672448 661607 621028 612616 653344 654573
6183F54573J2957J8665L9377N1071L724J8559P8472J9293l5799l4717p4193r7547
$$ 654573 667530 686195 725572 776643 780367 798926 877398 896691 860892 826175 751982 654435
6171F54435l3390k7715l0277j1304l7102J4127N512l6891m6762l83l996M572o55
$$ 654435 621045 593330 563053 551749 514647 528774 534286 497395 450633 450250 446254 450826 450171
6158D50171m019j3074M156J6354K2578n134l563K5675J5098j8434M781o456l1073
$$ 450171 446152 433078 437234 453588 476166 471032 467469 493144 508242 489808 494589 488133 457060
6145D57060n8556k5887o9378O876M482j5582o113l0223K1299J1391J0132o960
$$ 457060 398504 372617 303239 310115 314597 299015 292902 262679 283978 295369 305501 298541
6133B98541j3359K0041j0327J1132j1333l1074N862O583J0953M0951K9215k3927
$$ 298541 285182 305223 294896 306028 294695 263621 269483 276066 287019 327970 357185 333258
6121C33258j3463n805O973L5439M5853L4519N1184K6362k7060M5820Q2118J5196
$$ 333258 319795 313990 320963 356402 402255 436774 487958 514320 487260 533080 615198 630394
6109F30394J1909N9624Q322j2605M0764L0048k025J0204P5648Q491J1977M7231
$$ 630394 642303 701927 710249 697644 738408 768456 766431 776635 852283 860774 872751 919982
6097I19982M5890O8274Q9422Q7108Q8543J34365J19424N7903R1253O0453J0609
$$ 919982 965872 1034146 1123568 1210676 1299219 1433584 1553008 1610911 1702164 1762617 1773226
6086A773226P487p251k6736k802r271j7814l1121m3135M9828M1218m434O518K8626
$$ 1773226 1780713 1773462 1746726 1743924 1734653 1716839 1685718 1642583 1692411 1733629 1729195 1735713 1764339
6073A764339K8487Q260J6678J3061P4275O9151R1804J50547J59642J11430J50254
$$ 1764339 1792826 1801086 1817764 1830825 1905100 1974251 2066055 2216602 2376244 2487674 2637928
6062B637928R5948J13233L8616o5374k06972k41872k27644j89191j37051j15364
$$ 2637928 2733876 2847109 2885725 2820351 2613379 2371507 2143863 1954672 1817621 1702257
6052A702257j13438p8562n3181m3912k8202p7177l2545l8347J8060P410k6022
$$ 1702257 1588819 1510257 1457076 1413164 1384962 1307785 1275240 1236893 1254953 1262363 1236341
6041A236341M299J8414l2585j1123R932P4817N4889L4133K3639O5890K2194j8686
$$ 1236341 1240640 1259054 1226469 1215346 1225278 1300095 1354984 1389117 1412756 1478646 1500840 1482154
6029A482154q8345j56439j37979j06219q2594p7756p0548l3632m9377m6530j0171
$$ 1482154 1393809 1237370 1099391 993172 910578 832822 762274 728642 679265 632735 622564
6018F22564k4947l3127N984j2912l8144K0585l2825M126l4876k9586l6825k9898
$$ 622564 597617 564490 570474 557562 519418 540003 507178 511304 476428 446842 410017 380119
6006C80119j8848j1393K8601l097J4574j8454k3890P406l564j6420P196K285O225
$$ 380119 361271 349878 378479 375382 389956 371502 347612 355018 351454 335034 342230 344515 350740
5993C50740j6045j5361j154l611o819j3933o990R630J0364q401J0140k9719J9489
$$ 350740 334695 319334 318180 314569 307750 293817 286827 296457 306821 298420 308560 278841 298330
5980B98330R15r726k7332l2246L9711r895L4719N958j9326P91M7424n302K5472
$$ 298330 299245 289519 262187 229941 269652 259757 294476 300434 281108 281899 329323 324021 349493
5967C49493k432R67l1528k3658K2871o576r523k7196N7957J7158l8906K0043j1136
$$ 349493 347061 348028 316500 292842 315713 309137 299614 272418 330375 347533 308627 328670 317534
5954C17534o221K7299m523K5325J2557j2637l0151J2857K655l522N742p444j8139
$$ 317534 311313 338612 334089 359414 371971 359334 329183 342040 344695 341173 346915 339471 321332
5941C21332J2170J2548N027j8550p439O740j5325j7990O454L9389K2885q921j4466
$$ 321332 333502 346050 351077 332527 325088 331828 316503 298513 304967 344356 367241 358320 343854
5928C43854l2548R380k7343J2513L6798n495l4731L91K4051k0905m168k2415n222
$$ 343854 311306 320686 293343 305856 342654 337159 302428 302819 326870 305965 301797 279382 274160
5915B74160J1698L7073l457m0557J757Q570k6980p755j0372n285l8230J3256M446
$$ 274160 285858 322931 319474 278917 280674 289244 262264 254509 244137 238852 200622 213878 218324
5902B18324j4942m857J8280o337k9612N257J010L2240L0254j5919j4224m516k6051
$$ 218324 203382 198525 216805 210468 180856 186113 187123 219363 249617 233698 219474 214958 188907
5889A88907J1802O194m0189Q243K6231l5842K4394k850p61l9780l5812J9613j3889
$$ 188907 200709 206903 166714 174957 201188 165346 189740 186890 186129 146349 110537 130150 116261
5876A16261j5188o572j9965L2002K3722N537k0138k6891K7708L2902k059j3073
$$ 116261 101073 94501 74536 106538 130260 135797 115659 88768 116476 149378 147319 134246
5864A34246M678n695J3068J137m371J0702l6219o459j516n797J7957k6892q994
$$ 134246 138924 133229 146297 147434 143063 153765 117546 111087 109571 103774 121731 94839 85845
5851H5845r675L9160j34J2798j8439j6594m53K0155J2907k1871P317N177j4592
$$ 85845 76170 115330 115196 127994 109555 92961 92508 112663 125570 103699 111016 116193 101601
5838A01601N12K3903K1013k47j6090l786l9023l656R633M083r43Q17O212j2364
$$ 101601 102113 126016 147029 146782 130692 126906 87883 84227 93860 97943 97000 97817 104029 91665
5824I1665k210M3930k8184j2869J5236k8734K5160q235Q814j3367Q616K2696j1989
$$ 91665 89455 133385 105201 92332 107568 78834 103994 95759 104573 91206 99822 122518 110529
5811A10529j4480J0773L8388l2463l4061k084J9001l548K9907k036k1959r917
$$ 110529 96049 106822 145210 112747 78686 76602 95603 92055 121962 119926 97967 88050
5799H8050o2432K7230K6376j8909J6022J4286J9769K554k5786j839J8724j7474
$$ 88050 25618 52848 79224 60315 76337 90623 110392 112946 87160 85321 104045 86571
5787H6571J9073K546J875o933l6079K7052Q631J602K0800l1735q042O310J0305
$$ 86571 105644 108190 110065 103132 67053 94105 102736 104338 125138 93403 85361 91671 101976
5774A01976O088K2487l007o512n900j5935K9307n317k395k3205p536N462k2481
$$ 101976 108064 130551 127544 121032 115132 99197 128504 123187 120792 97587 90051 95513 73032
5761G3032K4595o195N23J8264J8770N194J2080m169p431K3446j7267j1988k9080
$$ 73032 97627 91432 91955 110219 128989 134183 146263 142094 134663 158109 140842 128854 99774
5748I9774J5400m440l554O9749p286l9747Q607k2893J1103J098j7491l443L935
$$ 99774 115174 110734 107180 176929 169643 129896 138503 115610 126713 127811 110320 106877 110812
5735A10812l419K6584K0138N40J5232j9694k6562k0993L6659J3472m9248r911
$$ 110812 107393 133977 154115 154655 169887 150193 123631 102638 139297 152769 103521 93610
5723I3610M8706J0926o964K3475j4692n0997J037j0045J3969K5698m348L9032
$$ 93610 142316 153242 146278 169753 155061 104064 105101 95056 109025 134723 130375 169407
5711A69407k5098j3066M3272J0660k5862j3325q017k0672K5029p032q728M466
$$ 169407 144309 131243 174515 185175 159313 145988 137971 117299 142328 135296 126568 131034
5699A31034J9436m763k2047J9825n944J1453K081l771o201Q017J661J3204J5180
$$ 131034 150470 145707 123660 143485 137541 148994 151075 147304 141103 149120 150781 163985 179165
5686A79165j7440q786J1102n58l9946r810N0105K871q859M255q171k7632J3761
$$ 179165 161725 152939 164041 163483 123537 113727 163832 166703 157844 162099 153928 126296 140057
5673A40057J8363j7096o069M302q01l450J1477l869L3713K3213k3100m1451L2322
$$ 140057 158420 141324 135255 139557 138756 135306 146783 142914 176627 199840 176740 135289 167611
5660A67611K6647J6052K1629m312n691j7504M460K3111l3963l1601N286j2050
$$ 167611 194258 210310 231939 227627 221936 204432 208892 232003 198040 166439 171725 159675
5648A59675J3113J0749K5832J5876o959j518j3902j6594M294K0101j0902L1413
$$ 159675 172788 183537 209369 225245 218286 216768 202866 186272 190566 210667 199765 231178
5636B31178K5147n551P131j4417J5592j406J9459P064J1910M3562M1344K1808
$$ 231178 256325 250774 257905 243488 259080 257674 277133 284197 296107 339669 381013 402821
5624D02821n861l7077l1648l6934J1141K4905l7230N503J0776j1657L2092J6651
$$ 402821 396960 359883 328235 291301 302442 327347 290117 295620 306396 294739 326831 343482
5612C43482k0487J0973K7865P026O325n324q564J2870J6276L0692J8676K158K5142
$$ 343482 322995 333968 361833 368859 375184 369860 361296 374166 390442 421134 439810 441968 467110
5599D67110L4305J4203R647J3188K6741P490r36j3035L5056Q891K67J5819m601
$$ 467110 501415 515618 525265 538453 565194 572684 571748 558713 593769 602660 602927 618746 614145
5586F14145L3459L1385k1881L4476J4028j8811J6656K6124L8438K828J10634N4279
$$ 614145 647604 678989 657108 691584 705612 686801 703457 729581 768019 770847 881481 935760
5574I35760J2956L4846L6436P83J1263J7832o6975j3753l7373m506K2473q811
$$ 935760 948716 983562 1019998 1020781 1032044 1049876 982901 969148 931775 927269 949742 940931
5562I40931k0578J2165L75n350L9220J1406P338J9268m3160L6221J0578M6343
$$ 940931 920353 932518 932893 927543 966763 978169 985507 1004775 961615 997836 1008414 1054757
5550A054757P1281N4240Q1800P3023J13321P4792K7004R032n2798j54953r1731
$$ 1054757 1126038 1180278 1262078 1335101 1448422 1523214 1550218 1559250 1506452 1351499 1259768
5539A259768o9621j02635q2345n2292o3202o5072m037j1241j8715L3828K5094
$$ 1259768 1190147 1087512 1005167 952875 889673 824601 820564 809323 790608 824436 849530
5528H49530r71K6570K7316k528L0519M1031O3213J25058O6050O3308P2397N3324
$$ 849530 848559 875129 902445 899917 930436 971467 1034680 1159738 1225788 1289096 1361493 1414817
5516A414817O6053j44r2006j42274j23661r6793p4812r1339p5523j8233k2348
$$ 1414817 1480870 1480726 1388720 1246446 1122785 1025992 951180 859841 784318 766085 743737
5505G43737j6119j7130j7290r023k3552M072Q072O4P334M0485J7181N464Q1717
$$ 743737 727618 710488 693198 684175 660623 664695 672767 672831 680165 720650 737831 743295 825012
5492H25012O5550L4043Q1056M9412q470k1197m4544j05709r3404k8547o3145q2768
$$ 825012 890562 924605 1005661 1055073 1046603 1025406 980862 875153 781749 753202 690057 607289
5480F07289k2554k9613r594J9610K2634J5897l3947k8276j1530k0641o604j0423
$$ 607289 584735 555122 545528 565138 587772 603669 569722 541446 529916 509275 502671 492248
5468D92248N4650M1745L9948J7776k133L9987M2855K0705j1496l2300P09k7924
$$ 492248 546898 588643 628591 646367 644234 684221 727076 747781 736285 703985 704694 676770
5456F76770q290n016k5135L8548L4299J4222L6457O4682K0951J0528M2524M3309
$$ 676770 668480 663464 638329 676877 711176 725398 761855 826537 847488 858016 900540 943849
5444I43849N9476P4292J18772J09904P9572R5494P7174n577q4718p5931o4845
$$ 943849 1003325 1077617 1196389 1306293 1385865 1481359 1558533 1552956 1468238 1392307 1327462
5433A327462o0368q0836M910l2478l9019n504P0L1752N5263J5095M3448J11884
$$ 1327462 1267094 1186258 1191168 1158690 1119671 1114167 1114237 1145989 1201252 1216347 1259795 1371679
5421A371679Q3140J14528J01192Q0883O9848P3936N3565J17423J71545K06214
$$ 1371679 1454819 1569347 1670539 1751422 1821270 1895206 1948771 2066194 2237739 2443953
5411B443953J72128R1826m6257j60213k32613k23753j46911p5909q5508p3787
$$ 2443953 2616081 2707907 2661650 2501437 2268824 2045071 1898160 1822251 1736743 1662956
5401A662956p0748m0087q214o3511J7648L3419L5314M8525N9033P8927N1265K4901
$$ 1662956 1592208 1552121 1543907 1480396 1498044 1531463 1566777 1615302 1674335 1753262 1804527 1829428
5389A829428j42l960k879m5354k3241m6237k5360n3440p0707j28658j26086q2580
$$ 1829428 1829286 1825326 1822447 1777093 1753852 1707615 1682255 1628815 1558108 1429450 1303364 1220784
5377A220784p6222j14559o4545l1536k3690n0897L88m0528m07j0050l5215P87
$$ 1220784 1144562 1030003 965458 933922 910232 859335 859723 819195 818788 808738 773523 774310
5365G74310j7610K1775J2151j3469K0659j4464n4154l4866k8227m5082o5508m954
$$ 774310 756700 778475 790626 777157 797816 783352 729198 694332 666105 621023 555515 550561
5353E50561m0462k2168l1954k939N443l4341n6233n045J8945l2319j7793J2764
$$ 550561 510099 487931 455977 453038 458481 424140 367907 362862 381807 349488 331695 344459
5341C44459l5124J2472j5072j0054K6173M6439l1486l6024O997j0373O155o849
$$ 344459 309335 321807 306735 296681 322854 369293 337807 301783 308780 298407 304562 297713
5329B97713l1973j3728j3620j4331j15M2771L7113r197m1751L1366k5670j5392
$$ 297713 265740 252012 238392 224061 223946 266717 303830 294633 252882 284248 258578 243186
5317B43186K2658j2046l1702M460Q843r402L1924Q357p990m0737m178k3790N2780
$$ 243186 265844 253798 222096 226556 235399 225997 257921 266278 258288 217551 213373 189583 242363
5304B42363J4225Q204r607j625N169O586k7059j2614r448j2349R186Q713J248
$$ 242363 256588 264792 255185 253560 258729 265315 238256 225642 216194 203845 213031 221744 222992
5291B22992l9063k721P893r626j0266K1863J4068j7557q015K1601J341j5212J5794
$$ 222992 183929 181208 189101 179475 169209 191072 205140 187583 179568 201169 202510 187298 203092
5278B03092j3674k4441R286o492L028k2227j6335p817M7693K7942k092K8445O960
$$ 203092 189418 164977 174263 167771 170799 148572 132237 124420 172113 200055 197963 226408 233368
5265B33368k3672P733J7682j3400k7406j4255j5300L9200o608Q480L075j960k1773
$$ 233368 209696 217429 235111 221711 194305 180050 164750 203950 197342 205822 208897 206937 185164
5252A85164n1663j039K5630J5466j1946o542J5013L7204l0982j5243J3078j267
$$ 185164 133501 132462 158092 173558 161612 155070 170083 207287 176305 161062 174140 172873
5240A72873K2559R61k2972n829J6608J1926L8452j0119j6782n2j5893J387n806
$$ 172873 195432 196393 173421 167592 184200 196126 234578 224459 207677 207625 191732 193119 187313
5227A87313K390j4200k638l1263k1594K1319K9823R732j81l5119J4578j545K9870
$$ 187313 189703 175503 172865 141602 120008 141327 171150 180882 180701 145582 160160 158615 188485
5214A88485m841K0288J4812m3996j9443K3085M186l7335P614m292j3218J4266
$$ 188485 183644 203932 218744 174748 155305 178390 182576 145241 152855 148563 135345 149611
5202A49611M6344N399j7836J1519l799L760N758R87j7337J7003r929k5374j1307
$$ 149611 195955 201354 183518 195037 191238 194998 200756 201743 184406 201409 191480 166106 154799
5189A54799K5788J6069K295j0843p923J2780j9907J0900j6678j0236J0823J7400
$$ 154799 180587 196656 198951 188108 180185 192965 173058 183958 167280 157044 167867 185267
5177A85267j5301j8997J6413K7965j0040O453j5518k2354l0812j0479K1274M0400
$$ 185267 169966 150969 167382 195347 185307 191760 176242 153888 123076 112597 133871 174271
5165A74271q62M485m57l6322M6538O542j6967k8692j041J6938J9623k894J1116
$$ 174271 173409 177894 177437 141115 187653 194195 177228 148536 147495 164433 184056 181162 192278
5152A92278K7952k7843O0451m0785j8115j5620J6999J7149j6118o265j080p846
$$ 192278 220230 192387 252838 212053 193938 178318 195317 212466 196348 190083 189003 181157
5140A81157j2688Q891O885M740J0529J8359j5555O780k5499k7380J6560p608k1136
$$ 181157 168469 177360 184245 188985 199514 217873 202318 209098 183599 156219 172779 165171 144035
5127A44035L9586J0904J3423J3899o775J847L4340j1814j1335J0228l296j2212
$$ 144035 183621 194525 207948 221847 215072 216919 251259 239445 228110 238338 235042 222830
5115B22830R390j18l7118M1470K5745k0474j8489l2262k300M4030M5553n152j1223
$$ 222830 232220 232102 194984 236454 262199 241725 223236 190974 188674 232704 278257 273105 261882
5102B61882O197p672J7553K687j9350J6896k665n801J279L312k7001K2604j1244
$$ 261882 268079 260407 277960 280647 261297 278193 275528 269727 271006 274318 247317 269921 258677
5089B58677P826P052K8751n651l111q698R504L924J5043K2325J6203J5006k5446
$$ 258677 266503 273555 302306 296655 293544 284846 294350 298274 313317 335642 351845 366851 341405
5076C41405J1754N1146K2866L0690K3613K4634J5527J9646L4199J2392N7419L7769
$$ 341405 353159 404305 427171 457861 481474 506108 521635 541281 575480 587872 645291 683060
5064F83060L5232L0184O0700Q4582P7002O1000J17982J18935J32151J43121J43937
$$ 683060 718292 748476 809176 893758 970760 1031760 1149742 1268677 1400828 1543949 1687886
5053A687886J12369J17091K23776K25212J21151Q0745R305P7624J95596K13100
$$ 1687886 1800255 1917346 2141122 2366334 2487485 2568230 2577535 2655159 2850755 3063855
5043C063855N1020k22106m41589l75174k70569j71285j48936j01663p1840o4188
$$ 3063855 3114875 2892769 2451180 2076006 1805437 1634152 1485216 1383553 1311713 1247525
5033A247525p7900q4418n1304o2971k6290l8989m6649n0876n1814j9249l2349
$$ 1247525 1169625 1085207 1033903 970932 944642 905653 859004 808128 756314 737065 704716
5022G04716k9832n046r812l7275N446o5189p049M104p204j9345K2107N755k2987
$$ 704716 674884 669838 660026 622751 628197 563008 555959 560063 552859 533514 555621 561376 538389
5009E38389p671j7105j3705l7809N918N344N259l2033j9835j3911j2559K0876
$$ 538389 530718 513613 499908 462099 468017 473361 478620 446587 426752 412841 400282 421158
4997D21158K4648k9670L052j3370J5018M909Q985k6359J5069r454j9583j7304
$$ 421158 445806 416136 419188 405818 420836 425745 434730 408371 423440 413986 394403 377099
4985C77099J1473P130k5269k273n721j6613J3856q040m257j4953K3155N51J8550
$$ 377099 388572 395702 370433 368160 362439 345826 359682 351642 347385 332432 355587 356138 374688
4972C74688j7397J1363j7898p2K2783K8937J590m5259J4348N468j2260k4737R080
$$ 374688 357291 368654 350756 350684 373467 402404 403994 358735 373083 378551 366291 341554 350634
4959C50634J7785L7933j6935J012P3L024L811M4452L4763k5098L7433M4930K7552
$$ 350634 368419 406352 389417 390429 390502 393526 397337 441789 476552 451454 488887 533817 561369
4946E61369q653j2757R026m862K5947J11L3184J9436K4030k6666K4309p86l493
$$ 561369 552716 539959 548985 544123 570070 570181 603365 622801 646831 620165 644474 643688 640195
4933F40195J3796M8183j4996k3422j6378k6899N240j7680j1735l7256J5858J8343
$$ 640195 653991 702174 687178 663756 647378 620479 625719 608039 596304 559048 574906 593249
4921E93249k410j6592L1799L765j0013k0385o2254q784K6763m557Q00j3661p688
$$ 593249 590839 574247 606046 609811 599798 579413 517159 508375 535138 530581 531381 517720 510032
4908E10032j7498K4876j975j6320O6102L0252Q39m128K9520M3073n3488j2907
$$ 510032 492534 517410 515435 499115 565217 595469 596308 592180 621700 664773 611285 598378
4896E98378l9143J0728J0897p95J8072k1779J6791l633J7961j2014m4016M1323
$$ 598378 559235 569963 580860 580065 598137 576358 593149 589516 607477 595463 551447 592770
4884E92770J400M666J612j9228K1504J0128L665j5826O7476o739M5659J6182j1536
$$ 592770 594170 598836 600448 581220 602724 612852 616517 600691 668167 661428 707087 723269 711733
4871G11733K1038k8363k5450R722K2626j1083k2806K1846j1141K3389L0358M557
$$ 711733 732771 704408 678958 688680 711306 700223 677417 699263 688122 711511 741869 746426
4859G46426P334j4646o580J2681O46j7362K2501J4043L4827J9271k5570j0166
$$ 746426 753760 739114 732534 745215 745861 728499 751000 765043 799870 819141 793571 783405
4847G83405L1464M724M134K5144J9574j082j7377K2810K1021K1953N793l6679
$$ 783405 814869 819593 823727 848871 868445 867363 849986 872796 893817 915770 921563 884884
4835H84884K1742J4376R445K4174L4152K9403P578K7268M7720K4314L9364K7411
$$ 884884 906626 921002 930447 954621 988773 1018176 1025754 1053022 1100742 1125056 1164420 1191831
4823A191831J5410m63L6075L0198k457M0974P0506k799M149K7715n899Q053K0742
$$ 1191831 1207241 1206778 1242853 1273051 1270594 1311568 1382074 1379275 1383424 1411139 1405240 1413293 1434035
4810A434035L7867K7439L2012L4857P8906M9618L3852K4930O0029L4594K1938
$$ 1434035 1471902 1499341 1531353 1566210 1645116 1694734 1728586 1753516 1813545 1848139 1870077
4799A870077O0347O1685M6761J8058J15853P4859N0486R3027J12761J25361J35585
$$ 1870077 1930424 1992109 2038870 2056928 2172781 2247640 2298126 2391153 2503914 2629275 2764860
4788B764860J44791J23591J32035J01046J80141K07497J69557J83636K30560K36460
$$ 2764860 2909651 3033242 3165277 3266323 3446464 3653961 3823518 4007154 4237714 4474174
4778D474174K34246K59284K94331K89601K55968L17936L53786L92762M66506M60056
$$ 4474174 4708420 4967704 5262035 5551636 5807604 6125540 6479326 6872088 7338594 7798650
4768G798650M89138N06236M94505N74898O67013Q30247J009177J169400J378086
$$ 7798650 8287788 8794024 9288529 9863427 10530440 11360687 12369864 13539264 14917350
4759A4917350J444610J296521R31786N07822K77927K39087L33881L63100K64102
$$ 14917350 16361960 17658481 18590267 19098089 19376016 19615103 19948984 20312084 20576186
4750B0576186J74527K18362L04041N02406O26701O08090O26143P15263Q53976
$$ 20576186 20750713 20969075 21273116 21775522 22402223 23010313 23636456 24351719 25205695
4741B5205695R28672R99715R54825Q21801P45955P30840Q76715J052169J230663
$$ 25205695 26134367 27134082 28088907 28910708 29656663 30387503 31264218 32316387 33547050
4732C3547050J410279J576941J696455J687758J509282R38380k8687r83609j449124
$$ 33547050 34957329 36534270 38230725 39918483 41427765 42366145 42337458 41353849 39904725
4723C9904725j478242j321103j171156j053693q84003p40060o54479p00938r05324
$$ 39904725 38426483 37105380 35934224 34880531 33996528 33256468 32601989 31901051 30995727
4714C0995727j077719j128972j039582q85212o98541n26231m38961m22863m40937
$$ 30995727 29918008 28789036 27749454 26864242 26165701 25639470 25200509 24777646 24336709
4705B4336709l36310j58865k5462k3997r8748k17735l17957k85908l67169p15932
$$ 24336709 24000399 23841534 23816072 23792075 23693327 23475592 23157635 22871727 22504558 21788626
4695B1788626j274619j666690j708188j445346j176760r23226o83637o11140n11903
$$ 21788626 20514007 18847317 17139129 15693783 14517023 13593797 12910160 12299020 11787117
4686A1787117m94376n17645n11021m90040m45751m02806l63330l14730l32949
$$ 11787117 11292741 10775096 10264075 9774035 9328284 8925478 8562148 8247418 7914469
4677G914469l29784l04665l08611k99832k99384k61367k20583k22423k00771j94643
$$ 7914469 7584685 7280020 6971409 6671577 6372193 6110826 5890243 5667820 5467049 5272406
4667E272406k10574j92680j69113j62144j55553j35832q7655j21146j52189j08748
$$ 5272406 5061832 4869152 4700039 4537895 4382342 4246510 4158855 4037709 3885520 3776772
4657C776772q2156n3937n2016m3659o2807n9109l9480m2067j9194l3503p0002
$$ 3776772 3694616 3640679 3588663 3545004 3482197 3423088 3383608 3341541 3322347 3288844 3218842
4646C218842m4220j9808o4132j8694j7392n0732l4852n8634n8022n7452j18099
$$ 3218842 3174622 3154814 3090682 3071988 3054596 3003864 2969012 2910378 2852356 2794904 2676805
4635B676805j02473j03027o3379n8005j12069n0690m7308k9213o0916l3786m3769
$$ 2676805 2574332 2471305 2407926 2349921 2237852 2187162 2139854 2110641 2049725 2015939 1972170
4624A972170n6907p316o0893m5113p711j4698r611j1178m3418m1459l8048m2134
$$ 1972170 1915263 1907947 1847054 1801941 1794230 1779532 1769921 1758743 1715325 1673866 1635818 1593684
4612A593684P786n3452m248k4593j8638j9017p1607l0888m2016m5681o6107l2749
$$ 1593684 1601470 1548018 1543770 1519177 1500539 1481522 1409915 1379027 1337011 1291330 1225223 1192474
4600A192474M300m7031j1278l5904k0433L206K068p1112k8997j0819j8254k7659
$$ 1192474 1196774 1149743 1138465 1102561 1082128 1085334 1087402 1016290 987293 976474 958220 930561
4588I30561o896j4109j3608O33j1269r14n4037j8302j9083K2982J2760j2407k6367
$$ 930561 923665 909556 895948 896581 885312 884398 830361 812059 792976 815958 828718 816311 789944
4575G89944o591j0381j3991m0966J2567J6220j7743K8695L1230l5521j1448k6860
$$ 789944 783353 772972 758981 718015 730582 746802 729059 757754 788984 753463 742015 715155
4563G15155j7416j4157K5392l6815O571J3012R535l936k2789O002l0316m606J9741
$$ 715155 697739 683582 708974 672159 678730 691742 701277 697341 674552 680554 650238 645632 665373
4550F65373K674k206J8702P272k2823l574M633O214k1634j4035K1734L236P167
$$ 665373 668047 665841 684543 691815 668992 665418 670051 676265 654631 640596 662330 665566 672733
4537F72733P637j6608j145k706n702o047r280J1093m615l0479N43l5719q44N638
$$ 672733 680370 663762 662617 659911 654209 648162 638882 649975 645360 614881 615424 579705 578861 584499
4523E84499j037J5286k9425L3644m100n369K7687k7587j9149k324j3451K2358
$$ 584499 583462 598748 569323 602967 598867 593498 621185 593598 574449 572125 558674 581032
4511E81032J0835K9281m6494l0104j1184K7915j2404j5639o993l506j6380J6598
$$ 581032 591867 621148 574654 544550 533366 561281 548877 533238 526245 522739 506359 522957
4499E22957M0263k355l4305J5111M485k0661l122o485R194k3447j1279j1507j068
$$ 522957 563220 560865 526560 541671 546156 525495 522373 515888 525082 501635 490356 478849 477781
4486D77781O6640j7888k1070n033l3877L8345j773l371j2729L247j5482K3051
$$ 477781 544421 526533 505463 500430 466553 504898 503125 499754 487025 490272 474790 497841
4474D97841J5719m3894P712j0093l2099L2754J9746j5847p851j5694L8308M52
$$ 497841 513560 469666 477378 467285 435186 467940 487686 471839 463988 448294 486602 487054
4462D87054j5488m453k5101K0761K9537l2154j362K6398j6054J0310J926J9978
$$ 487054 471566 467113 442012 462773 492310 460156 458794 485192 469138 479448 481374 501352
4450E01352R861m322J6054J2050p991J1252J7509m3264L7780l0882j956L4658
$$ 501352 511213 506891 522945 534995 527004 538256 555765 512501 550281 519399 517443 552101
4438E52101l2845M5843O484k47j0173J6776J0025n285R231j643J3449m444J1329
$$ 552101 519256 565099 571583 571336 561163 577939 587964 582679 591910 590267 603716 599272 610601
4425F10601L711K112J6120J7401m656m418P778N1322L8175m0926j7651l1013L3827
$$ 610601 614312 616424 632544 649945 645289 640871 648649 699971 738146 697220 679569 648556 682383
4412F82383k617q182j7358n014k4829k1009j4361j0472K3437J8303l3681n991
$$ 682383 679766 671584 654226 649212 624383 603374 589013 578541 601978 620281 586600 580609
4400E80609K9105k289K0428q693j6991L1773q127j546J5735j246L703j3314K0393
$$ 580609 609714 607425 627853 619160 602169 633942 625815 624269 640004 638758 642461 629147 649540
4387F49540j0841j660k1990K574L55K0322m679k7517r018l485P872O12M469J601
$$ 649540 638699 637039 615049 617623 617978 638300 633621 606104 597086 593601 601473 602085 606554 608155
4373F08155k2804k4749N2914k2862l1100J2204J5134K6327J0962L0608j0514k5377
$$ 608155 585351 560602 613516 590654 559554 571758 586892 613219 624181 654789 644275 618898
4361F18898K4853K326k144J0306J6960j208J9526j7009J1659Q681j428j1071l1734
$$ 618898 643751 646077 643933 654239 671199 669991 689517 672508 684167 692848 691420 680349 648615
4348F48615M0364k0136N219J4943L2062l3354J1086k0900L2391L377p658K2649
$$ 648615 688979 668843 674062 689005 721067 687713 698799 677899 710290 713667 706009 728658
4336G28658j6315M715n6458L564O0753K4129k3094K0347K3158L1354j8755q165
$$ 728658 712343 717058 660600 664164 724917 749046 725952 746299 769457 800811 782056 773891
4324G73891J1711L382j2958j5397K977K0235k65K3487K4261O418K1346j353M1548
$$ 773891 785602 788984 776026 760629 763606 783841 783576 807063 831324 837742 859088 857735 899283
4311H99283j599m406k3532L7933N2132M6784o534l1560K6438N5880L2896N1330
$$ 899283 897684 893278 869746 907679 959811 1006595 1000061 968501 994939 1050819 1083715 1135045
4299A135045J8467K8794L5692O8731N9446P058P2668N0424N1238P7348Q4260R1358
$$ 1135045 1153512 1182306 1217998 1286729 1346175 1353233 1425901 1476325 1527563 1604911 1689171 1780529
4287A780529Q1289R9041J47409R1694J17603J14811J25335J08692J05257J35322
$$ 1780529 1861818 1960859 2108268 2199962 2317565 2432376 2557711 2666403 2771660 2906982
4277B906982J98597J57115K24403K35885L01597L48120L42014L57124L39827L22613
$$ 2906982 3105579 3262694 3487097 3722982 4024579 4372699 4714713 5071837 5411664 5734277
4267E734277K77672K13728K13743J63199J96524K98444L65882M30926N42896O54544
$$ 5734277 6011949 6225677 6439420 6602619 6799143 7097587 7463469 7894395 8437291 9091835
4257I091835O82346P16924P09686O29603N19365L69676J87168P5514J4718M1933
$$ 9091835 9774181 10491105 11200791 11830394 12349759 12719435 12906603 12982117 12996835 13038768
4247A3038768J72833L50656N03514O05705P44839Q43417Q38106P85729O35659
$$ 13038768 13211601 13562257 14065771 14671476 15416315 16259732 17097838 17883567 18519226
4238A8519226M48307K17309q3564l52667m59395l84043k60984j84445Q4723K11284
$$ 18519226 18967533 19184842 19101278 18748611 18289216 17905173 17644189 17459744 17544467 17755751
4228A7755751L27046M96420N19022M92053L80903N7240j93471m60818p26374r13876
$$ 17755751 18082797 18579217 19098239 19590292 19971195 20028435 19834964 19374146 18647772 17733896
4218A7733896q47511p55105n97174m26971k75220r6176J338M7885Q9787K7142
$$ 17733896 16886385 16131280 15534106 15107135 14831915 14735739 14737077 14784962 14874749 14901891
4208A4901891j71937l96405o51212p92690q48241q39451p29623o54276n40555
$$ 14901891 14729954 14333549 13682337 12889647 12041406 11201955 10472332 9818056 9277501
4199I277501l44814k88880j82174j20509j52391j80095k13204l42857m43451m54077
$$ 9277501 8932687 8643807 8461633 8341124 8188733 8008638 7795434 7452577 7009126 6555049
4189F555049m70751m31231l92736l34953k62140k08918j69603j87567j21583j16856
$$ 6555049 6084298 5653067 5260331 4925378 4663238 4454320 4284717 4097150 3975567 3858711
4179C858711j00585j14541j70922j31578j58603j60225j27970j36183p9051r9775
$$ 3858711 3758126 3643585 3472663 3341085 3182482 3022257 2894287 2758104 2679053 2579278
4169B579278p4545r1810j07581p8234r8703o7986m7878j8416n9329m5227m8930
$$ 2579278 2504733 2412923 2305342 2227108 2128405 2060419 2012541 1994125 1934796 1889569 1840639
4158A840639o4424m9492p3625j1126k0279k3871l2605m8827l0792k3660j7871
$$ 1840639 1776215 1726723 1653098 1641972 1621693 1597822 1565217 1516390 1485598 1461938 1444067
4147A444067k1273l9612r789K7972l3340k0594j6182O277R028l4726P358l6691
$$ 1444067 1422794 1383182 1373393 1401365 1368025 1347431 1331249 1337526 1346554 1311828 1319186 1282495
4135A282495k9318L0925J085k5281k3354l9605j3601j5764l4796j3629l3073j4348
$$ 1282495 1253177 1284102 1285187 1259906 1236552 1196947 1183346 1167582 1132786 1119157 1086084 1071736
4123A071736J8829k1360k9331l05k5306j0623P108K6491k6318K2596p008l5749
$$ 1071736 1090565 1069205 1039874 1039569 1014263 1003640 1010748 1037239 1010921 1033517 1026509 990760
4111I90760K4035J5146L534j7842k8332Q333J9441j4337K248j561k1081j5286
$$ 990760 1014795 1029941 1033475 1015633 987301 995634 1015075 1000738 1002986 1001425 980344 965058
4099I65058J7127q056R08K6667K7085j9245p262p936J5483K7852M642j7258N0535
$$ 965058 982185 974129 975037 1001704 1028789 1009544 1002282 994346 1009829 1037681 1042323 1025065 1075600
4086A075600J4465J2475L3355O995k9074J3533l854j2210q920K585M5283L0582
$$ 1075600 1090065 1102540 1135895 1142890 1113816 1127349 1123495 1111285 1102365 1104950 1150233 1180815
4074A180815L9946L1672l680L330K5165P055M701L3050K5110j4866O879K6696
$$ 1180815 1220761 1252433 1248753 1252083 1277248 1284303 1289004 1322054 1347164 1332298 1339177 1365873
4062A365873L9446M986K0018J8911K9401L0705O146j061J9116l3628k5207j5690
$$ 1365873 1405319 1410305 1430323 1449234 1478635 1509340 1515486 1514425 1533541 1499913 1474706 1459016
4050A459016M57j4125q214O623P911L8921N0785k0237j778j0089n3572L065K7000
$$ 1459016 1459473 1445348 1437134 1443757 1451668 1490589 1541374 1521137 1519359 1509270 1455698 1458763 1485763
4037A485763P032M654K661L6800l001O986K0006m4529r376J6218K5575j6927K4682
$$ 1485763 1492795 1497449 1500110 1536910 1533909 1540895 1560901 1516372 1506996 1523214 1548789 1531862 1556544
4024A556544O1248n075l1914J8728J5738L1129O8051L0642J4144P806O4008K2128
$$ 1556544 1617792 1612717 1580803 1599531 1615269 1646398 1714449 1745091 1759235 1767041 1831049 1853177
4012A853177k671J2927P7107K0624L4090L4861j0289O9850M5262m531j0979K0508
$$ 1853177 1850506 1863433 1940540 1961164 1995254 2030115 2019826 2089676 2134938 2130407 2119428 2139936
4000B139936L0039J8409J7254N431M6057N5464J6889n117j43N4159J8289L6970
$$ 2139936 2169975 2188384 2205638 2211069 2257126 2312590 2329479 2324362 2324219 2378378 2396667 2433637
3988B433637k0863R746J9825N059J9579O081J4491K0789N3066K5369L8709p235
$$ 2433637 2412774 2422520 2442345 2447404 2466983 2473064 2487555 2508344 2561410 2586779 2625488 2618253
3976B618253n492J849q211J274K8623M254N7203M9452K7006N2965L9309M2273
$$ 2618253 2612761 2614610 2606399 2607673 2636296 2640550 2697753 2747205 2774211 2827176 2866485 2908758
3964B908758N7534K1780N3179L4461Q556O6615L1267O6550M4761M1971K8223m466
$$ 2908758 2966292 2988072 3041251 3075712 3084268 3150883 3182150 3248700 3293461 3335432 3363655 3359189
3952C359189k4464J4779l1605J492K9001R5859Q5893P6262J31427J37898J32135
$$ 3359189 3334725 3349504 3317899 3319391 3348392 3444251 3530144 3606406 3737833 3875731 4007866
3941D007866J61005J86459K57235K22327J91419J61748N8200M0539J4777J0658
$$ 4007866 4168871 4355330 4612565 4834892 5026311 5188059 5246259 5286798 5301575 5312233
3931E312233O3982N1331M8804Q2348J11993J44384K04526J96182J87398K45402
$$ 5312233 5376215 5427546 5476350 5558698 5670691 5815075 6019601 6215783 6403181 6648583
3921F648583K25582L06965L61490M53044M77194N56662O23831O40046O24967N73570
$$ 6648583 6874165 7181130 7542620 7995664 8472858 9029520 9653351 10293397 10918364 11491934
3911A1491934N78369O75953Q31680J009983J184661J366530J530606J536010J312079
$$ 11491934 12070303 12746256 13577936 14587919 15772580 17139110 18669716 20205726 21517805
3902B1517805Q61947L16794P941j5238Q2864K52292L42298N16410P25237R58515
$$ 21517805 22379752 22696546 22704487 22689249 22772113 23024405 23366703 23883113 24608350 25566865
3892B5566865J144392J242197J215200R97251O82151M09344J67441J55944J51907
$$ 25566865 26711257 27953454 29168654 30165905 30848056 31257400 31424841 31580785 31732692
3883C1732692J89632L24358N46115Q30028J137600J507474J878245K114360K232264
$$ 31732692 31922324 32246682 32792797 33622825 34760425 36267899 38146144 40260504 42492768
3874D2492768K195678J715156O78083q91274k229746k825458k669103k098532
$$ 42492768 44688446 46403602 47081685 46190411 43960665 41135207 38466104 36367572
3866C6367572j577096j111696q07205n69051l87174k73048m7861o7573j47181
$$ 36367572 34790476 33678780 32871575 32302524 31915350 31642302 31594441 31526868 31379687
3857C1379687k71498m60689p56383j159645j382503j403937j242270r01759n44118
$$ 31379687 31108189 30647500 29891117 28731472 27348969 25945032 24702762 23801003 23256885
3848B3256885l26715j89469j06325j37778r8056j39747l80838q04439j216280
$$ 23256885 22930170 22740701 22634376 22496598 22398542 22258795 21877957 21073518 19857238
3839A9857238j435625j419717j242538j062051q06048n74218n25179n35078n12086
$$ 19857238 18421613 17001896 15759358 14697307 13891259 13317041 12791862 12256784 11744698
3830A1744698m51507n08349n18872l93284l65127l34103k63931k37374j65050
$$ 11744698 11293191 10784842 10265970 9872686 9507559 9173456 8909525 8672151 8507101
3821H507101j68372j27373j32082j07509p5892r7948o3621l5023m7970j07923
$$ 8507101 8338729 8211356 8079274 7971765 7895873 7797925 7734304 7699281 7651311 7543388
3811G543388p7835r2311j15311j57057j99664k07343k04917j63740j31500p3741
$$ 7543388 7465553 7373242 7257931 7100874 6901210 6693867 6488950 6325210 6193710 6119969
3801F119969l8554m2844o4750o9045k8121n5854r0471o7024k2802k4766o521l3374
$$ 6119969 6081415 6038571 5973821 5904776 5876655 5820801 5730330 5663306 5640504 5615738 5609217 5575843
3789E575843l474k1444j5660j6626m2974n1424m4525k4694m2703l0225p9766n0897
$$ 5575843 5572369 5550925 5535265 5518639 5475665 5424241 5379716 5355022 5312319 5282094 5202328 5151431
3777E151431m7398k0373j8170l5184N9277O918k5140M9407P6066O3662M5564K2796
$$ 5151431 5104033 5083660 5065490 5030306 5089583 5096501 5071361 5120768 5196834 5260496 5306060 5328856
3765E328856J3256O0997L3322P9348Q4471Q4592J23026J57793J86234J70871J53313
$$ 5328856 5342112 5403109 5436431 5515779 5600250 5684842 5807868 5965661 6151895 6322766 6476079
3754F476079J63466K00613K63129K52784L17472K86827L30649L68348M17961M75931
$$ 6476079 6639545 6840158 7103287 7356071 7673543 7960370 8291019 8659367 9077328 9553259
3744I553259N37718N90963O81922P88892R04203J050253J168085J387927J587531
$$ 9553259 10090977 10681940 11363862 12152754 13056957 14107210 15275295 16663222 18250753
3735A8250753J762020J851124J953707J942333J816877J604642J299534R11590
$$ 18250753 20012773 21863897 23817604 25759937 27576814 29181456 30480990 31392580
3727C1392580N24207J75674j30291l92079m56910m37161l25929o6820J37372K59100
$$ 31392580 31916787 32092461 31962170 31570091 31113181 30676020 30350091 30283271 30420643 30679743
3717C0679743L94041L18147J97195j05249l74969o80385j032254j333986j554085
$$ 30679743 31073784 31391931 31589126 31483877 31108908 30428523 29396269 28062283 26508198
3708B6508198j697874j784303j783485j687551j553963j340850j227468j027548
$$ 26508198 24810324 23026021 21242536 19554985 18001022 16660172 15432704 14405156
3700A4405156q97076p67036p28269o54249n27960m56692m39709m06402l89520
$$ 14405156 13508080 12741044 12012775 11358526 10830566 10373874 9934165 9527763 9138243
3691I138243l02163k69334l12983k48991k06871j84085j91080j46076j45122j38140
$$ 9138243 8836080 8566746 8253763 8004772 7797901 7613816 7422736 7276660 7131538 6993398
3681F993398j26405q9571j24335r3116o1828p2295q9955p9653j19437o6321r2295
$$ 6993398 6866993 6777422 6653087 6559971 6498143 6425848 6335893 6256240 6136803 6070482 5978187
3670E978187j28504o2695p9003n6113l4390o3215n1868o3503l362l393k8065J9989
$$ 5978187 5849683 5786988 5707985 5651872 5617482 5554267 5502399 5438896 5435534 5432141 5404076 5424065
3658E424065J002m2934k0079o706j9961O999J5244M1617N5239o407L2166L3672
$$ 5424065 5425067 5382133 5362054 5355348 5335387 5342386 5357630 5399247 5454486 5448079 5480245 5513917
3646E513917N8527K7739N3661N8893N7342L0535P2743J02889O2731P6502J20734
$$ 5513917 5572444 5600183 5653844 5712737 5770079 5800614 5873357 5976246 6038977 6115479 6236213
3635F236213J19822J10510Q6636J00126Q4705P0825Q4586Q4456J24242Q9796R9105
$$ 6236213 6356035 6466545 6553181 6653307 6738012 6808837 6893423 6977879 7102121 7191917 7291022
3624G291022J11838J26754J66812J27615J95920K18225K25978K11532K06752K60367
$$ 7291022 7402860 7529614 7696426 7824041 8019961 8238186 8464164 8675696 8882448 9142815
3614I142815K98105L02102L53157M25589M95352N56068O39327O74222P79797R18000
$$ 9142815 9440920 9743022 10096179 10521768 11017120 11573188 12212515 12886737 13666534 14584534
3604A4584534J063439J280609J477621J691286J878774K056524K103068K084189
$$ 14584534 15647973 16928582 18406203 20097489 21976263 24032787 26135855 28220044
3596B8220044J977834J758551J470464J124890P83417M64560J78635N7311k7547
$$ 28220044 30197878 31956429 33426893 34551783 35335200 35799760 35978395 36035706 36008159
3587C6008159K9097J79789L24942M56268N17101N06608L32309Q5680k52638o19027
$$ 36008159 36037256 36217045 36541987 36998255 37515356 38021964 38354273 38439953 38187315 37568288
3577C7568288r46465j248091j593176j828235j940115j962643j880382j722126
$$ 37568288 36621823 35373732 33780556 31952321 30012206 28049563 26169181 24447055
3569B4447055j551297j360683j171506r48520p82045p09576n61406m70412l85252
$$ 24447055 22895758 21535075 20363569 19415049 18633004 17923428 17362022 16891610 16506358
3560A6506358l24720k21837j62995q5139m7862O2748J23689J98015K44773L19936
$$ 16506358 16181638 15959801 15796806 15711667 15663805 15726553 15850242 16048257 16293030 16612966
3550A6612966M13298M74158N91183P37778Q06681R27866J048353J231721J370776
$$ 16612966 17026264 17500422 18091605 18829383 19636064 20563930 21612283 22844004 24214780
3541B4214780J602203J784419K000567K275246K558238K798431K940649L067399
$$ 24214780 25816983 27601402 29601969 31877215 34435453 37233884 40174533 43241932
3533D3241932L014388K916062K741549K632330K520322K409387K189959J926452
$$ 43241932 46256320 49172382 51913931 54546261 57066583 59475970 61665929 63592381
3525F3592381J536909J084437O98580K59418j19386l79651o54517q24508j009393
$$ 63592381 65129290 66213727 66912307 67171725 67052339 66672688 66018171 65193663 64184270
3516F4184270j128649j302189j457766j595518j763158j831047j888309j938587
$$ 64184270 63055621 61753432 60295666 58700148 56936990 55105943 53217634 51279047
3508E1279047j916703j870899j717441j588894j349956j063546p64065m15111
$$ 51279047 49362344 47491445 45774004 44185110 42835154 41771608 41007543 40592432
3500D0592432m2523L54707N88519P01635P61806J084555J401212J776076J834381
$$ 40592432 40549909 40904616 41493135 42194770 42956576 44041131 45442343 47218419 49052800
3491D9052800J673934J274446J218976J735043K355997K901874L202805L397371
$$ 49052800 50726734 52001180 53220156 54955199 57311196 60213070 63415875 66813246
3483F6813246L376461L237122K991616K708472K388395K057404J911303J844772
$$ 66813246 70189707 73426829 76418445 79126917 81515312 83572716 85484019 87328791
3475H7328791K024731K384767K889817L512077M214616M709027M929776M778439
$$ 87328791 89353522 91738289 94628106 98140183 102354799 107063826 111993602 116772041
3467A16772041M491138M061459L275916K102838L88362j595404l411101m386124
$$ 116772041 121263179 125324638 128600554 130703392 131091754 129496350 126085249 121699125
3459A21699125m817655m740233m443619l930171l311405k678718k130177j804045
$$ 121699125 116881470 112141237 107697618 103767447 100456042 97777324 95647147 93843102
3451I3843102j657654j582052j690419j909001k223939k721378l235354l655596
$$ 93843102 92185448 90603396 88912977 87003976 84780037 82058659 78823305 75167709
3443G5167709l960296m045403l993661l880898l585619l344108l037914k734859
$$ 75167709 71207413 67162010 63168349 59287451 55701832 52357724 49319810 46584951
3435D6584951k381418k038141j763826j432977j176631r34679p37448n27041l41150
$$ 46584951 44203533 42165392 40401566 38968589 37791958 36857279 36119831 35592790 35251640
3426C5251640j57833j8625K31563M33410O70675R22578J231397J587984J896801
$$ 35251640 35093807 35075182 35306745 35740155 36410830 37333408 38564805 40152789 42049590
3417D2049590K169914K373429K414921K375828K190028K012054J845673J677763
$$ 42049590 44219504 46592933 49007854 51383682 53573710 55585764 57431437 59109200
3409E9109200J557890J315524R33692N03402R2432l69352o60201q71101q77578
$$ 59109200 60667090 61982614 62916306 63419708 63512140 63142788 62482587 61611486 60733908
3400F0733908q90291q08074p77218p23815n61240n08743n40514o08464p33966
$$ 60733908 59843617 59035543 58258325 57534510 56973270 56464527 55924013 55315549 54581583
3391E4581583r41524j176072j462899j677754j912732k096414k249853k322977
$$ 54581583 53640059 52463987 51001088 49323334 47410602 45314188 43064335 40741358
3383D0741358k250233k141078k036214j846392j722503j509205j274699j162905
$$ 40741358 38491125 36350047 34313833 32467441 30744938 29235733 27961034 26798129
3375B6798129j010280r33002q40097p71247p04287n66626m49538l85958k96685
$$ 26798129 25787849 24854847 24014750 23243503 22539216 21972590 21523052 21137094 20840409
3366B0840409k04414j01313m8037L3602J21089K52737M29945O31978Q10748R52023
$$ 20840409 20635995 20534682 20486645 20520247 20641336 20894073 21324018 21955996 22766744 23718767
3356B3718767R50252R29646P40055K70734l44183r73880j169579r39862n38721
$$ 23718767 24669019 25598665 26338720 26609454 26265271 25291391 24121812 23181950 22643229
3347B2643229k43058r8570l8331n8877K3543N0013J15756J25694P8228J4056l7117
$$ 22643229 22400171 22301601 22263270 22204393 22227936 22277949 22393705 22519399 22597627 22611683 22574566
3336B2574566j0556O2596J71082K67370L94683O16642P68904R63544J022759R74971
$$ 22574566 22564010 22626606 22797688 23065058 23459741 24076383 24845287 25808831 26831590 27806561
3326B7806561Q84042M84948q5413n18853m22072N696N44655R31187J238593J483259
$$ 27806561 28690603 29175551 29090138 28571285 28149213 28154909 28699564 29630751 30869344 32352603
3316C2352603J625689J672854J752075J865785J936165J988739J992130J938854
$$ 32352603 33978292 35651146 37403221 39269006 41205171 43193910 45186040 47124894
3308D7124894J783022J647169J451322J291460J262218J236796J205379J074113
$$ 47124894 48907916 50555085 52006407 53297867 54560085 55796881 57002260 58076373
3300E8076373Q39856N16559K40963M8650k2890p7675j64232m78196q18248j144598
$$ 58076373 58916229 59432788 59673751 59722401 59699511 59621836 59457604 58979408 58161160 57016562
3290E7016562j520369j708644j852995j990773k173554k339867k494372k608568
$$ 57016562 55496193 53787549 51934554 49943781 47770227 45430360 42935988 40327420
3282D0327420k650135k601644k475237k355118k197812k055511j836341j642126
$$ 40327420 37677285 35075641 32600404 30245286 28047474 25991963 24155622 22513496
3274B2513496j486537j305959j129760r87584r26143q17124p09389o40564n92566
$$ 22513496 21026959 19721000 18591240 17603656 16677513 15860389 15151000 14510436 13917870
3265A3917870n58721n05745m53529l91492k86948k70630l31183k85359k39189
$$ 13917870 13359149 12853404 12399875 12008383 11721435 11450805 11119622 10834263 10595074
3256A0595074j85692j88605j91863j40377r6572n7011p2056p1702m7388q2778
$$ 10595074 10409382 10220777 10028914 9888537 9791965 9734954 9662898 9591196 9543808 9461030
3246I461030n1877p6993j01514m9938j11992j06910q0192j04183j15107j24945
$$ 9461030 9409153 9332160 9230646 9180708 9068716 8961806 8881614 8777431 8662324 8537379
3236H537379j21851j22240j12848p1444j32818r6101o0778j40441j45006j26400
$$ 8537379 8415528 8293288 8180440 8108996 7976178 7880077 7819299 7678858 7533852 7407452
3226G407452j25291j50462j52870j75655j76624j41887j10294j32425j20627j09787
$$ 7407452 7282161 7131699 6978829 6803174 6626550 6484663 6374369 6241944 6121317 6011530
3216F011530q6528q6405j02805l9048o9684n9881j7257p0058r8444l4883l1590
$$ 6011530 5925002 5838597 5735792 5696744 5627060 5567179 5549922 5479864 5381420 5346537 5314947
3205E314947j0051p1968m9096m0875o7252n1483k0566j117k2496l1375m503m5044
$$ 5314947 5304896 5232928 5183832 5142957 5075705 5024222 5003656 5002539 4980043 4948668 4944165 4899121
3193D899121P987Q303Q500l0366k1806o2578l858K2000L8810J8785N4614J5511
$$ 4899121 4907108 4915411 4923911 4893545 4871739 4809161 4805303 4827303 4866113 4884898 4939512 4955023
3181D955023j4972K2898O260P847k5818K9007o264L09o4805M479j1009l0774o303
$$ 4955023 4940051 4962949 4969209 4977056 4951238 4980245 4973981 4974290 4909485 4913964 4902955 4872181 4865878
3168D865878L197l4528j3187j7762m218l5154j1894K2473j8305k6519J8247j4090
$$ 4865878 4869075 4834547 4821360 4803598 4799380 4764226 4752332 4774805 4756500 4729981 4748228 4734138
3156D734138j353k1911J9649J3918m147j4731k4125o2043J6286K26L0577L6606
$$ 4734138 4732785 4710874 4730523 4744441 4740294 4725563 4701438 4639395 4655681 4655907 4686484 4723090
3144D723090o056J4248O0617K2351K2475K7264N5693O6215Q4193J24950P1466
$$ 4723090 4717034 4731282 4791899 4814250 4836725 4863989 4919682 4985897 5070090 5195040 5266506
3133E266506R3742R6871J09125R6916P8448P9824J36479R1930J45546J28281J12618
$$ 5266506 5360248 5457119 5566244 5663160 5741608 5821432 5957911 6049841 6195387 6323668 6436286
3122F436286J20410J85904J84550J65112K07059J90460K28072K35799K25558K89707
$$ 6436286 6556696 6742600 6927150 7092262 7299321 7489781 7717853 7953652 8179210 8468917
3112H468917L21058K81246L19532L26497K93475L26781L40104M25003M24063M91163
$$ 8468917 8789975 9071221 9390753 9717250 10010725 10337506 10677610 11102613 11526676 12017839
3102A2017839N45815N53512O65170P10649P35320Q12258Q43308R27594R67049
$$ 12017839 12563654 13117166 13782336 14492985 15228305 16040563 16883871 17811465 18778514
3093A8778514J049491J131456J227507J365535J500174J601833J796527K073512
$$ 18778514 19828005 20959461 22186968 23552503 25052677 26654510 28451037 30524549
3085C0524549K317135K632775L067831L582566M104501M646733N236940N961135
$$ 30524549 32841684 35474459 38542290 42124856 46229357 50876090 56113030 62074165
3077F2074165O706244P657600Q712036J0130980J1805118J3987509J6764139J9880869
$$ 62074165 68780409 76438009 85150045 95281025 107086143 121073652 137837791 157718660
3069A57718660K3040800K6145169K8525865K7204436J9950121Q982786J130439
$$ 157718660 180759460 206904629 235430494 262634930 282585051 291567837 292698276
3062B92698276N72344J748781l654209j6795845k9881007l4531746l0970643k4432159
$$ 292698276 293270620 295019401 291365192 274569347 244688340 210156594 179185951 154753792
3054A54753792j8816780j4649432j1755307r679641q158161p183964o658288o158297
$$ 154753792 135937012 121287580 109532273 99852632 91694471 84510507 77852219 71693922
3046G1693922n598408m890102m265596l760139l437879l210958k924342k674738
$$ 71693922 66095514 61205412 56939816 53179677 49741798 46530840 43606498 40931760
3038D0931760k432340k210162j964575j796631j633144j482447j380249j244423
$$ 40931760 38499420 36289258 34324683 32528052 30894908 29412461 28032212 26787789
3030B6787789j148337j107976j000126r44095q79854q33587q04799p81329o90094
$$ 26787789 25639452 24531476 23531350 22587255 21707401 20873814 20069015 19287686 18597592
3021A8597592o76292p11011o43729o29355o01981n21355m98995m48585m22531
$$ 18597592 17921300 17210289 16566560 15937205 15335224 14813869 14314874 13866289 13443758
3012A3443758m20704l61403l70529l10298k84706k95435l04206l05029k76012
$$ 13443758 13023054 12661651 12291122 11980824 11696118 11400683 11096477 10791448 10515436
3003A0515436l03374k66784k51260k58559k57256k12169j96277k22931k14400
$$ 10515436 10212062 9945278 9694018 9435459 9178203 8966034 8769757 8546826 8332426
2994H332426k34933k09988j65580j57771j91735j55279j03834j58142j47425j62349
$$ 8332426 8097493 7887505 7721925 7564154 7372419 7217140 7113306 6955164 6807739 6645390
2984F645390j33564j48436j03556j25498j69042j61765j22397j63315j68500r6070
$$ 6645390 6511826 6363390 6259834 6134336 5965294 5803529 5681132 5517817 5349317 5253247
2974E253247q6529p6742j08415r2082j22285j12283o6113n3811p5317j10635m4890
$$ 5253247 5166718 5089976 4981561 4889479 4767194 4654911 4588798 4534987 4459670 4349035 4304145
2963D304145o0690r7727o1841o5119n9021n1622n9201m7600q3532q4629n3138
$$ 4304145 4243455 4145728 4083887 4018768 3959747 3908125 3848924 3801324 3717792 3633163 3580025
2952C580025k7977j7816n1190n4411k4898q9301l0222l8343o9298k2775k3662
$$ 3580025 3552048 3534232 3483042 3428631 3403733 3314432 3284210 3245867 3176569 3153794 3130132
2941C130132o3909p1294n8241P773j7727m9668o0238n6693k5403n4289m5472l2873
$$ 3130132 3066223 2994929 2936688 2944461 2926734 2877066 2816828 2760135 2734732 2680443 2634971 2602098
2929B602098j6244l9309l8103l8325o9287q3215K145l0893r9254n8629m7465k0676
$$ 2602098 2585854 2546545 2508442 2470117 2400830 2317615 2319760 2288867 2189613 2130984 2083519 2062843
2917B062843j5696j1874l9725m7145k668j6417K0170P540j5456k5836k6441k4546
$$ 2062843 2047147 2035273 1995548 1948403 1945735 1929318 1949488 1957028 1941572 1915736 1889295 1864749
2905A864749j044J1448K1848n5874j9140K733j2583r985P438k0672m8496j9312
$$ 1864749 1863705 1875153 1897001 1841127 1821987 1824720 1812137 1802152 1809590 1788918 1740422 1721110
2893A721110J1227K9477o162N938k5921k4134k1093j5066j1234J4277L028j6760
$$ 1721110 1732337 1761814 1755652 1761590 1735669 1711535 1690442 1675376 1664142 1678419 1681447 1664687
2881A664687k4249q918m3501j2429J5199k0444m3237o4836k6092j1251k8975j9623
$$ 1664687 1640438 1631520 1588019 1575590 1590789 1570345 1527108 1462272 1436180 1424929 1395954 1376331
2869A376331m9838k7341n40k558k8689J5j0785j4835L5918j2731j3927J6j1874
$$ 1376331 1326493 1299152 1298612 1296054 1267365 1267380 1256595 1241760 1277678 1264947 1251020 1251036 1239162
2856A239162l2982k5560l8225j991k4144m1388k3730m792p818J8574J1654L8477
$$ 1239162 1206180 1180620 1142395 1140404 1116260 1074872 1051142 1046350 1038532 1057106 1068760 1107237
2844A107237M5607J4957R948L1003k5264K7696j3414l9464R780O133k4127l7142
$$ 1107237 1152844 1167801 1177749 1208752 1183488 1211184 1197770 1158306 1168086 1174219 1150092 1112950
2832A112950L7986m624k4618k5285l5710l329J025j6048J785j2379M084M5110
$$ 1112950 1150936 1146312 1121694 1096409 1060699 1057370 1058395 1042347 1044132 1031753 1035837 1080947
2820A080947J6105l0741j2826k137P682j1317R005k2022o538M6398k6114j2875
$$ 1080947 1097052 1066311 1053485 1051348 1059030 1047713 1056718 1034696 1028158 1074556 1048442 1035567
2808A035567j9751j8191K8457j4730m8706J9391K4752l8352L8467K4684q490J1847
$$ 1035567 1015816 997625 1026082 1011352 962646 982037 1006789 968437 1006904 1031588 1023098 1034945
2796A034945l54M2340M9651N5475L3440M4382O7806P5045O4034Q2222J13078J47024
$$ 1034945 1034591 1076931 1126582 1182057 1215497 1259879 1327685 1402730 1466764 1548986 1662064 1809088
2784A809088J49374J53141J03873L8794k111o347n064K4179q5091j60457j66742
$$ 1809088 1958462 2111603 2215476 2254270 2252159 2245812 2240748 2264927 2179836 2019379 1852637
2773A852637k42664j77586j00332j09199l9103n2398m9316k0202l1857k9982m0859
$$ 1852637 1609973 1432387 1332055 1222856 1183753 1131355 1082039 1061837 1029980 999998 959139
2762I59139J1277M338l1179m5602l7581n4837j523L652m0943q034k1045k5546
$$ 959139 970416 974754 943575 897973 860392 805555 804032 807684 766741 758707 737662 712116
2750G12116K5969J398j2821j3578o780l2701Q758m8806n863Q784O985l8494j8295
$$ 712116 738085 739483 726662 713084 706304 673603 682361 633555 627692 636476 643461 604967 586672
2737E86672k6905o285j7038j6237j5721J1310J1268q73J6805n236k6701k0557
$$ 586672 559767 553482 536444 520207 504486 515796 527064 526191 542996 537760 511059 490502
2725D90502m957j974L667P837k7808K8226Q175j6046l1798n486r653M771O032
$$ 490502 485545 483571 487238 495075 467267 495493 503668 487622 455824 450338 440685 445456 451488
2712D51488N775J5012k2658l734o257j0034j1071J726L542J7550j9483j7642j6410
$$ 451488 457263 472275 449617 445883 439626 429592 418521 420247 423789 441339 421856 404214 387804
2699C87804l2021P210K0401j5932K9939o626J1705n3087J5426K1320J074r616
$$ 387804 355783 362993 383394 367462 397401 390775 402480 349393 364819 386139 387213 377597
2687C77597R856L358j7897J4518j6377j1771P751o540P016m5826K5392J1336L0269
$$ 377597 387453 390811 372914 387432 371055 359284 367035 360495 367511 321685 347077 358413 388682
2674C88682J3964J8833k6234p486M2115L641j5496k2365j3676l283p515k1433
$$ 388682 402646 421479 395245 387759 429874 433515 418019 395654 381978 378695 371180 349747
2662C49747O407O64K7422l4908o853J1813K1701K7543k3403K6393l331n0919p999
$$ 349747 356154 356818 384240 349332 342479 354292 375993 403536 380133 406526 403195 352276 344277
2649C44277L501J538j8082j9867K1869m679k6935J8255L0410K8872l8940J2875
$$ 344277 347778 349316 331234 311367 333236 328557 301622 319877 350287 379159 340219 353094
2637C53094L6759m1588k1042l3401n627j585Q711Q871m0281j1338j3010L0543
$$ 353094 389853 348265 327223 293822 288195 286610 295321 304192 263911 252573 239563 270106
2625B70106J7893J8765j9329o13P789Q642J6457l878j6586k7167J8824K0015j8233
$$ 270106 287999 306764 287435 286822 294611 303253 319710 315832 299246 272079 290903 310918 292685
2612B92685m9724r478J2921L618l906m994Q757N777m865k2204j9794J7113j6772
$$ 292685 242961 233483 246404 250022 246116 241122 249879 255656 250791 228587 208793 225906 209134
2599B09134k789P842p333R361L1169n593q735j3669n278J3365k1412m646P559
$$ 209134 206345 214187 206854 216215 247384 241791 233056 219387 214109 227474 206062 201416 208975
2586B08975K188k729r622J1418J3664m042N831j5123k4694L1169L6907j2386j0657
$$ 208975 211163 208434 198812 210230 223894 219852 225683 210560 185866 217035 253942 241556 230899
2573B30899m352L2105J4785j6841Q934J1366j610Q860j2086l3977j8785j4634
$$ 230899 226547 258652 273437 256596 265530 276896 275286 284146 272060 238083 219298 204664
2561B04664m8558K0646J0865N648J1195J6140k865n123Q23m520N037j8084k740
$$ 204664 156106 176752 187617 193265 204460 220600 217735 212612 213435 208915 213952 195868 193128
2548A93128K5435j4711j7365L5178j7609l4861o585m063L2473L074j411M3548
$$ 193128 218563 203852 186487 221665 204056 169195 162610 158547 191020 194094 192683 236231
2536B36231O890m8563k1104M1505J7200o967J1843j5560m117o767l4033K4968
$$ 236231 243121 194558 173454 214959 232159 225192 237035 221475 217358 210591 176558 201526
2524B01526l761j3980K199Q83q345j6306J4534K40J81M566k6637N18J1831j9628
$$ 201526 197765 183785 185984 186867 178522 162216 176750 176990 177171 181737 155100 155618 167449 147821
2510A47821J0670J1449L045K0209l8563J3234L6636k3181Q670j0047L385J100
$$ 147821 158491 169940 172985 193194 154631 167865 204501 181320 189990 179943 183328 184428
2498A84428J490O230r396k525j4806R456P338k260j739o535m614r374L2566r246
$$ 184428 185918 192148 182752 180227 165421 174877 182215 179955 178216 171681 167067 157693 190259 181013
2484A81013k7763N51Q565k3005n072J4953M301l199l0673O888O672m636P341l148
$$ 181013 153250 153801 162366 139361 134289 149242 153543 150344 119671 126559 133231 128595 135936 132788
2470A32788Q366J7111j2722j0687j1625k019Q091K352l4488M6608J431J1797j0725
$$ 132788 141154 158265 145543 134856 123231 121212 129303 131655 97167 143775 145206 157003 146278
2457A46278J7277L971p261P438J6780o649n475q949L687j6363r003O862j1033
$$ 146278 163555 167526 160265 167703 184483 177834 172359 163410 167097 150734 141731 148593 137560
2444A37560K3828J579j4068K370K2796O161k394l4459R646J0077k9573j999K2938
$$ 137560 161388 162967 148899 151269 174065 180226 177832 143373 153019 163096 133523 131524 154462
2431A54462K085K6185k4513p248K2520j2441k9297l9890L5686L4825J4904R037
$$ 154462 156547 182732 158219 150971 173491 161050 131753 91863 127549 162374 177278 186315
2419A86315k4266J2517o817j6089k4108M822k8143K1613L9138j1962j5142K8203
$$ 186315 162049 174566 167749 151660 127552 132374 104231 125844 164982 153020 137878 166081
2407A66081J5439J3705q94P31j513K1075P221r832M056L4335j1770m0429L9208
$$ 166081 181520 195225 194331 195062 193549 214624 221845 212013 216069 250404 238634 198205 237413
2394B37413O192k9584j045J1412j0643k7357M695L4947M079j1084N48M566q616
$$ 237413 243605 214021 212976 224388 213745 186388 191083 226030 230109 219025 219573 224139 215523
2381B15523o2468j6764J2378L007J2559n267O324L1499K156j6425N2926j6043
$$ 215523 153055 136291 148669 151676 164235 158968 165292 196791 198947 182522 235448 219405
2369B19405j9820K5810k8797K6552j8622k6414L5689r267j4547R362j0950L5214
$$ 219405 199585 225395 196598 223150 204528 178114 213803 204536 189989 199351 188401 223615
2357B23615O628J8216J0435J9254K2085k5951K4990K008J7177K2390L9653l5664
$$ 223615 230243 248459 258894 278148 300233 274282 299272 301280 318457 340847 380500 344836
2345C44836n016O0579J6434j1083M1741q721k8224K0857L4912O4971L6767K5713
$$ 344836 339820 400399 416833 405750 447491 438770 410546 431403 466315 531286 568053 593766
2333E93766N9630N1153L6316L8854K2776O7474N6290L5293M7150Q1560J02068
$$ 593766 653396 704549 740865 779719 802495 869969 926259 961552 1008702 1090262 1192330
2322A192330R2887J20591J16240J31420J73124K57047K67026K51121J91205K34995
$$ 1192330 1285217 1405808 1522048 1653468 1826592 2083639 2350665 2601786 2792991 3027986
2312C027986K18391L40111M22826N39422O57472R33585J159837J515848J539763
$$ 3027986 3246377 3586488 4009314 4548736 5206208 6139793 7299630 8815478 10355241
2303A0355241K066006K361796J670187l57011k686416k821766k131224j344120
$$ 10355241 12421247 14783043 16453230 16096219 13409803 10588037 8456813 7112693
2295G112693j012370p64322n75275m57360l94736k91405k80007k25455j41852
$$ 7112693 6100323 5336001 4760726 4303366 3908630 3617225 3337218 3111763 2969911
2286B969911j02159j58339k24701k00190k04555j84364j44623n3289o4269j40131
$$ 2969911 2867752 2709413 2484712 2284522 2079967 1895603 1750980 1697691 1633422 1493291
2276A493291r8303o5961q3912l9802m6701r2954p0514k9886l5049o0721l5270
$$ 1493291 1394988 1329027 1245115 1205313 1158612 1065658 995144 965258 930209 869488 834218
2265H34218j5960j2443k4956R535o0841k8995m0663l2965j2492k6112k0773l3311
$$ 834218 818258 805815 780859 790394 729553 700558 659895 626930 614438 588326 567553 534242
2253E34242P597k5094l9993m3273K2154N2978j7219l4808j8190j1525P083k4779
$$ 534242 541839 516745 476752 433479 455633 508611 491392 456584 438394 426869 433952 409173
2241D09173l8343P744j6118k0351r019k017J210m6741m744N4638j9023k8419J2265
$$ 409173 370830 378574 362456 342105 333086 331069 332279 285538 280794 335432 316409 287990 300255
2228C00255K932q041O490l6536J3978K6545j4328r453n5400J6909k3644J8821
$$ 300255 303187 295146 301636 265100 279078 305623 291295 281842 226442 243351 219707 238528
2216B38528K6148m8198m017M117l043M076J2818J9864j2718m3532j1327p44K127
$$ 238528 264676 216478 212461 216578 213535 217611 230429 250293 237575 194043 182716 181972 184099
2203A84099J0150l4451J5181K1009k59J1123q942k8898L952m653k1943K3624o52
$$ 184099 194249 159798 174979 195988 195729 206852 197910 169012 172964 168311 146368 169992 169340
2190A69340J1718j0296L7831p09o2119j0137j0151K9355J16L876J5048j2727L561
$$ 169340 181058 170762 208593 207884 145765 135628 125477 154832 154948 158824 173872 161145 164706
2177A64706P792q92J2274j0124k3863j4694L2647k0884l8853J5352J0105j4708
$$ 164706 172498 171606 183880 173756 149893 135199 167846 146962 108109 123461 133566 118858
2165A18858j4467k7274O345Q669L0789K6973j3431N478k1710l1134j6240J476
$$ 118858 104391 77117 83462 92131 122920 149893 136462 141940 120230 89096 72856 74332
2153G4332l248k7188o709J1867J1532J820P836K7929r24l162L0332o623J06K813
$$ 74332 71084 43896 37187 49054 60586 62406 70242 98171 97247 94085 124417 117794 117900 120713
2139A20713k9767K4511k9282l8727K3899J5367O560o412K8796k4571m5883K1983
$$ 120713 90946 115457 86175 47448 71347 86714 93274 86862 115658 91087 45204 67187
2127F7187L1033n288J0668J581j4350j7499n859L4932K653r791n011j0715j6036
$$ 67187 98220 92932 103600 105181 90831 73332 67473 102405 105058 95267 90256 79541 63505
2114F3505K0662J7395q336j3335m87K0857k6184n731R081J9661j3694k188p121
$$ 63505 84167 101562 93226 79891 79404 100261 74077 68346 77427 97088 83394 81206 74085
2101G4085n2992O6452Q694r052O899o712J2286K630j3963k5523L7287R999k3400
$$ 74085 21093 87545 96239 87187 94086 87374 99660 102290 88327 62804 100091 110090 86690
2088H6690M277k474k0671k8008K2073K5013P119L951k0256j2958R938J7229k887
$$ 86690 90967 88493 67822 39814 61887 86900 94019 97970 77714 64756 74694 91923 89036
2075H9036j1689K3044j942l0834J3365J1530m916M609p270J82r070J4359L460
$$ 89036 77347 100391 98449 67615 80980 92510 87594 92203 84933 85115 76045 90404 93864
2062I3864m3281K1510J4187n2371J4212K469n345m16M528K429M632k163J3839
$$ 93864 50583 72093 86280 33909 48121 50590 45245 44829 49357 51786 56418 54255 68094
2049F8094k2732n002P124j1887j1420J1876J2169J33K5030J7520k324R529J703
$$ 68094 45362 40360 47484 35597 24177 36053 48222 48355 73385 90905 88581 98110 99813
2036I9813j0429J6777Q71p262K1895P321l7416N2654k6843n4547K5334k6950j5109
$$ 99813 89384 106161 107032 99770 121665 128986 91570 144224 117381 62834 88168 61218 46109
2023D6109K8361J792R794K4809Q606l5808j9716O483l366J0258j3745l4206M669
$$ 46109 74470 76262 86056 110865 119471 83663 63947 70430 67064 77322 63577 29371 34040
2010C4040P899m11J5556R476j4571J8996m5936J259P493r324r265j1954J9516
$$ 34040 41939 41528 57084 66560 51989 70985 25049 26308 33801 24477 15212 3258 22774
1997B2774l24P230J1160k4684N77K7979j6206J8417k6626J7649m185l0475K8574
$$ 22774 22450 29680 40840 16156 16733 44712 28506 46923 20297 37946 33761 3286 31860
1984C1860j741j933M5293k7406j2871L5036J6360o148l3986j2231J222k1319r441
$$ 31860 30119 28186 73479 46073 33202 68238 84598 78450 44464 32233 33455 12136 2695
1971B695K031k1819J7266K5135Q722j4740J5329k320j0132L5957J6491k6148k1857
$$ 2695 4726 -17093 173 25308 34030 19290 34619 32299 22167 58124 74615 48467 26610
1958B6610j7905M2299j6610K1008j3075j1287M0352j0587J633j0929O334l1553
$$ 26610 8705 51004 34394 55402 42327 31040 71392 60805 62438 51509 57843 26290
1946B6290J2014J3314l5541J319M0094O35j5671R372K2297j0580j4007k7521q371
$$ 26290 38304 51618 16077 17396 57490 58125 42454 51826 74123 63543 49536 22015 13644
1933A3644L6344R36O370K222l4208L1884N756k6511J0395J6432l710j2925k1654
$$ 13644 49988 50924 57294 59516 25308 57192 62948 36437 46832 63264 59554 46629 24975
1920B4975n067R106k5537J0718Q472M8887P647j8702r26j5801k1467J6654q051
$$ 24975 19908 29014 3477 14195 22667 71554 79201 60499 59573 43772 22305 38959 30908
1907C0908j8036J2843k4800J1066J8402J2200m271l0678J663M0260j0800J774
$$ 30908 12872 25715 915 11981 30383 42583 38312 7634 9297 49557 38757 40531
1895D0531L154m699K9168j3312k0114O3943k7162l8205o920J2159O963l4520N103
$$ 40531 43685 38986 68154 54842 34728 98671 71509 33304 26384 38543 45506 10986 16089
1882A6089J6624L11J3467j257j1682j4162j8339l2816N027J6232P185K4858M27
$$ 16089 32713 33024 46491 45234 33552 19390 1051 -31765 -26738 -10506 -3321 21537 21964
1869B1964q828J9534r963Q462k613J0298j1628Q99q88k3290K4982k9705k0315
$$ 21964 13136 32670 22707 31169 28556 38854 27226 28125 27237 3947 28929 -776 -21091
1856b1091J3257K8524J3661J4242O171l1396q612m860m984K8447l5188L726k624
$$ -21091 -7834 20690 34351 48593 54764 23368 14756 9896 4912 33359 -1829 1897 -727
1843g27K930L8252J4044K1055K0277p390m0292k615N757j7759L736l0713M1651
$$ -727 2203 40455 54499 75554 95831 88441 48149 45534 51291 33532 37268 6555 48206
1830D8206j2524j9208j0795j0634k0625J4395m296j4717O537N3327m081k25j766
$$ 48206 35682 16474 5679 -4955 -25580 -11185 -15481 -30198 -23661 29666 25585 25360 23594
1817B3594J347K4291n744J4039l18j4256j2200k0411j421J5340J4595J3002j6398
$$ 23594 24941 49232 43488 57527 57209 42953 30753 10342 8921 24261 38856 51858 35460
1804C5460K634l548J255J3708p369p556j7786j4390P954n781R194k361M9281k7824
$$ 35460 38094 34546 35801 49509 42140 34584 16798 2408 10362 4581 13775 11414 60695 32871
1790C2871J628j7101k9501N2289j293j9015o842o894J7565K7300N922k4177k1306
$$ 32871 34499 17398 -12103 40186 38893 19878 13036 6142 23707 51007 56929 32752 11446
1777A1446j0126O261L0774l166K935K3685q557l247k4002Q717k0498k4810L998
$$ 11446 1320 7581 38355 35189 38124 61809 53252 50005 26003 34720 14222 -10588 -6590
1764f590J0277J5796K8238J5127l2596n0999M8156J448L3512n1793j4366L3175
$$ -6590 3687 19483 47721 62848 30252 -20747 27409 28857 62369 10576 -3790 29385
1752B9385q168n251P868j1610k2977k3860Q280K102P267K7137J6002J7175l249
$$ 29385 21217 15966 23834 12224 -10753 -34613 -26333 -24231 -16964 10173 26175 43350 40101
1739D0101l0111j4033R636o998K6456q441J4431J6663n938p998k1363n279J6225
$$ 40101 9990 -4043 5593 -1405 25051 16610 31041 47704 41766 33768 12405 7126 23351
1726B3351j1536J9445N181R234j2367j4273K7988M0054l3345l6727j1114K5486
$$ 23351 11815 31260 36441 45675 33308 19035 47023 87077 53732 17005 5891 31377
1714C1377j6816l4413M191N909L832J6657j5097J6661k3417J8767J925K1072j4122
$$ 31377 14561 -19852 -15661 -9752 -5920 10737 -4360 12301 -11116 7651 9576 30648 16526
1701A6526j0884J6523j763K1263o225m04k179j0197J8270J2872N894k6405r523
$$ 16526 5642 22165 20402 41665 35440 35036 32857 22660 40930 53802 59696 33291 23768
1688B3768K1045k2882M3491J7266m4678l1617j2547K2402k0358J6979K2922l850
$$ 23768 44813 21931 65422 82688 38010 6393 -6154 16248 -4110 12869 35791 31941
1676C1941k941j3027k7348j3846L6012N754j204K9538K9248k7355j5120p654k7762
$$ 31941 29000 15973 -11375 -25221 10791 16545 15341 44879 74127 46772 31652 23998 -3764
1663c764J2161M0860l5177l9043r801L7774J4823k450L1838k9368q849O38r410
$$ -3764 8397 49257 14080 -24963 -34764 3010 17833 15383 47221 17853 9004 9642 232
1650B32m066j9357M5600K7214r687p318K9878m4433j7003l2280N502L1735j7499
$$ 232 -3834 -23191 22409 49623 39936 32618 62496 18063 1060 -31220 -25718 6017 -11482
1637a1482K7278K2665j3048N055m815m7660J8103M0368m2866P173J9582k1600
$$ -11482 15796 38461 25413 30468 25653 -22007 -3904 36464 -6402 771 20353 -1247
1625a247L386l383L0368k653l0511L870K8477l226j2340K497k3636J7890K4748
$$ -1247 2139 -1244 29124 26471 -4040 -170 28307 25081 12741 15238 -8398 9492 34240
1612C4240J4482k6634O11k30q097K458m450K0848j9627l1431K1344K5043j3943
$$ 34240 48722 22088 22699 22469 14372 16830 12380 33228 13601 -17830 3514 28557 14614
1599A4614R039j4713K848q112k6137K9721J1627j2776N057m571j876j530J5361
$$ 14614 23653 8940 11788 3676 -22461 7260 18887 6111 11168 6597 4721 3191 18552
1586A8552n944L2286j3612k4715j4948L4557k9631O00J2673K002m476m367J3738
$$ 18552 12608 44894 31282 6567 -8381 26176 -3455 -2855 9818 11820 7344 2977 16715
1573A6715Q778N627J2727l1294j945J7511m3163l770n528M541J8165K912J4924
$$ 16715 25493 31120 43847 12553 10608 28119 -15044 -18814 -24342 -19801 -1636 1276 16200
1560A6200l709j9653n301m772J3261J1378K9125l1173q845j5533O444L1485J1601
$$ 16200 12491 -7162 -12463 -17235 -3974 7404 36529 5356 -3489 -19022 -12578 18907 30508
1547C0508j0937P416k3397k179J8694k9825n444P482K533q569N313K3560o331
$$ 30508 19571 26987 3590 1411 20105 -9720 -15164 -7682 -5149 -13718 -8405 15155 8824
1534H824M744N305j2353k897J5406j0755k680j950k1772L590P920K1448R984l9937
$$ 8824 13568 18873 6520 3623 19029 8274 5594 3644 -18128 -14538 -6618 14830 24814 -15123
1520a5123r073j2487K4507L67K808j6117L9588J4576j0205J2036k1121j4641L1697
$$ -15123 -24196 -36683 -12176 -11809 -9001 -25118 14470 29046 18841 30877 9756 -4885 26812
1507B6812R151N112k3566q175p405k2727P598q265K1781j3372o151J624K8435
$$ 26812 35963 41075 17509 9334 1929 -20798 -13200 -21465 316 -13056 -19207 -17583 10852
1494A0852m729K959J2384k9035m11L6316n526l88k894j6325l13K8801R35l4719
$$ 10852 6123 9082 21466 -7569 -7980 28336 22810 22422 19528 3203 2890 31691 32626 -2093
1480b093O742q569J091N129K0592j5671n314n979Q29R617k6834K3382L341Q586
$$ -2093 4649 -3920 -2829 2300 22892 7221 1907 -4072 -3243 6374 -20460 2922 6263 14849
1466A4849j0495q052J1534L9178k5323k4116K2866j3074L464N409l0149J6194
$$ 14849 4354 -3698 7836 47014 21691 -2425 20441 7367 10831 16240 -13909 2285
1454B285M363J828L951k0369K1859K2011J541l7805q517N803Q587r680r817L2546
$$ 2285 6648 8476 12427 -7942 13917 35928 37469 -336 -8853 -3050 5537 -4143 -13960 18586
1440A8586k4083N0504J1301j9689J01k0281j2746J0594J5023j3452r462K6866
$$ 18586 -5497 45007 56308 36619 36720 16439 3693 14287 29310 15858 6396 33262
1428C3262M271N435l0518l3380L4932j8009j9750L4494p761o957L624o992l2709
$$ 33262 37533 42968 12450 -20930 14002 -4007 -23757 10737 2976 -3981 -357 -7349 -40058
1415d0058K6478k793m341J6832J4071J4963j6935J4479k2861J9673J3893j5497
$$ -40058 -13580 -16373 -20714 -3882 10189 25152 8217 22696 -165 19508 33401 17904
1403A7904Q644j2129O63J2804j2768J1628K0076m3991L579l1960J6196m939J0395
$$ 17904 26548 14419 15082 27886 15118 26746 46822 2831 6410 -25550 -9354 -14293 -3898
1390c898L3314O547j8964O347q731j8491J6503k2590L7054k0960M610q75L6266
$$ -3898 29416 35963 16999 23346 14615 -3876 12627 -9963 27091 6131 10741 9866 46132
1377D6132k050l4097r018J2003p993K9484j7651l0131L033p100K565J9907O421
$$ 46132 44082 9985 967 12970 4977 34461 16810 -13321 -10288 -17388 -14823 5084 11505
1364A1505n944o539o896k6565K8532J8371J660j3957O7k7848K0926K0879k7904
$$ 11505 5561 -978 -7874 -34439 -5907 12464 14124 167 234 -27614 -6688 14191 -13713
1351a3713K6320k5227K9968m2221K0410l016j4545l617J550N856J2992j9598n911
$$ -13713 12607 -12620 17348 -24873 -4463 -7479 -22024 -25641 -24091 -18235 -5243 -24841 -30752
1338c0752K8787j9951L8114j1902j7980M86K7184p360K2417k911J1891l6186J5451
$$ -30752 -1965 -21916 16198 4296 -13684 -13198 13986 6626 29043 26132 38023 1837 17288
1325A7288L4888N745k6110j1869k5323q813K2544j3001j4654p865k1940K1281
$$ 17288 52176 57921 31811 19942 -5381 -14194 8350 -4651 -19305 -27170 -49110 -27829
1313b7829J3717l0752L7491K6400n468Q410j6968j2147J6670n15Q563l7142N1267
$$ -27829 -14112 -44864 -7373 19027 13559 21969 5001 -7146 9524 9009 17572 -19570 31697
1300C1697L438k4730M2946l2166o784K0716L0605j5258k3296n475J9035O811l2436
$$ 31697 35135 10405 53351 21185 14401 35117 65722 50464 27168 21693 40728 47539 15103
1287A5103j7800q041m756P424l606L1190n135q772L670k9154K6278j3778K7424
$$ 15103 -2697 -10738 -15494 -8070 -11676 19514 14379 5607 9277 -19877 6401 -7377 20047
1274B0047k5216k1246R677Q582O201l918k5034J1087M1795m876k2184L507j4863
$$ 20047 -5169 -26415 -16738 -8156 -1955 -5873 -30907 -19820 21975 17099 -5085 -1578 -16441
1261a6441j6083k990K4629K3357M929j8300M993K0940k6238k9484j1110j404K7616
$$ -16441 -32524 -35514 -10885 12472 17401 -899 4094 25034 -1204 -30688 -41798 -43202 -15586
1248a5586K1833j0915j127R366m4536K302M2921j2788q027J7754P367k9043o716
$$ -15586 6247 -4668 -5795 3571 -40965 -38663 4258 -8530 -16557 1197 8564 -20479 -27195
1235b7195R681O601J7535k2774k0727K5923L7425j9698k9102l3814L5121K8601
$$ -27195 -17514 -10913 6622 -16152 -36879 -10956 26469 6771 -22331 -56145 -21024 7577
1223G577P496j838L172n297l8677J4004J4508L6135O530l8105O816J2678p719
$$ 7577 15073 13235 16407 11110 -27567 -13563 945 37080 43610 5505 12321 24999 17280
1210A7280m1317R46J7643K5387j0855J0604N646o882j0706j4436J4531k7956K0285
$$ 17280 -24037 -23091 -5448 19939 9084 19688 25334 18452 7746 -6690 7841 -20115 170
1197A70M0992k2158L4599m6053J4209J5537l8399K6097j4340j2769r335j5535
$$ 170 41162 19004 53603 7550 21759 37296 -1103 24994 10654 -2115 -11450 -26985
1185b6985q476M4883j5037k1093n35J102k862L1333j3023j944j4882J9351K1999
$$ -26985 -35461 9422 -5615 -26708 -27243 -26141 -29003 2330 -10693 -12637 -27519 -8168 13831
1172A3831K8968k9583R318k5023m5070K5594Q312K6370j8719o90K3590R584N10
$$ 13831 42799 13216 22534 -2489 -47559 -21965 -13653 12717 -6002 -6692 16898 26482 26992
1159B6992k1144o237q029K5035k1031j2345K9282J7836Q140K6933k3994p284k099
$$ 26992 5848 -389 -8418 16617 -4414 -16759 12523 30359 38499 65432 41438 34154 32055
1146C2055l6429r643L6178j844l3880k8115J5717L6620L344k602l9618J9134l783
$$ 32055 -4374 -14017 22161 20317 -13563 -41678 -25961 10659 14003 11401 -28217 -9083 -12866
1133a2866P079J5463j7587L2180K1756n1958j3112K0905K0197J4700o662j5794
$$ -12866 -5787 9676 -7911 24269 46025 -5933 -19045 1860 22057 36757 30095 14301
1121A4301k4751r405J8515J5004J5854J037r838J2367l0028J114M1368J5361j2364
$$ 14301 -10450 -19855 -1340 13664 29518 30555 20717 33084 3056 4170 45538 60899 48535
1108D8535k7091l123j934n649N288L60k3433K6310k0821j2468J9986j6288r188
$$ 48535 21444 18321 16387 10738 16026 16386 -7047 19263 -1558 -14026 5960 -10328 -19516
1095a9516J3895o275j0282J8136L1343m541m3564j9862M5885O830j8327K2701
$$ -19516 -5621 -11896 -22178 -4042 27301 22760 -20804 -40666 5219 12049 -6278 16423
1083A6423j348J356J3405k9025l5460K1779K7320J031j1161M3423M624k0479k1642
$$ 16423 15075 16431 29836 811 -34649 -12870 14450 15481 4320 47743 52367 31888 10246
1070A0246J0546r792N693K184L0750l5885k3346J6731Q080o599K419j1215J6657
$$ 10246 20792 11000 16693 18877 49627 13742 -9604 7127 15207 8608 11027 -188 16469
1057A6469R825J5269k3846k3459J118k3399J2048P592K0484J1493M425m0880L6239
$$ 16469 26294 41563 17717 -5742 -4624 -28023 -15975 -8383 12101 23594 28019 -12861 23378
1044B3378J9970l0908m2711L2812L354J5191k8115J7081M970k0162k1785J7018
$$ 23378 43348 12440 -30271 2541 5895 21086 -7029 10052 15022 -5140 -26925 -9907
1032i907J0383J4978m8230R016J4271j2373N884M7234n5142j1914K9383J995k793
$$ -9907 476 15454 -32776 -23760 -9489 -21862 -15978 31256 -23886 -35800 -6417 -4422 -7215
1019g215l033j4371n019M6459o335k385l3216M853O784J2402j8591J9487j699
$$ -7215 -10248 -24619 -29638 16821 10486 8101 -25115 -20262 -13478 -1076 -19667 -180 -1879
1006a879Q15n350j0565J2574J9845j8578j256k1294j0656k344J3963K8223j6693
$$ -1879 -1064 -6414 -16979 -4405 15440 -3138 -4394 -25688 -36344 -38688 -24725 3498 -13195
993a3195J294K2051K4544j8816J6166J1110k4154m625j3554L0642j9716j3117
$$ -13195 -11901 10150 34694 15878 32044 43154 19000 14375 821 31463 11747 -1370
981a370j4095K0382j6084j3427J1719k4043q158J2148n539P885J3079K9031L670
$$ -1370 -15465 4917 -11167 -24594 -12875 -36918 -45076 -32928 -38467 -30582 -17503 11528 15198
968A5198j1362Q358J3254j4414n5549J5167O323J3805p007m780L7025j995j2841
$$ 15198 3836 12194 25448 11034 -44515 -29348 -23025 -9220 -16227 -21007 16018 14023 1182
955A182J5012m0875j4672N2551j3281l0101L3828J8590k4755m22j5477j8033L2331
$$ 1182 16194 -24681 -39353 13198 -83 -30184 3644 22234 -2521 -2943 -18420 -36453 -4122
942d122j1210j6570K9129Q115K8109k2763j0389j1182j4850O633L3592J720j6063
$$ -4122 -15332 -31902 -2773 5342 33451 10688 299 -10883 -25733 -19100 14492 16212 149
929A49J7843n6741J1666L6875K0996j0737j377K6741j8824K739j0261l5891r372
$$ 149 17992 -38749 -27083 9792 30788 20051 18674 45415 26591 29330 19069 -16822 -26194
916b6194R503k3464q997M0532J7000r23q147k539n125j0908J0155R376l121N366
$$ -26194 -16691 -40155 -49152 -8620 8380 7457 -690 -3229 -8354 -19262 -9107 269 -2852 2514
902B514N480m6574M952N096p792K5933L1471j925J3586k2617k8312L0352l2318
$$ 2514 7994 -38580 -33628 -28532 -36324 -10391 21080 19155 32741 10124 -18188 12164 -20154
889b0154l4539K9484L1434k0005p104J7302K7233L06n107J5467J9130l6233J1823
$$ -20154 -54693 -25209 6225 -13780 -20884 -3582 23651 23957 18850 34317 53447 17214 29037
876B9037j585k336k7884j8651L6837l8067j7312M1173o703j0316K3461n243j3762
$$ 29037 27452 25116 -2768 -21419 15418 -22649 -39961 1212 -5491 -15807 7654 2411 -11351
863a1351K651J1419j29J7484l2217L926K8728k6141k1274J6811o689N129j875
$$ -11351 -8700 2719 2590 20074 -12143 -8217 20511 -5630 -26904 -10093 -16782 -11653 -13528
850a3528p21L6529l1005k0342K7620l5163j5989j257M4526K0679j7639k3442K3694
$$ -13528 -14249 22280 -8725 -29067 -1447 -36610 -52599 -53856 -9330 11349 -6290 -29732 -6038
837f038L215K48j6209l569K6814j5291L5363r670R424j8276J5626k0803n739N400
$$ -6038 -2823 -2575 -18784 -22353 4461 -10830 24533 14863 24287 6011 21637 834 -4905 495
823D95k3685J9026K9185j0567m1178k0668J7067K4895J0459q968n055O053q231
$$ 495 -23190 -4164 25021 14454 -26724 -47392 -30325 -5430 5029 -3939 -8994 -2941 -11172
810a1172j6019r179J8885K3313O93q433J4783l707o914J8621j319l5642p400K4760
$$ -11172 -27191 -36370 -17485 5828 6521 -1912 12871 9164 2250 20871 19552 -16090 -23490 1270
796A270k4446q381m806J6614M3284Q25p706k6697j870J5965l7641K117K4561j0903
$$ 1270 -23176 -31557 -36363 -19749 23535 24360 16654 -10043 -11913 4052 -33589 -31472 -6911 -17814
782a7814j0822P422j169K2317J1399l2659K2195O511N317K3343K116k0868Q641
$$ -17814 -28636 -21214 -22383 -66 11333 -21326 869 7380 12697 36040 38156 17288 25929
769B5929l7858j8454J9917j8143Q053J0384K889j2604R269O212O622j492J0966
$$ 25929 -11929 -30383 -10466 -28609 -20556 -10172 -7283 -19887 -10618 -4406 2216 724 11690
756A1690j1208J6629k7353j7823J6860K5672l2132l70j042L5105O5335m7822n4455
$$ 11690 482 17111 -10242 -28065 -11205 14467 -17665 -18035 -19077 16028 81363 33541 -20914
743b0914o294o83J324k761l0288J6845J435L6624J837j5381o391R137j5166J6073
$$ -20914 -27208 -27891 -26567 -29328 -59616 -42771 -41336 -4712 -2875 -18256 -24647 -15510 -30676 -14603
729a4603Q862k777R441l543q491J7367J5237m008n632k1872L14N1238Q020p483
$$ -14603 -5741 -8518 923 -2620 -11111 6256 21493 17485 11853 -10019 -9705 41533 49553 42070
715D2070l0472R880j1773j6844o486j3284j3944K992K7431j4843P261J7699O594
$$ 42070 11598 21478 9705 -7139 -13625 -26909 -40853 -37861 -10430 -25273 -18012 -313 6281
702F281m6863J6948J4564k8385k885J5174P805j9277j302J8705L1375j758j8790
$$ 6281 -40582 -23634 -9070 -37455 -40340 -25166 -17361 -36638 -37940 -19235 12140 10382 -8408
689h408j8620K2480q287J2848L7937m4026k8947m417K1065J3264m699K1927k3445
$$ -8408 -27028 -4548 -12835 13 37950 -6076 -35023 -39440 -18375 -5111 -9810 12117 -11328
676a1328k2419k319p231M2811O098L486k1540K4123j3464k2192J7894L1523k570
$$ -11328 -33747 -36066 -43297 -486 5612 9098 -12442 11681 -1783 -23975 -6081 25442 22872
663B2872r760j4655o71J8346k8946j1696N3700P18j3352K7241n1067l1892P48
$$ 22872 13112 -1543 -2214 16132 -12814 -24510 29190 29908 16556 43797 -7270 -39162 -38414
650c8414L6398K5777j1185m8187M0008K1169p321l1996O413J7395K4566k1292
$$ -38414 -2016 23761 12576 -35611 4397 25566 18245 -13751 -7338 10057 34623 13331
638A3331j0314J0180l153k8149K832K3172j6156r774R64L5480j414K1287p108
$$ 13331 3017 13197 10044 -18105 -15273 7899 -8257 -18031 -17067 18413 16999 38286 31178
625C1178k7824M370j0214k5181j300J8379J1485k9240L282j8758J1910K7886K7756
$$ 31178 3354 7724 -2490 -27671 -28971 -10592 893 -28347 -25065 -43823 -31913 -4027 23729
612B3729K7692m6734j7775P889J8065j7242l5522Q174k377L6159m829j6979l4040
$$ 23729 51421 4687 -13088 -5199 12866 -4376 -39898 -31724 -34101 2058 -2771 -19750 -53790
599e3790K6426L4650Q416k4062Q576Q930p856Q813K548l1734j0109J134P353l1279
$$ -53790 -27364 7286 15702 -8360 216 9146 1290 10103 12651 -19083 -29192 -28058 -20705 -51984
585e1984l030K0997K4565K0211l8469K9822J8677l1108l7326m714J7880K0881
$$ -51984 -55014 -34017 -9452 10759 -27710 2112 20789 -10319 -47645 -52359 -34479 -13598
573a3598l3999J2288J753j0810J3450J9947k719K1854l008j2072P913J1626q513
$$ -13598 -47597 -35309 -33556 -44366 -30916 -10969 -13688 8166 5158 -6914 999 12625 4112
560D112k4080K5988j1780j39N664j8223R160J105O258J7584j4027J4040J658k4104
$$ 4112 -19968 6020 -5760 -5899 -235 -18458 -9298 -8193 -1935 15649 1622 15662 17320 -6784
546f784M2428j6357m6525j615J2080K1917j5167R607j2134j2360J8578o347K5150
$$ -6784 35644 19287 -27238 -28853 -16773 5144 -10023 -416 -12550 -24910 -6332 -12679 12471
533A2471l0394j4245J5806m3633J7543R102J9028R461j2488j7733l9576O091L2108
$$ 12471 -17923 -32168 -16362 -59995 -42452 -33350 -14322 -4861 -17349 -35082 -74658 -68567 -36459
520c6459L8216j5282P309K8283l3528j4833k2418K5638J0773k2337J5520J8066
$$ -36459 1757 -13525 -6216 22067 -11461 -26294 -48712 -23074 -12301 -34638 -19118 -1052
508a052l387m6563Q113J8301J3938K5988J1522m975R211o954P812J0181k6279
$$ -1052 -4439 -51002 -42889 -24588 -10650 15338 26860 21885 31096 24142 31954 42135 15856
495A5856k4991k2606K7424k3100j0706K1843K787L3673j8156l487o368Q016q816
$$ 15856 -9135 -31741 -4317 -27417 -38123 -16280 -13493 20180 2024 -1463 -7831 185 -8631
482h631P879M5689m2330k8464O284J6732K1235j5590j8603k7496P617K3K73M294
$$ -8631 -752 44937 2607 -25857 -19573 -2841 18394 2804 -15799 -43295 -35678 -35655 -35382 -31088
468c1088J96j774J1762J215m986l021J129J8450J4446L3112j912q009m421l0241
$$ -31088 -30892 -32666 -20904 -19689 -24675 -27696 -26567 -8117 6329 39441 37529 29520 25099 -5142
454e142J8888k3735j4557M8790j9079l1263K5659K750l855k8319l1017M1466M3773
$$ -5142 13746 -9989 -24546 24244 5165 -26098 -439 2311 -1544 -29863 -60880 -19414 24359
441B4359l989k3713j1798J3544j1363k7664j7351K8704R650k6883L8164J2722
$$ 24359 20370 -3343 -15141 -1597 -12960 -40624 -57975 -29271 -19621 -46504 -8340 4382
429D382j3458j5658J8926l328k0178K8705K939j2772n389k219j9494k281N4185
$$ 4382 -9076 -24734 -5808 -9136 -29314 -609 2330 -10442 -15831 -18050 -37544 -39825 14360
416A4360k4361k985K718k756r042j1318K6062L1328j154l4611j9064K1165m111
$$ 14360 -10001 -12986 -10268 -13024 -22066 -33384 -7322 24006 22852 -11759 -30823 -9658 -13769
403a3769M754r942L429k7175J4762K7264j4056j1592K950K2975l841K5687N122
$$ -13769 -9015 -18957 -15528 -42703 -27941 -677 -14733 -26325 -23375 -400 -4241 21446 26568
390B6568j3143J8318q359m3666k4350j368J1357L6586P188j3777J2477j0672P47
$$ 26568 13425 31743 23384 -20282 -44632 -46000 -34643 1943 9131 -4646 7831 -2841 -2094
377b094l3280L5583J3088k3587M0041j7834P206J5423m5037j8561k1445K9580
$$ -2094 -35374 209 13297 -10290 29751 11917 19123 34546 -10491 -29052 -50497 -20917
365b0917l0936J4662L5774j0946l941K22k3098l110L9697r488K3455n2592J8997
$$ -20917 -51853 -37191 -1417 -12363 -16304 -16082 -39180 -42290 -2593 -12081 11374 -41218 -22221
352b2221O459j9530J0360O188L1615j4677j7865J1674k0026J3914L0724m806j1227
$$ -22221 -15762 -35292 -24932 -18744 12871 -1806 -19671 -7997 -28023 -14109 16615 11809 582
339E82j2173R128K9955o077k3114J4689J6141K1290k8467j9004j2865n325K4370
$$ 582 -11591 -2463 27492 21415 -1699 12990 29131 50421 21954 2950 -9915 -15240 9130
326I130J31k0088o752J8815L8362l0527k2001o920J7008M35k1607L50J4851K5391
$$ 9130 9261 -10827 -17579 1236 39598 9071 -12930 -19850 -2842 -2407 -24014 -23664 -8813 16578
312A6578K6110k6042j7849l9526P009J2535j1804J9443K3032j4436p302M830K6063
$$ 16578 42688 16646 -1203 -40729 -33720 -21185 -32989 -13546 9486 -4950 -12252 -7422 18641
299A8641J2628k3027j8767L829J3663m273M927l951l2232j7176M6767R202K3771
$$ 18641 31269 8242 -10525 -6696 6967 2694 7621 3670 -28562 -45738 1029 10231 34002
286C4002j4564n6881k5916M8106K795L26L156j6275K8833L209m6233j4006n138
$$ 34002 19438 -37443 -63359 -15253 -12458 -12132 -8976 -25251 3582 6791 -39442 -53448 -58586
273e8586L6112N900J3104M708k9043j5179J6273m441Q742P123j8907J08K238P994
$$ -58586 -22474 -16574 -3470 1238 -27805 -42984 -26711 -31152 -22410 -15287 -34194 -34086 -31848 -23854
259b3854k5945O239r254J6391L2381k0984l903K2407J3464J4084j4827k7828J8210
$$ -23854 -49799 -43560 -52814 -36423 -4042 -25026 -28929 -6522 6942 21026 6199 -21629 -3419
246c419J5822J1542J2278M272m2497Q109J0750k0620J5274K512j0268m4517r293
$$ -3419 12403 23945 36223 40495 -2002 6107 16857 -3763 11511 14023 3755 -40762 -50055
233e0055K8624J8208l185j0007L00k5664J2966K3443k0050J3375k2270r47L4969
$$ -50055 -21431 -3223 -6408 -16415 -16115 -41779 -28813 -5370 -25420 -12045 -34315 -35262 -293
220b93N993k3632q791j7210L5276J3851j8858Q39R005M1024j1881j8319j7147
$$ -293 5700 -17932 -26723 -43933 -8657 5194 -13664 -12825 -3820 37204 25323 7004 -10143
207a0143R123j6870m53J5824J1312j0153k7883L0995k4768j3477K0274J5373m696
$$ -10143 -1020 -17890 -18343 -2519 8793 -1360 -29243 1752 -23016 -36493 -16219 -846 -5542
194e542k4562L871J7905O475j2984j1757K8959l161j9467l826L3181j0403j2019
$$ -5542 -30104 -26233 -8328 -1853 -14837 -26594 2365 -796 -20263 -24089 9092 -1311 -13330
181a3330K122R228N357j0018k2912j98N5145j4639k5845k0177J8381K4388K1950
$$ -13330 -11208 -1980 3377 -6641 -29553 -29751 25394 10755 -15090 -35267 -16886 7502 29452
168B9452K094k2403p193l995k5569j5536L2337M6216m2871p644J6622k8963j894
$$ 29452 31546 9143 1950 -2045 -27614 -43150 -10813 35403 -7468 -15112 1510 -27453 -29347
155b9347K4742J1239n378k4242J3772n897r179J1547r910L0106j0489M375J7302
$$ -29347 -4605 6634 1256 -22986 -9214 -15111 -24290 -12743 -22653 7453 -3036 1339 18641
142A8641J756j7661j9312K618J5000j1814k889k664n094K3451R322k7070k3548
$$ 18641 20397 2736 -16576 -13958 1042 -10772 -13661 -16325 -21419 2032 11354 -15716 -39264
129c9264J8351J2045q326N375j8461j7734J3551J1934R142L5543k7630k979Q102
$$ -39264 -20913 -8868 -17194 -11819 -30280 -48014 -34463 -22529 -13387 22156 -5474 -8453 -351
116c51L186J0244n436j5439j5227n869j0896J2115o20K4928j3898M829O462O125
$$ -351 2835 13079 7643 -7796 -23023 -28892 -39788 -27673 -28293 -3365 -17263 -12434 -5972 153
102A53J452r924j068O386R995j4597j051M763k5188J6027l131k5391L808K0244
$$ 153 1605 -8319 -9387 -3001 6994 -7603 -8654 -3891 -29079 -13052 -16183 -41574 -37766 -17522
88a7522J3252P955L2152m7098j1820L0123l501k8266m498l529r52J3109k401J9595
$$ -17522 -4270 3685 35837 -11261 -23081 7042 3541 -24725 -29223 -32752 -33704 -20595 -22996 -3401
74c401j823j3014O231J6192j1546k8967K2507M606O439k234o967K4031J4227k1010
$$ -3401 -5224 -18238 -12007 4185 -7361 -36328 -13821 -9215 -2776 -5010 -11977 12054 26281 5271
60E271l7089j2160Q766P501L1749M378l2365P801r25R224l2033J2418m68J217
$$ 5271 -31818 -43978 -35212 -27711 4038 8416 -23949 -16148 -17073 -7849 -39882 -27464 -27932 -26715
46b6715J3906j8342q161p156J9853J5568k8879J3354J2908j8245N845J3794J3671
$$ -26715 -12809 -31151 -39312 -46468 -26615 -11047 -39926 -26572 -13664 -31909 -26064 -12270 1401
33A401N693j7111o932j1524K4383J98J8788K824j3977N233k1906m883K753L3349
$$ 1401 7094 -10017 -16949 -28473 -4090 -3892 14896 17720 3743 8976 -12930 -17813 -15060 18289
19A8289o317m673j5173j3818J488J8838J9246j8446r842j3803j035P572O2Q565
$$ 18289 11972 7299 -7874 -21692 -20204 -1366 17880 -566 -10408 -24211 -25246 -17674 -17612 -9047
5i047J791j2724O26p999l033
$$ -9047 -7256 -19980 -19354 -27353 -30386
0c0386
$$ -30386
$$ Imaginary data points
##PAGE= N=2
##DATA TABLE= (X++(I..I)), XYDATA
16383a069216J2497J8635L7522L5224J7953n896K4617n526J6640J9624Q471l698
$$ -1069216 -1056719 -1038084 -1000562 -965338 -947385 -953281 -928664 -934190 -917550 -897926 -889455 -893153
16371h93153j8546L0186J8297k997J6724L2547o979N935J4235Q49J0485J4172
$$ -893153 -911699 -881513 -863216 -866213 -849489 -816942 -823921 -817986 -803751 -802902 -792417 -778245
16359g78245K4666L6448N810l321K9057J9696p740j1208M7431K6949J245M797
$$ -778245 -753579 -717131 -711321 -714642 -685585 -665889 -673629 -684837 -637406 -610457 -609212 -604415
16347f04415K1735K1120P036J3448P069J6392k198K3286j3855j19J9831J6890
$$ -604415 -582680 -561560 -554524 -541076 -534007 -517615 -519813 -496527 -510382 -510501 -490670 -473780
16335d73780J0964J7971L8453K7015J6885j4476J4529r305J3834L577J1871L2026
$$ -473780 -462816 -444845 -406392 -379377 -362492 -376968 -362439 -371744 -357910 -354333 -342462 -310436
16323c10436j4099J0773K3565J0348j3009J2393Q783J9555J1425J3042L812J6565
$$ -310436 -324535 -313762 -290197 -279849 -292858 -280465 -271682 -252127 -240702 -227660 -223848 -207283
16311b07283J074M785K7278J4537k506l127R384K5216J5787J9562J0448R232J8326
$$ -207283 -206209 -201424 -174146 -159609 -162115 -165242 -155858 -130642 -114855 -95293 -84845 -75613 -57287
16298e7287J4420l543R953J6475n290l812J4262J2459J7614n817J737L9391n391
$$ -57287 -42867 -46410 -36457 -19982 -25272 -29084 -14822 -2363 15251 9434 11171 50562 45171
16285D5171j5500L4954J4739K2176L5208m286Q154K2357R716j2313N629J4481
$$ 45171 29671 64625 79364 101540 136748 132462 140616 162973 172689 160376 166005 180486
16273A80486K413K5849K272k234o436k3998K4036K6838L479K554J905J7470N97
$$ 180486 182899 208748 211020 208786 202350 178352 202388 229226 232705 235259 237164 254634 255231
16260B55231L835K3482O123K7684N718m143L5604J9106p801J6469j9507J2165
$$ 255231 259066 282548 288671 316355 322073 317930 353534 372640 364839 381308 361801 373966
16248C73966r314R318Q399j1719J9783j789R151J4944J2889n666K5200N715k3211
$$ 373966 364652 373970 382369 370650 390433 388644 397795 412739 425628 419962 445162 450877 427666
16235D27666m795K2244K1887L0090q843j760J8174J8057J5172k0154o788J01M925
$$ 427666 422871 445115 467002 497092 488249 486489 504663 522720 537892 517738 510950 511051 515976
16222E15976J1394K2000j4633l458p23M2798n35O638K6865m112K0198l0548l1623
$$ 515976 527370 549370 534737 531279 530556 573354 572819 579457 606322 602210 622408 591860 560237
16209E60237K9158J6353J0937q206n805q632K3880N994P085L8475q114J657n185
$$ 560237 589395 605748 616685 608479 602674 594042 617922 623916 631001 669476 661362 663019 657834
16196F57834K6674p596k2468R133K6391K0176o739J5239j4307m9982J248J623
$$ 657834 684508 676912 654444 663577 689968 710144 703405 718644 704337 654355 655603 657226
16184F57226M5781J1499k2770p893J3216K6539K3180l831p224j4932o775J8342
$$ 657226 703007 714506 691736 683843 697059 723598 746778 742947 735723 720791 714016 732358
16172G32358l1038J4669M4719r636J8480j5471J6771K1656j064J2479k0558j846
$$ 732358 701320 715989 760708 751072 769552 754081 770852 792508 791444 803923 783365 781519
16160G81519J267K8305j0714J7868P832M213O568L134n203j2724j5731J2948J8218
$$ 781519 782786 811091 800377 818245 826077 830290 836858 839992 834789 822065 806334 819282 837500
16147H37500j5772L0510J0605o0885k57K5395K4664l602k3J5950k9077J4935P539
$$ 837500 821728 852238 862843 801958 801701 827096 851760 848158 848135 864085 835008 849943 857482
16134H57482j7790K2923j0791k1832L820o907J5325K3055l502j6073Q671j1624
$$ 857482 839692 862615 851824 829992 833812 826905 842230 865285 861783 845710 854381 842757
16122H42757J8809m697K852m783J1813j7264r809M7136O302j024k6872J1263L628
$$ 842757 861566 856869 859721 854938 866751 849487 839678 886814 893116 892092 865220 876483 880111
16109H80111K0191m198p954l978j5125J2502k1960J206J8035o179j1078K9414
$$ 880111 900302 896104 888150 884172 869047 881549 859589 860795 878830 872651 861573 890987
16097H90987K7690l3589J0120J9034l2554N116L095L3980j1264k7684J2250j0715
$$ 890987 918677 885088 895208 914242 881688 886804 889899 923879 912615 884931 897181 886466
16085H86466K6304K24r803j565N115M2503l11m1900J3251J4913o570L382l850
$$ 886466 912770 912994 903191 901626 906741 949244 948933 907033 920284 935197 928627 932009 928159
16072I28159N858j9200k1881p482Q387L3992L192k4226q132K6737k3144K2953
$$ 928159 934017 914817 892936 885454 893841 927833 931025 906799 898667 925404 902260 925213
16060I25213j1257J459k043Q231K9629k3182j3313j3834L7800L985k5111l3547
$$ 925213 913956 915415 913372 921603 951232 928050 914737 900903 938703 942688 917577 884030
16048H84030N483J9766L9152J0060k7249j8870o264o337L1116m39m389R614j8380
$$ 884030 889513 909279 948431 958491 931242 912372 906108 899771 930887 930448 926059 935673 917293
16035I17293K060r811k0756J0930K48j6596r207J1457J2166j7323k7394M8879
$$ 917293 919353 909542 888786 899716 899964 883368 874161 885618 897784 880461 853067 901946
16023I01946N140J0226L0323q723j3622n61q914k340j0775j517J9382O135M038
$$ 901946 907086 917312 947635 938912 925290 924729 915815 913475 902700 901183 920565 926700 930738
16010I30738J668L101k0256k2311J5745J5478M709n251K958L2262k5981q67O62
$$ 930738 932406 935507 915251 892940 908685 924163 928872 923621 926579 958841 932860 931993 932655
15997I32655P075R246l293M642P879k0893K0057k772j4969j7811O915j39k4879
$$ 932655 939730 948976 945683 950325 958204 937311 957368 954596 939627 921816 928731 928592 903713
15984I03713j4979J1374K7765J5576l906k3783j0852J2966j9483J5331M0017M330
$$ 903713 888734 900108 927873 943449 939543 915760 904908 917874 898391 913722 953739 958069
15972I58069J135p549J1070j9121p424n795k0697L543K9151j0661n608K6683O76
$$ 958069 959204 951655 962725 943604 936180 930385 909688 913231 942382 931721 926113 952796 953472
15959I53472l238k9979j4302J088J9591M719J7265j0552p638L0893k4152M09j1879
$$ 953472 950234 920255 905953 907041 926632 931351 948616 938064 930426 961319 937167 937576 925697
15946I25697P79j6064j0386L2828J7832K4143j2834l315o480n4818K445J2377
$$ 925697 926476 910412 900026 932854 950686 974829 961995 958680 952200 897382 899827 912204
15934I12204J7457K1270L183Q407R409J3963O752R221k7781l4887J0394k956l0039
$$ 912204 929661 950931 954114 962521 971930 985893 992645 1001866 974085 939198 949592 946636 916597
15921I16597K291P627k878k3670M3894Q594m06k088k0038J7919j6170K4324J3517
$$ 916597 918888 926515 923637 899967 943861 952455 952049 949961 929923 947842 931672 955996 969513
15908I69513l2611J3243P654j7495N5591p307n5054o264M375j0244J8870m45N418
$$ 969513 936902 950145 957799 940304 995895 988588 933534 927270 931645 921401 940271 939826 945244
$$ [...]
##END NTUPLES=NMR SPECTRUM
##END=
