##TITLE=1H_DE-80H_X3
 200.13MHz, d2o
 8 sc
 
 19ns.26.2.2025
##JCAMPDX= 6.0         $$ Bruker NMR JCAMP-DX V2.0
##DATA TYPE= NMR SPECTRUM
##DATA CLASS= NTUPLES
##ORIGIN= UXNMR, Bruker Analytische Messtechnik GmbH
##OWNER= pz
$$ XWIN-NMR		Version 3.5
$$ Fri Jun 20 15:01:52 2025 Russian Standard Time (UT+4h)  Yarkov@DPX200
##.OBSERVE FREQUENCY= 200.1313
##.OBSERVE NUCLEUS= ^1H
##.ACQUISITION MODE= SIMULTANEOUS
##.ACQUISITION SCHEME= undefined
##.AVERAGES= 8
##.DIGITISER RES= 18
##SPECTROMETER/DATA SYSTEM= spect
##.PULSE SEQUENCE= zg30
##.SOLVENT NAME= CDCl3
##.SHIFT REFERENCE= (INTERNAL, CDCl3, 0, 15.5188)
##AUDIT TRAIL= $$ (NUMBER, WHEN, WHO, WHERE, WHAT)
$$ ##TITLE= Audit trail, XWIN-NMR		Version 3.5
$$ ##JCAMPDX= 5.01
$$ ##ORIGIN= Bruker BioSpin GmbH
$$ ##OWNER= Yarkov
$$ C:/Bruker/XWIN-NMR/data/yarkov2/nmr/H-C/1/pdata/1/auditp.txt
$$ ##AUDIT TRAIL=  $$ (NUMBER, WHEN, WHO, WHERE, WHAT)
(   1,<2025-06-20 15:01:03.92 +0400>,<Yarkov>,<DPX200>,
      <created by zg, POWCHK disabled, PULCHK disabled
       configuration hash MD5:
       00 E9 B6 7A A2 85 ED C7 34 08 36 98 17 FE 4E 26
       data hash MD5: 16K
       76 20 13 6A A6 EF 3F 80 EE 07 D0 A3 0B 89 52 82>)
(   2,<2025-06-20 15:01:08.48 +0400>,<Yarkov>,<DPX200>,
      <Start of raw data processing
       efp BC_mod = 2 LB = 0.25 FT_mod = 6 PKNL = 1 PHC0 = -1717.772 PHC1 = 14.16658 SI = 16K 
       data hash MD5: 16K
       B6 6B 57 82 84 6E DE 64 05 6C CA E0 FD 6A 27 1E>)
(   3,<2025-06-20 15:01:14.39 +0400>,<Yarkov>,<DPX200>,
      <abs ABSG = 5 
       data hash MD5: 16K
       27 50 EF 54 C4 6E 58 62 6F FA 0D 29 4F AE 0C 42>)
$$ ##END=
$$ 
$$ hash MD5
$$ C4 52 2E 88 91 E2 71 BE 7E 95 3F 6D D6 53 21 0C
##$RELAX= 
##$RELAX= 
##$RELAX= 
##$RELAX= 
##$RELAX= 
##$RELAX= 
$$ Bruker specific parameters
$$ --------------------------
##$DU= <C:/Bruker/XWIN-NMR>
##$EXPNO= 1
##$NAME= <H-C>
##$PROCNO= 1
##$TYPE= <nmr>
##$USER= <yarkov2>
##$AMP= (0..31)
100 100 100 100 100 100 100 100 100 100 100 100 100 100 100 100 100 100 
100 100 100 100 100 100 100 100 100 100 100 100 100 100 
##$AQSEQ= 0
##$AQ_mod= 1
##$AUNM= <au_zg>
##$AUTOPOS= <>
##$BF1= 200.13
##$BF2= 200.13
##$BF3= 200.13
##$BF4= 200.13
##$BF5= 200.13
##$BF6= 200.13
##$BF7= 200.13
##$BF8= 200.13
##$BYTORDA= 1
##$CFDGTYP= 0
##$CFRGTYP= 5
##$CHEMSTR= <none>
##$CNST= (0..31)
1 1 145 1 1 1 1 1 1 1 1 1 1 1 1 1 1 1 1 1 1 1 1 1 1 1 1 1 1 1 1 1 
##$CPDPRG= <>
##$CPDPRG1= <>
##$CPDPRG2= <>
##$CPDPRG3= <>
##$CPDPRG4= <mlev>
##$CPDPRG5= <mlev>
##$CPDPRG6= <mlev>
##$CPDPRG7= <mlev>
##$CPDPRG8= <mlev>
##$CPDPRGB= <>
##$CPDPRGT= <>
##$D= (0..31)
0 0.7 0 0 0 0 0 0 0 0 0 0.03 0 0 0 0 0 0 0 0 0 0 0 0 0 0 0 0 0 0 0 0 
##$DATE= 1750417263
##$DBL= (0..7)
120 120 120 120 120 120 120 120 
##$DBP= (0..7)
150 150 150 150 150 150 150 150 
##$DBP07= 0
##$DBPNAM0= <>
##$DBPNAM1= <>
##$DBPNAM2= <>
##$DBPNAM3= <>
##$DBPNAM4= <>
##$DBPNAM5= <>
##$DBPNAM6= <>
##$DBPNAM7= <>
##$DBPOAL= (0..7)
0.5 0.5 0.5 0.5 0.5 0.5 0.5 0.5 
##$DBPOFFS= (0..7)
0 0 0 0 0 0 0 0 
##$DE= 6
$$ [...]
##$SUBNAM3= <"">
##$SUBNAM4= <"">
##$SUBNAM5= <"">
##$SUBNAM6= <"">
##$SUBNAM7= <"">
##$SUBNAM8= <"">
##$SUBNAM9= <"">
##$SW= 18.0517328524113
##$SWIBOX= (0..15)
0 0 2 0 0 0 0 0 0 0 0 0 0 0 0 0 
##$SW_h= 3612.71676300578
##$TD= 16384
##$TD0= 1
##$TE= 0
##$TE2= 300
##$TE3= 300
##$TEG= 300
##$TL= (0..7)
0 120 120 120 120 120 120 120 
##$TP= (0..7)
150 150 150 150 150 150 150 150 
##$TP07= 0
##$TPNAME0= <>
##$TPNAME1= <>
##$TPNAME2= <>
##$TPNAME3= <>
##$TPNAME4= <>
##$TPNAME5= <>
##$TPNAME6= <>
##$TPNAME7= <>
##$TPOAL= (0..7)
0.5 0.5 0.5 0.5 0.5 0.5 0.5 0.5 
##$TPOFFS= (0..7)
0 0 0 0 0 0 0 0 
##$TUNHIN= 0
##$TUNHOUT= 0
##$TUNXOUT= 0
##$USERA1= <user>
##$USERA2= <user>
##$USERA3= <user>
##$USERA4= <user>
##$USERA5= <user>
##$V9= 5
##$VALIST= <valist>
##$VCLIST= <CCCCCCCCCCCCCCC>
##$VD= 0
##$VDLIST= <DDDDDDDDDDDDDDD>
##$VPLIST= <PPPPPPPPPPPPPPP>
##$VTLIST= <TTTTTTTTTTTTTTT>
##$WBST= 1024
##$WBSW= 4
##$XGAIN= (0..3)
0 0 0 0 
##$XL= 0
##$YL= 0
##$YMAX_a= 255301
##$YMIN_a= -247372
##$ZGOPTNS= <>
##$ZL1= 120
##$ZL2= 120
##$ZL3= 120
##$ZL4= 120
##$ABSF1= 15.48907
##$ABSF2= -2.562779
##$ABSG= 5
##$ABSL= 3
##$ALPHA= 0
##$AQORDER= 0
##$ASSFAC= 0
##$ASSFACI= 0
##$ASSFACX= 0
##$ASSWID= 0
##$AUNMP= <proc_1d>
##$AZFE= 0.1
##$AZFW= 0.1
##$BCFW= 0
##$BC_mod= 2
##$BYTORDP= 0
##$COROFFS= 0
##$CY= -3
##$DATMOD= 1
##$DC= 0
##$DFILT= <>
##$DTYPP= 0
##$F1P= 0
##$F2P= 0
##$FCOR= 1
##$FTSIZE= 16384
##$FT_mod= 6
##$GAMMA= 0
##$GB= 0
##$INTBC= 1
##$INTSCL= 3.241238e-09
##$ISEN= 128
##$LB= 0.25
##$LEV0= 0
##$LPBIN= 0
##$MAXI= 10000
##$MC2= 0
##$MEAN= 0
##$ME_mod= 0
##$MI= 1.114404
##$NCOEF= 0
##$NC_proc= -7
##$NLEV= 6
##$NOISF1= 3.799351
##$NOISF2= 2.8
##$NSP= 0
##$NTH_PI= 0
##$NZP= 0
##$OFFSET= 15.51882
##$PC= 1
##$PHC0= -1717.772
##$PHC1= 14.16658
##$PH_mod= 1
##$PKNL= yes
##$PPARMOD= 0
##$PSCAL= 0
##$PSIGN= 0
##$REVERSE= no
##$SF= 200.130000576808
##$SI= 16384
##$SIGF1= 3
##$SIGF2= 2
##$SINO= 0.751879
##$SIOLD= 32768
##$SREGLST= <19F.Aceton>
##$SSB= 0
##$STSI= 16384
##$STSR= 0
##$SW_p= 3612.71676300578
##$SYMM= 0
##$S_DEV= 0
##$TDeff= 16384
##$TDoff= 0
##$TI= <>
##$TILT= no
##$TM1= 0
##$TM2= 0
##$TOPLEV= 0
##$USERP1= <user>
##$USERP2= <user>
##$USERP3= <user>
##$USERP4= <user>
##$USERP5= <user>
##$WDW= 1
##$XDIM= 16384
##$YMAX_p= 390999785
##$YMIN_p= -689366
$$ End of Bruker specific parameters
$$ ---------------------------------
##NTUPLES= NMR SPECTRUM
##VAR_NAME=  FREQUENCY,     SPECTRUM/REAL,   SPECTRUM/IMAG
##SYMBOL=    X,             R,               I
##VAR_TYPE=  INDEPENDENT,   DEPENDENT,       DEPENDENT
##VAR_FORM=  AFFN,          ASDF,            ASDF
##VAR_DIM=   16384,         16384,           16384
##UNITS=     HZ,            ARBITRARY UNITS, ARBITRARY UNITS
##FACTOR=    0.220516191357247, 1,           1
##FIRST=     3105.78141731854, 0,            0
##LAST=      -506.935345687244, 0,           0
##MIN=       -506.935345687244, -689366,     0
##MAX=       3105.78141731854, 390999785,    0
$$ Real data points
##PAGE= N=1
##DATA TABLE= (X++(R..R)), XYDATA
$$ [...]
5970B910625O6181p853O5449J4759m3296k1535p4466r208o697M4690L7579O972
$$ 2910625 2976806 2968953 3034402 3049161 3005865 2984330 2909864 2900656 2893959 2938649 2976228 2983200
5958B983200Q833l2133p122K2569P840Q3364M6721L4519M4071N4994L1861J14881
$$ 2983200 2992033 2959900 2952778 2975347 2983187 3066551 3113272 3147791 3191862 3246856 3278717 3393598
5946C393598N5297M9942J14467J1513J0765k3321j1995n2702q4984n3942j04928
$$ 3393598 3448895 3498837 3613304 3624817 3635582 3612261 3600266 3547564 3462580 3408638 3303710
5935C303710j4520r0811j20113k2002J0687p7232o9740j07839r2352j2162o086
$$ 3303710 3289190 3198379 3078266 3056264 3066951 2989719 2919979 2812140 2719788 2707626 2701540
5924B701540n0208K3555L8219m682p160j4342O599n632p4766l1198o2960m2007
$$ 2701540 2651332 2674887 2713106 2708424 2701264 2686922 2693521 2687889 2613123 2581925 2518965 2476958
5912B476958l4973m9097j53755q9672r0653j74889j20507p8173J2338l4327o9382
$$ 2476958 2441985 2392888 2239133 2149461 2058808 1883919 1763412 1685239 1697577 1663250 1593868
5901A593868l7899k4533p2558j3947M2999j10531k3476M950p7141o9553M271J3372
$$ 1593868 1555969 1531436 1458878 1444931 1487930 1377399 1353923 1358873 1281732 1212179 1216450 1229822
5889A229822j4268L3933k9898L996k6814j05012q0960j46535j115P6232j6074
$$ 1229822 1215554 1249487 1219589 1223585 1196771 1091759 1010799 864264 863149 939381 923307
5878I23307j10341m7561p9994J5611j275q9343J4721K5764l8023m6856J1299L381
$$ 923307 812966 765405 685411 701022 699747 610404 625125 650889 612866 566010 577309 580690
5866E80690l6589N3345l1109o689l8287m586N7915j4154n590k6912K7602j5363
$$ 580690 544101 597446 566337 559648 521361 516775 574690 560536 554946 528034 555636 540273
5854E40273J1660N050n2216k4219K8789o5487L08J6392K8300k4018J0422j03034
$$ 540273 551933 556983 504767 480548 509337 443850 444158 460550 488850 464832 475254 372220
5842C72220L4519K3968L2970k3087j5010L5316j3266k1436l6092M8937M4936J366
$$ 372220 406739 430707 463677 440590 425580 460896 447630 426194 390102 439039 483975 485341
5830D85341M7785k7224n971p9661l6112K0559K6920l0080o964L2493l0289m4073
$$ 485341 533126 505902 499931 420270 384158 404717 431637 401557 394593 427086 396797 352724
5818C52724j3659k8248K4696m8966j1950M2922J4765R748R128k7076k1495P5968
$$ 352724 339065 310817 335513 286547 274597 317519 332284 342032 351160 324084 302589 378557
5806C78557l4172j7155p799K7535K3392J8211n8399O4095j5143q565o4514K0347
$$ 378557 344385 327230 319431 346966 370358 388569 330170 394265 379122 370557 306043 326390
5794C26390O7121j02129j6652L6964L5256k8145o909J1779O9420q153m1955k6709
$$ 326390 393511 291382 274730 311694 346950 318805 311896 323675 393095 384942 342987 316278
5782C16278K4309o2232k0345L8345L4345l402O454J0027L1947M1172p1071M146
$$ 316278 340587 278355 258010 296355 330700 327298 333752 343779 375726 416898 345827 349973
5770C49973l9431n6637J9623K3426L5746M1960m713L2813j3816O2011k6153L743
$$ 349973 310542 253905 273528 296954 332700 374660 369947 402760 388944 450955 424802 428545
5758D28545J4256j1879J6893N3486N306k6527l5042M4421l9634L8964J7348K8588
$$ 428545 442801 430922 447815 501301 506607 480080 445038 489459 449825 488789 506137 534725
5746E34725k5963j8988j3741J5937L2005k1484K6571K2323o2729o4468K1440j5284
$$ 534725 508762 489774 476033 491970 523975 502491 529062 551385 488656 424188 445628 430344
5734D30344M8566J05091J8754k5010M4492p8208J0127L136O9635J4299L4126j2123
$$ 430344 478910 584001 602755 577745 622237 544029 554156 557292 626927 641226 675352 663229
5722F63229m4314M4245M4859L1286q3940j01585L61l2222L1712k9797m1848P051
$$ 663229 618915 663160 708019 739305 655365 553780 554141 521919 553631 523834 481986 489037
5710D89037L9241J1550O736K0743K969m6232j1222M6619m9752O5050l0951K0725
$$ 489037 528278 539828 546564 567307 570276 524044 512822 559441 509689 574739 543788 564513
5698E64513P2042j4273M5235O0096K7056r2038m4429J7596j7680J8282q2263j5328
$$ 564513 636555 622282 667517 727613 754669 662631 618202 635798 618118 636400 554137 538809
5686E38809J5577l6825j1138R837L4665P790N7611n6866j7780J4433L060k6847
$$ 538809 554386 517561 506423 516260 550925 558715 616326 559460 541680 556113 559173 532326
5674E32326J3741M2091K9815O2224o7358j9121O2865O6878Q4595K6243q3751n6130
$$ 532326 546067 588158 617973 680197 612839 593718 656583 723461 808056 834299 750548 694418
5662F94418q71J1283K3029q176L0072L6516o499M6603p6770n2233M365N7081R314
$$ 694418 693547 704830 727859 719683 749755 786271 779772 826375 749605 697372 701737 758818 768132
5649G68132l7070j5352M6170N5458Q9966L1848L0165K4953m0903Q6807K0598L5729
$$ 768132 731062 715710 761880 817338 907304 939152 969317 994270 953367 1040174 1060772 1096501
5637A096501L1487N4496L3651P4458P6586l7069l1488N6328J6567k7305j3744
$$ 1096501 1127988 1182484 1216135 1290593 1367179 1330110 1298622 1354950 1371517 1344212 1330468
5626A330468J8736M9885L1814J06618k3158j6649R1784n11N3497P7325L4225O2818
$$ 1330468 1349204 1399089 1430903 1537521 1514363 1497714 1589498 1588987 1642484 1719809 1754034 1816852
5614A816852M0442J45959J12765J13195O4396m524O4360J09936O4929J9470P8321
$$ 1816852 1857294 2003253 2116018 2229213 2293609 2289085 2353445 2463381 2528310 2547780 2626101
5603B626101Q6699q13J58571J62531J02679P6598J29204J22400J7529N0215R5705
$$ 2626101 2712800 2711987 2870558 3033089 3135768 3212366 3341570 3463970 3481499 3531714 3627419
5592C627419J27452J10622J55109J46454Q7362J17989K03836J79395J90348J94140
$$ 3627419 3754871 3865493 4020602 4167056 4254418 4372407 4576243 4755638 4945986 5140126
5582E140126K33194J42697K15504L12452L47746L82390M75908M73680N08021M51163
$$ 5140126 5373320 5516017 5731521 6043973 6391719 6774109 7250017 7723697 8231718 8682881
5572H682881M88488L04469P8233j2257o8138k06912j83214k39743j95956j42453
$$ 8682881 9171369 9475838 9554071 9541814 9473676 9266764 9083550 8843807 8647851 8505398
5562H505398j56589n1023J1483J26439J46104J59968J99528K37884K41221L19805
$$ 8505398 8348809 8297786 8309269 8435708 8581812 8741780 8941308 9179192 9420413 9740218
5552I740218L42391L88653M73378O02266P88399R64253J044174R89435P23410
$$ 9740218 10082609 10471262 10944640 11546906 12335305 13299558 14343732 15333167 16056577
5543A6056577L25886j51712p59533j004281j113953j017327r10287p79115n53983
$$ 16056577 16382463 16230751 15471218 14466937 13352984 12335657 11425370 10646255 10092272
5534A0092272n57286m22582k78403k11048q2746O9000P30J5091J48430J90209
$$ 10092272 9534986 9112404 8834001 8622953 8540207 8609207 8609937 8625028 8773458 8963667
5524H963667K90317L67219M69834N74604P49761Q82960Q89393Q47551O23309J76879
$$ 8963667 9253984 9621203 10091037 10665641 11415402 12298362 13187755 14035306 14658615 14835494
5514A4835494l25865p20663j006639j093733j076426r26115q52144o05892n46163
$$ 14835494 14509629 13788966 12782327 11688594 10612168 9686053 8833909 8228017 7681854
5505G681854l87778l37468k68846k39409j10522l3782R03L6644M5501J19393J94899
$$ 7681854 7294076 6956608 6687762 6448353 6337831 6304049 6304952 6341596 6387097 6506490 6701389
5494F701389K73053M04906N18586N29405N41688N72316L89886O6196l34651o53760
$$ 6701389 6974442 7379348 7897934 8427339 8969027 9541343 9931229 9997425 9662774 9009014
5484I009014p52757o43436o50973n09047l93457k51050k75141j39826j53173j18185
$$ 9009014 8256257 7612821 6961848 6452801 6059344 5808294 5533153 5393327 5240154 5121969
5474E121969M0234m7655l17M7246J05327J03663J28315J34368K00842K73552L34350
$$ 5121969 5162203 5114548 5114231 5161477 5266804 5370467 5498782 5633150 5833992 6107544 6441894
5463F441894L14667L49684L13404K60994Q4388n643r5618r215j4414J1510M7116
$$ 6441894 6756561 7106245 7419649 7680643 7765031 7759388 7663770 7654555 7640141 7651651 7698767
5452G698767K42772K83030L07591M17181N41739M37965L67738M46404N17005O94576
$$ 7698767 7941539 8224569 8532160 8949341 9491080 9929045 10296783 10743187 11260192 11954768
5442A1954768Q00269R50090J207419J168092R02824M89286l2813n37684o51976
$$ 11954768 12755037 13705127 14912546 16080638 16983462 17472748 17439935 16902251 16250275
5433A6250275p91901o52387n84787m13808l65521k59219p6522l6236J78304L40753
$$ 16250275 15458374 14805987 14221200 13807392 13441871 13182652 13106130 13069894 13248198 13588951
5423A3588951M72762N12115O81096P84134Q05320O78580O74473Q48919J022271
$$ 13588951 14061713 14573828 15254924 16039058 16844378 17522958 18197431 19046350 20068621
5414B0068621J336505J595770J846213J962560J594994O57250m35291j234835
$$ 20068621 21405126 23000896 24847109 26809669 28404663 29061913 28626622 27391787
5406B7391787j820928j882103j755962j563630j273246j216313j034022q04753
$$ 27391787 25570859 23688756 21932794 20369164 19095918 17879605 16845583 16040830
5398A6040830p11823m90449l51432j44057j11069J9095J71499K22998J76126J60231
$$ 16040830 15329007 14838558 14487126 14343069 14232000 14251095 14422594 14645592 14821718 14981949
5388A4981949J57058J62962K19760K89664K69633J08832k37050n09333q44445
$$ 14981949 15139007 15301969 15521729 15811393 16081026 16189858 15952808 15443475 14599030
5379A4599030j143029j229237j186464j021414q02843p69455p29389o64368m82472
$$ 14599030 13456001 12226764 11040300 10018886 9216043 8446588 7717199 7052831 6570359
5370F570359l85471m52343m05718k51353k09528j84552m1571l5159j30250j34217
$$ 6570359 6184888 5732545 5326827 5075474 4865946 4681394 4639823 4604664 4474414 4340197
5360D340197j80806j66554j85257j83298j79304k37235k48516j65708j54687j26956
$$ 4340197 4159391 3992837 3807580 3624282 3444978 3207743 2959227 2793519 2638832 2511876
5350B511876j39512j40942j60962p9422r4274o4396k2659l7111n8387o4000k6136
$$ 2511876 2372364 2231422 2070460 1991038 1896764 1832368 1809709 1772598 1714211 1650211 1624075
5339A624075m6263k3616q8954m0359j316l8867j9946K4341J3110J2702j10861
$$ 1624075 1577812 1554196 1465242 1424883 1423567 1384700 1364754 1389095 1402205 1414907 1304046
5328A304046j3672n095k3381m2487j1180n2820k6350O8940J7938n5032l0743m8450
$$ 1304046 1290374 1285279 1261898 1219411 1208231 1155411 1129061 1198001 1215939 1160907 1130164 1081714
5316A081714J2257J3321o7507J4054p5137p3040J6042J7601j3402l2184P601l6496
$$ 1081714 1093971 1107292 1039785 1053839 978702 905662 921704 939305 925903 893719 901320 864824
5304H64824K4489o007j3632m0675N8177O124J00841J02020n1794o250j07283l6758
$$ 864824 889313 883306 869674 828999 887176 893300 994141 1096161 1044367 1038117 930834 894076
5292H94076K0569l4939O860l7948n6472k6595k6514m172J4136m7734M9996j6863
$$ 894076 914645 879706 886566 848618 792146 765551 739037 734865 749001 701267 751263 734400
5280G34400l1230K6132j9448k2087P661o057P715k7388q1809m0999P6945N9729
$$ 734400 703170 729302 709854 687767 695428 689371 697086 669698 587889 546890 623835 683564
5268F83564k4740K7930o4157J6813q509j6297O8567M4033l2774k7456l4950j8504
$$ 683564 658824 686754 622597 639410 630901 614604 683171 727204 694430 666974 632024 613520
5256F13520N7605m6985j7471l863l7542P549l8607k297J3948k8327L3759R5080
$$ 613520 671125 624140 606669 602806 565264 572813 534206 531909 545857 517530 551289 646369
5244F46369n8667l4357J4270l5551n7728J0951N3122l42k6769K5846k2809o1648
$$ 646369 587702 553345 567615 532064 474336 485287 538409 538067 511298 537144 514335 452687
5232D52687K0890Q6452j4749K5132O0108l0537k5044K1217K3604k4972o0464l9908
$$ 452687 473577 560029 545280 570412 630520 599983 574939 596156 619760 594788 534324 494416
5220D94416O3670K8523N135J8951J0840r5475k3158Q018k7059K1775j037r4304
$$ 494416 558086 586609 591744 610695 621535 526060 502902 510920 483861 505636 504599 410295
5208D10295N8876Q0243K4340j2763M604L7934m7716L352P054P0750L1836j4756
$$ 410295 469171 549414 573754 560991 565595 603529 555813 559165 566219 636969 668805 654049
5196F54049l8596n0788J2672J0191n3356P2205M0979O166p8157N1643o815p0689
$$ 654049 615453 564665 577337 587528 534172 606377 647356 653522 575365 627008 620193 549504
5184E49504k4996K8427j9395q842K1645L1771K2519m1708L8735J3608o58K1492
$$ 549504 524508 552935 533540 524698 546343 578114 600633 558925 597660 611268 610610 632102
5172F32102m247K6966k7233l021k0676q096k6619k2256n701j4640K8891K745Q1849
$$ 632102 627855 654821 627588 624567 603891 595795 569176 546920 541219 526579 555470 558215 640064
5159F40064k4737j6423k3415K0307L383k3150k487K2264J0008J7544J1153Q599
$$ 640064 615327 598904 575489 595796 599179 576029 573542 595806 605814 623358 634511 643110
5147F43110K087k413J6422R739k0578k3366J0220j6952O018L6452j0655N8014
$$ 643110 645197 642784 659206 668945 648367 625001 635221 618269 624287 660739 650084 708098
5135G08098M281n3829L9308J6404J7673k4590M0912J0323k7668r104P931Q7671
$$ 708098 712379 658550 697858 714262 731935 707345 748257 758580 730912 721808 729739 817410
5123H17410P077j5627K0680Q0816K7926q2613J3945Q4134k1820k62l9350p929
$$ 817410 824487 808860 829540 910356 938282 855669 869614 953748 931928 931666 892316 884387
5111H84387L0177k9360j0533O703R693j8201k0925l871P1058J35771J9212q101
$$ 884387 914564 885204 874671 881374 891067 872866 851941 848070 919128 1054899 1074111 1066010
5099A066010N6735K4109m853Q8354R3416O3458Q949j37N172Q4304M7868N6028
$$ 1066010 1122745 1146854 1142001 1230355 1323771 1387229 1396178 1396041 1401213 1485517 1533385 1589413
5087A589413P4343P2441L3663R3923J43262P0434Q6072L4922J14345J13217N1908
$$ 1589413 1663756 1736197 1769860 1863783 2007045 2077479 2163551 2198473 2312818 2426035 2477943
5076B477943J00015M7425J04315Q4948N8729J67837J21840J70998J24249J80599
$$ 2477943 2577958 2625383 2729698 2814646 2873375 3041212 3163052 3334050 3458299 3638898
5066C638898J20014J69884L02671K78611L10947K31572L04416M30905M32617N45837
$$ 3638898 3758912 3928796 4231467 4510078 4821025 5052597 5357013 5787918 6220535 6766372
5056F766372O24932O13893O64342O79235R05354J062801Q96731O50774O65313
$$ 6766372 7391304 8005197 8669539 9348774 10254128 11316929 12213660 12864434 13529747
5047A3529747O53901P09728J075225Q40830j09105q86496j492503j859988j843989
$$ 13529747 14183648 14893376 15968601 16809431 16700326 15813830 14321327 12461339 10617350
5038A0617350j511210j117496q67763q11619o91601n90723n33960l53706l39142
$$ 10617350 9106140 7988644 7120881 6309262 5617661 5026938 4492978 4139272 3800130
5029C800130k98482k54120j74666j52040j79127j68823j19168j45389j55021o5825
$$ 3800130 3501648 3247528 3072862 2920822 2741695 2572872 2453704 2308315 2153294 2087469
5019B087469o6940j13393o7221p4830l7538l1183n5219j6892p5046k7527l787
$$ 2087469 2020529 1907136 1839915 1765085 1727547 1696364 1641145 1624253 1549207 1521680 1517893
5008A517893M5l3380n61n9410o4380j4841k5778o7717J088J8954m8491k0596K5743
$$ 1517893 1517938 1484558 1483997 1424587 1360207 1345366 1319588 1251871 1252959 1271913 1223422 1202826 1228569
4995A228569j2175l5853P0029l0355l5246K0362L4690l4984l356j3757J1496M5856
$$ 1228569 1216394 1180541 1250570 1220215 1184969 1205331 1240021 1205037 1201681 1187924 1199420 1245276
4983A245276m5865K0966j9878o9916j264k7175P5333m8626r966m4931M3095R392
$$ 1245276 1199411 1220377 1200499 1130583 1129319 1102144 1177477 1128851 1118885 1073954 1117049 1126441
4971A126441L2861m0021k0337Q2607j4439K756O9448L2154L245J6968M60N8678
$$ 1126441 1159302 1119281 1098944 1181551 1167112 1169868 1239316 1271470 1274715 1291683 1292143 1350821
4959A350821L4821j6724l0067M0411N3099O3199O0073L5027J27026J37570J61
$$ 1350821 1385642 1368918 1338851 1379262 1432361 1495560 1555633 1590660 1717686 1855256 1855417
4948A855417K3200P31J2700L10L0476J57931Q3247K2720R6076J13148Q7532N2086
$$ 1855417 1878617 1879348 1892048 1892358 1922834 2080765 2164012 2186732 2282808 2395956 2483488 2535574
4936B535574O6215P5642J099J157k0996L3847j5217p4724q4303m3798q9945j23173
$$ 2535574 2601789 2677431 2678530 2679687 2658691 2692538 2677321 2602597 2518294 2474496 2384551 2261378
4924B261378l0437r3950q0532K724p4700j15054j1718k1188k2796k7778k3475
$$ 2261378 2230941 2136991 2056459 2059183 1984483 1869429 1857711 1836523 1813727 1785949 1762474
4913A762474L80k0481o9159p916r993R718m962J0769O2501L0270K7156K0512J00984
$$ 1762474 1762854 1742373 1673214 1665298 1655305 1665023 1660061 1670830 1733331 1763601 1790757 1811269 1912253
4900A912253J67927O8069l387p8516r1532r6207n4990n2354o9278r643k7292m3424
$$ 1912253 2080180 2148249 2144862 2066346 1974814 1878607 1823617 1771263 1701985 1692342 1665050 1621626
4888A621626o203j0736j6870K671O0645j30168k1869p206O3054Q2214P2351M162
$$ 1621626 1615423 1604687 1587817 1590488 1651133 1520965 1499096 1491890 1554944 1637158 1709509 1713671
4876A713671O3819R7549N6767O8895p0233L500J3453J1320k613j06463K3684N3936
$$ 1713671 1777490 1875039 1931806 2000701 1930468 1933968 1947421 1958741 1956128 1849665 1873349 1927285
4864A927285l1634l5413o178p3314o5172K4279K1252p508K1244j049N0567K9379
$$ 1927285 1895651 1860238 1854060 1780746 1715574 1739853 1761105 1753597 1774841 1773792 1824359 1853738
4852A853738k1357P307m3247Q7283J44588J4233O746Q2179Q3127J1356l4136R118
$$ 1853738 1832381 1839688 1796441 1883724 2028312 2042545 2049291 2131470 2214597 2225953 2191817 2200935
4840B200935O6792J00792P363p61M5376n354N6837Q8125K4288L1077J21286J74225
$$ 2200935 2267727 2368519 2375882 2375121 2420497 2415143 2471980 2560105 2584393 2615470 2736756 2910981
4828B910981J92579R259O8201J11222O0584J23300p58N7580P9817J03963O0089
$$ 2910981 3103560 3112819 3181020 3292242 3352826 3476126 3475368 3532948 3612765 3716728 3776817
4817C776817L8724Q162o351J38879J53359P8645R3296J41429J56067J13329K26765
$$ 3776817 3815541 3823703 3817352 3956231 4109590 4188235 4281531 4422960 4579027 4692356 4919121
4806D919121J29353J18968J91420J94125K22442K01591J80468K57203K52014L44730
$$ 4919121 5048474 5167442 5358862 5552987 5775429 5977020 6157488 6414691 6666705 7011435
4796G011435K50203L61882L58662L94867L14363L51775L80648M16278M44520L57444
$$ 7011435 7261638 7623520 7982182 8377049 8691412 9043187 9423835 9840113 10284633 10642077
4786A0642077M68473N24950O20808O38670O25234O49970O92905O99255P48477
$$ 10642077 11110550 11635500 12256308 12894978 13520212 14170182 14863087 15562342 16310819
4777A6310819Q87131P84452Q76028J117547R57897J007427J118031J079932J276205
$$ 16310819 17197950 17982402 18858430 19975977 20933874 21941301 23059332 24139264 25415469
4768B5415469J496533J784754K040189K335577K333100K096555J788043J272754
$$ 25415469 26912002 28696756 30736945 33072522 35405622 37502177 39290220 40562974
4760D0562974R30282Q86273O78198N27350N62770M08061M61963N84043O84273
$$ 40562974 41493256 42379529 43057727 43585077 44147847 44555908 45017871 45601914 46286187
4751D6286187Q28344R44167J041905J172642J350513J437073J544201J496889
$$ 46286187 47114531 48058698 49100603 50273245 51623758 53060831 54605032 56101921
4743E6101921J302992J312425J175325J233906J467372J722154K046932K306237
$$ 56101921 57404913 58717338 59892663 61126569 62593941 64316095 66363027 68669264
4735F8669264K419776K522711K212256J344207L1015j000678j846159k274068
$$ 68669264 71089040 73611751 75824007 77168214 77199229 76198551 74352392 72078324
4727G2078324k399123k381106k172417j867621j717427j624690j668656j762710
$$ 72078324 69679201 67298095 65125678 63258057 61540630 59915940 58247284 56484574
4719E6484574j924081k036254j961457j859637j494784j261516j216614j063858
$$ 56484574 54560493 52524239 50562782 48703145 47208361 45946845 44730231 43666373
4711D3666373r18744p88081n66871m32258l65232l39788l61066m41082n06740
$$ 43666373 42747629 41959548 41392677 40960419 40595187 40255399 39894333 39453251 38946511
4702C8946511p37878j265757j860792k313028k518576k408874k168919j887273
$$ 38946511 38208633 36942876 35082084 32769056 30250480 27841606 25672687 23785414
4694B3785414j490941j246011j198758j064462r63181q39066p89255p56988o64656
$$ 23785414 22294473 21048462 19849704 18785242 17822061 16982995 16193740 15436752 14772096
4685A4772096o27060n80231n06887m95627n26228m24536l71237l89529l80138
$$ 14772096 14145036 13564805 13057918 12562291 12036063 11611527 11240290 10850761 10470623
4676A0470623l10413k89057k13586k90012k95810l04533l85580k44802l51171
$$ 10470623 10160210 9871153 9657567 9367555 9071745 8767212 8381632 8136830 7785659
4667G785659k86340k86571k02918j83247j44094q2602j18540j32058j29888l7524
$$ 7785659 7499319 7212748 7009830 6826583 6682489 6599887 6481347 6349289 6219401 6181877
4657F181877r1316m3800o5946J5934o9468P90M8969k1L5346N1941L9292K3842
$$ 6181877 6090561 6046761 5980815 5996749 5927281 5928071 5977040 5977019 6012365 6064306 6103598 6127440
4645F127440K2813Q1307J6941o9553m681p2838j45652j46143k13293j94151j56197
$$ 6127440 6150253 6231560 6248501 6178948 6174267 6101429 5955777 5809634 5596341 5402190 5245993
4634E245993j82313j25840k34833j63905j46361j35599j76829j23872o2767m5864
$$ 5245993 5063680 4937840 4703007 4539102 4392741 4257142 4080313 3956441 3893674 3847810
4624C847810o5124n0384q0040l7249l2928o2408L1202M0178J0879o1478Q261n3244
$$ 3847810 3782686 3732302 3652262 3615013 3582085 3519677 3550879 3591057 3601936 3540458 3548719 3495475
4612C495475o8606k6234M769n5106J4359p4833j99135j06942k17012j27693n1240
$$ 3495475 3426869 3400635 3405404 3350298 3364657 3289824 3090689 2983747 2766735 2639042 2587802
4601B587802q1176j05495j39646l3623p0205j13132j04731m5242M542n1208m6393
$$ 2587802 2506626 2401131 2261485 2227862 2157657 2044525 1939794 1894552 1899094 1847886 1801493
4590A801493M4043q5530p4314J3742o5830j2211l9930m8012k0086j5834p1149
$$ 1801493 1845536 1760006 1685692 1699434 1633604 1621393 1581463 1533451 1513365 1497531 1426382
4579A426382q6868K9399K3450M0253J0244m1618l5634K0368L131l4434m1732K1317
$$ 1426382 1339514 1368913 1392363 1432616 1442860 1401242 1365608 1385976 1389107 1354673 1312941 1334258
4567A334258k839K8051L4738p6862m6986j7137J5578j1952n3660q078L7941l584
$$ 1334258 1331419 1359470 1394208 1317346 1270360 1253223 1268801 1256849 1203189 1195111 1233052 1229468
4555A229468J6806K357K3191j0747n4962j1619N0737p222m541J6120o465l9075
$$ 1229468 1246274 1248631 1271822 1261075 1206113 1194494 1245231 1238009 1233468 1249588 1243123 1204048
4543A204048R7086O975n4182o9339m4362Q5021l7214P81Q369N2814O612l2624
$$ 1204048 1301134 1308109 1253927 1184588 1140226 1225247 1188033 1188814 1197183 1249997 1256609 1223985
4531A223985n270l327n9362N3224J4767p3379R1874j6937J1380k4479j8289M3705
$$ 1223985 1218715 1215388 1156026 1209250 1224017 1150638 1242512 1225575 1236955 1212476 1194187 1237892
4519A237892l755l1831K3031k9243M1465l5896J7725P306K6470N0836p6826m3272
$$ 1237892 1234137 1202306 1225337 1196094 1237559 1201663 1219388 1226694 1253164 1304000 1227174 1183902
4507A183902K2757k1179j0243J9558j0609M69j3084L279K608J4234j0166J5490
$$ 1183902 1206659 1185480 1175237 1194795 1184186 1184655 1171571 1174850 1177458 1191692 1181526 1197016
4495A197016m922m3426l9088J1557J0539j6237o580L6237J5626P1997J6007j2982
$$ 1197016 1192094 1148668 1109580 1121137 1131676 1115439 1108859 1145096 1160722 1232719 1248726 1235744
4483A235744l6629K2080j7781l43l1347l0700M0693K8753M8933k5879j7294k1689
$$ 1235744 1199115 1221195 1203414 1203071 1171724 1141024 1181717 1210470 1259403 1233524 1216230 1194541
4471A194541l2465K538P5193j2004N8111L2378j1177J4181p0397k8731L6723Q9922
$$ 1194541 1162076 1164614 1239807 1227803 1285914 1318292 1307115 1321296 1250899 1222168 1258891 1348813
4459A348813k4317k7977M3033K7144n82P1p408n594J1762k2196j6744L2286J4707
$$ 1348813 1324496 1296519 1339552 1366696 1366114 1366185 1358777 1353183 1364945 1342749 1326005 1358291 1372998
4446A372998o896L9391J5752R932R9072M3751K7462M1365k4512j05196N146L0274
$$ 1372998 1366102 1405493 1421245 1431177 1530249 1574000 1601462 1642827 1618315 1513119 1518265 1548539
4434A548539K595o4668R84K6387O2331k749R2977L9856J411J4868p607l2027k8959
$$ 1548539 1551134 1486466 1487450 1513837 1576168 1573419 1666396 1706252 1707663 1722531 1714924 1682897 1653938
4421A653938O9983K0278L473j8861k4470m5270N1667L869m1832l2361M972O938
$$ 1653938 1723921 1744199 1747672 1728811 1704341 1659071 1710738 1714607 1672775 1640414 1645386 1652324
4409A652324l0612O2684J7751o3476j9618L4706N043o7037m9401O7845L0216P41
$$ 1652324 1621712 1684396 1702147 1638671 1619053 1653759 1658802 1591765 1542364 1610209 1640425 1641166
4397A641166J2440j4890J5134J2763Q716J2844J7368P2958J588J1081N76o9563
$$ 1641166 1653606 1638716 1653850 1666613 1675329 1688173 1705541 1778499 1780087 1791168 1791744 1722181
4385A722181j9482o4863K3235N6436m8162k3170k4207M7674J6996l7283J20006
$$ 1722181 1702699 1637836 1661071 1717507 1669345 1646175 1621968 1669642 1686638 1649355 1769361
4374A769361k7263j27514J3145K1604R1963K1967r2402l4693J578P8215J3018
$$ 1769361 1742098 1614584 1627729 1649333 1741296 1763263 1670861 1636168 1637746 1715961 1728979
4363A728979O6421l8277M1123N1614j28l0921N2554M0015J23266j0060q5066m3262
$$ 1728979 1795400 1757123 1798246 1849860 1849732 1818811 1871365 1911380 2034646 2024586 1939520 1896258
4351A896258K0513j9576m6542J06755J0991J0595N2836k3835O2430J7155J4588
$$ 1896258 1916771 1897195 1850653 1957408 1968399 1978994 2031830 2007995 2070425 2087580 2102168
4340B102168M3627j0449n1195Q538L7164M7417N9938j3743k7635O7137J12396
$$ 2102168 2145795 2135346 2084151 2092689 2129853 2177270 2237208 2223465 2195830 2262967 2375363
4329B375363q334k0044l3666N9772j2519O035O6711j8247J2091P2673n156M1602
$$ 2375363 2367029 2346985 2313319 2373091 2360572 2366607 2433318 2415071 2427162 2499835 2494679 2536281
4317B536281K3831N6476P4427P2155l3492P1637L5595N0022J21240Q1136M8250
$$ 2536281 2560112 2616588 2691015 2763170 2729678 2801315 2836910 2886932 3008172 3089308 3137558
4306C137558O0856Q2520Q5983O7750K8311R1119R3691J01743J45371Q7517n392
$$ 3137558 3198414 3280934 3366917 3434667 3462978 3554097 3647788 3749531 3894902 3982419 3977027
4295C977027J66170J72931K18402J72711J32248J68971K40510K14936K15974K97263
$$ 3977027 4143197 4316128 4534530 4707241 4839489 5008460 5248970 5463906 5679880 5977143
4285E977143K78316K60660K22754K51702K79436K90216L31900M16828L67718L52837
$$ 5977143 6255459 6516119 6738873 6990575 7270011 7560227 7892127 8308955 8676673 9029510
4275I029510M60813M50944M11050N67321O05453N95740O08074N49341M28647M15311
$$ 9029510 9490323 9941267 10352317 10919638 11525091 12120831 12728905 13278246 13706893 14122204
4265A4122204M28464L51363L78672M57219N31778N66572P77457Q78430R68024
$$ 14122204 14550668 14902031 15280703 15737922 16269700 16836272 17613729 18492159 19460183
4256A9460183R90738R54897Q25315O26940N12013K68159K11448N1993J07897J44850
$$ 19460183 20450921 21405818 22231133 22858073 23370086 23638245 23849693 23901686 24009583 24154433
4246B4154433K51961M55064O31232P26637P89618R06905P48379N13096K56856
$$ 24154433 24406394 24861458 25492690 26219327 27008945 27915850 28664229 29177325 29434181
4237B9434181L9488k21799m08303n56796n42786n54701l53279k01119p0904L5052
$$ 29434181 29473669 29251870 28843567 28286771 27743985 27189284 26836005 26634886 26563982 26599034
4227B6599034Q8535J39802k49l3209k59098l80129o84967q31923q64200r61603
$$ 26599034 26687569 26827371 26827122 26793913 26534815 26154686 25469719 24637796 23773596 22811993
4217B2811993r27513r27125p03848n68212n41253m72272l25086k77932l27861
$$ 22811993 21884480 20957355 20253507 19685295 19144042 18671770 18346684 18068752 17740891
4208A7740891m21569m52763o09271o84431p35727p69425q16282q28568o29576
$$ 17740891 17319322 16866559 16257288 15572857 14837130 14067705 13251423 12422855 11793279
4199A1793279n35375m78218m66121l68449k92022k67892l40137k89504l22831
$$ 11793279 11257904 10779686 10313565 9945116 9653094 9385202 9045065 8755561 8432730
4190H432730l08056m55187l72038l77786l63973l43587k52780k02034k40197j60098
$$ 8432730 8124674 7669487 7297449 6919663 6555690 6212103 5959323 5757289 5517092 5356994
4180E356994j37832j14556j08539q6395o7022j06354j12200p3628q8338j41864
$$ 5356994 5219162 5104606 4996067 4909672 4842650 4736296 4624096 4550468 4462130 4320266
4170D320266j72718j04466r9782o1741k2495n0658j32753k1506n6488L7650k0425
$$ 4320266 4147548 4043082 3943300 3881559 3859064 3808406 3675653 3654147 3597659 3635309 3614884
4159C614884q7065n5506k3880J4170r3431p9513Q178p345K984o087j8788q1269
$$ 3614884 3527819 3472313 3448433 3462603 3369172 3289659 3297837 3290492 3293476 3287389 3268601 3187332
4147C187332J009m8436j4389J9762K1887l3035k9534J2346n0472J0816m275P1520
$$ 3187332 3188341 3139905 3125516 3145278 3167165 3134130 3104596 3116942 3066470 3077286 3073011 3144531
4135C144531R621m2726Q1657m3664k8931j3072j7350N7770m5228k2286l1534m4159
$$ 3144531 3154152 3111426 3193083 3149419 3120488 3107416 3090066 3147836 3102608 3080322 3048788 3004629
4123C004629R7901Q0593j5869r1658J2745J02316n1938j26384O0828R3987m638
$$ 3004629 3102530 3183123 3167254 3075596 3088341 3190657 3138719 3012335 3073163 3167150 3162512
4112C162512L8943P3515j1025q819J12884J00410L4627L4217K5881M3173K1203
$$ 3162512 3201455 3274970 3263945 3255126 3368010 3468420 3503047 3537264 3563145 3606318 3627521
4101C627521j1802Q1364L8844n3869K8848J36667L6171K1652M3849P5031R4299
$$ 3627521 3615719 3697083 3735927 3682058 3710906 3847573 3883744 3905396 3949245 4024276 4118575
4090D118575Q1016P1251J47030N4697R5539J68685O9475J05885N7492J00455J00201
$$ 4118575 4199591 4270842 4417872 4472569 4568108 4736793 4806268 4912153 4969645 5070100 5170301
4079E170301P3216P5078M7244O0846J32210K02202J04957J53456J31620O7102
$$ 5170301 5243517 5318595 5365839 5426685 5558895 5761097 5866054 6019510 6151130 6218232
4069F218232J20502P2012N6528L1631O7532R9702N9855J24787J09801J55980J09791
$$ 6218232 6338734 6410746 6467274 6498905 6566437 6666139 6725994 6850781 6960582 7116562 7226353
4058G226353J69577J61534R2586J22010P3350m0909j64717r8640K0578j3896K7452
$$ 7226353 7395930 7557464 7650050 7772060 7845410 7804501 7639784 7541144 7561722 7547826 7575278
4047G575278J09515M1711Q8364R6255J13262M0481K7280k9428l524N7631K6936
$$ 7575278 7684793 7726504 7814868 7911123 8024385 8064866 8092146 8062718 8059194 8116825 8143761
4036H143761Q3090R2403J05594J06135M0401P2107J60843R7525R4419J12749K8184
$$ 8143761 8226851 8319254 8424848 8530983 8571384 8643491 8804334 8901859 8996278 9109027 9137211
4025I137211Q1454J04075J41685J40650J92436J11352K3952J28182Q8464K51518
$$ 9137211 9218665 9322740 9464425 9605075 9797511 9908863 9932815 10060997 10149461 10400979
4015A0400979K00880J73943J50074J55777L07569K81762K80675L23249M60119
$$ 10400979 10601859 10775802 10925876 11081653 11389222 11670984 11951659 12274908 12735027
4006A2735027M36061L64727K18448Q7567N609L3119J0600K9101J25737J69495
$$ 12735027 13171088 13535815 13754263 13841830 13847439 13880558 13891158 13920259 14045996 14215491
3996A4215491K10885L07782M09869L02391J70510P7278R8975L0900o7958m5995
$$ 14215491 14426376 14734158 15144027 15446418 15616928 15694206 15793181 15824081 15756123 15710128
3986A5710128j623k9402o7163k2739J07176P3884K32816K07710J66150J95960
$$ 15710128 15708505 15679103 15611940 15589201 15696377 15770261 16003077 16210787 16376937 16572897
3976A6572897L6465l6152r5948j04081o2535j05704K6120J13145P1563J22277
$$ 16572897 16609362 16573210 16477262 16373181 16310646 16204942 16231062 16344207 16415770 16538047
3966A6538047J19008J74153J77706R6852J11893M8391r265R033o3576j6279N8812
$$ 16538047 16657055 16831208 17008914 17105766 17217659 17266050 17256785 17265818 17202242 17185963 17244775
3955A7244775J44358J59398O8791N8049l768l191R7565J67060J44721K81200M58722
$$ 17244775 17389133 17548531 17617322 17675371 17671603 17668412 17765977 17933037 18077758 18358958 18817680
3944A8817680M19526N54516O62352O88044P52861R12347Q31148O41225N84483
$$ 18817680 19237206 19791722 20454074 21142118 21894979 22807326 23638474 24279699 24864182
3935B4864182N97481N05479M60770M38178M81698M60300N85991O80619O61642
$$ 24864182 25461663 25967142 26427912 26866090 27347788 27808088 28394079 29074698 29736340
3926B9736340P41545P62247P97291Q23237P47035O98633P80480Q40537J096967
$$ 29736340 30477885 31240132 32037423 32860660 33607695 34306328 35086808 35927345 37024312
3917C7024312J311803J461768J554096J729721J852737J936024J965208K019082
$$ 37024312 38336115 39797883 41351979 43081700 44934437 46870461 48835669 50854751
3909E0854751K051141K126001K329103K425254K224557J741966J272859R32324
$$ 50854751 52905892 55031893 57360996 59786250 62010807 63752773 65025632 65957956
3901F5957956P40047P23015P93808Q21399R48075J127643J548346J845985J874290
$$ 65957956 66698003 67421018 68214826 69036225 69984300 71111943 72660289 74506274 76380564
3892G6380564J883279J520649J178107P46959L38215R4477O186K0215J37148L78007
$$ 76380564 78263843 79784492 80962599 81709558 82047773 82142250 82148436 82168651 82305799 82683806
3882H2683806O78433R22775J349286J829483K311983K665943K787288K538469
$$ 82683806 83362239 84285014 85634300 87463783 89775766 92441709 95228997 97767466
3874I7767466J182824n83683k211617l375305l869294l584800l065268k446693
$$ 97767466 98950290 98366607 96154990 92779685 88910391 85325591 82260323 79813630
3866G9813630k006767j604407j303065j013376p40175n08316m68566o05770r71359
$$ 79813630 77806863 76202456 74899391 73886015 73145840 72637524 72168958 71563188 70591829
3857G0591829j559514k101861k493308k657221k431320k061170j541621j236849
$$ 70591829 69032315 66930454 64437146 61779925 59348605 57287435 55745814 54508965
3849E4508965r51437n61766m38815k64799k87361l27687q09251j383000j730515
$$ 54508965 53557528 52995762 52556947 52292148 52004787 51677100 50867849 49484849 47754334
3840D7754334j937933k003786j649987j563770j371561j247561j230968j207907
$$ 47754334 45816401 43812615 42162628 40598858 39227297 37979736 36748768 35540861
3832C5540861j183757j076436j193970j027333p69743o49204n63506l91112l24380
$$ 35540861 34357104 33280668 32086698 31059365 30289622 29640418 29076912 28685800 28361420
3823B8361420k24064l9535K2081N8562J41758K01014R7987P9087O3358L1667k6135
$$ 28361420 28137356 28097821 28119902 28178464 28320222 28521236 28619223 28698310 28761668 28793335 28767200
3812B8767200j73879l22247m75998n79992p63434o88195o48248o02547m54238
$$ 28767200 28593321 28271074 27795076 27215084 26451650 25763455 25115207 24512660 24058422
3803B4058422m30838l56027j45272q997Q0300K05113L12969K81488J48919K8466
$$ 24058422 23627584 23271557 23126285 23117288 23197588 23402701 23715670 23997158 24146077 24174543
3793B4174543N5820j44046j8613j4397J35270J78629J13519J53567J21786P3304
$$ 24174543 24230363 24086317 24067704 24053307 24188577 24367206 24480725 24634292 24756078 24829382
3783B4829382j37108j68145j91847k29186j94546j39213k47565j98930k77857
$$ 24829382 24692274 24524129 24332282 24103096 23908550 23769337 23521772 23322842 23044985
3774B3044985j88807n7225j8333J45839K27570K01994K55500K62285K24977M1740
$$ 23044985 22856178 22798953 22780620 22926459 23154029 23356023 23611523 23873808 24098785 24140525
3764B4140525l6992l014Q1270J22784K08476M02078N20135N21132O01078O79662
$$ 24140525 24103533 24100519 24181789 24304573 24513049 24915127 25435262 25956394 26557472 27237134
3754B7237134O62943O06657O65472O38040O88441Q00875Q10915Q52299R00417
$$ 27237134 27900077 28506734 29172206 29810246 30498687 31299562 32110477 32962776 33863193
3745C3863193R68914J194792J318871J424097J547884J755845K071683K354148
$$ 33863193 34832107 36026899 37345770 38769867 40317751 42073596 44145279 46499427
3737D6499427K628450K902470L102410L168337L086765K854736K541566K004629
$$ 46499427 49127877 52030347 55132757 58301094 61387859 64242595 66784161 68788790
3729F8788790J500784Q85830K26785j84804n66046p88199q87623q16128o67481
$$ 68788790 70289574 71175404 71402189 71217385 70651339 69863140 68975517 68159389 67491908
3720F7491908m06160l66788l72683m54942p45071j141560j582609k172466k635037
$$ 67491908 67085748 66718960 66346277 65891335 65146264 64004704 62422095 60249629 57614592
3711E7614592k925967l285243l447749l410988l329844l117739k887277k636273
$$ 57614592 54688625 51403382 47955633 44544645 41214801 38097062 35209785 32573512
3703C2573512k311173k062838j816605j587585j375793j204549r29953r57805
$$ 32573512 30262339 28199501 26382896 24795311 23419518 22214969 21285016 20327211
3695B0327211q47923p27850n66899n21180n05062m85453m34506l88564k24420
$$ 20327211 19479288 18751438 18184539 17663359 17158297 16672844 16238338 15849774 15625354
3686A5625354k77759j68902k01132k33114j47459k75887k45086j68323j45288
$$ 15625354 15347595 15178693 14977561 14744447 14596988 14321101 14076015 13907692 13762404
3677A3762404j01232j50971j64334j67897j73976r3851j75331j35351j12754j16287
$$ 13762404 13661172 13510201 13345867 13177970 13003994 12910143 12734812 12599461 12486707 12370420
3667A2370420j24820j01872m6287J615o371o3364m2724r606M0519M7802o3279
$$ 12370420 12245600 12143728 12097441 12099056 12092685 12029321 11986597 11976991 12017510 12065312 12002033
3656A2002033q735J6324n436m5285O0896O4853K0033J50316R9884R7376J86149
$$ 12002033 11993298 12009622 12004186 11958901 12019797 12084650 12104683 12254999 12354883 12452259 12638408
3645A2638408R6708K06023J91142J19800K57571J78952J73717L13811L89604L41074
$$ 12638408 12735116 12941139 13132281 13252081 13509652 13688604 13862321 14176132 14565736 14906810
3635A4906810K80404L42487K40357K29096K86281J97042J52495J35636O8693O6167
$$ 14906810 15187214 15529701 15770058 15999154 16285435 16482477 16634972 16770608 16839301 16905468
3625A6905468N6139P8392K63459J07295J23037K15900K16078K32677J43097K20728
$$ 16905468 16961607 17039999 17303458 17410753 17533790 17749690 17965768 18198445 18341542 18562270
3615A8562270K70280J97237J97870K69845K35708K16446L59875M22556L96767
$$ 18562270 18832550 19029787 19227657 19497502 19733210 19949656 20309531 20732087 21128854
3606B1128854M46518N35352O04731O32092P72854R65307J127497J336095J426918
$$ 21128854 21575372 22110724 22715455 23347547 24120401 25085708 26213205 27549300 28976218
3597B8976218J421421J466222J525383J319179J183763J021688Q37549O67941
$$ 28976218 30397639 31863861 33389244 34708423 35892186 36913874 37751423 38419364
3589C8419364M70027K84695K74234K92857J68063J88961K68260J76045J84345
$$ 38419364 38889391 39174086 39448320 39741177 39909240 40098201 40366461 40542506 40726851
3580D0726851M4551j84019l69214l47276o47690q16600q72891j023314j025849
$$ 40726851 40771402 40587383 40218169 39870893 39223203 38406603 37533712 36510398 35484549
3571C5484549j052825r37812q33436o97728n36909l63744j74884N716R3117J53633
$$ 35484549 34431724 33493912 32660476 31962748 31425839 31062095 30887211 30892927 30986044 31139677
3561C1139677K39469M57292M80250O01825P52173Q29054Q45569J074054J162692
$$ 31139677 31379146 31836438 32316688 32918513 33670686 34499740 35345309 36419363 37582055
3552C7582055J380679J419718J577137J779232J978921K096347K337774K516721
$$ 37582055 38962734 40382452 41959589 43738821 45717742 47814089 50151863 52668584
3544E2668584K872716L089557L361007L731632M183087M557591M988171N224984
$$ 52668584 55541300 58630857 61991864 65723496 69906583 74464174 79452345 84677329
3536H4677329N322365N366591N233570N069077M919433M669591M480085M148504
$$ 84677329 89999694 95366285 100599855 105668932 110588365 115257956 119738041 123886545
3528A23886545L630475L045329K379704J867182J224415O25495P219m60426p30116
$$ 123886545 127517020 130562349 132942053 134809235 136033650 136659145 136666364 136205938 135475822
3519A35475822r85745j256171j448408j687907j891638j986544k113291k132111
$$ 135475822 134490077 133233906 131785498 130097591 128205953 126219409 124106118 121974007
3511A21974007j923223j826642j516455j156633p43661l61863K68134R00803J760156
$$ 121974007 120050784 118224142 116707687 115551054 114807393 114445530 114713664 115614467 117374623
3502A17374623K545937L557532M714238N958247P522110Q753485Q797865Q936795
$$ 117374623 119920560 123478092 128192330 134150577 141672687 150426172 159224037 168160832
3494A68160832J0023189J0109815R920057Q998509M538247j044758m702981o561173
$$ 168160832 178184021 188293836 198213893 207212402 211750649 210705891 206002910 199441737
3486A99441737o571733m533837k121259p5241R12907J378386J739931J882218
$$ 199441737 192870004 188336167 186214908 186139667 187052574 188430960 190170891 192053109
3478A92053109K061782K157402K075946K210835K696099L317749M466126N748146
$$ 192053109 194114891 196272293 198348239 200559074 203255173 206572922 211039048 216787194
3470B16787194P129240Q488270Q795738Q278900Q406420Q196808O517497M673906
$$ 216787194 223916434 232404704 241200442 249479342 257885762 266082570 272600067 277273973
3462B77273973M8522p382696j3422316j7255087j8965396j8292630j6173218j3841647
$$ 277273973 277322495 269939799 256517483 239262396 220297000 202004370 185831152 171989505
3454A71989505j1893850j0475066r082869p749673o598805n650152n014621m467799
$$ 171989505 160095655 149620589 140537720 132788047 126189242 120539090 115524469 111056670
3446A11056670m213439m106505l957393l880101l854833l749904l645145l564220
$$ 111056670 106843231 102736726 98779333 94899232 91044399 87294495 83649350 80085130
3438H0085130l415661l268515k953638k819730k642348k363789k044566j835246
$$ 80085130 76669469 73400954 70447316 67627586 64985238 62621449 60576883 58741637
3430E8741637j660960j406028j123534j022233o99789o74797m90394l41831j74756
$$ 58741637 57080677 55674649 54551115 53528882 52829093 52154296 51663902 51322071 51147315
3421E1147315J22826J94161M95544O40254P74424R48462J140329J236027J197117
$$ 51147315 51270141 51464302 51959846 52600100 53374524 54322986 55463315 56699342 57896459
3412E7896459J325249J379662J472287J548532J535890J740203J505847N31121
$$ 57896459 59221708 60601370 62073657 63622189 65158079 66898282 68404129 68935250
3404F8935250m43331j123794j581082j803131j714668j442574j197139j073478
$$ 68935250 68491919 67368125 65787043 63983912 62269244 60826670 59629531 58556053
3396E8556053q92990p62630o44699m38935l31821l41368m26012n88460o14949
$$ 58556053 57663063 56900433 56255734 55816799 55484978 55143610 54717598 54129138 53514189
3387E3514189o66207p23358q38045q12820p89183m99862k72198J00459O01632
$$ 53514189 52847982 52124624 51286579 50473759 49684576 49184714 48912516 49012975 49614607
3378D9614607M18519r6236m97315o96696q11979o89235k68264J23782L53277O08209
$$ 49614607 50033126 49936890 49439575 48742879 47930900 47241665 46973401 47097183 47450460 48058669
3368D8058669R79761J364418J590010J797971K176733K174663K452202L056262
$$ 48058669 49038430 50402848 51992858 53790829 55967562 58142225 60594427 63650689
3360F3650689L551142M310355N514883O798962P958528Q995652R033604R166760
$$ 63650689 67201831 71512186 77027069 83826031 91784559 100780211 109813815 118980575
3352A18980575P204478J723754l743288p174143r329918r512934p899354n814225
$$ 118980575 126185053 127908807 124165519 116991376 107661458 98148524 90249170 84434945
3344H4434945m180112l418681k663559j731507j059395m01184N5521N70640Q44517
$$ 84434945 80254833 76836152 74172593 72441086 71381691 70980507 71036028 71606668 72451185
3335G2451185Q79526J422035K035512K756408L671484N062912O331526P580817
$$ 72451185 73330711 74752746 76788258 79544666 83216150 88279062 94610588 102191405
3327A02191405Q489490Q506850Q493247N718933j00755m771003p522849r026308
$$ 102191405 110680895 119187745 127680992 133399925 133299170 128528167 121005318 111979010
3319A11979010q347064o273415m161175k631679j874646j157653m02715J18687
$$ 111979010 103631946 97358531 93197356 90565677 88691031 87533378 87130663 87249350
3311H7249350O25515R28995R46273R07457O77382L01613P696k16553m37534o71672
$$ 87249350 87874865 88803860 89750133 90657590 91334972 91636585 91644281 91427728 90990194 90318522
3301I0318522q85836j296342j672928j985823k303507k489874k563573k737466
$$ 90318522 89432686 88136344 86463416 84477593 82174086 79684212 77120639 74383173
3293G4383173k749815k700010k801996k889557k904944k830577k873251k752317
$$ 74383173 71633358 68933348 66131352 63241795 60336851 57506274 54633023 51880706
3285E1880706k733956k675609k757502k742155k527540k433198k384361k241468
$$ 51880706 49146750 46471141 43713639 40971484 38443944 36010746 33626385 31384917
3277C1384917k055485j898436j752710j578853j496447j322184j068780r52636
$$ 31384917 29329432 27430996 25678286 24099433 22602986 21280802 20212022 19259386
3269A9259386q74418q32704o92128n88264m97377m74335l80448l38713l42281
$$ 19259386 18384968 17552264 16860136 16271872 15774495 15300160 14919712 14580999 14238718
3260A4238718k68641k77740k05904j92654j60450j29672j17424j55369m6285j6483
$$ 14238718 13970077 13692337 13486433 13293779 13133329 13003657 12886233 12730864 12684579 12668096
3250A2668096p2887m462j4550l4922J0501o9426j15724q3199j33094j91178j73925
$$ 12668096 12595209 12590747 12576197 12541275 12551776 12482350 12366626 12283427 12150333 11959155 11785230
3239A1785230j96901k17748j37407j70506j95929k57203k00145j30797j58038
$$ 11785230 11588329 11370581 11233174 11062668 10866739 10609536 10409391 10278594 10120556
3230A0120556j99888k08651k10482k10420k43088j39722k27365k55958j21727
$$ 10120556 9920668 9712017 9501535 9291115 9048027 8908305 8680940 8424982 8303255
3221H303255k25660j86293j88668j38579p8169p2490q4662m1716n2652k7930K5943
$$ 8303255 8077595 7891302 7702634 7564055 7485886 7413396 7328734 7287018 7234366 7206436 7232379
3210G232379q7051l0506j7766j4504j4250J4975J7820N1397O1819j4567k4013
$$ 7232379 7145328 7114822 7097056 7082552 7068302 7083277 7101097 7152494 7214313 7199746 7175733
3199G175733P98K4769j26534q4762L5978m4562j0636j3915J1336k2562O084k7255
$$ 7175733 7176531 7201300 7074766 6990004 7025982 6981420 6970784 6956869 6968205 6945643 6951727 6924472
3187F924472L3522J4793k9790m0077J6193L3948P6570J46704m682P075Q0512J6243
$$ 6924472 6957994 6972787 6942997 6902920 6919113 6953061 7029631 7176335 7171653 7178728 7259240 7275483
3175G275483j0383N5194l2079K8911R245o1607j61610m3384o8170p4230l35l9
$$ 7275483 7265100 7320294 7288215 7317126 7326371 7264764 7103154 7059770 6991600 6917370 6917035 6916996
3163F916996N4649O406K0832R005m3828M5925O8254R4715R8199M2967J03113R7064
$$ 6916996 6971645 6978051 6998883 7007888 6964060 7009985 7078239 7172954 7271153 7314120 7417233 7514297
3151G514297R9682J49930J48149J69951J45906J86387J65326J68586L8117J30130
$$ 7514297 7613979 7763909 7912058 8082009 8227915 8414302 8579628 8748214 8786331 8916461
3141H916461K32309J77078J73239K60375K70653K46574K65773K61162L33182K56769
$$ 8916461 9148770 9325848 9499087 9759462 10030115 10276689 10542462 10803624 11136806 11393575
3131A1393575K50851K63803L19656L45210L03275L45979M30812L89677M22487
$$ 11393575 11644426 11908229 12227885 12573095 12876370 13222349 13653161 14042838 14465325
3122A4465325N49503O06076N33467N82616O02392O41147P90902P86173R08648
$$ 14465325 15014828 15620904 16154371 16736987 17339379 17980526 18771428 19557601 20466249
3113B0466249R66811J006578J116907J232984J259812J305243J410994J448328
$$ 20466249 21433060 22439638 23556545 24789529 26049341 27354584 28765578 30213906
3105C0213906J628515J763445J883627J900058J938169J985722K043493K017793
$$ 30213906 31842421 33605866 35489493 37389551 39327720 41313442 43356935 45374728
3097D5374728J858909J614516J659276J895698K052451K311889K403251K344659
$$ 45374728 47233637 48848153 50507429 52403127 54455578 56767467 59170718 61515377
3089F1515377K365594K656851L081084L555061L992384M344227M891901N506152
$$ 61515377 63880971 66537822 69618906 73173967 77166351 81510578 86402479 91908631
3081I1908631O077823O728399P578438Q404426Q965622R453563J0272666J1391519
$$ 91908631 97986454 104714853 112293291 120697717 129663339 139116902 149389568 160781087
3073A60781087J2905584J5236874J8405817K2228171K6635300L0596272L3366572
$$ 160781087 173686671 188923545 207329362 229557533 256192833 286789105 320155677
3066C20155677L3010576K5573340J2260192j189062j1145061j6171729j6473606
$$ 320155677 353166253 378739593 390999785 389810723 378665662 362493933 346020327
3059C46020327j5833671j7858806k1954533k6244035k8722226k8379324k5538504
$$ 346020327 330186656 312327850 290373317 264129282 235407056 207027732 181489228
3052A81489228k1648685j8077403j5477190j3418114j1595320r856871q466174
$$ 181489228 159840543 141763140 126285950 112867836 101272516 91415645 82949471
3045H2949471p304409o336087n446122m858408m276189l739028l344682k922772
$$ 82949471 75645062 69308975 63862853 59004445 54728256 50989228 47644546 44721774
3037D4721774k591125k332276k187993j989509j879984j763739j570629j472638
$$ 44721774 42130649 39798373 37610380 35620871 33740887 31977148 30406519 28933881
3029B8933881j386114j222143j232064j038772r44770r32851q90849p61418p45938
$$ 28933881 27547767 26325624 25093560 24054788 23110018 22177167 21286318 20524900 19778962
3020A9778962p43617o24493o35714o21576o04553n59724n30959m96755m46858
$$ 19778962 19035345 18410852 17775138 17153562 16549009 15989285 15458326 14961571 14514713
3011A4514713n14403n09239m29401l43474l72712m18735k97714k72559k96993
$$ 14514713 14000310 13491071 13061670 12718196 12345484 11926749 11629035 11356476 11059483
3002A1059483l07116l16212k37122k19428k70279l93416k47879k57827k40083
$$ 11059483 10752367 10436155 10199033 9979605 9709326 9315910 9068031 8810204 8570121
2993H570121k41496j90104k65033j67489j90126k13086j68538j28626j23890p3937
$$ 8570121 8328625 8138521 7873488 7705999 7515873 7302787 7134249 7005623 6881733 6807796
2983F807796m9770j36036j28327n5418j69787k8014j03938j82126m2469r0954
$$ 6807796 6758026 6621990 6493663 6438245 6268458 6240444 6136506 5954380 5911911 5820957
2973E820957n4000l5380j26652k416j34277j30136q2434j32799j7822j37004p8047
$$ 5820957 5766957 5731577 5604925 5602509 5468232 5338096 5255662 5122863 5105041 4968037 4889990
2962D889990j24062m3938r5244j16305o5665p5671j48435q2529j13085l0133n365
$$ 4889990 4765928 4721990 4626746 4510441 4444776 4369105 4220670 4138141 4025056 3994923 3989558
2951C989558k5831q4842m3593k4107j02680p6954q5641o5993k6557n3886p4871
$$ 3989558 3963727 3878885 3835292 3811185 3708505 3631551 3545910 3479917 3453360 3399474 3324603
2940C324603m4449p1842m1134j5959m0092k2976j12440l9705l9568r5442J0081
$$ 3324603 3280154 3208312 3167178 3151219 3111127 3088151 2975711 2936006 2896438 2800996 2811077
2929B811077k074l5898K695o5107o3626q52n4846o6757k6658K5309N1194j5216
$$ 2811077 2809003 2773105 2775800 2710693 2647067 2646215 2591369 2524612 2497954 2523263 2574457 2559241
2917B559241q5320n7872J1948k3201l7526M565m6662j68270q9086j1170M1116
$$ 2559241 2473921 2416049 2427997 2404796 2367270 2371835 2325173 2156903 2067817 2056647 2097763
2906B097763k2647l1486o5157m2367M633n8430n1510j6278J80l6914p0755o7232
$$ 2097763 2075116 2043630 1978473 1936106 1940739 1882309 1830799 1814521 1814701 1777787 1707032 1639800
2894A639800j888J0630P850J3117p231r244m5621L0580k635j9756m6294n7044
$$ 1639800 1637912 1648542 1656392 1669509 1662278 1653034 1607413 1637993 1635358 1615602 1569308 1512264
2882A512264n9725n5409K3972P772n7154o5734j1171j002M1534k5828r663n5089
$$ 1512264 1452539 1397130 1421102 1428874 1371720 1305986 1294815 1293813 1335347 1309519 1299856 1244767
2870A244767j1505P846N6176K9013J0787L6738l8292J4353K7614J1429M6124L127
$$ 1244767 1233262 1241108 1297284 1326297 1337084 1373822 1335530 1349883 1377497 1388926 1435050 1438177
2858A438177J3991q036k6440O4531K4206j0472m4215L1952M4645L5711j61k5207
$$ 1438177 1452168 1444132 1417692 1482223 1506429 1495957 1451742 1483694 1528339 1564050 1563889 1538682
2846A538682L6916m2019o5914K4991K7178J659M18o605J3636j8286K0817r3231
$$ 1538682 1575598 1533579 1467665 1492656 1519834 1521493 1521911 1515306 1528942 1510656 1531473 1438242
2834A438242m1327O0762K1258J18295N443M6082l827M80k2082l0574m8794k3474
$$ 1438242 1396915 1457677 1478935 1597230 1602673 1648755 1644928 1645408 1623326 1592752 1543958 1520484
2822A520484M8171m6618q6964r3545K5364N2401L8039n167N8822O775l4240n3031
$$ 1520484 1568655 1522037 1435073 1341528 1366892 1419293 1457332 1452165 1510987 1517762 1483522 1430491
2810A430491J1625O9437J7820n0837K4174K4781m2162K9383M5915k6068Q783J6187
$$ 1430491 1442116 1511553 1529373 1478536 1502710 1527491 1485329 1514712 1560627 1534559 1543342 1559529
2798A559529N7731O1789O4696k2751N9606J8746K5569N1731N982J42004J55686
$$ 1559529 1617260 1679049 1743745 1720994 1780600 1799346 1824915 1876646 1882628 2024632 2180318
2787B180318Q6658P9031J50757J57276K19640J86271M7596K434m4404j18260K3024
$$ 2180318 2266976 2346007 2496764 2654040 2873680 3059951 3107547 3109981 3065577 2947317 2970341
2776B970341o6788j74793j29724j49652q1171p1868j72455j55891j00361j69723
$$ 2970341 2903553 2728760 2599036 2449384 2368213 2296345 2123890 1967999 1867638 1697915
2766A697915r7326p9502q5751j9246k4068K3588m4181n5863o3338K3497p0570
$$ 1697915 1600589 1521087 1435336 1416090 1392022 1415610 1371429 1315566 1252228 1275725 1205155
2755A205155o3168k866N658L3869m9414J426q7842j2301o630j7278r674m1251
$$ 1205155 1141987 1139121 1144779 1178648 1129234 1130660 1042818 1030517 1023887 1006609 996935 955684
2743I55684M0195Q804l4082n1560m1183M5327j4579J5515M1362K1957l2453o8312
$$ 955684 995879 1004683 970601 919041 877858 923185 908606 924121 965483 987440 954987 886675
2731H86675n5821j4729J0257r037r943N8194Q9126j9137j08897n4996K5033n1512
$$ 886675 830854 816125 826382 817345 807402 865596 954722 935585 826688 771692 796725 745213
2719G45213K3803k2217l8803R82J6164J3927K6209P250L1109p4038n813K9807
$$ 745213 769016 746799 707996 708978 725142 739069 765278 772528 803637 729599 723786 753593
2707G53593n061l5061r2095m7747K1335J1705k2561L34L3044L3857k6106N5503
$$ 753593 748532 713471 621376 573629 594964 606669 584108 584442 617486 651343 625237 680740
2695F80740k0783P34M6136O3463m6168o9007m3287q556K9818j55957O664L7654
$$ 680740 659957 660691 706827 770290 724122 655115 611828 603272 633090 477133 483797 521451
2683E21451n1718R7399j3865j7769Q639L6381l9300L4485P9310p9992M7838N4171
$$ 521451 469733 567132 553267 535498 544137 580518 541218 575703 655013 575021 622859 677030
2671F77030K2250m4984J9517m060o2732N654j2801l573j3987K414k3081K7639
$$ 677030 699280 654296 673813 669753 607021 612675 599874 596301 582314 584728 561647 589286
2659E89286P4651R661k4568O005J4312J1776k7190m6309O3094l0635q0610N0129
$$ 589286 663937 673598 649030 655035 669347 681123 653933 607624 670718 640083 559473 609602
2647F09602o980j03250N0743r755m0253o4226M2531N56L0381j3100N741N0048
$$ 609602 602622 499372 550115 540360 500107 435881 478412 478968 509349 496249 501990 552038
2635E52038o0509J7345j1244l5066l1066M5913P4337q4723l1127K847M2081k7304
$$ 552038 491529 508874 497630 462564 431498 477411 551748 467025 435898 438745 480826 453522
2623D53522j2630L2726o0727l0188K613o273p3659m5044k8997L4885P9933P2916
$$ 453522 440892 473618 412891 382703 385316 379043 305384 260340 231343 266228 346161 419077
2611D19077m1337j5694j9184n864r005J39984p0111j8548O4198l1960k6986J3306
$$ 419077 377740 362046 342862 336998 327993 467977 397866 379318 443516 411556 384570 397876
2599C97876N1280N321k2737J2987K910l8232l8438N8396L1982l6765J2333m1750
$$ 397876 449156 454477 431740 444727 447637 409405 370967 429363 461345 424580 436913 395163
2587C95163K9585k4904J1710j8354N5314J2308j583P736m5539M2925l7873j7608
$$ 395163 424748 399844 411554 393200 448514 460822 459239 466975 421436 464361 426488 408880
2575D08880J5097J8492k4741j320K691M1845M5674J9568K5619k2714j1528M0708
$$ 408880 423977 442469 417728 416408 419099 460944 506618 526186 551805 529091 517563 558271
2563E58271m7568j10487L0638K1844q7579j411Q1269L5020l6905n6596j4869M6504
$$ 558271 510703 400216 430854 452698 365119 363708 444977 479997 443092 386496 371627 418131
2551D18131k5291m1914M1043J7547J2190k2950O137N3271n6300n506J6430J8485
$$ 418131 392840 350926 391969 409516 421706 398756 404893 458164 401864 396358 412788 431273
2539D31273Q930j9620m2412j5351J1245k8870N674M7741J0631j6825j3682M32
$$ 431273 440203 420583 378171 362820 374065 345195 350869 398610 409241 392416 378734 379166
2527C79166J2307j2244p476n6344n493Q8003J7903l1099n3632L030l8764k21J4807
$$ 379166 391473 379229 371753 315409 309916 397919 415822 384723 331091 334121 295357 295136 309943
2514C09943J8019L6476k8375k6211j6482L2718M1160k606k870L2190n8617K0625
$$ 309943 327962 364438 336063 309852 293370 326088 367248 364642 361772 393962 335345 355970
2502C55970L8085j1622p1577J474M7179O759J1919k9967j7878K5764k3060o6702
$$ 355970 394055 382433 310856 312330 359509 366268 378187 348220 330342 356106 333046 266344
2490B66344m6722J3539o518J6362p550P5595O6412o7896o2419M7142K759l9738
$$ 266344 219622 233161 226643 243005 235455 311050 377462 309566 247147 294289 297048 257310
2478B57310P1010J611J8637M5297j03719K9533R350J4951M7395l1864o871j3370
$$ 257310 328320 329931 348568 393865 290146 319679 329029 343980 391375 359511 352640 339270
2466C39270P266j8172j6507k2463k066P7360J3047m3268j6785j6020l3376l06
$$ 339270 346536 328364 311857 289394 287328 364688 377735 334467 317682 301662 268286 267980
2454B67980N6201O1931L649o7541J2896l2143l6003M5491P8343l3024p0437P1508
$$ 267980 324181 386112 389761 322220 335116 302973 266970 312461 390804 357780 287343 358851
2442C58851K016q792K1889o614l626m9629j0770K171K7379q937m149J496J0013
$$ 358851 360867 352075 373964 367350 363724 314095 303325 305496 332875 323938 319789 321285 331298
2429C31298p886O3726M851j9267n3036k7433J15410n045j9353J6487p9743m4200
$$ 331298 323412 387138 391989 372722 319686 292253 407663 402618 383265 399752 320009 275809
2417B75809M4164r170M0152j9074J03831O562p5481j4901l1339n7977O4658M6377
$$ 275809 319973 310803 350955 331881 435712 442274 366793 351892 320553 262576 327234 373611
2405C73611q8747L1716M1671N6926j3397j7732K283O7491L8121o7778m0869K4893
$$ 373611 284864 316580 358251 415177 401780 384048 386331 453822 491943 424165 383296 408189
2393D08189O2342q087K0797k9955L6983K6602m4116K445l505O5786k7223p7301
$$ 408189 470531 462444 483241 453286 490269 516871 472755 475200 471695 537481 510258 432957
2381D32957P637K1979P5992j8169p553k3209j655J35919L5185p3645q825m3833
$$ 432957 440594 462573 538565 520396 512843 489634 487979 623898 659083 585438 576613 532780
2369E32780M929m3550k7160L6696M0168J17289n3370k1178K6734M3181L5578O645
$$ 532780 537709 494159 466999 503695 543863 661152 607782 586604 613338 656519 692097 698742
2357F98742J6359R9545N2453J1788J7070M4338N1253J253k4032K6442Q0026N1743
$$ 698742 715101 814646 867099 878887 895957 940295 991548 992801 968769 995211 1075237 1126980
2345A126980N0634Q1958J0212P816P8881J87112J45666J59957Q4004J37194Q9821
$$ 1126980 1177614 1259572 1269784 1277600 1356481 1543593 1689259 1849216 1933220 2070414 2160235
2334B160235J68987J47797Q9109M8215P7949J21751Q8095P1825R1982J79629J75960
$$ 2160235 2329222 2477019 2566128 2614343 2692292 2814043 2902138 2973963 3065945 3245574 3421534
2323C421534J95385J43478J32032K71852K79606K31255K89083M17656N27737M34949
$$ 3421534 3616919 3760397 3892429 4164281 4443887 4675142 4964225 5381881 5909618 6344567
2313F344567M01150N12270L66298L47767N23474N58895O06780Q59051J160062
$$ 6344567 6745717 7257987 7624285 7972052 8495526 9054421 9661201 10520252 11680314
2304A1680314J695258K348972K564662L469692L777608J719664n33663j929125
$$ 11680314 13375572 15724544 18289206 21758898 25536506 27256170 26722507 24793382
2296B4793382l173230l607988k986800k169867j620459j440578j326502j051932
$$ 24793382 21620152 18012164 15025364 12855497 11235038 9794460 8467958 7416026
2288G416026q53582o43596n34735l36590l55061l39579l67199l65321l32568k68217
$$ 7416026 6562444 5918848 5384113 5047523 4692462 4352883 3985684 3620363 3287795 3019578
2278C019578k84963j33140j68240j92222j29474j30612j43953r6641j08179m3447
$$ 3019578 2734615 2601475 2433235 2241013 2111539 1980927 1836974 1740333 1632154 1588707
2268A588707q0484q9124p4507q0385J0400l2779l4435m4556n6259K8741l5015
$$ 1588707 1508223 1419099 1344592 1264207 1274607 1241828 1207393 1162837 1106578 1135319 1100304
2257A100304j02279m3612m8389p347q9812k0323M5140J811J5572m8181k3954p98
$$ 1100304 998025 954413 906024 898677 808865 788542 833682 835493 851065 802884 778930 778132
2245G78132m4652j14527k9655M1178j3203K577J6110J4895j2278J2701j431j2205
$$ 778132 733480 618953 589298 630476 617273 619850 635960 650855 638577 651278 649847 637642
2233F37642j6007r0236m3056r268Q927q203k5884K7231k6814o460k7238J7779
$$ 637642 621635 531399 488343 479075 488002 479799 453915 481146 454332 447872 420634 438413
2221D38413l1206K7276k133j229N904l3996p067L4887k4737n4386J4174m7397
$$ 438413 407207 434483 432350 431121 437025 403029 395962 430849 406112 351726 365900 318503
2209C18503j5749M7474J5655J7256j1679l7722K7468p1476n8170j0551O1409P4634
$$ 318503 302754 350228 365883 383139 371460 333738 361206 289730 231560 221009 282418 357052
2197C57052l7672R457K560m5191J9387K6923m3847L0462n7299Q415L4522m6611
$$ 357052 319380 328837 331397 286206 305593 332516 288669 319131 261832 270247 304769 258158
2185B58158K1563N8662N2603l8808n2119m3642k0852J3272J8608p6032k6321K843
$$ 258158 279721 338383 390986 352178 300059 256417 235565 248837 267445 191413 165092 167935
2173A67935Q8134j240l7381j2185J8270J04471l8981l0306J9275k542k5232l7033
$$ 167935 256069 254829 217448 205263 223533 328004 289023 258717 277992 275450 250218 213185
2161B13185p792M9468P5142K2806n1517q3199m9283K9181k2158r432L1717M6892
$$ 213185 205393 254861 330003 352809 301292 218093 168810 197991 175833 166401 198118 245010
2149B45010o4412M0160N5106m1853l9776M002r571J8685M7840j2444n3053K9757
$$ 245010 180598 220758 275864 234011 194235 198237 188666 207351 255191 242747 189694 219451
2137B19451K6437N660n2673j1680K6811q3L0868k0343K415l5694k8670M5804q5131
$$ 219451 245888 251548 198875 187195 214006 213923 244791 224448 226863 191169 162499 208303 123172
2124A23172J0293N5111l3973O8770j5727k5542K189M9896L128m7427j1333l3410
$$ 123172 133465 188576 154603 223373 207646 182104 184293 234189 237317 189890 178557 145147
2112A45147k695N8634M2642r5168m1119J27124L6205n0443l4469k7414M777M456
$$ 145147 142452 201086 243728 148560 107441 234565 270770 220327 185858 158444 163221 167677
2100A67677K4019L9833j3539k1676l5186k0212J6638N8334l8546K512J6646M6805
$$ 167677 191696 231529 217990 196314 161128 140916 157554 215888 177342 179854 196500 243305
2088B43305k5018j8388m9349l4495J2480K7763J187L5425J4852J4695p456q199
$$ 243305 218287 199899 150550 116055 128535 156298 157485 192910 207762 222457 215001 206802
2076B06802N3264r2723m9111O2324m9572j8411J48030o2079j8544k4305l1324
$$ 206802 260066 167343 118232 180556 130984 112573 260603 198524 179980 155675 124351
2065A24351M4004N0240N1745k3241m5747K5695o1645M0741j2293k5254O8957k7648
$$ 124351 168355 218595 270340 247099 201352 227047 165402 206143 193850 168596 237553 209905
2053B09905n370O4234L5315o3432n6424k5354m0523k4441R7996m799M4728M1926
$$ 209905 204535 268769 304084 240652 184228 158874 118351 93910 191906 187107 231835 273761
2041B73761o2262n6735J7591M0498L2524J366M253L52J332Q2351j1106m0324N6838
$$ 273761 211499 154764 172355 212853 245377 246743 250996 251348 252680 335031 323925 283601 340439
2028C40439J5956r4772M160n0457k4419L7982k3145J2656j2261J4596k8359j2200
$$ 340439 356395 261623 265783 215326 190907 228889 205744 218400 206139 220735 192376 180176
2016A80176N081K0150r1143n5798O7530k858j9811J6115N178Q7788J6190o3739
$$ 180176 185257 205407 114264 58466 125996 123138 103327 119442 124620 212408 228598 164859
2004A64859k4471J0300Q927L5178l9420n7130j3184m5185K4874J775K1675l8606
$$ 164859 140388 150688 159615 194793 155373 98243 85059 39874 64748 66523 88198 49592
1992D9592J4415M8253M1275o0893l4224J0671J8450J9169N754K2059l183k8562
$$ 49592 64007 112260 153535 92642 58418 69089 87539 106708 112462 134521 131338 102776
1980A02776M1491n7142J2933P3669n3780M3898m2261q73j8937p413J123j6006
$$ 102776 144267 87125 100058 173727 119947 163845 121584 120711 101774 94361 95484 79478
1968G9478N1566J7867j5617J6318J8026K33q082q766m3447K1184L0055j2895L661
$$ 79478 131044 148911 133294 149612 167638 167871 159789 151023 107576 128760 158815 145920 149581
1955A49581M9946N489L0225k9205m7172k1433j6314L0068m9978J2619j2685k7704
$$ 149581 199527 205016 235241 206036 158864 137431 121117 151185 101207 113826 101141 73437
1943G3437m9270m9764O8070K44j8501M1151j693M5714q398J5201L6946j4470p4798
$$ 73437 24167 -25597 42473 42717 24216 65367 63674 109388 100990 116191 153137 138667 63869
1930F3869k1345O7783l8944j4703J8694N3134k3887K9224j2587n7895Q5958k7628
$$ 63869 42524 110307 71363 56660 75354 128488 104601 133825 121238 63343 149301 121673
1918A21673N480k1189K881Q5300K3888q3893o2297J721P6998n5876m489L4411
$$ 121673 127153 105964 108845 194145 218033 134140 71843 73564 150562 94686 90197 124608
1906A24608M9430k6504r8692M0288M3390J0545n993M1541l6169n2205k0528K534
$$ 124608 174038 147534 48842 89130 132520 143065 137072 178613 142444 90239 69711 72245
1894G2245P7959m9627m1828m20P641M5977M036J9305k2815k0954K3876k1556n9371
$$ 72245 150204 100577 58749 58329 65970 111947 115983 135288 112473 91519 115395 93839 34468
1881C4468K4314P2324m8656K7376l1319k9398p130N9681m5264l5933Q2865k0543
$$ 34468 58782 131106 82450 109826 78507 49109 41979 101660 56396 20463 103328 82785
1869H2785N2657o0396K134L8652k4044R506O1034m2343m3432n7341J1854O4845
$$ 82785 135442 75046 77180 115832 91788 101294 162328 119985 76553 19212 31066 95911
1857I5911J6863n5026m1143N1768j534K4553k4096j6697l0735p096O6145k5834
$$ 95911 112774 57748 16605 68373 66839 91392 67296 50599 19864 12768 78913 53079
1845E3079L9995L4642O833p0459M9580l9672k144l2209m5273R8422j472p9092
$$ 53079 93074 127716 134549 64090 113670 73998 71854 39645 -5628 92794 91322 12230
1833A2230j4574K3825O4628q886q0728Q344R8444k1378j1493L3083o1935l0687
$$ 12230 -2344 21481 86109 77223 -3505 4839 103283 81905 70412 103495 41560 10873
1821A0873J7698O4472M7786j074k2500k4996l8675K603L7938r735r171O1095m0696
$$ 10873 28571 93043 140829 139755 117255 92259 53584 56187 94125 84390 75219 136314 95618
1808I5618O717k1536K4014M0468m1725K731k1377L2848L4375l5460j3627l578
$$ 95618 102335 80799 104813 145281 103556 106287 84910 117758 152133 116673 103046 99468
1796I9468n2320n1414J28621P2318r568j6053q1192j6874j5806n582J6813j0982
$$ 99468 47148 -4266 124355 196673 187105 171052 89860 72986 57180 51598 68411 57429
1784E7429O719j191o049J4091K9093p424j8757J2459K2361p0294M4390K2528n8236
$$ 57429 64148 62957 56908 70999 100092 92668 73911 86370 108731 38437 82827 105355 47119
1771D7119J9720L6516j00675Q120O5380M0612m0794j3787P030J5717k633k0145
$$ 47119 66839 103355 2680 10800 76180 116792 75998 62211 69241 84958 82325 62180
1759F2180J4419P497J6349J8889K5303r0411M742K5656K4598j3139l7048j9639
$$ 62180 76599 84096 100445 119334 144637 54226 58968 84624 109222 96083 59035 39396
1747C9396M245j0545r870N0286M1017k1268o9136l4937N4973k4685j4832k1811
$$ 39396 43641 33096 23226 73512 114529 93261 24125 -10812 44161 19476 4644 -17167
1735a7167L1966M8186L8141K1921p4750k2799k7709N258J8928j896L1440M0955
$$ -17167 14799 62985 101126 123047 48297 25498 -2211 3047 21975 20079 51519 92474
1723I2474l5141K4556J865q157k7452L9293O8182p2833J2757m512r48J8545l8723
$$ 92474 57333 81889 83754 75597 48145 87438 155620 82787 95544 91032 90084 108629 69906
1710F9906k3638k1871j6313O4426J8652j1292k5021P558j7624m1672R6415J3671
$$ 69906 46268 24397 8084 72510 91162 79870 54849 62407 44783 3111 99526 113197
1698A13197l7073M1281m7101m8175J6118J8438o4487n653O9238N1439l7783n347
$$ 113197 76124 117405 70304 22129 38247 56685 -7802 -13455 55783 107222 69439 64092
1686F4092J4284l4333l9822J3887Q4012m3433n223j1973L6606L6682k1611K293
$$ 64092 78376 44043 4221 18108 102120 58687 53464 41491 78097 114779 93168 95461
1674I5461k2861J8159n6626q118L5796O2435M430k2206p3084L0529J7939k4881
$$ 95461 72600 90759 34133 26015 61811 124246 128676 106470 33386 63915 81854 56973
1662E6973k6314K5172j0552n1138R4196l1846K6026J5856l811m2311J80K3183
$$ 56973 30659 55831 45279 -5859 88337 56491 82517 98373 94562 52251 52431 75614
1650G5614m5554M0830O3835j04113p6618N1769R1546k8026k4770J4571j0922l303
$$ 75614 30060 70890 134725 30612 -46006 5763 97309 69283 44513 59084 48162 44859
1638D4859J5951R541k5490l875M1085k4364k3719J5468o7571L8443N5443N6267
$$ 44859 60810 70351 44861 40986 82071 57707 33988 49456 -18115 20328 75771 132038
1626A32038m2418m0019m5844K0992K9060m5782l32j8420M7578M3642N009n8809
$$ 132038 89620 49601 3757 24749 53809 8027 7695 -10725 36853 80495 85504 26695
1614B6695J7192j2439o161j4572q121L1731p5787R4179j285J0163L1230n391l0361
$$ 26695 43887 31448 25287 10715 2594 34325 -41462 52717 51432 61595 92825 87434 57073
1601E7073n1734M5387m8784P361j8317M6063M5019J253k0235L6537q030J580m6349
$$ 57073 5339 50726 1942 9303 -9014 37049 82068 83321 63086 99623 91593 93173 46824
1588D6824K8605L6721m6039K9329J8293l6951J9090q53j14j4626q867k159r7610
$$ 46824 75429 112150 66111 95440 113733 76782 95872 95019 94905 80279 71412 69253 -28357
1575b8357L025L6587Q6333j7586l2391L1607j6066k284o622j9971o025M965l4704
$$ -28357 -25332 11255 97588 80002 47611 79218 63152 60868 54246 34275 28250 33215 -1489
1562a489L6765l1151N9909K1676k8035P20K6511j4614k6976N766j8479l0909M2215
$$ -1489 35276 4125 64034 85710 57675 58395 84906 70292 43316 49082 30603 -306 41909
1549D1909L8702j1063l3450P830l5088k8321N1288n7996L9115J6418r2745J6312
$$ 41909 80611 69548 36098 43928 8840 -19481 31807 -26189 12926 29344 -63401 -47089
1537d7089M9044J4119P3217k9758m0785l2587J8835l5697l0686j1218M6126k5276
$$ -47089 1955 16074 89291 59533 18748 -13839 4996 -30701 -61387 -72605 -26479 -51755
1525e1755r114O6571J10342m5984m8094m6275J5576L2314j3221n427M4653k3623
$$ -51755 -60869 5702 116044 70060 21966 -24309 -8733 23581 10360 4933 49586 25963
1513B5963M08l6086r819m2461N5709l2056N997Q0572K1301k2006o5715j1702M279
$$ 25963 26371 -9715 -19534 -61995 -6286 -38342 -32345 48227 69528 47522 -18193 -29895 -25616
1500b5616K6403l9800O686k1448j324j8506J04485K9329K7688j9355l7908P0437
$$ -25616 787 -39013 -32327 -53775 -55099 -73605 30880 60209 87897 68542 30634 101071
1488A01071m4730m3308M4889k162n3482K4017L2409l2133q3916j4416K3878J8618
$$ 101071 56341 13033 57922 55760 2278 26295 58704 26571 -57345 -71761 -47883 -29265
1476b9265K9334m9172J0594N742O9760M6333m1820K6758l2679j3229J9740l8323
$$ -29265 69 -49103 -38509 -32767 36993 83326 41506 68264 35585 22356 42096 3773
1464C773p3565j2769M6920J9902L6670K4109j6058k3072J5595L5688O669k4498
$$ 3773 -69792 -82561 -35641 -15739 20931 45040 28982 5910 21505 57193 63862 39364
1452C9364r2384l49P2447p665L2097j96j5292o382M6612j0764k3788m2225M1384
$$ 39364 -53020 -53369 19078 11413 43510 43314 28022 21640 68252 57488 33700 -8525 32859
1439C2859r377j0005K0044O7296J0756k7623K192K1414n1396q803O150m9858n0959
$$ 32859 23482 13477 33521 100817 111573 83950 86142 107556 56160 47357 53507 3649 -47310
1426d7310J0667L7563j0683m331J10089j3940k274P1486m6672p8986J2077L9477
$$ -47310 -36643 920 -9763 -14094 95995 82055 79781 151267 104595 25609 37686 77163
1414G7163j0865L0691o448l6872J0454j7090l4791J5221m058k1327o6213j6985
$$ 77163 66298 96989 90541 53669 64123 47033 12242 27463 23405 2078 -64135 -81120
1402h1120R4973L7540j5956j4541M271M1106p226L381l1920J4362j6690o2499
$$ -81120 13853 51393 35437 20896 25167 66273 59047 62428 30508 44870 28180 -34319
1390c4319K2198N085O0187J5358M1542k5171l879J3218r4951L9678k6413K3838
$$ -34319 -12121 -7036 53151 68509 110051 84880 81001 94219 -732 38946 12533 36371
1378C6371J9088l072j2186k8002L1235K5107k6955k6437M2596k3517N5050j04759
$$ 36371 55459 52387 40201 12199 43434 68541 41586 15149 57745 34228 89278 -15481
1366a5481M1163P5558o7180k8519K0975m9050j01287R8785O3205L359m8415J6131
$$ -15481 25682 101240 34060 5541 26516 -22534 -123821 -25036 38169 41528 -6887 9244
1354I244J9480M2580l0938p489o6354N888p0K735M5748M8220l5522J7056J3314
$$ 9244 28724 71304 40366 32877 -33477 -27589 -27659 -24924 20824 69044 33522 50578 63892
1341F3892k4040q414J1645N200j7427j8795L8816J1790K536L6856k0457J15J5077
$$ 63892 39852 31438 43083 48283 30856 12061 50877 62667 65203 102059 81602 81717 96794
1328I6794j07618l822N4907N536o606j0765L764L9468p7629k8967J3937K0293
$$ 96794 -10824 -14646 40261 45797 39191 28426 32190 71658 -5971 -34938 -21001 -708
1316g08N8356k1275p20R124J7493j9688j9204l9350k813O1371K3429M118J5536
$$ -708 57648 36373 35653 44777 62270 42582 23378 -15972 -18785 42586 66015 70133 85669
1303H5669o405o6505J3675J0921k5812k4802K741Q2160m5141r375Q6472n6335
$$ 85669 79264 12759 26434 37355 11543 -13259 -10518 71642 26501 17126 103598 47263
1291D7263n4281k1850J3243J4803R0916L1880q2568l017m6824j1554K7852J1761
$$ 47263 -7018 -28868 -15625 -822 90094 121974 39406 36389 -10435 -21989 5863 17624
1279A7624l9757K9676j9118k5947P5673K7824O058l7561p254L6249n6887J3519
$$ 17624 -22133 7543 -11575 -37522 38151 65975 72033 34472 27218 63467 6580 20099
1267B0099m6276R97m0700J3066n64J2764M0741M1180k6546l0357Q1750m8770L6211
$$ 20099 -26177 -25180 -65880 -52814 -53378 -40614 127 41307 14761 -15596 66154 17384 53595
1254E3595M6067k9742j04460k4060L9076J8260L0341p595n9966p623Q4127l4061
$$ 53595 99662 69920 -34540 -58600 -19524 -1264 29077 21482 -38484 -46107 38020 3959
1242C959j6105l8039K7134K6595k7618K6730M2432J3395n081J9537O0700o3116
$$ 3959 -12146 -50185 -23051 3544 -24074 2656 45088 58483 53402 72939 133639 70523
1230G0523n9483k9415L3228p6671O8787M0198p3791L1652m099J20J3990m2223
$$ 70523 11040 -18375 14853 -61818 6969 47167 -26624 5028 929 1049 15039 -27184
1218b7184J9872P085k0481l3313O8498K3889o2381J7409L8448O0664K6304o8782
$$ -27184 -7312 -227 -20708 -54021 14477 38366 -24015 -6606 31842 92506 118810 50028
1206E0028L3588l7108q4720J0608K9291M5687J2170n6451j7813K0689j5149N2657
$$ 50028 83616 46508 -38212 -27604 1687 47374 59544 3093 -14720 5969 -9180 43477
1194D3477L6199p9004m7902M6581L0379K1571j41310L8546Q7054K557l9542Q77
$$ 43477 79676 672 -47230 -649 29730 51301 -90009 -51463 35591 38148 -1394 -517
1182e17o285R338K2146L9404k1093j1654J43041j0266j22434o2187L7131K9975
$$ -517 -6802 2536 24682 64086 42993 31339 174380 164114 41680 -20507 16624 46599
1170D6599M1885k1372m9594m5290J1177J21544n2141j9053j4531K4017n5067K9405
$$ 46599 88484 67112 17518 -27772 -16595 104949 52808 33755 19224 43241 -11826 17579
1158A7579k710k7530k1232M8941J9542j6601o5897J81K2458J9000r195M8160M3436
$$ 17579 14869 -12661 -33893 15048 34590 17989 -47908 -47727 -25269 -6269 -15464 32696 76132
1145G6132n8696m113l2901k4500L7121m5879O0901O027k709R706P092J9579m0472
$$ 76132 17436 13323 -19578 -44078 -6957 -52836 8065 14092 11383 21089 28181 47760 7288
1132G288k0065J7871P0671j7930p5160R73N3404J4710l2841k0359L4357k8061
$$ 7288 -12777 5094 75765 57835 -17325 -16352 37052 51762 18921 -1438 32919 4858
1120D858k412j149n1232J7141J6722o862K6102J7923P8347o2909p0J0955K5236
$$ 4858 2446 1297 -49935 -32794 -16072 -22934 3168 21091 99438 36529 36459 47414 72650
1107G2650j07277K8650Q3919m7483L1612j866k8662J0553l4987M025j7811j4717
$$ 72650 -34627 -5977 77942 30459 62071 60205 31543 42096 7109 11134 -6677 -21394
1095b1394O1164j2129k6027J615P5181l6346m5435O6141j6367J03964L1164q1595
$$ -21394 39770 27641 1614 3229 78410 42064 -3371 62770 46403 150367 181531 99936
1083I9936p2842j6036n5755l2534L5795j5100M8939L0010k4456k4416M4673M1147
$$ 99936 27094 11058 -44697 -77231 -41436 -56536 -7597 22413 -2043 -26459 18214 59361
1071E9361o2158p5206M0942K0932k1593K8453J553p0299k3600J01980r269l2572
$$ 59361 -2797 -78003 -37061 -16129 -37722 -9269 -7716 -78015 -101615 365 -8904 -41476
1059d1476N6802K1874p792j2840j2805L7041P463J4277k6319P1009k9660p2688
$$ -41476 15326 37200 29408 16568 3763 40804 48267 62544 36225 107234 77574 4886
1047D886M5811j8941m5059k5136L6230M4539k2209o6511K4541O3175O385o8659
$$ 4886 50697 31756 -13303 -38439 -2209 42330 20121 -46390 -21849 41326 47711 -20948
1035b0948m86k449L4053Q948l953Q599J2276l5804k7864M2669k9024J3533n68
$$ -20948 -21434 -23883 10170 19118 15165 23764 36040 236 -27628 15041 -13983 -450 -1018
1022a018q1031J6496M0320J2291O922p336J623p211L5357L5148L9312m4729l6694
$$ -1018 -82049 -65553 -25233 -12942 -6020 -13356 -11733 -18944 16413 51561 90873 46144 9450
1009I450p6582N0014K1478j7611J7777l1123N4053K080k8392r8092N8102j5669
$$ 9450 -67132 -17118 4360 -13251 4526 -26597 27456 29536 1144 -96948 -38846 -54515
997e4515J6353L3994l7042j4081k0182J7176K8468M6111l367N2766m511j1310
$$ -54515 -38162 -4168 -41210 -55291 -75473 -58297 -29829 16282 12915 65681 61170 49860
985D9860L3382n6054l7111j8865J0660L4886k7358k1260m222M1913m99o583K3932
$$ 49860 83242 27188 -9923 -28788 -18128 16758 -10600 -31860 -36082 5831 5332 -1251 22681
972B2681m8117l3718M0046R0476m1891J4710J1275o9264l0453m4253J3016K6499
$$ 22681 -25436 -59154 -19108 71368 29477 44187 55462 -13802 -44255 -88508 -75492 -48993
960d8993O3743L953j4712M2731L3750k1453r246m4664r2803m36M4249L9871k697
$$ -48993 14750 18703 3991 46722 80472 59019 49773 5109 -87694 -88130 -43881 -4010 -6707
947f707J3489K416J2362K9077K4308q8525o4265K8109N6539n84J1324K5283m9481
$$ -6707 6782 9198 21560 50637 74945 -13580 -77845 -49736 6803 6219 17543 42826 -6655
934f655k5448l4921N9520J8562k8758n9317L19m3160k0651J9436N5646R7741o3818
$$ -6655 -32103 -67024 -7504 11058 -17700 -77017 -76698 -119858 -140509 -121073 -65427 32314 -31504
921c1504k0841L3823n2467K23K7751k8625N6697k7656j2892j8715N2831P419L0558
$$ -31504 -52345 -18522 -70989 -70766 -43015 -71640 -14943 -42599 -55491 -74206 -21375 -13956 16602
908A6602m3717l4835P0783O315L3196k742j7426l8450Q733k5576J5591o0409K2352
$$ 16602 -27115 -61950 8833 15148 48344 45602 28176 -10274 -1541 -27117 -11526 -71935 -49583
895d9583L2195J6528j1783p812l7321N0654N4356n3971l6898m5460k117P6243
$$ -49583 -17388 -860 -12643 -20455 -57776 -7122 47234 -6737 -43635 -89095 -91212 -14969
883a4969M3542j6923k6560n2674m4103j0603L6213N2790L6343p859j9579J0954
$$ -14969 28573 11650 -14910 -67584 -111687 -122290 -86077 -33287 3056 -4803 -24382 -13428
871a3428L2947m442j1383k8941L4140l9682L5422K4061J5736K1465k1223l6617
$$ -13428 19519 15077 3694 -25247 8893 -30789 4633 28694 44430 65895 44672 8055
859H055n0278K672J2619J8628j4316l8282P0751L246n5187J9246m6324J0986K0439
$$ 8055 -42223 -39551 -26932 -8304 -22620 -60902 9849 13095 -42092 -22846 -69170 -58184 -37745
846c7745M0081L620l589M4400M5764k5761l9577M5686p0746k3604j6214o719M5075
$$ -37745 2336 5956 2367 46767 92531 66770 27193 72879 2133 -21471 -37685 -44404 671
833F71M645o7389J1864L7499k0334m2212Q2554J7109n1338p377K9330M65l0956
$$ 671 5316 -62073 -50209 -12710 -33044 -75256 7298 24407 -26931 -34308 -4978 -4513 -35469
820c5469N4593K5641q5537k615J1260k9548K6878k4275M7914k1088j00220N0198
$$ -35469 19124 44765 -40772 -43387 -32127 -61675 -34797 -59072 -11158 -32246 -132466 -82268
808h2268M4332L0361L5041j6890n856n0928M4255K9684o697j6279m9406j6820
$$ -82268 -37936 -7575 27466 10576 4720 -46208 -1953 27731 21034 4755 -44651 -61471
796f1471r841K886L0344l2994L9761l1365m630L6963K676o5511O2084k4904n3661
$$ -61471 -71312 -68426 -38082 -71076 -31315 -62680 -67310 -30347 -27671 -93182 -31098 -56002 -109663
783a09663P8660J10485l8807p288O4244K79l6171n5631n4870K4800N200K1374
$$ -109663 -31003 79482 40675 33387 97631 97910 61739 6108 -48762 -23962 -18762 2612
771B612n2405K5078j3806j7412j1761n6J8582J7032M366M047K3633K9608k9550
$$ 2612 -49793 -24715 -38521 -55933 -67694 -67750 -49168 -32136 -27770 -23723 -90 29518 -32
758c2o8662J4433p91O1152k5051R484n8344O4929l3999M4694K5343L4828l8211
$$ -32 -68694 -54261 -55052 6100 -18951 -9467 -67811 -2882 -36881 7813 33156 67984 29773
745B9773j2300m352r2956R627M394m493P4473P2352l2453l2252j8378k3070j0523
$$ 29773 17473 13121 -79835 -70208 -65814 -70307 4166 76518 44065 11813 -6565 -29635 -40158
732d0158m5896k4328K0506O9751O099n7324P2888M3129j24158L431N0706L9933
$$ -40158 -86054 -110382 -89876 -20125 -14026 -71350 1538 44667 -79491 -76060 -25354 14579
720A4579l778m4042L7214Q655j3911K7164L2505m2135p3759j967L4337l8792K9845
$$ 14579 10801 -33241 3973 12628 -1283 25881 58386 16251 -57508 -59475 -25138 -63930 -34085
707c4085O3592p5891m097n8001m7427j8516L8531M5358M9770R5473m5659o0472
$$ -34085 29507 -46384 -50481 -108482 -155909 -174425 -135894 -90536 -40766 54707 9048 -51424
695e1424n3859P4463k7270j438L7210o9408P9861K0583m8065J8243m4588j9284
$$ -51424 -105283 -30820 -58090 -59528 -22318 -91726 -11865 8718 -39347 -21104 -65692 -84976
683h4976L0045N0958l2560j2151J9661J4321J9045l5589j7925J9292M127p6614
$$ -84976 -54931 -3973 -36533 -48684 -29023 -14702 4343 -31246 -49171 -29879 -25752 -102366
671a02366l1123K9698J3960P7O3369l5777k6324J3861J7896M7013M8972o3330
$$ -102366 -133489 -103791 -89831 -89754 -26385 -62162 -88486 -74625 -56729 -9716 39256 -24074
659b4074j11317K5971M8688L1169l9833K3374K3727m1776L0832K5259K2802J1747
$$ -24074 -135391 -109420 -60732 -29563 -69396 -46022 -22295 -64071 -33239 -7980 14822 26569
647B6569l9006j6265J2690K9544p2924m2002K0008N5818j1140k488M3280J6789
$$ 26569 -12437 -28702 -16012 13532 -59392 -101394 -81386 -25568 -36708 -39196 4084 20873
635B0873m4334j3605J8915r020K1812p034j3667l0067P946N8854j8620l6865k454
$$ 20873 -23461 -37066 -18151 -27171 -5359 -12393 -26060 -56127 -48181 10673 -7947 -44812 -47266
622d7266K5519O294l9817N792m720m6753J6494j9015q481L4820m6823K5405M1424
$$ -47266 -21747 -15453 -55270 -49478 -54198 -100951 -84457 -103472 -111953 -77133 -123956 -98551 -57127
609e7127J8439J2288r77N251j3984K3730k1170l3143P7870K1942q915L3571k2852
$$ -57127 -38688 -26400 -27377 -22126 -36110 -12380 -33550 -66693 11177 33119 24204 57775 34923
596C4923n8266K9123L2542n4489K1477k8307M4809R673n8248k5281J4781m0269
$$ 34923 -23343 5780 38322 -16167 5310 -22997 21812 31485 -26763 -52044 -37263 -77532
584g7532j7617O1380Q441J7123L5600k8873R906L686l780k1161L5589L9331l9768
$$ -77532 -95149 -33769 -25328 -8205 27395 -1478 8428 12114 8334 -12827 22762 62093 22325
571B2325l9974j0369j2047K5209j6484J1968j8770k0678O5587O154m8645j2065
$$ 22325 -17649 -28018 -40065 -14856 -31340 -19372 -38142 -58820 6767 12921 -35724 -47789
559d7789J2898J6097Q247o420o0360M0597L7319n3788O6520o277j0651J3509L9469
$$ -47789 -34891 -18794 -10547 -16967 -77327 -36730 589 -53199 13321 7044 -3607 9902 49371
546D9371p995m7432K1411O63n1570n3534j4798M0888j8660K3136k520N5916j7016
$$ 49371 41376 -6056 15355 16018 -35552 -89086 -103884 -62996 -81656 -58520 -61040 -5124 -22140
533b2140K7416l0556P200k3835k1696M2379K363j7589L5147l6415o1264J1421
$$ -22140 5276 -25280 -18080 -41915 -63611 -21232 -18869 -36458 -1311 -37726 -98990 -87569
521h7569Q2719J9438O1833o235q7279n6376J3748N9380N847m0022M4170l7544
$$ -87569 -4850 14588 76421 70186 -17093 -73469 -59721 -341 5506 -34516 9654 -27890
509b7890K0768M7230o4005l2456j324N4621J0297k7031j186r50l3065r511J7074
$$ -27890 -7122 40108 -23897 -56353 -57677 -3056 7241 -19790 -20976 -21926 -54991 -64502 -47428
496d7428M782N5951l450k1350k4512n3647J16266K6469l740q9499o1410M64J8059
$$ -47428 -42646 13305 9855 -11495 -36007 -89654 26612 53081 49341 -40158 -101568 -101104 -83045
483h3045P020P415m438m5600m824N0714j6959K3682l5928P3788m4030K3611K8634
$$ -83045 -76025 -68610 -73048 -118648 -123472 -72758 -89717 -66035 -101963 -28175 -72205 -48594 -19960
470a9960n3745m326M2891m8753j7631P7546j5740Q526n1454K7589M7208o040j1485
$$ -19960 -73705 -78031 -35140 -83893 -101524 -23978 -39718 -31192 -82646 -55057 -7849 -13889 -25374
457b5374m449l2807j369M8600J318O1262n776k4495k9869l3350P65Q9053L1561
$$ -25374 -29823 -62630 -63999 -15399 -14081 47181 41405 16910 -12959 -46309 -45544 43509 75070
444G5070r7819L5562k0527K95L7320l0510J3762o8182M6665L2031L766k7719j18942
$$ 75070 -22749 12813 -7714 -7419 29901 -609 13153 -55029 -8364 23667 27433 -286 -119228
431a19228N862Q5534K4879l5715k0203J0434m1948L4048R3336j5356n5117l7731
$$ -119228 -113366 -27832 -2953 -38668 -58871 -48437 -90385 -56337 36999 21643 -33474 -71205
419g1205L0493M404j6032r066L0752j657K6369p068J902o3620k3800R312l6804
$$ -71205 -40712 -36308 -52340 -61406 -30654 -32311 -5942 -13010 -11108 -74728 -98528 -89216 -126020
406a26020L6404l2062k0386N2858Q9641M710k0340o3325L819P9780Q481j8144
$$ -126020 -89616 -121678 -142064 -89206 435 5145 -15195 -78520 -74701 5079 13560 -4584
394d584l3529K4782k5528k5446o8982Q2952Q0968k4257k9689j3122n7043M3817
$$ -4584 -38113 -13331 -38859 -64305 -133287 -50335 30633 6376 -23313 -36435 -93478 -49661
382d9661M7138L6550O6151r4683n7437N2332j8888l8346K0191J191m3577L1705
$$ -49661 -2523 34027 100178 5495 -51942 390 -18498 -56844 -36653 -35462 -79039 -47334
370d7334L0402p9373K9045M0036n526p0396j7311Q4345O0441k7343o0743M8068
$$ -47334 -16932 -96305 -67260 -27224 -32750 -103146 -120457 -36112 24329 -3014 -63757 -15689
358a5689J1387m3645l2881L2810M4588k8016p373p057j7437k7358o689M4617j8687
$$ -15689 -4302 -47947 -80828 -48018 -3430 -31446 -38819 -45876 -63313 -90671 -97360 -52743 -71430
345g1430N3546k8148k3932k8540N3353K684L6142M2162p2768l138j8426J5769
$$ -71430 -17884 -46032 -69964 -98504 -45151 -42467 -6325 35837 -36931 -40069 -58495 -42726
333d2726R511j7177n922Q009l5545Q821P0788j2902q3287L7491M6660j9633l2349
$$ -42726 -33215 -50392 -56314 -48305 -83850 -75029 -4241 -17143 -100430 -62939 -16279 -35912 -68261
320f8261O0800p888m4385j4022l9906J3718N5618J9860P236o1555l6244M8701
$$ -68261 -7461 -15349 -59734 -73756 -113662 -99944 -44326 -24466 -17230 -78785 -115029 -66328
308f6328r2J5568L341K6250Q964p858P652J6976L0465k6396n1181m5889n038n9881
$$ -66328 -66420 -50852 -47511 -21261 -12297 -20155 -12503 4473 34938 8542 -42639 -88528 -93566 -153447
294a53447l1853Q1503Q9575p7504j8635M4961Q600K8860l0032P7672j1347p3405
$$ -153447 -185300 -103797 -14222 -91726 -110361 -65400 -56800 -27940 -57972 19700 8353 -65052
282f5052j3681L039J4558m5505O8089Q68k6735O863K1970k6587l1469k7958J2138
$$ -65052 -78733 -75694 -61136 -106641 -38552 -37684 -64419 -57556 -35586 -62173 -93642 -121600 -109462
269a09462N4456J0098o6048M2289N6674p2596j8798L5371m1029K7269j8862R8330
$$ -109462 -55006 -44908 -110956 -68667 -11993 -84589 -103387 -68016 -109045 -81776 -100638 -2308
257b308j0259r716j4163n1230j2557M0328K824p4573O5396K2794m308P851P0362
$$ -2308 -12567 -22283 -36446 -87676 -100233 -59905 -57081 -131654 -66258 -43464 -47772 -39921 30441
244C0441K6242J262o9726K8766K2604n9476l0384J5114n237k4703J0365j9606
$$ 30441 56683 57945 -11781 16985 39589 -19887 -50271 -35157 -40394 -65097 -54732 -74338
232g4338L1878N7849K1237o6246m9096O6254L6819k2134L0040K5590j03175J5271
$$ -74338 -42460 15389 36626 -29620 -78716 -12462 24357 2223 32263 57853 -45322 -30051
220c0051K2880R101n1072n27R965j7710K731m7096O82N9879k1750r556L208k9927
$$ -30051 -7171 1930 -49142 -49669 -39704 -57414 -54683 -101779 -101097 -41218 -62968 -72524 -69316 -99243
206i9243J2122P6580j3645P158o2421m1645N7238N8324k024k0860n6914P886J11544
$$ -99243 -87121 -10541 -24186 -17028 -79449 -121094 -63856 -5532 -7556 -28416 -85330 -77444 34100
193C4100J2629l1035k3839k9592M9745K5076p3459N7411L1312q8766k5826M9839
$$ 34100 46729 15694 -8145 -37737 12008 37084 -36375 21036 52348 -36418 -62244 -12405
181a2405O0393l4382j6811q8612k4796M8883K5168j0229l8075K6515L8190q4317
$$ -12405 47988 13606 -3205 -91817 -116613 -67730 -42562 -52791 -90866 -64351 -26161 -110478
169a10478l1654N9974j1879J239M6770J6402j4497k5190R198j8245K6470R155
$$ -110478 -142132 -82158 -94037 -92798 -46028 -29626 -44123 -69313 -60115 -78360 -51890 -42735
157d2735j7323O4611n2557l3290O2679r786l9663l8322J4440N3677k082m6087
$$ -42735 -60058 4553 -48004 -81294 -18615 -28401 -68064 -106386 -91946 -38269 -40351 -86438
145h6438m3099O8057J7245N3273m1345j6983j392j966r564J3309m1277J0073O8882
$$ -86438 -129537 -61480 -44235 9038 -32307 -49290 -50682 -52648 -62212 -48903 -90180 -80107 -11225
132a1225J7522r5716o1593k7325J2866K2938J9595M5077O4950o7434K2433J5065
$$ -11225 6297 -89419 -151012 -178337 -165471 -142533 -122938 -77861 -12911 -80345 -57912 -42847
120d2847K9412J4613r913K6144j1860K0109P722P932k5796j5678k3069J0525m8071
$$ -42847 -13435 1178 -8735 17409 5549 25658 33380 41312 15516 -162 -23231 -12706 -60777
107f0777l2576j5363J2094L0735o891l2068N8543o415M8613L3761l9470l7426
$$ -60777 -93353 -108716 -96622 -65887 -72778 -104846 -46303 -52718 -4105 29656 -9814 -47240
95d7240l0286K8966l1696J4488L1752K8067J8554n771k5860R825n0098J9624O8188
$$ -47240 -77526 -48560 -80256 -65768 -34016 -5949 12605 6834 -19026 -9201 -59299 -39675 28513
82B8513m3407n8190J129K9331o3460L0615O490K7569J3180n798k9645J0139M872
$$ 28513 -14894 -73084 -71955 -42624 -106084 -75469 -68979 -41410 -28230 -34028 -63673 -53534 -48662
69d8662l8143j6381L2646J8449l1280L1125M296k1526J6858j9356J673j4889J4765
$$ -48662 -86805 -103186 -70540 -52091 -83371 -52246 -47950 -69476 -52618 -71974 -70301 -85190 -70425
56g0425N5697J3654j9787M762L1652n5742j8177J6418n83j0955l5617J5952O6190
$$ -70425 -14728 -1074 -20861 -16099 15553 -40189 -58366 -41948 -42531 -53486 -89103 -73151 -6961
43f961k8076L979Q626Q024K1328k968K146k8727l3511M2134L0225r4753o493L9320
$$ -6961 -35037 -31058 -22432 -14408 6920 3952 6098 -22629 -56140 -14006 16219 -78534 -85027 -45707
29d5707K7613J11r370j2669j2680l3740j2436O5320l530j6381K1207o1354J6073
$$ -45707 -18094 -17983 -27353 -40022 -52702 -86442 -98878 -33558 -37088 -53469 -32262 -93616 -77543
16g7543M5536l4606J2478l2258k1687J0466N5024R118L0055k2184m2536L2181
$$ -77543 -32007 -66613 -54135 -86393 -108080 -97614 -42590 -33472 -3417 -25601 -68137 -35956
4c5956p968m578L2369J7063
$$ -35956 -43924 -48502 -16133 930
0I30
$$ Imaginary data points
##PAGE= N=2
##DATA TABLE= (X++(I..I)), XYDATA
16383b057882J2372O4364J2340J0586K5223K1582j06K0629M1157L5990K0658L6616
$$ -2057882 -2045510 -1981146 -1968806 -1958220 -1932997 -1911415 -1911521 -1890892 -1849735 -1813745 -1793087 -1756471
16371a756471K8076j9674K1549L259P1374N280M0728L6038M6702M9080L2556K145
$$ -1756471 -1728395 -1748069 -1726520 -1723261 -1651887 -1646607 -1605879 -1569841 -1523139 -1474059 -1441503 -1439358
16359a439358L647K0737N0828J0151J1151J3509P633P0430O3355K4395j4351L6274
$$ -1439358 -1435711 -1414974 -1364146 -1353995 -1342844 -1329335 -1321702 -1251272 -1187917 -1163522 -1177873 -1141599
16347a141599J909P228N385N4216N9355o199J2904N0480J3737o242N8917J9944
$$ -1141599 -1139690 -1132462 -1127077 -1072861 -1013506 -1019705 -1006801 -956321 -942584 -948826 -889909 -869965
16335h69965Q646P0012L8727J2750k0364O868N1973K5966P2718K5995L8797m0994
$$ -869965 -861319 -791307 -752580 -739830 -760194 -753326 -701353 -675387 -602669 -576674 -537877 -578871
16323e78871L9795j1903k9043J04531K7799L0940k1544M9145L267J3930N0194
$$ -578871 -539076 -550979 -580022 -475491 -447692 -416752 -438296 -389151 -385884 -371954 -321760
16312c21760J6876M3681J53k2344M5731r287o864N7150O3279n377K7528M4426
$$ -321760 -304884 -261203 -261050 -283394 -237663 -246950 -253814 -196664 -133385 -138762 -111234 -66808
16300f6808L6935K8911k1568M2723L8728j921N6814k3846k2955Q4993L6354n4413
$$ -66808 -29873 -962 -22530 20193 58921 57000 113814 89968 67013 152006 188360 133947
16288A33947J5138L1843k4632K2375O9294O4224n7847N3703k18M2496k566j8316
$$ 133947 149085 180928 156296 178671 247965 312189 254342 308045 307827 350323 347757 329441
16276C29441Q635O0917J8035Q585P7869n715l125j808M7206l5713N5129N78L3526
$$ 329441 338076 398993 417028 425613 503482 497767 494642 492834 540040 504327 559456 560034 593560
16263E93560R4019n592L0160m7703q888M0410L8461M564P1734m4445q609L3729
$$ 593560 687579 681987 712147 664444 655556 695966 734427 738991 810725 766280 757671 791400
16251G91400j5442P2824K9158r067L9729j1958m3604P9666j1394J7020M9842l5623
$$ 791400 775958 848782 877940 868873 908602 896644 853040 932706 921312 938332 988174 952551
16239I52551M541J2558n616P1476m1495k2686N2872N5948K5873L8530K2419k0320
$$ 952551 957092 969650 964034 1035510 994015 971329 1024201 1080149 1106022 1144552 1166971 1146651
16227A146651k1569L8169J7176M5018J9889p4372L7893J0028N2051P4006m4588
$$ 1146651 1125082 1163251 1180427 1225445 1245334 1170962 1208855 1218883 1270934 1344940 1300352
16216A300352m3029P588M0215k2644m9624M3886K5260K6277M061n492O4237J9037
$$ 1300352 1257323 1264911 1305126 1282482 1232858 1276744 1302004 1328281 1332342 1326850 1391087 1410124
16204A410124m641K3268K8445l5618J3556P1479k9068n1021l6816M4194j2357
$$ 1410124 1405483 1428751 1457196 1421578 1435134 1506613 1477545 1426524 1389708 1433902 1421545
16193A421545L3040M4323k496K9282m1013L2223M3829j7110j720P9094k6985j7393
$$ 1421545 1454585 1498908 1496412 1525694 1484681 1516904 1560733 1543623 1541903 1620997 1594012 1576619
16181A576619j5481n0779O2118L6503m9844N3082L8489O0978n9724J0229k6586
$$ 1576619 1561138 1510359 1572477 1608980 1559136 1612218 1650707 1711685 1651961 1662190 1635604
16170A635604o1870R1325M8291l2965J5323k6913j0567J0924n170N9152K5541
$$ 1635604 1573734 1665059 1713350 1680385 1695708 1668795 1658228 1669152 1663982 1723134 1748675
16159A748675J501l7514Q8212K1342k6066n1855L1786P666l6123N738j0510O3076
$$ 1748675 1750176 1712662 1800874 1822216 1796150 1744295 1776081 1783747 1747624 1753362 1742852 1805928
16147A805928l639J4998m0735K808p754k2697K3027o476J4530J3438J3669k4736
$$ 1805928 1802289 1817287 1776552 1779360 1771606 1748909 1771936 1765460 1779990 1793428 1807097 1782361
16135A782361L1458j4896o435k0398l6070K8002N2289L456K6238l8594K6483l0504
$$ 1782361 1813819 1798923 1792488 1772090 1736020 1764022 1816311 1819767 1846005 1807411 1833894 1803390
16123A803390P3110l5588Q455m9050K2050N0782j7548P6057k975j5111J3310N8398
$$ 1803390 1876500 1840912 1849367 1800317 1822367 1873149 1855601 1931658 1928683 1913572 1926882 1985280
16111A985280j7054o4500K6504m9948J9432j8892J9053O8821J97M1886Q562l4167
$$ 1985280 1968226 1903726 1930230 1880282 1899714 1880822 1899875 1968696 1968893 2010779 2019341 1985174
16099A985174m9806O887l4431j909M4419M1206N105L3958q0053p2078j0956Q8889
$$ 1985174 1935368 1942255 1907824 1905915 1950334 1991540 1996645 2030603 1950550 1878472 1867516 1956405
16087A956405P4305n0279j1594j889k6547J1838m9157k4251j8930M4167n2507
$$ 1956405 2030710 1980431 1968837 1966948 1940401 1952239 1903082 1878831 1859901 1904068 1851561
16076A851561L2999M1069k179J7347K8087j7199N514m8927l7792L4518N4858k4356
$$ 1851561 1884560 1925629 1923450 1940797 1968884 1951685 1957199 1908272 1870480 1904998 1959856 1935500
16064A935500J1364M4174j2277m1800L2314q387J8178K6041K5194l6810o308J6108
$$ 1935500 1946864 1991038 1978761 1936961 1969275 1960888 1979066 2005107 2030301 1993491 1987183 2003291
$$ [...]
##END NTUPLES=NMR SPECTRUM
##END=
