##TITLE=1H_DE-80H_X3
 200.13MHz, d2o
 8 sc
 
 19ns.26.2.2025
##JCAMPDX= 6.0         $$ Bruker NMR JCAMP-DX V2.0
##DATA TYPE= NMR SPECTRUM
##DATA CLASS= NTUPLES
##ORIGIN= UXNMR, Bruker Analytische Messtechnik GmbH
##OWNER= pz
$$ XWIN-NMR		Version 3.5
$$ Wed Jun 11 11:44:30 2025 Russian Standard Time (UT+4h)  Yarkov@DPX200
##.OBSERVE FREQUENCY= 200.1313
##.OBSERVE NUCLEUS= ^1H
##.ACQUISITION MODE= SIMULTANEOUS
##.ACQUISITION SCHEME= undefined
##.AVERAGES= 8
##.DIGITISER RES= 18
##SPECTROMETER/DATA SYSTEM= spect
##.PULSE SEQUENCE= zg30
##.SOLVENT NAME= CDCl3
##.SHIFT REFERENCE= (INTERNAL, CDCl3, 0, 15.5431)
##AUDIT TRAIL= $$ (NUMBER, WHEN, WHO, WHERE, WHAT)
$$ ##TITLE= Audit trail, XWIN-NMR		Version 3.5
$$ ##JCAMPDX= 5.01
$$ ##ORIGIN= Bruker BioSpin GmbH
$$ ##OWNER= Yarkov
$$ C:/Bruker/XWIN-NMR/data/yarkov2/nmr/H-C/1/pdata/1/auditp.txt
$$ ##AUDIT TRAIL=  $$ (NUMBER, WHEN, WHO, WHERE, WHAT)
(   1,<2025-06-11 11:43:22.67 +0400>,<Yarkov>,<DPX200>,
      <created by zg, POWCHK disabled, PULCHK disabled
       configuration hash MD5:
       00 E9 B6 7A A2 85 ED C7 34 08 36 98 17 FE 4E 26
       data hash MD5: 16K
       15 BA 74 09 13 6B 11 F4 A0 45 1E C3 CC D3 1E 7C>)
(   2,<2025-06-11 11:43:43.10 +0400>,<Yarkov>,<DPX200>,
      <Start of raw data processing
       efp BC_mod = 2 LB = 0.25 FT_mod = 6 PKNL = 1 PHC0 = -1714.501 PHC1 = 9.76656 SI = 16K 
       data hash MD5: 16K
       1C E8 4E 0E CE 9E 91 7D E0 6D D9 D5 13 2F 98 AE>)
(   3,<2025-06-11 11:43:47.03 +0400>,<Yarkov>,<DPX200>,
      <abs ABSG = 5 
       data hash MD5: 16K
       0A 6F B4 A7 28 FD 7E BD 30 DF 67 E2 E0 61 1C B1>)
$$ ##END=
$$ 
$$ hash MD5
$$ 35 50 E5 3C 42 31 3E B5 BA C1 88 79 10 B5 A5 98
##$RELAX= 
##$RELAX= 
##$RELAX= 
##$RELAX= 
##$RELAX= 
##$RELAX= 
$$ Bruker specific parameters
$$ --------------------------
##$DU= <C:/Bruker/XWIN-NMR>
##$EXPNO= 1
##$NAME= <H-C>
##$PROCNO= 1
##$TYPE= <nmr>
##$USER= <yarkov2>
##$AMP= (0..31)
100 100 100 100 100 100 100 100 100 100 100 100 100 100 100 100 100 100 
100 100 100 100 100 100 100 100 100 100 100 100 100 100 
##$AQSEQ= 0
##$AQ_mod= 1
##$AUNM= <au_zg>
##$AUTOPOS= <>
##$BF1= 200.13
##$BF2= 200.13
##$BF3= 200.13
##$BF4= 200.13
##$BF5= 200.13
##$BF6= 200.13
##$BF7= 200.13
##$BF8= 200.13
##$BYTORDA= 1
##$CFDGTYP= 0
##$CFRGTYP= 5
##$CHEMSTR= <none>
##$CNST= (0..31)
1 1 145 1 1 1 1 1 1 1 1 1 1 1 1 1 1 1 1 1 1 1 1 1 1 1 1 1 1 1 1 1 
##$CPDPRG= <>
##$CPDPRG1= <>
##$CPDPRG2= <>
##$CPDPRG3= <>
##$CPDPRG4= <mlev>
##$CPDPRG5= <mlev>
##$CPDPRG6= <mlev>
##$CPDPRG7= <mlev>
##$CPDPRG8= <mlev>
##$CPDPRGB= <>
##$CPDPRGT= <>
##$D= (0..31)
0 0.7 0 0 0 0 0 0 0 0 0 0.03 0 0 0 0 0 0 0 0 0 0 0 0 0 0 0 0 0 0 0 0 
##$DATE= 1749627802
##$DBL= (0..7)
120 120 120 120 120 120 120 120 
##$DBP= (0..7)
150 150 150 150 150 150 150 150 
##$DBP07= 0
##$DBPNAM0= <>
##$DBPNAM1= <>
##$DBPNAM2= <>
##$DBPNAM3= <>
##$DBPNAM4= <>
##$DBPNAM5= <>
##$DBPNAM6= <>
##$DBPNAM7= <>
##$DBPOAL= (0..7)
0.5 0.5 0.5 0.5 0.5 0.5 0.5 0.5 
##$DBPOFFS= (0..7)
0 0 0 0 0 0 0 0 
##$DE= 6
$$ [...]
##$SUBNAM3= <"">
##$SUBNAM4= <"">
##$SUBNAM5= <"">
##$SUBNAM6= <"">
##$SUBNAM7= <"">
##$SUBNAM8= <"">
##$SUBNAM9= <"">
##$SW= 18.0517328524113
##$SWIBOX= (0..15)
0 0 2 0 0 0 0 0 0 0 0 0 0 0 0 0 
##$SW_h= 3612.71676300578
##$TD= 16384
##$TD0= 1
##$TE= 0
##$TE2= 300
##$TE3= 300
##$TEG= 300
##$TL= (0..7)
0 120 120 120 120 120 120 120 
##$TP= (0..7)
150 150 150 150 150 150 150 150 
##$TP07= 0
##$TPNAME0= <>
##$TPNAME1= <>
##$TPNAME2= <>
##$TPNAME3= <>
##$TPNAME4= <>
##$TPNAME5= <>
##$TPNAME6= <>
##$TPNAME7= <>
##$TPOAL= (0..7)
0.5 0.5 0.5 0.5 0.5 0.5 0.5 0.5 
##$TPOFFS= (0..7)
0 0 0 0 0 0 0 0 
##$TUNHIN= 0
##$TUNHOUT= 0
##$TUNXOUT= 0
##$USERA1= <user>
##$USERA2= <user>
##$USERA3= <user>
##$USERA4= <user>
##$USERA5= <user>
##$V9= 5
##$VALIST= <valist>
##$VCLIST= <CCCCCCCCCCCCCCC>
##$VD= 0
##$VDLIST= <DDDDDDDDDDDDDDD>
##$VPLIST= <PPPPPPPPPPPPPPP>
##$VTLIST= <TTTTTTTTTTTTTTT>
##$WBST= 1024
##$WBSW= 4
##$XGAIN= (0..3)
0 0 0 0 
##$XL= 0
##$YL= 0
##$YMAX_a= 381030
##$YMIN_a= -405755
##$ZGOPTNS= <>
##$ZL1= 120
##$ZL2= 120
##$ZL3= 120
##$ZL4= 120
##$ABSF1= 15.70393
##$ABSF2= -2.347923
##$ABSG= 5
##$ABSL= 3
##$ALPHA= 0
##$AQORDER= 0
##$ASSFAC= 0
##$ASSFACI= 0
##$ASSFACX= 0
##$ASSWID= 0
##$AUNMP= <proc_1d>
##$AZFE= 0.1
##$AZFW= 0.1
##$BCFW= 0
##$BC_mod= 2
##$BYTORDP= 0
##$COROFFS= 0
##$CY= -3
##$DATMOD= 1
##$DC= 0
##$DFILT= <>
##$DTYPP= 0
##$F1P= 0
##$F2P= 0
##$FCOR= 1
##$FTSIZE= 16384
##$FT_mod= 6
##$GAMMA= 0
##$GB= 0
##$INTBC= 1
##$INTSCL= 3.241238e-09
##$ISEN= 128
##$LB= 0.25
##$LEV0= 0
##$LPBIN= 0
##$MAXI= 10000
##$MC2= 0
##$MEAN= 0
##$ME_mod= 0
##$MI= 1.114404
##$NCOEF= 0
##$NC_proc= -6
##$NLEV= 6
##$NOISF1= 3.799351
##$NOISF2= 2.8
##$NSP= 0
##$NTH_PI= 0
##$NZP= 0
##$OFFSET= 15.54306
##$PC= 1
##$PHC0= -1714.501
##$PHC1= 9.76656
##$PH_mod= 1
##$PKNL= yes
##$PPARMOD= 0
##$PSCAL= 0
##$PSIGN= 0
##$REVERSE= no
##$SF= 200.129995726989
##$SI= 16384
##$SIGF1= 3
##$SIGF2= 2
##$SINO= 0.751879
##$SIOLD= 32768
##$SREGLST= <19F.Aceton>
##$SSB= 0
##$STSI= 16384
##$STSR= 0
##$SW_p= 3612.71676300578
##$SYMM= 0
##$S_DEV= 0
##$TDeff= 16384
##$TDoff= 0
##$TI= <>
##$TILT= no
##$TM1= 0
##$TM2= 0
##$TOPLEV= 0
##$USERP1= <user>
##$USERP2= <user>
##$USERP3= <user>
##$USERP4= <user>
##$USERP5= <user>
##$WDW= 1
##$XDIM= 16384
##$YMAX_p= 300755434
##$YMIN_p= -321877
$$ End of Bruker specific parameters
$$ ---------------------------------
##NTUPLES= NMR SPECTRUM
##VAR_NAME=  FREQUENCY,     SPECTRUM/REAL,   SPECTRUM/IMAG
##SYMBOL=    X,             R,               I
##VAR_TYPE=  INDEPENDENT,   DEPENDENT,       DEPENDENT
##VAR_FORM=  AFFN,          ASDF,            ASDF
##VAR_DIM=   16384,         16384,           16384
##UNITS=     HZ,            ARBITRARY UNITS, ARBITRARY UNITS
##FACTOR=    0.220516191357247, 1,           1
##FIRST=     3110.63259197056, 0,            0
##LAST=      -502.084171035217, 0,           0
##MIN=       -502.084171035217, -321877,     0
##MAX=       3110.63259197056, 300755434,    0
$$ Real data points
##PAGE= N=1
##DATA TABLE= (X++(R..R)), XYDATA
$$ [...]
8440 129998 41151 5911 107095 99681 35957 59889 79100 46898 81050 75852 -41363 16191
8428 16191 57781 92709 60944 12865 80622 59305 39122 78698 94434 101178 54659 41698
8416 41698 9072 -12711 -35867 25677 68424 -20701 -2562 15656 19414 6342 12082 -11912
8404 -11912 -28966 -28894 24307 23775 22248 -9233 8078 25705 32796 -37127 -50682 -100298 27065
8391 27065 23147 -24823 -21326 -26927 -43245 5285 89372 -23920 -71310 -77992 -67740 -106797
8379 -106797 -70466 26244 -46300 -98218 -80414 -46237 -11348 -31490 4728 4625 -3980 -77623
8367 -77623 -46739 -58953 -80163 -40604 -42019 -41482 -45100 -23197 -23951 -21175 -39427 -122687 -61234
8354 -61234 -61378 -130793 -126827 -81917 28604 -5057 -57624 -28112 -46973 -55354 -85624 -83910 -52459
8341 -52459 -51166 -3938 -4451 -22828 17092 -35569 -72600 -13920 -4879 -4413 -39642 -32213 -79152
8328 -79152 -60958 -25237 -67168 -59944 -42631 -44051 -27886 -24020 -48147 -16661 -36350 -54750
8316 -54750 -128834 -141225 -11893 -33523 -30460 27018 -5925 -15928 -50896 -48094 -20341 -12799
8304 -12799 -48783 -59266 -52034 -35016 46159 -8174 -50801 -10165 -25076 -21414 6202 6884 -13994
8291 -13994 -60607 -44585 -47500 -51207 -51634 -789 40980 57128 -9486 -30304 7027 -65683 -55657
8278 -55657 25232 -31243 -119896 -100118 -45475 -105863 -129257 -78957 -72450 -10542 -6254 -16037
8266 -16037 -7407 -18347 -17993 -27639 -27454 -407 13464 -2650 -33880 -131772 -99302 -34938 -31157
8253 -31157 -43 -34836 -75982 -137696 -132607 -88389 -74948 -49001 -10694 -10646 34813 31849 -32827
8240 -32827 -31930 12156 -68439 -19897 11725 -8574 -51722 -26919 -55164 -12322 -3574 -43921
8228 -43921 -32337 -21157 -43376 -28360 -5859 -60359 -63822 -72399 -97574 -18571 563 -56522
8216 -56522 -24598 -26447 -59799 -67422 -125088 -143300 -86287 -111326 -120212 -51378 -68632 -93197
8204 -93197 -41413 -44172 38660 -3635 -4817 9478 -14237 -132597 -137759 -187809 -129864 -136891
8192 -136891 106366 128673 -76438 -6834 -39474 17550 48069 62817 -36657 -46564 -24942
8181 -24942 18074 25770 -34286 -29360 -53199 -65941 -18647 -24810 -22424 -38509 -41456 -8320 -86769
8168 -86769 -56973 -46490 -96826 -91645 -133540 -31233 -56495 -44881 -11277 -57578 -68697 -49471
8156 -49471 -29778 -35924 -72269 -64332 -54057 -29055 -69224 -75257 -24275 -32819 -12769 -29283 -24044
8143 -24044 6606 41045 30076 -16268 156 46189 33522 -42408 -31626 15958 20662 1901
8131 1901 -36211 -91726 -101410 -104030 -63157 -24571 -77805 -49319 -48898 -20092 -62435 -87356 -99695
8118 -99695 -52561 -62016 -70104 -88309 -31557 -13090 -51232 -15698 -37181 -75981 -155745 -114860
8106 -114860 -63980 -19372 -29706 -48035 -55220 -43704 -19495 -17445 -11535 -24928 -42263 -64335
8094 -64335 4357 -48288 -77130 -83120 -88169 -69807 -43250 18895 16559 -9495 -25205 43693
8082 43693 30338 -3531 640 -59960 -10497 62925 101827 105979 4129 -49055 -8048 3045
8070 3045 -3587 -13171 -29127 -76412 -120836 -154852 -99897 -45700 -8988 -52996 -26542 15398
8058 15398 35865 80965 40139 44164 45567 52601 39004 75997 38390 11334 12960 -2175 -37903
8045 -37903 3326 -10801 11796 48152 13768 38283 18947 39444 103948 36685 -48272 -9523
8033 -9523 -33378 -78410 -81081 -53187 -12263 -27100 -52422 -84182 -42995 -14842 -31017 -63707
8021 -63707 43778 30999 -75876 -44720 266 -4177 -28110 -39484 -50817 -36346 39356 15135
8009 15135 21876 24818 -37265 -50663 -30351 -62924 -69311 -21223 12906 65599 54638 -48442
7997 -48442 -53247 -19805 -69315 -76724 -41663 -41936 -63241 7142 -85784 -89550 -22691 6204 18676
7984 18676 -887 67559 60916 35756 56790 40945 46439 61364 86845 61238 25834 -45336
7972 -45336 -53992 -57578 -107310 -20993 -6738 -15064 25439 3726 -26905 3449 -28548 -45930
7960 -45930 10173 -14967 -33501 -74084 -19313 -18620 -2606 -57798 -22677 11995 -7078 5683
7948 5683 -40812 -34752 -66754 -62646 -8712 -77311 -170657 -88111 -44347 -38938 -63302 -139990 -162017
7935 -162017 -92322 -58601 -48208 -61009 -77075 -30152 -30686 -59053 -34443 -74188 -75040 -103339
7923 -103339 -150343 -114508 -29041 3446 -67683 -96778 -8217 40857 13238 13702 -31924 -62300
7911 -62300 -28427 -23933 4831 -26508 -80999 -56647 -26608 -14454 26473 3226 67363 19486
7899 19486 -56904 -68559 -127787 -119328 -119702 -55989 -73326 -39931 -54126 -66901 -35089 -48668
7887 -48668 -66359 -77214 -43077 -39352 -23649 -36935 -11919 -7923 -40489 15249 -9330 -48257
7875 -48257 -32377 -18275 -1979 -25780 -57847 -90348 -131004 -66891 -48295 -20963 -28196 -34877
7863 -34877 -32590 4200 -6307 -38240 19274 -28922 16581 -5953 -27491 -19705 -18661 -439
7851 -439 32084 68376 85166 4670 28880 123506 140491 57152 31536 9332 -65316 -28040
7839 -28040 -14424 -48973 -36900 -62845 -78014 748 -28101 -83901 -46086 12539 2970 -37629
7827 -37629 -92241 -52774 1836 26965 7863 -37638 -41584 -56726 -32512 -54790 -34607 -33837
7815 -33837 -67316 -23669 -26363 57091 13213 36580 87092 213852 -79745 -321877 -178633
7804 -178633 -114588 -132190 -97594 -7207 -48707 -67347 -109279 -63090 -8590 3847 -79169 -87195
7792 -87195 -77618 -34412 -70726 -99543 13449 8448 14704 14704 -5029 -21801 -5958 -20489 -89322
7779 -89322 -68123 -61228 -3892 -21609 -49201 -83396 -67126 -27030 -35125 -36621 -66415 -38272
7767 -38272 -69129 -36594 -44616 -26316 -54737 -50615 -80664 -94932 -89426 -49077 -60067 -119121
7755 -119121 -106497 -78248 -40237 -13520 -41646 -68143 -44880 -31086 -20120 -90406 -41206 -44888
7743 -44888 -70433 -119049 -40842 -108004 -82395 -99153 -73977 -68917 19742 16555 -108263 -61468
7731 -61468 -97828 -122289 -56279 -35616 -70410 -97378 -149470 -92486 -35274 -80906 -55053 -671
7719 -671 41126 36290 68759 21498 -9218 22160 -43622 -56927 -64500 -23943 -92010 -47280 -15650
7706 -15650 -92022 -99718 -78807 -69386 19406 4898 -68141 -58175 -66540 -123294 -48666 -95993 -62696
7693 -62696 -60489 -98022 -36325 -1037 14212 -49601 -36230 -25116 -56215 -34586 -29584 -33129
7681 -33129 -53088 -78302 -130719 -160777 -112833 -118550 -110617 -116106 -117562 -73174 -70525 -68010 -89545
7668 -89545 -63246 -35108 -15404 -36016 -37391 -11484 -20399 -32580 -21176 26681 41829 -23149
7656 -23149 -64960 -77759 -101590 -54519 4834 -31787 -136137 -102368 -69516 -52129 -54203 -58145
7644 -58145 -64728 -73396 -66016 -28191 8636 -11087 -44859 -24267 -18121 -27837 -65931 -37841 -54841
7631 -54841 17243 -818 -57534 9808 48423 6928 18874 41232 18984 -53083 -79945 -47787
7619 -47787 -47687 -49772 -64861 -71941 -45601 -2043 -48252 -16898 715 -76899 -69093 -1466 42218
7606 42218 28897 -32580 -22075 -12191 -11460 34213 69928 27351 6477 -8266 -48468 -55352 -19540
7593 -19540 -12886 -65310 -23359 79292 91043 38095 32379 17432 -32633 -36836 -86470 4127
7581 4127 60881 10185 916 -29702 -55164 14651 52883 23326 11777 33604 -3487 -1930
7569 -1930 10305 -12812 -23996 9626 29556 -11447 -55439 -33235 -66029 -72023 -123456 -40943
7557 -40943 22624 11889 21822 13704 -3221 -13798 3371 43743 -6299 -78715 -47878 -851
7545 -851 -29663 -49805 -69467 -23340 -13065 -70149 -41445 -38602 -22068 -27932 12149 6001 43887
7532 43887 -6472 -74404 -102225 -50459 32864 29633 66274 55167 21015 -41704 -90625 -90971
7520 -90971 -66092 -40274 -51069 -33253 -16966 7641 38699 101932 41288 -84394 -70232 -53623
7508 -53623 -87674 -28289 -13048 -187 -10987 -32102 -10024 -8321 -59579 -76019 -44845 -5649
7496 -5649 4964 -69502 -100979 -82908 -61545 -22921 -82923 -1497 -10592 -21737 -96836 -151159
7484 -151159 -89005 -14343 -4843 -6445 -14448 -48846 -18330 -55328 -47978 24022 -9330 -61956
7472 -61956 -17451 -53747 -89849 -43194 -11908 -14540 -64786 -44283 -22621 77101 12663 13163
7460 13163 6111 40171 44390 18698 -37720 -6809 12673 -63138 -16121 -5337 -53400 -68599
7448 -68599 -26833 -54409 -52087 -77876 -59764 -55732 -41257 -17669 24203 -42947 -18334 -5835
7436 -5835 1586 -9535 3292 7346 -80 14841 -12497 -38198 -38743 -81512 1603 -6723 19855
7423 19855 -68805 -49412 5253 -8179 -52657 -88938 -70317 -12725 -471 12159 16161 -3661
7411 -3661 -54527 -129020 -51675 -40800 14472 22566 -24275 -10169 -20237 -57217 -53258 -42293
7399 -42293 -9991 -45179 -117716 -84025 -51617 -69051 -47926 -66948 -26639 17267 -10371 1830
7387 1830 32267 -45442 -92719 -53013 -59387 -53278 81708 61175 3240 -85283 -73296 -63678
7375 -63678 -128098 -95950 -98895 -111102 -74836 -75938 -30100 40957 -37803 -10246 -32268 -102566
7363 -102566 -103419 -98239 -84581 -51955 -62589 -99430 -38594 -15084 -12527 45540 7707 41742
7351 41742 33932 31245 27826 69720 991 -19286 -16762 -27075 -65944 -74647 -33668 -590 61300
7338 61300 40685 -94562 -116900 -71341 -3048 -59305 -55766 -55036 -62503 -64975 -72303 -605 14778
7325 14778 -21233 -45810 -42364 -38254 -76199 -58521 -13997 -54392 -74149 -62659 -92405 -77458
7313 -77458 13721 54479 25227 1277 -12101 -43581 -55777 -59842 28852 -125628 -139415 -145781
7301 -145781 -46466 -38356 -52201 -97983 -87655 -81984 -77836 -84763 -25951 26058 -79859 -86346
7289 -86346 -16008 -31437 -50500 -81064 -19078 -125713 -53593 36624 3318 -52459 -71963 -71559
7277 -71559 -64548 -46967 -74907 -15013 -13141 -67089 -37841 -42280 -71892 -107744 -97062 -54731
7265 -54731 -73437 -23983 -43171 -98385 -40614 30561 12198 10464 -98917 -105224 280 -43348
7253 -43348 -56028 9460 51351 54425 19273 -23163 -35725 -11267 54466 76483 12509 3147
7241 3147 -36469 -25576 33402 3526 -3573 24788 -27028 -86806 -82175 30383 22162 -48902
7229 -48902 -31698 19873 43626 26668 -38693 -22579 -1199 54168 -38756 -59757 -55261 -83367
7217 -83367 -138700 -100137 -71722 -42046 -70508 -58849 37963 -20886 -136158 -53355 29945 16212
7205 16212 16765 51185 66540 58779 53449 23544 -55801 -108424 6474 -16287 -37322 -38467 -56982
7192 -56982 -66055 -73798 -50152 -5159 -72529 -58527 -22807 -45229 -27898 -92964 -48217 -9278
7180 -9278 13335 -31631 23710 -24783 -13764 35340 -56009 10409 115713 135107 29860 -3776
7168 -3776 -43643 -84220 -55652 -64305 -8170 78202 101315 67939 5974 -47811 -29337 -92597
7156 -92597 -35284 4702 55202 30814 10519 63937 24768 -20038 -66987 -45844 10112 2871
7144 2871 -4537 -7836 -429 78556 21824 -45990 5106 -1567 -25253 18082 -17663 9888 -31003
7131 -31003 10755 -30433 -11051 44192 22245 -50703 -69794 16396 1973 11260 67973 80445
7119 80445 18191 -24745 30048 25572 73698 153124 90394 16942 35368 18648 -34516 32354
7107 32354 14915 9544 12475 -5957 -53962 -51678 31843 -16798 -4430 -5910 17455 32535 13338
7094 13338 56060 36703 43936 -50906 -59503 8588 -58688 -1482 -52084 -105461 -128833 -70211
7082 -70211 31574 36304 910 -4523 9467 -92168 -157782 -90939 -7902 5107 30967 23118
7070 23118 5199 22703 12242 624 -102637 -84298 -59800 -54615 -32001 -65377 -119773 -77961
7058 -77961 -22284 1545 -17891 36488 -10254 -13462 -58601 -54573 -51585 -57963 -47395 -68870 -49231
7045 -49231 -33449 -21606 16136 12522 -11256 -243 -15796 10738 -18722 -43165 -27514 -89509
7033 -89509 -52610 -2750 -34188 -30457 -21330 -53637 -71565 -13624 -17721 27709 -17589 8984
7021 8984 -17626 64849 64553 58112 62985 60038 51417 35720 30058 -12096 36235 49969 -11411
7008 -11411 -13992 47204 39097 56615 99194 70522 46330 -7624 -3 -1521 -247 43116 77773
6995 77773 76157 116359 110599 111762 70103 63754 47783 71294 108404 186966 221083 192150 140945
6982 140945 129220 107623 106484 120196 89511 71411 20052 56914 38242 12522 13208 6294
6970 6294 33046 19309 23684 5076 30651 -14991 -20830 -7981 12062 -6356 22847 25954 6077
6957 6077 45425 35698 26620 108439 112147 43337 40689 -30533 -52962 -86778 -3564 15474 49621
6944 49621 82416 51258 24523 1907 -40730 -11513 -25953 76718 90186 21625 -46005 -18363
6932 -18363 32960 46903 50286 56255 -5675 26018 24373 -52417 6010 25159 14984 11673 11249
6919 11249 26510 -13892 -35689 -17394 39809 41270 -41319 -38327 -77967 -23767 -10473 3498
6907 3498 -23934 -80504 -22056 41931 24516 -5302 -7485 19039 18411 -16019 -1149 -21679 -47554
6894 -47554 -13805 8773 34572 -36956 -15470 21392 -16877 -44016 963 33423 14397 55467
6882 55467 25819 42144 -29591 13467 30130 -19580 -19661 37435 7680 43765 52425 -7512 23196
6869 23196 75451 36219 -29138 -5656 -30049 -52835 -54401 -16353 -5319 13125 44681 16311
6857 16311 36450 27341 29419 37008 -69473 -36768 -25139 -30604 -11331 22714 94042 68740
6845 68740 57267 55454 32801 13425 10558 -18412 37580 128639 56975 2556 11986 3330 -1325
6832 -1325 52304 42897 62106 685 44780 133332 93670 109658 71709 2572 2615 43564 34932
6819 34932 -11198 -2116 80167 84858 47063 75044 37146 1182 77471 61107 25016 29759
6807 29759 77954 130584 68871 24276 56554 40928 -7750 65835 77813 23418 57867 81180
6795 81180 53776 111783 117240 77957 91019 84538 101193 111995 43164 63197 101420 114385
6783 114385 189246 150044 128487 177889 238645 266410 284243 269227 219654 219684 279876 281031
6771 281031 214208 254313 276481 275525 283630 223644 252196 311634 358725 404628 367196 365971
6759 365971 413021 392233 436871 417007 505491 540519 545415 617072 651245 629447 581880 676851
6747 676851 749409 725918 655449 612719 643422 668978 583030 566273 527663 493980 512617 561268
6735 561268 661431 665080 696501 699740 696823 801643 805540 862703 915245 951363 1003568 1144536
6723 1144536 1160596 1190538 1248716 1406227 1477772 1469934 1472122 1318529 1237848 1111154 1013306
6712 1013306 1012232 985508 978881 941450 902364 895481 934100 993195 1012439 994197 1003510 1143681
6700 1143681 1179688 1167111 1152105 1288769 1429880 1480156 1589812 1678481 1780562 1821342 1850815
6689 1850815 1803371 1717850 1600912 1439949 1312096 1205396 1111767 1025551 948483 948358 878752
6678 878752 905200 935381 898089 846438 837961 872417 898699 931434 1001602 1052829 1027479 1127004
6666 1127004 1196328 1279017 1387551 1452952 1436928 1365051 1292657 1164987 1037005 940356 836484
6655 836484 750971 711051 690746 687364 606450 472531 461884 472045 430990 400982 477744 455124
6643 455124 498383 552033 452347 473465 546995 528453 551956 518198 601996 549568 520972 511415
6631 511415 469410 431431 466673 351956 291997 332168 333043 249477 210996 219246 240757 247558
6619 247558 260137 227284 199831 204991 177172 179808 189339 197892 161714 183623 178590 190719 192325
6606 192325 164428 89430 99676 81962 175080 100153 54434 37213 36619 21320 80224 127092
6594 127092 119009 132277 59611 88711 95158 64426 91508 47185 38887 98360 64732 42158
6582 42158 92719 109830 76316 75129 115498 125585 90138 77037 50793 75749 65965 -16216
6570 -16216 22516 5994 23485 31986 51667 25557 9486 18204 56479 102697 96446 66244
6558 66244 22533 78545 91704 107782 110516 118926 83738 30764 24253 22722 23731 77172 73002
6545 73002 11526 23179 29681 50756 107934 64941 40679 650 -1210 -13753 -11348 14005
6533 14005 64298 67579 2990 34771 17175 13810 -2565 -23697 10391 103582 -45750 -25311
6521 -25311 63323 30744 47034 100099 142771 84822 70662 89730 146117 99651 24000 69200
6509 69200 99847 73496 86601 27462 82978 148710 75916 80804 117901 4928 24183 29121
6497 29121 29872 8556 50715 67303 294 57350 94545 100594 -17769 33134 109449 191218
6485 191218 85368 76973 134570 118518 116640 71194 31080 22540 55602 33004 58480 137285
6473 137285 121419 51880 20364 9079 67320 168071 118987 99010 105868 125751 107638 96631
6461 96631 106720 97680 131477 156418 180292 178178 127145 101969 110832 96495 113332 101582
6449 101582 84320 53225 77944 21179 12674 25357 22934 43156 110032 83571 67075 67743
6437 67743 117790 139704 150683 62588 -4039 38190 109871 119274 81195 121050 118641 99899
6425 99899 136539 187411 190723 133026 115565 82480 30361 -34338 54813 52591 26418 85425
6413 85425 58363 43142 33437 53970 109437 104707 109593 83552 81389 107970 92366 70722 63341
6400 63341 95515 78969 55399 21845 81881 117952 106724 79571 101493 159389 89633 70870
6388 70870 147674 141335 130680 81241 47265 62341 149587 72322 23457 21389 46390 112370
6376 112370 134615 134569 105182 90540 122283 77101 56511 18153 70629 144891 95126 167059
6364 167059 161933 88259 44740 74585 158449 154836 138921 146311 187417 186613 65134 75140
6352 75140 112099 119748 111600 159563 177513 187818 111985 127358 167156 151913 141459 104129
6340 104129 107405 79540 152632 187177 154394 103074 144034 111453 125476 154326 121926 155950
6328 155950 173061 232263 184182 132825 170226 101971 99777 172813 194218 107236 124644 77294
6316 77294 63079 87736 141454 127358 110583 154562 191146 232513 257023 223171 186920 200772
6304 200772 152588 150663 160071 180432 152973 124816 122036 105508 134032 124117 125880 135481 112429
6291 112429 47954 48241 149344 108519 135820 140452 130792 81103 120336 124159 156260 130077
6279 130077 204467 232952 212934 207610 153897 157073 115450 191831 228029 323337 344765 264966
6267 264966 148727 126220 160253 174528 200079 253815 266506 200543 212018 203065 230496 262045
6255 262045 193929 206909 259386 216607 199674 147528 163728 198351 157117 182861 212678 223003
6243 223003 240913 245655 171924 204271 168883 224494 185440 111709 140431 188009 198774 167576
6231 167576 177802 213281 234651 255880 269548 240222 272597 213458 227232 240182 249661 212532
6219 212532 247814 284000 273919 222410 261405 174684 188341 173660 210829 283140 221340 241466
6207 241466 276373 264290 236694 250687 307376 368953 306648 298524 297119 270268 210554 237444
6195 237444 311734 328794 289852 211153 214325 322313 323318 348017 329686 257083 249576 352806
6183 352806 313216 314354 352643 338252 368896 397907 396201 379143 384990 359937 398252 493274
6171 493274 497470 507344 455158 399099 353249 309139 380408 428645 427779 483907 452971 391640
6159 391640 425831 472353 467890 462684 437305 378324 412252 495680 509044 410241 447996 468830
6147 468830 508023 478420 498582 565709 569005 565196 512723 577641 632247 650869 645037 590022
6135 590022 535572 538889 569878 580904 544562 498522 529610 532876 525941 514693 522841 592901
6123 592901 604505 614089 627440 616908 609029 615041 652851 645540 643960 636425 731090 733775 746205
6110 746205 799553 804633 814151 885151 924325 880742 870112 935857 873498 797941 792475 809738
6098 809738 894884 878696 924823 897940 868062 863395 915430 1018460 1059981 1086899 1123966 1195795
6086 1195795 1247085 1283487 1360290 1416643 1457869 1521084 1649579 1651939 1643606 1804088 1890422
6075 1890422 1914658 2078825 2231883 2333750 2494423 2668787 2787965 2867792 2903051 2963370
6065 2963370 3029837 2963953 2868320 2802208 2769223 2725212 2630805 2607383 2654349 2634725 2709379
6054 2709379 2770432 2712569 2702275 2747681 2859016 2953690 3067541 3260891 3367178 3445159 3636164
6043 3636164 3834397 4105053 4319806 4544334 4772945 4926787 5019600 4957296 4855023 4565115
6033 4565115 4215445 3945094 3707968 3470321 3287246 3033311 2901651 2768939 2613006 2579723
6023 2579723 2478695 2477022 2454708 2435242 2461884 2435093 2457269 2506820 2561722 2605159 2623134
6012 2623134 2745203 2806804 2891741 2881815 2897195 2904620 2864247 2813283 2603782 2398291 2252458
6001 2252458 2159910 1987994 1850642 1775865 1673267 1589753 1524368 1430892 1394607 1336046 1267570
5990 1267570 1318594 1325774 1190146 1103036 1119723 1091231 1071867 1062976 1101131 1075752 1095600 1045346
5978 1045346 1060720 1130775 1083634 1028307 999193 1018762 999682 970517 961274 1084759 1048094
5967 1048094 971221 1026137 1039012 1002646 970323 1040719 1004258 969439 960536 1009649 985500 936628
5955 936628 979005 936829 981908 954071 909541 970861 967984 903506 854122 829498 816723 827495
5943 827495 812361 789979 852895 823846 818251 757815 802540 754477 801408 827259 777579 831939
5931 831939 755715 761070 773261 771668 776105 840526 818762 755118 736245 726250 731364 678506 644174
5918 644174 622360 652534 632334 596965 625529 727938 641878 589083 606861 555388 521548
5907 521548 579100 616429 604596 634842 664250 697157 595990 547035 598790 559247 531534
5896 531534 575042 586076 580530 579832 615270 650476 653417 639152 597305 557097 592631 523824
5884 523824 550848 591561 571725 500658 492708 550328 569911 566386 539249 506967 507887 558412
5872 558412 534334 509220 551443 579144 555677 579297 658055 611194 657779 581384 554505 575858
5860 575858 532692 574528 659681 671416 648960 689732 678125 632498 635108 676606 714041 735032
5848 735032 799413 794876 774402 854684 826020 865486 947999 940815 887493 922703 973126 1084254
5836 1084254 1074142 1043691 1078402 1079092 1128977 1247606 1335447 1369900 1389770 1390259 1476854 1527038
5824 1527038 1615521 1675491 1797597 1898945 2000959 2166054 2287991 2550354 2735789 3024328
5814 3024328 3234611 3454610 3538123 3455257 3337493 3085500 2877027 2708101 2599724 2461481
5804 2461481 2349111 2344262 2355372 2377535 2407664 2446174 2553485 2665371 2749714 2814131 2907394
5793 2907394 3020492 3228835 3451545 3664170 3888286 4196981 4531553 4943726 5473348 6086300
5783 6086300 6738529 7428269 7942627 8109635 7801349 7158077 6277777 5548526 4985168 4546094
5773 4546094 4258522 3865568 3708183 3548233 3418135 3249457 3188687 3235436 3320375 3425893
5763 3425893 3455421 3463860 3563411 3657812 3781026 3974101 4161286 4464883 4734410 5122077
5753 5122077 5601712 6117212 6750201 7441922 7969123 8068403 7702065 7046391 6231428 5379342
5743 5379342 4735400 4210609 3735829 3354119 3054822 2930805 2785704 2654777 2549574 2434955
5733 2434955 2345491 2362237 2274242 2322864 2347882 2321914 2332476 2348666 2402781 2518905 2648990
5722 2648990 2712678 2849597 2921444 3156149 3376501 3520401 3483231 3326633 3079401 2779345
5712 2779345 2547806 2340961 2144478 2055868 1939011 1783310 1741776 1622312 1530500 1480134
5702 1480134 1503655 1549361 1444457 1382045 1358790 1389256 1412618 1393730 1381734 1381379 1400116 1353312
5690 1353312 1335397 1368137 1388662 1335162 1339786 1313262 1310387 1352580 1313479 1317403 1370636 1317405
5678 1317405 1266600 1317312 1308402 1280938 1292783 1280102 1183486 1175612 1148334 1182928 1242584 1215796
5666 1215796 1163416 1162526 1195309 1261718 1160107 1135349 1178500 1219502 1228688 1183793 1207736 1201926
5654 1201926 1161965 1186174 1200802 1242400 1264141 1225577 1257663 1240082 1221527 1338306 1324137
5643 1324137 1198217 1260384 1285115 1172406 1190569 1270975 1279613 1312382 1322615 1350313 1310108
5632 1310108 1329157 1317539 1370226 1395892 1362842 1429197 1447456 1388567 1410812 1496172 1531574
5621 1531574 1523758 1574951 1615338 1627789 1646078 1744968 1731313 1678117 1679959 1777120 1781305 1717835
5609 1717835 1774091 1807313 1822807 1804248 1759282 1791794 1805587 1831139 1911216 1955140 2022013
5598 2022013 2001933 2066037 2085744 2140693 2190067 2208533 2291788 2377881 2466597 2534857 2610557
5587 2610557 2632079 2700727 2777103 2804070 2780724 2757289 2766076 2722552 2746765 2783455 2745592 2865874
5575 2865874 2921238 2895699 2995286 3120977 3135078 3256127 3405969 3509206 3593201 3613324 3777546
5564 3777546 3835792 3964344 4099253 4223179 4401098 4520311 4618377 4770141 4866290 4956547
5554 4956547 4978936 4995451 5135260 5195795 5319877 5508526 5683707 5798937 6090094 6305540
5544 6305540 6598749 6855170 7043171 7285045 7520803 7804666 8048806 8309858 8597056 8819306
5534 8819306 9120509 9449799 9669089 9852095 10140969 10427153 10606080 10767021 10961199 11203416
5524 11203416 11419563 11644086 11856713 12095458 12353354 12564437 12842013 13213622 13482869
5515 13482869 13752748 14147423 14509557 14838845 15134890 15418063 15749786 16035999 16333320
5506 16333320 16709742 16990032 17131759 17381311 17630125 17918173 18087109 18241887 18484998
5497 18484998 18688126 18905335 19215632 19493363 19708721 19937139 20205598 20520862 20881708
5488 20881708 21157049 21410821 21727735 22060624 22222892 22476516 22667022 22834205 22986917
5479 22986917 23061467 23160585 23217067 23299854 23249685 23229901 23310292 23244587 23211530 23203241 23282307
5468 23282307 23334619 23370280 23476526 23436745 23460188 23513967 23536971 23578882 23600591 23605185 23716055
5457 23716055 23726601 23690601 23692759 23733584 23643730 23579352 23406714 23273235 23185331 22983664 22676850
5446 22676850 22325786 22025705 21636573 21278268 20969977 20693362 20383414 20004492 19744980
5437 19744980 19505734 19218717 19036713 18718998 18421457 18040178 17667517 17279612 16988673
5428 16988673 16691879 16359086 15963459 15620007 15369124 15005754 14586073 14242507 13960294
5419 13960294 13528730 13140351 12738709 12338417 11976621 11565987 11206493 10894017 10578405
5410 10578405 10269736 10039491 9767939 9475147 9223730 8930365 8701841 8434134 8119048
5401 8119048 7730761 7474060 7258652 7038044 6765752 6499901 6232828 6004809 5712972 5411460
5391 5411460 5182254 5050901 4831656 4633144 4439999 4221329 4076445 3942757 3759695 3650623
5381 3650623 3554509 3431328 3304488 3184613 3176886 3079062 3026048 2945929 2803215 2749784 2695756
5370 2695756 2607810 2568078 2533202 2542285 2577758 2477882 2285652 2219527 2193644 2085867 2016617
5359 2016617 2009482 2030855 1990926 1964980 1868732 1878905 1875216 1773025 1782259 1703581 1698159 1737834
5347 1737834 1663473 1630407 1612753 1565199 1504752 1458734 1451905 1460834 1492771 1498750 1440969 1439954
5335 1439954 1448597 1431586 1434774 1328048 1363164 1377376 1390045 1419196 1339432 1390414 1337026 1311796
5323 1311796 1384243 1313444 1312970 1271275 1211600 1210707 1278608 1228497 1200091 1186520 1129109 1131185
5311 1131185 1178387 1233658 1222653 1225748 1206886 1214392 1212925 1169656 1101223 1066999 1072336 1093383
5299 1093383 1165996 1146388 1123677 1135184 1105136 1061804 1138551 1170622 1148677 1095165 1106039
5288 1106039 1092734 1039683 1074852 1070092 1065704 1056146 1101637 1128119 1084494 1080054 1118935 1133749
5276 1133749 1113238 1079543 1117360 1167371 1114212 1115528 1157626 1163873 1153366 1163851 1168952 1079122
5264 1079122 1154218 1225412 1184305 1157958 1129505 1101879 1145221 1133833 1135406 1159916 1163863 1150535
5252 1150535 1085881 1130358 1110596 1090793 1122400 1180039 1102943 1065182 1077306 1055551 1047919 1114224
5240 1114224 1184506 1152706 1157293 1134971 1158660 1174675 1163590 1142875 1158616 1183865 1191626 1175075
5228 1175075 1187861 1220975 1282061 1260418 1235390 1228927 1193334 1203401 1301695 1378308 1350802 1351046
5216 1351046 1358538 1442379 1485147 1464924 1491115 1493484 1517277 1521297 1474202 1482785 1475608 1458514
5204 1458514 1465754 1506809 1516179 1516178 1574331 1651468 1688263 1626857 1667535 1713731 1784520 1852588 1884340
5191 1884340 1880178 1866023 2002540 2054570 2040002 2116605 2193811 2263256 2295096 2309894 2459562
5180 2459562 2451248 2528069 2654879 2779074 2888983 2826581 2902432 3000473 3084522 3128514 3216812
5169 3216812 3323145 3383308 3565061 3735546 3814173 3900062 3960012 4150944 4310220 4478890
5159 4478890 4606834 4763669 4973618 5148233 5311484 5471407 5696739 5842891 6052247 6200628
5149 6200628 6466130 6795888 6969229 7192567 7381183 7589847 7752890 7963752 8243200 8476579
5139 8476579 8634765 8775955 8977753 9179012 9441517 9643002 9741795 9871691 10080395 10320616
5129 10320616 10529089 10710559 11012857 11320194 11571567 11792382 12086363 12417091 12721660
5120 12721660 13000140 13289152 13660955 14033662 14376054 14659614 14928658 15196761 15521434
5111 15521434 15829323 16110813 16349151 16596818 16761125 16943581 17025018 17194860 17362734 17480843
5101 17480843 17622611 17791647 17933942 18022366 18101761 18178654 18322603 18444693 18535220 18636535
5091 18636535 18836677 19017002 19109584 19234574 19343919 19456175 19651643 19806253 19991902 19998583
5081 19998583 20161291 20269516 20379671 20465299 20518982 20574222 20559682 20544071 20453772 20417066 20401802
5070 20401802 20438351 20366741 20304109 20227487 20093781 20034064 19999790 19921969 19744185 19685221 19625849
5059 19625849 19487357 19343193 19165107 18971619 18820491 18665040 18519988 18316084 18170073
5050 18170073 18028860 17838626 17764557 17663057 17528804 17329447 17198419 17040532 16947054 16776566
5040 16776566 16594948 16426895 16337628 16259182 16075795 15973637 15813380 15761423 15585506 15417808
5030 15417808 15184769 14979933 14803111 14615593 14415095 14305409 14068442 13758584 13479566
5021 13479566 13254566 13110177 12882807 12612212 12301788 12056182 11832989 11633138 11486936
5012 11486936 11330069 11156338 11026481 10862190 10774652 10661264 10594207 10537595 10464613 10466095
5002 10466095 10407782 10364714 10417856 10479403 10547555 10611344 10651060 10738673 10927219 11024751 11185671
4991 11185671 11415191 11624599 11939711 12386717 13023293 13803440 14663215 15505328 15926831
4982 15926831 15719225 14881067 13661089 12384224 11192453 10215980 9419979 8761032 8292919
4973 8292919 7864859 7524781 7220578 7008743 6798030 6607727 6474523 6335011 6219253 6055642
4963 6055642 5933445 5805744 5762169 5624935 5543079 5429954 5354139 5338187 5231821 5257555
4953 5257555 5212464 5089194 4984021 4969003 4883929 4859986 4789522 4720721 4657495 4611416 4568603
4942 4568603 4604560 4523795 4451678 4397907 4358630 4375054 4348234 4302484 4252412 4224149 4168375
4931 4168375 4106785 4035320 3965069 3900336 3853318 3841486 3782575 3755010 3755488 3699843 3581960 3556552
4919 3556552 3513870 3493294 3554464 3425344 3396312 3374680 3330521 3242266 3118152 3059561 2955313
4908 2955313 2892659 2856538 2797180 2814135 2750693 2682058 2658113 2683533 2615751 2520111 2440856
4897 2440856 2426207 2376077 2320224 2303813 2281210 2161235 2126749 2107042 2032639 1996678 1926352
4886 1926352 1870784 1898139 1879459 1833430 1766355 1727741 1765118 1791715 1679528 1612966 1512189
4875 1512189 1420701 1420833 1477881 1419587 1365384 1396751 1306885 1297221 1277390 1241960 1195307 1127423
4863 1127423 1099850 1083416 1071705 1050817 1052232 1010360 980295 1036758 994550 937547 920654 899917
4851 899917 870429 863697 912547 877629 776868 795486 861139 844850 801377 764565 768780 806947
4839 806947 774187 787109 781728 762703 821842 746264 667647 657364 697367 661624 638522 660716
4827 660716 605724 599671 695177 709499 682991 734705 708802 686834 621786 669120 721965 658356
4815 658356 657567 690765 656616 688723 663817 650710 611837 606750 686532 684092 597262 656440
4803 656440 686467 676454 610690 583936 607232 576506 545700 634654 610627 564804 635899 608980
4791 608980 622172 610163 612906 625995 613925 544489 567163 632047 645842 675781 652041 565230
4779 565230 609783 659474 690193 608500 544825 598064 654588 654701 691474 722402 677931 655570
4767 655570 674316 674458 673493 636706 569755 628794 604331 526780 564769 620125 639531 619036
4755 619036 568869 546178 638814 693979 697428 713553 678698 696335 603883 619786 610597 575938
4743 575938 617735 671981 629948 594669 650583 661279 619317 649896 640466 619054 655325 603247
4731 603247 615782 558343 595997 622269 597955 615842 574533 566241 560271 571326 655610 658130
4719 658130 627242 561836 604802 640163 688473 618016 628115 608811 556864 632509 690921 701421
4707 701421 667637 739547 696971 642353 654422 640878 593173 641562 648972 638185 651166 664868
4695 664868 647926 644053 669158 705427 707122 718270 723316 720280 705315 672799 662270 696080
4683 696080 675788 692148 696827 706830 729259 776093 839910 790819 736840 754234 804813 834949
4671 834949 813371 789660 782623 815937 790889 789982 826457 820726 878486 841320 807016 790334
4659 790334 751340 718728 767899 750482 776812 786268 797003 815099 809808 770002 771093 781020
4647 781020 834592 832924 814784 773110 833414 823850 772937 817952 893303 858697 799584 808097
4635 808097 871796 878015 869443 879684 844691 873114 817874 885368 888819 937755 972545 913318
4623 913318 887162 899756 937278 961367 918731 866657 841703 943339 971718 975487 941003 942527
4611 942527 982968 1028887 1021926 1002762 1003910 1007705 987491 1058366 1064057 1057917 1026715 1061420 1039982
4598 1039982 1031530 1128133 1095039 1118848 1134611 1103590 1065886 1132153 1135674 1180466 1234444 1235069
4586 1235069 1216417 1185509 1186909 1161741 1193451 1211464 1227163 1225553 1250672 1243616 1204245 1251064
4574 1251064 1258760 1289685 1372620 1307734 1291575 1353428 1302945 1402516 1386320 1403159 1403756 1323984
4562 1323984 1381930 1427695 1396970 1393107 1390962 1491172 1438372 1387649 1402942 1461459 1476708 1468650
4550 1468650 1488153 1482316 1439960 1450076 1420975 1349607 1335445 1391467 1352276 1325647 1338791 1437323
4538 1437323 1514174 1491186 1401474 1451048 1455217 1365023 1443390 1456060 1513049 1531738 1512691 1458017
4526 1458017 1497846 1468034 1449785 1473252 1464559 1463877 1524447 1437175 1417736 1417517 1430805 1427628 1415485
4513 1415485 1393680 1448198 1459529 1497118 1504990 1529277 1503976 1510462 1551602 1465730 1465514 1496001
4501 1496001 1462744 1500160 1520556 1514641 1515784 1568802 1659186 1602804 1587570 1661047 1618577 1655788
4489 1655788 1694830 1727594 1776592 1810139 1786878 1730126 1782101 1849770 1819631 1777677 1843877
4478 1843877 1866793 1935026 1906466 1922956 1954786 2036729 2031158 2021935 2043128 2067543 2140210 2184498
4466 2184498 2213525 2230247 2211867 2176156 2175649 2247373 2316126 2346359 2379486 2404496 2414157 2435929
4454 2435929 2450482 2455078 2473526 2519888 2593019 2581679 2623937 2696525 2737521 2760789 2823904 2846504
4442 2846504 2886398 2904123 2963177 3057072 3086991 3168181 3192602 3350840 3350932 3454228 3546256 3588185
4430 3588185 3691178 3787335 3892812 4002392 4115848 4214356 4341376 4513321 4651763 4755337
4420 4755337 4941903 5132106 5296337 5494122 5689809 5930174 6144488 6397468 6654428 6879511
4410 6879511 7268776 7492719 7793739 8127310 8467347 8865800 9212459 9638178 10018138 10400236
4400 10400236 10860097 11294327 11777593 12276681 12679821 13214897 13729638 14201725 14727448
4391 14727448 15313937 15878682 16316408 16890781 17425824 17987910 18646955 19298643 19891080
4382 19891080 20432363 20971655 21437615 21718106 22067490 22412919 22695346 23017971 23357105
4373 23357105 23727755 24087967 24443941 24797572 25146238 25345711 25551065 25561327 25490858 25389102
4363 25389102 25271244 25108275 24842917 24680142 24528717 24395393 24341368 24257643 24122625 24005420
4353 24005420 23856322 23624283 23273762 22927331 22613419 22255385 21903099 21612864 21318500
4344 21318500 21075634 20814180 20612397 20490509 20294933 20216533 20089554 19986217 19956170 19875345
4334 19875345 19751945 19759519 19698150 19576433 19626100 19718491 19837658 19934986 20012308 20124004 20338411
4323 20338411 20470234 20579884 20715134 20961342 21204971 21397086 21552914 21734664 21909549
4314 21909549 22119046 22301237 22562452 22822911 23008768 23195812 23522725 23782981 23922994
4305 23922994 24222577 24604306 24889788 25189702 25478212 25741485 26024806 26265879 26433172
4296 26433172 26680048 26863585 27015945 27192357 27273208 27346273 27371146 27494034 27518507 27523244
4286 27523244 27547680 27517190 27542256 27673915 27687000 27605550 27588495 27518262 27470422 27385744 27429645
4275 27429645 27425666 27342290 27254786 27120601 26985325 26812718 26613878 26410304 26116340 25763494
4265 25763494 25458589 25171355 24838036 24490142 24179216 23827297 23464097 23123282 22775775
4256 22775775 22409856 22113180 21845236 21550661 21285487 21114313 20873288 20673341 20504010
4247 20504010 20365448 20096679 19915088 19789094 19633628 19353394 19030242 18835616 18601638
4238 18601638 18219895 17885029 17535226 17221317 16917258 16583935 16228653 15859610 15522416
4229 15522416 15259345 14916733 14636396 14319602 13951039 13700469 13420449 13122279 12868664
4220 12868664 12689951 12502523 12253725 12086797 11997957 11814605 11613505 11460186 11335991 11308794
4210 11308794 11249611 11157058 11118179 11083453 11046258 11006965 11009447 10919041 10863482 10831543 10761470
4199 10761470 10699500 10602557 10541176 10499789 10452572 10401141 10305230 10270609 10141268 10072565 10028809
4188 10028809 9908837 9761990 9695329 9537169 9460468 9400921 9278339 9208576 9144578 9099163
4178 9099163 8987439 8930660 8984054 8973077 8887443 8973077 9043050 9112757 9092222 9141582 9200009
4167 9200009 9238422 9264767 9339253 9419281 9533679 9595817 9654571 9721053 9806617 9909087 9945821
4156 9945821 10071932 10096076 10187624 10218296 10303661 10344105 10408782 10505683 10641223 10640237 10687411
4145 10687411 10807513 10885453 11009107 11148129 11301169 11500180 11657123 11830211 11961627 12054255
4135 12054255 12144525 12328320 12548267 12709477 12887935 13019697 13147833 13301889 13517889 13690040
4125 13690040 13779150 13887043 14064183 14198181 14330173 14458251 14541070 14587400 14697891 14806410
4115 14806410 14869366 15112122 15227672 15287796 15452095 15615295 15707360 15853449 16117439 16292744
4105 16292744 16413460 16587315 16797183 16974344 17181949 17444279 17762098 18032978 18309869
4096 18309869 18663195 18982300 19370249 19772434 20103207 20475057 20814226 21125628 21481190
4087 21481190 21834525 22187591 22521322 22789719 23095716 23386372 23682765 23999862 24306113
4078 24306113 24584184 24904364 25130303 25384976 25620740 25799081 26064332 26354654 26616543
4069 26616543 26870680 27132088 27473230 27798308 28117238 28441550 28807211 29212225 29626822
4060 29626822 29999802 30453970 30869062 31332306 31759534 32202554 32608788 33002774 33419219
4051 33419219 33807264 34159447 34481436 34835241 35114697 35301252 35420338 35612557 35772603
4042 35772603 35863663 35957997 36043686 36103158 36223060 36355189 36395394 36474345 36563510 36674286 36807225
4031 36807225 36791134 36799156 36825191 36825759 36742085 36729107 36649945 36619433 36604714 36517138 36450675 36408154
4019 36408154 36363997 36251838 36095080 35981298 35851995 35771787 35763415 35752394 35727323 35756996 35847540
4008 35847540 35913371 36079736 36328450 36524505 36799532 37134182 37531609 38055589 38616279 39257088
3998 39257088 40038750 40998832 41993659 43094529 44370936 45789999 47313189 48945292 50575818
3989 50575818 52215047 53824027 55233302 56491383 57567001 58352380 58852069 59054132 59009901
3980 59009901 58795941 58545184 58149062 57684829 57213837 56687161 56140339 55584690 54878915
3971 54878915 54097924 53135068 51774641 50295047 48600132 46717016 44629641 42441426
3963 42441426 40223480 37956133 35767309 33694017 31752983 29908758 28227296 26667508
3955 26667508 25173320 23928156 22760226 21595012 20616365 19661219 18861717 18135984 17443825
3946 17443825 16835112 16268325 15783225 15375244 15038604 14659194 14296223 14051208 13874145
3937 13874145 13714406 13511027 13358969 13227740 13162087 13099309 12950773 12886610 12814661 12794292
3927 12794292 12719990 12742215 12672096 12640739 12536304 12438697 12420553 12383112 12316442 12294206 12288707
3916 12288707 12219445 12164899 12104168 12122859 12188240 12186441 12260569 12395376 12481977 12542582 12571312
3905 12571312 12629500 12689752 12898932 13110476 13381551 13532157 13668849 13823065 13941699 14090958
3895 14090958 14195540 14383109 14489384 14676070 14757065 14753292 14809963 14793583 14786160 14817633 14846892
3884 14846892 14785138 14773922 14697016 14702739 14853792 14950621 14981248 15090673 15225751 15398139 15539778
3873 15539778 15682811 15860221 16017272 16290135 16625684 16854347 17116880 17368150 17702786
3864 17702786 18063473 18423943 18885941 19343368 19803855 20189909 20786503 21325639 21734829
3855 21734829 22306296 23020452 23749036 24485637 25242003 26097840 26972457 27927351 29022920
3846 29022920 30036012 30980103 31990881 33102910 34071786 35155749 36188965 37186865 38127263
3837 38127263 38984419 39818985 40573614 41153572 41615184 42038202 42236395 42248266 42246757 42177631
3827 42177631 41990501 41624888 41204095 40759814 40256657 39834420 39326650 38854752 38435116
3818 38435116 37974130 37559382 37200312 36795090 36444224 36174873 36016486 35857259 35743513
3809 35743513 35727853 35726489 35800345 35982599 36214902 36491153 36882258 37454877 38072209 38811038
3799 38811038 39660241 40642972 41802191 43067590 44577179 46200113 47940853 49959933
3791 49959933 52101295 54499541 57122781 59947107 63059449 66216192 69651451 73158843
3783 73158843 76642212 80076505 83400861 86538971 89350985 91762193 93768191 95333155
3775 95333155 96477898 97136651 97337254 97184048 96650001 95782267 94602870 93107896 91338551
3766 91338551 89368485 87221149 84830115 82238972 79462812 76494972 73425877 70189214
3758 70189214 66897898 63550269 60153870 56809250 53545981 50311552 47279426 44404815
3750 44404815 41660647 39058221 36668969 34376799 32311172 30489036 28828717 27282154
3742 27282154 25893188 24618859 23465880 22471093 21607156 20769723 19919405 19263449 18674267
3733 18674267 18153148 17708207 17334353 17042484 16706473 16426962 16149875 15969565 15863723
3724 15863723 15759738 15677874 15601682 15574717 15666535 15797289 15864680 15956911 16065426 16259450
3714 16259450 16384891 16358433 16366337 16425853 16430045 16361295 16196262 15913867 15652152 15290790 14773229
3703 14773229 14311835 13946536 13482647 12964841 12485046 12084499 11699986 11337289 10953716
3694 10953716 10630052 10290131 9941006 9744912 9468832 9223810 8984858 8808005 8636277
3685 8636277 8522548 8389278 8295083 8249853 8142083 8040253 7986071 7882903 7877877 7837153 7801296
3674 7801296 7744002 7646398 7629752 7624569 7639351 7622833 7660065 7617254 7492978 7497475 7383378
3663 7383378 7386207 7411084 7334254 7289812 7297174 7320260 7261547 7203854 7190421 7227201 7277323 7269005
3651 7269005 7268707 7262887 7231356 7261591 7334171 7424012 7455236 7469845 7494567 7546684 7645230 7711436
3639 7711436 7762037 7756602 7790597 7928664 8044757 8126215 8197968 8305225 8405048 8582724 8673042
3628 8673042 8812372 9008031 9207788 9422776 9581649 9757423 9962104 10209597 10502984 10806180
3618 10806180 11210578 11495692 11810964 12247327 12705216 13086804 13520622 14029303 14509029
3609 14509029 14966578 15370221 15808422 16161081 16432785 16708988 17041512 17261366 17503284
3600 17503284 17802699 18033481 18295831 18602976 18840654 19117265 19393344 19637353 19949665
3591 19949665 20194260 20521145 20733818 20905959 21074558 21264437 21520430 21872404 22248334
3582 22248334 22571422 23079942 23590839 24143340 24746066 25412809 26197039 27017265 27905765
3573 27905765 28816640 29784791 30827916 32020673 33315315 34579576 36046657 37614727
3565 37614727 39279799 41117767 43220154 45465399 47751632 50328568 53012902 55966436
3557 55966436 59140324 62505361 66002398 69645746 73470559 77272397 81121763 84833491
3549 84833491 88416758 91801398 94958316 97919271 100732914 103208624 105569936 107825489
3541 107825489 109928526 111900812 113517763 114826089 115673341 116143112 115993266 115233365 113935116
3532 113935116 112221049 110102518 107579184 104963140 102188479 99305298 96307159 93288461
3524 93288461 90238389 87132508 83916018 80570326 77178552 73849218 70536882 67231991
3516 67231991 64060524 61168505 58493841 56085313 53947942 52049111 50508112 49226513
3508 49226513 48122660 47191105 46503849 45966699 45588881 45453157 45502261 45763029 46246985
3499 46246985 46569293 46510172 45951600 45131785 44195808 43295139 42735272 42325043 41987336 41813379
3489 41813379 41849130 42016161 42341144 42752181 43320050 44020945 44881331 45924608 46939165
3480 46939165 48133347 49254574 50241863 51202879 52278805 53439471 54881445 56688335
3472 56688335 58913541 61529007 64487222 67519779 69920069 70888288 69830133 67372623
3464 67372623 64253432 61121620 58449436 56398530 54824594 53784878 53148634 52808900
3456 52808900 52844612 53225555 53840235 54661963 55672682 56700425 57707849 58753876 60007172
3447 60007172 61398094 62948445 64859585 67132430 69812093 72800871 75881065 78625166
3439 78625166 80481568 81477596 82287092 83288775 84796790 86385622 87721117 88754072
3431 88754072 89547365 90225963 90728880 90871729 90507958 89492724 87709721 85514678 82889108
3422 82889108 80038720 77106512 74382253 71878071 69542097 67502205 65612918 63819108
3414 63819108 62019624 60383022 58885045 57502461 56320750 55211065 54218784 53381310
3406 53381310 52735087 52259759 51949372 51895507 52068691 52350225 52703471 53336995 54178954 55216444
3396 55216444 56480319 58123961 60117177 62325465 64830876 67627391 70783985 74146898
3388 74146898 77674872 81113489 84511146 87488317 89950776 91686375 92512562 92378034
3380 92378034 91208331 89116158 86251079 82829864 78985524 75039548 71142519 67241076
3372 67241076 63539785 60168145 57026292 54267271 51809293 49726240 48053783 46728978
3364 46728978 45510814 44575445 43870977 43094315 42037727 40558056 38705383 36642122 34582936
3355 34582936 32790987 31168433 29824888 28662409 27623209 26762615 25937342 25309345 24753772
3346 24753772 24287174 23847019 23403392 22932445 22511558 22165361 21878983 21773258 21752802 21845916
3336 21845916 21981321 22216478 22445859 22488104 22055318 21088794 19844994 18469833 17159167
3327 17159167 16041075 15156558 14352524 13701794 13151621 12602350 12124301 11829338 11445558
3318 11445558 11198164 10878981 10575814 10325363 10126466 9961563 9806069 9670028 9522211
3309 9522211 9456731 9336047 9337373 9210148 8986233 8730081 8379813 8087953 7851128 7619073
3299 7619073 7412962 7231278 7147138 6981989 6852775 6775840 6649474 6615576 6579219 6481203
3289 6481203 6378903 6328869 6247171 6168297 6102350 6010236 5980314 5963493 5912287 5902053 5843457
3278 5843457 5817255 5771655 5657042 5669448 5665653 5535036 5468790 5383869 5314749 5358835 5311470
3267 5311470 5335317 5339127 5279410 5288600 5321923 5254187 5179199 5216292 5310689 5308408 5283883 5313289
3255 5313289 5330324 5304126 5296679 5349141 5347497 5274636 5262680 5342996 5356810 5351704 5337688 5271857
3243 5271857 5250600 5268253 5307492 5287959 5303658 5276741 5209218 5209456 5243531 5235168 5263786 5311200
3231 5311200 5420287 5396749 5390216 5402577 5463977 5474354 5528313 5574507 5644725 5699018 5703454 5771688
3219 5771688 5819730 5948754 6033301 6099207 6184028 6278866 6353017 6451426 6561272 6772315 6833265
3208 6833265 6890438 6968521 7045380 7244466 7400512 7550310 7777338 7837956 7958960 8214163
3198 8214163 8420351 8612034 8770103 9029040 9268438 9454697 9665920 9965037 10179310 10434274
3188 10434274 10723886 10914780 11347412 11767450 12187568 12549476 12962543 13420445 13919584
3179 13919584 14390437 14909470 15468381 16068509 16642417 17386775 18168640 18937205 19828122
3170 19828122 20755589 21814852 22902869 24067805 25283806 26619252 28074180 29645984
3162 29645984 31424454 33281786 35168202 37110515 38911764 40471078 41825781 43064389
3154 43064389 44063320 44991491 46091290 47249030 48576557 50196962 51850543 53716176
3146 53716176 55789062 58099014 60638325 63340395 66277944 69515026 73012538 76893087
3138 76893087 81223371 85910918 91163201 96900528 103174503 110073183 117643018 125841505
3130 125841505 134769233 144416918 154917453 166761891 180360984 196079011 214196017
3123 214196017 234323732 255626713 276158497 292662877 300755434 297623439 283793366
3116 283793366 262992917 239833892 217664657 197988669 181007813 166895664 155343459
3109 155343459 145772667 137802325 130987207 125047917 119864759 115433618 111797690 108906763
3101 108906763 106831663 105398377 104501239 104123172 104174974 104344032 104541514 104426797 103929241
3092 103929241 103028264 101648909 99926751 98073469 96092861 94337122 93090025 92441077
3084 92441077 92543350 93430655 94983987 97255987 100036630 102096165 102175506 100155992 96825894
3075 96825894 93392588 90139594 86891888 83458781 79753372 75867481 71869404 67823647
3067 67823647 63951822 60310124 56946195 53985599 51248128 48820695 46786944 44926204
3059 44926204 43364703 41956618 40750441 39699756 38893674 38278409 37708797 37301952 36936878
3050 36936878 36517812 36047612 35212656 34023788 32601036 30872603 29031939 27288123 25599721
3041 25599721 24040616 22695330 21440404 20247052 19122837 18170956 17347594 16547406 15838204
3032 15838204 15183005 14495300 13889008 13357111 12880406 12340007 11860858 11451104 11075468
3023 11075468 10681290 10331898 9955971 9634836 9368520 9117919 8855999 8633469 8374047
3014 8374047 8220610 8099255 7859087 7608315 7469365 7276815 7141930 6924192 6699031 6614227
3004 6614227 6428701 6270476 6102585 5935767 5811953 5597982 5530143 5352869 5237873 5112136
2994 5112136 4893803 4774588 4717278 4589991 4492189 4449403 4321120 4244279 4114170 4075848
2984 4075848 3991308 3880035 3798860 3672947 3661284 3669875 3571495 3487714 3431387 3369625 3322605
2973 3322605 3302710 3247520 3135510 3039223 3026352 2978111 2890969 2866084 2864188 2823973 2751433
2962 2751433 2645059 2675690 2640366 2561334 2563334 2537117 2489852 2423260 2433445 2408984 2308926
2951 2308926 2314049 2257526 2171657 2057608 2047692 2056315 2026272 1967667 1973289 2013353 1930138 1901715
2939 1901715 1911964 1909479 1897197 1820465 1826072 1807663 1724405 1696870 1617049 1602048 1585299 1628504
2927 1628504 1602404 1551643 1471202 1402063 1420474 1428905 1430076 1409973 1340551 1349125 1337462 1313359
2915 1313359 1337909 1344849 1328294 1258905 1219908 1184351 1220397 1215449 1132608 1137176 1137470 1080338
2903 1080338 1065515 1135658 1122324 1099299 1099779 1080235 1059419 1089832 1031678 992591 948073 933758
2891 933758 943407 844217 894297 888699 934661 892367 843662 839340 875011 936073 881480 862382
2879 862382 942713 926883 906344 903768 879248 861994 870129 856705 891345 843245 845222 875057
2867 875057 855559 813478 856631 899474 856875 874680 843489 875067 950880 968245 915064 967418
2855 967418 1026890 1041208 1024513 1032219 1012874 1011666 1044683 1104614 1080332 1062958 1190162 1263506
2843 1263506 1290575 1285757 1391055 1431679 1500327 1644746 1738922 1838924 1947126 1973208 1846977
2832 1846977 1841135 1794080 1657136 1588513 1503351 1436507 1332876 1277939 1265063 1207850 1148885
2821 1148885 1083635 1039619 998431 980820 949790 957443 988692 969579 898203 945039 895672 869522
2809 869522 830987 869445 886777 887464 894492 844843 884819 880546 874418 886155 916048 966750 986694
2796 986694 898865 848266 818948 772616 787920 785639 761949 744858 698124 731651 717600 686221
2784 686221 732480 719347 660983 614272 595625 627317 577845 549888 575949 578146 612532 540548
2772 540548 502604 514441 502275 514179 561266 550857 529549 456341 460234 517778 474351 504041
2760 504041 443282 363662 313418 359815 400304 413450 405147 365003 353210 381627 310986 323562
2748 323562 352927 314443 285369 239432 242904 268196 341332 328855 337904 335752 245559 215972
2736 215972 299767 321956 283683 225031 225655 192906 181081 222803 133908 148137 174926 199592
2724 199592 210959 199437 164991 124887 167058 204808 199017 166907 159755 181196 173332 206839
2712 206839 191055 152210 221305 217986 233500 189025 196998 247018 199639 184799 194358 202814
2700 202814 260254 212607 205566 271207 257301 183531 190960 178184 145175 165831 160617 116306
2688 116306 135785 180139 145328 109035 98223 149262 164910 120705 112319 232266 231132 196742
2676 196742 188667 188340 186710 136055 129901 118427 149392 123786 83739 61431 69068 97112 150743
2663 150743 177960 111400 52286 54482 63267 47810 67118 58249 45565 38306 110421 130703
2651 130703 80943 88495 55375 106076 112425 44401 54711 75049 83652 14724 26691 82797
2639 82797 -8669 -27289 22190 9703 51824 77948 45799 86700 68362 25931 17060 13015
2627 13015 32332 31661 76473 14971 -4078 88653 54622 52349 84353 37533 93653 60439
2615 60439 56491 78235 76969 49129 87887 69417 78495 124235 103032 90313 104420 110257 89440
2602 89440 80260 30158 56446 50073 77045 82824 111571 79061 51095 -203 -30504 -16473
2590 -16473 -24143 83641 62399 82825 156503 28063 18628 78700 33916 -2509 4482 65235
2578 65235 53382 93406 47486 31339 27497 26619 47285 29155 42889 35543 1653 10596 51357
2565 51357 44552 14326 40014 59084 53197 9626 86451 121066 81464 83101 48109 144814
2553 144814 82764 108777 133995 117811 51234 58490 121116 163233 197340 232725 170341 91538
2541 91538 73525 99774 136141 92379 100970 98547 43125 30413 66301 122298 95292 81243
2529 81243 68609 82670 35725 41034 41225 55942 51922 76848 46241 -62050 -10993 -21861
2517 -21861 -12022 33695 59081 -14980 2678 -8816 -13459 -9719 -26466 -6614 -65864 -15875
2505 -15875 7804 -14665 29836 12327 -27792 -40614 -24058 12467 33327 60068 119166 108885
2493 108885 134795 73853 80683 82980 66512 16637 -41126 -38611 -39516 -4329 -22225 286 116064
2480 116064 75307 116547 128358 40995 8033 70286 88932 67539 40962 101276 146663 134907
2468 134907 54988 33523 110656 102275 144135 120653 50976 26075 62487 84599 104385 73800
2456 73800 27996 33932 83530 118878 137612 120705 80099 127805 180272 144095 98122 82181
2444 82181 106881 112532 77109 -23429 -39369 -1701 10537 -28422 68424 82799 91080 65078
2432 65078 53832 27626 7655 33615 60887 76344 75545 59749 99350 69168 76161 18920
2420 18920 4293 -22545 -7730 92701 100046 120714 113154 135245 57483 62743 42288 43648
2408 43648 23436 37610 23010 26672 70335 46042 125118 171778 112872 121193 222873 166458
2396 166458 47756 66692 54775 35396 52048 74432 40055 82248 170810 156246 141755
2385 141755 93389 84999 62041 91935 120161 91794 77910 57924 81276 106073 26868 32165
2373 32165 67244 42236 97696 94798 155598 141529 143160 201048 249422 172337 158706 170831
2361 170831 212514 256199 256961 202240 145097 152161 126124 138954 239874 289234 280374 276511
2349 276511 304326 274881 235043 242157 311956 307654 359035 336703 358852 380855 363020 352421
2337 352421 366631 367771 422958 501094 489480 561897 590305 616650 716914 702123 710717 786506
2325 786506 849312 945078 963561 1069152 1202821 1249404 1347599 1457460 1654358 1784562 1839587
2314 1839587 1909897 1997001 2087054 2142928 2225506 2234280 2376805 2471732 2545441 2607018 2743103
2303 2743103 2944279 3154478 3299076 3493312 3729357 3887985 4085391 4412177 4737164 5090646
2293 5090646 5557670 5943773 6247318 6769218 7265318 7786636 8392761 9029958 9837434 10963628
2283 10963628 12320493 14172405 16452628 19077419 22670758 26308471 27475564 25306529
2275 25306529 20900200 16803478 13762152 11564812 9791971 8258197 7097622 6183781
2267 6183781 5450878 4935316 4507053 4184090 3896897 3606229 3334127 2979653 2725054 2471612
2257 2471612 2266234 2128461 1980564 1756959 1600573 1471694 1398195 1324785 1269319 1156530
2247 1156530 1050790 1007096 984721 901297 886860 829891 797709 819009 730893 727932 722896 707578
2235 707578 699289 648221 675641 605616 573166 526602 518812 504789 513578 427319 464716 505298
2223 505298 434237 377278 372469 365221 312055 380939 378589 332750 322989 338987 345449 291975 305137
2210 305137 312495 391621 332061 331058 294551 184879 151925 245367 274476 229945 227744 213677
2198 213677 236823 253493 183421 171140 201007 118219 124134 138424 105419 118771 184925 130195
2186 130195 130939 131123 129612 84644 120931 192154 160447 169267 124297 39641 58190 87375 108905
2173 108905 118369 114578 71223 57781 87562 71899 88226 54762 56829 89053 98441 80768
2161 80768 71255 40144 10342 9018 8662 50432 53760 85040 72904 98227 113074 9082 -63269
2148 -63269 -76929 -25987 -44613 -25671 -38810 -68847 -76939 -10973 32962 18830 21055 59735
2136 59735 56936 29136 36875 -7220 -10690 7779 43789 5421 37570 56275 118274 64385
2124 64385 3462 39330 -11140 26884 -17919 -36112 72848 24137 -46038 -44158 -22808 24582
2112 24582 1439 -22438 -52757 -58651 -64716 -93908 -73966 -17289 -2023 -21408 21437 36722
2100 36722 56174 33425 61128 3580 -32196 -46295 -18990 30059 120854 109739 17304 2895
2088 2895 -15947 8419 -4387 -5678 -27756 -59363 -26271 22818 33004 36027 40736 12181 28462
2075 28462 50630 57503 10866 21020 38124 4926 -11087 7072 15077 -35848 -7510 -19474
2063 -19474 -44223 -82604 -78072 6061 4193 -38796 -25078 44943 76340 40245 -3918 -26104
2051 -26104 -35046 19008 26901 23760 -7039 7931 86120 19960 14324 11172 21018 -10204 -6214
2038 -6214 -45917 -87857 -76505 -32385 28605 6401 -61142 -94451 -69792 -42201 -26250 -42940
2026 -42940 -75966 -103325 -4479 -23598 -94199 -59117 -93164 -64078 -40942 -64649 -49272 -26638
2014 -26638 53856 74623 37474 25824 86273 83828 26462 12579 54444 64095 26897 -7977
2002 -7977 -17060 1091 39646 75702 26735 56986 28249 -43181 27578 -23043 -100070 -5740
1990 -5740 23992 -5527 -22505 -13139 1373 19997 -14951 10414 -73954 -61857 -110338 -96760
1978 -96760 -44118 -39682 -14057 -73380 -22726 -14808 -63939 -88310 -69242 -79261 -60712 -32465
1966 -32465 -66970 -48130 -64045 -26747 -40733 -30792 51264 30714 19242 -41311 -38953 -128469
1954 -128469 -93157 -55916 -71473 -90111 -63453 -34113 14237 -44940 -59129 -35914 -25979 36539
1942 36539 31175 20784 15529 -6680 -52844 -498 -81845 -78319 -64426 -66472 -63276 -33191 9783
1929 9783 -32560 -117707 -95325 -74057 -69833 -13888 -50289 -45520 -3067 -75621 -83535 -74053 -93006
1916 -93006 -100238 -104238 -50017 -28792 -10398 7499 -15229 -2044 6885 40003 -1372 -81359
1904 -81359 -19313 -83841 -107781 -107333 -16828 43525 -50629 -44775 2137 -16742 -22724 -57671 -82174
1891 -82174 -71349 -37197 19012 -4738 -24171 -87969 -98096 -27911 -37824 15191 23207 -57531
1879 -57531 -76651 -49557 -29387 -55311 -106206 -70589 -46206 -9159 -46601 -36010 8537 -21854
1867 -21854 -88706 -122411 -96953 -64685 -42047 -39562 -40784 -38353 5286 879 -75607 -63958 87630
1854 87630 64267 42026 8999 -15943 -4277 -13723 -56165 -31114 -31318 -60140 -23001 -69046
1842 -69046 -40445 45314 52046 31218 -201 -23296 -27048 -47572 -76255 -60350 -118683 -68460
1830 -68460 -59647 -144833 -151133 -167981 -85796 -90473 -112298 -64611 -50062 -79029 -49471 -94970
1818 -94970 -68999 -2732 -86699 -67774 -30573 -3683 43372 40590 30898 -25262 -29115 -133742
1806 -133742 -169321 -119096 -58218 -95814 -61454 -55897 -47312 -33572 -92193 -92352 -87645 -91144 -75030
1793 -75030 -69646 -52455 -45533 -36179 -43278 -65165 -5433 -62733 -87671 -100602 -103544 -117972 -14682
1780 -14682 -23976 613 4134 -31395 -38994 28890 24768 21706 22255 -42320 -67707 -103929 -30619
1767 -30619 -53046 -18725 -20862 -50268 -75073 -100383 -79940 -26482 -34624 -18174 55526 -25582
1755 -25582 -48094 -48674 -24318 -49405 -42842 -30823 -17077 24335 46086 -1910 28249 13830
1743 13830 -30392 -28605 -22942 -28635 -65613 -60806 -33883 -21369 -127880 -104414 -69321 -49525
1731 -49525 -36380 -58054 -80965 -25290 -32549 -65603 -47069 -76741 -41740 -48365 -53390 -44133 -82259
1718 -82259 -38656 15221 -18409 -70804 -40667 -83267 -83793 -45911 -51787 -39427 -54442 -33105
1706 -33105 -44368 -21462 -79364 -136667 -33821 24945 21058 -13849 -25629 -36137 -48655 -65302
1694 -65302 -70378 -13502 -23778 -21815 -20844 -81099 -82697 -34235 -82736 -93225 -93076 -21619 6439
1681 6439 48168 26304 21334 12697 -53404 -11741 -98898 -106273 -119987 -165565 -108393 -73837 -4940
1668 -4940 -4685 -79902 -40736 -19385 -26725 -83971 -35000 -52136 -108450 -55775 -21243 11658 -1545
1655 -1545 -26246 2731 -23395 -27082 6980 -5275 -71978 -106189 -142992 -59286 -59094 -61844 -100130
1642 -100130 -44721 -3750 -52627 -32227 -55839 -54441 -63305 -17124 -55285 -26850 40629 -7135
1630 -7135 -35531 -19645 -24536 -61282 -70330 -55801 -76686 -67247 -25284 -10186 -16680 -36263 -35509
1617 -35509 -63963 -58345 -50844 -74989 -23191 -30700 -99967 -79135 -99680 -97125 -81422 -70899 -52962
1604 -52962 -81381 21771 -21725 -40832 4369 33909 -33585 -60574 -11041 13853 6881 16335
1592 16335 6724 -62861 -92118 -50798 -20322 -44785 5488 36766 -28475 -4855 -48843 -76964
1580 -76964 -17897 -19120 -65166 -74787 -81844 -56932 -93404 -98961 -109264 -35093 10927 5557 72020
1567 72020 27032 -8719 -93417 -76764 -96576 -137433 -46853 -5233 -94727 -88025 -81383 -71740
1555 -71740 -39919 17222 17704 31615 42148 -18711 -78336 -25796 -8926 -51642 -21946 -12036
1543 -12036 50843 75046 42631 7353 -59836 -83961 -92064 -40100 -88787 -84103 -33787 -46831
1531 -46831 -75827 -104428 -68138 -26824 6841 -21747 -95467 -117428 -32284 -23347 -54859 -25369
1519 -25369 2333 50895 62911 65235 40694 12167 7055 -57020 -2555 23469 -39462 -32098
1507 -32098 -33184 -54777 -32794 -25557 -63391 -57717 -59200 10777 -10530 -75865 -24200 -54889 -19912
1494 -19912 -10474 18804 986 -84161 -45894 -61941 -56644 -99589 -54064 -3890 -53087 -22321
1482 -22321 -57341 -94112 -102586 -110225 -98822 -73368 -45008 -13646 6224 5310 -65086 47848
1470 47848 44269 -6812 454 15630 13542 46033 9076 -52291 -89579 -81039 -25037 -21399 3682
1457 3682 45794 20547 -7146 -48292 -59736 -58139 -106864 -25348 5489 -39378 -85518 -10625
1445 -10625 31441 -68530 -41052 -58170 -112266 -96522 -80718 -48208 -25525 26646 40121 10761
1433 10761 -64321 -52391 5212 -20430 511 45278 44629 54058 -28036 -30412 192 3953 3429
1420 3429 29283 27461 -12581 -35779 2480 26932 38035 38185 39729 21761 -10570 21796 -43123
1407 -43123 -14935 -1511 -47806 37412 4635 13832 -57083 -88145 -6673 -11701 -63165 -2037
1395 -2037 -63625 -58503 -24437 -10475 11445 -19285 -28790 -59903 -79980 -109798 -48781 -69301
1383 -69301 -78296 -42791 -48636 -94942 -87743 -48321 -35493 -31103 36029 73950 -11277 -26275 6331
1370 6331 -23577 524 11595 -51185 -83637 -74439 -27607 17605 7636 -15313 -16450 -40750 -68926
1357 -68926 34994 64107 33863 -5365 -39680 -111217 -88006 -13270 22430 -21756 12778 13058
1345 13058 54503 -40942 -98848 -9749 -33249 -26926 -35511 -44032 -98390 -81574 -41875 8662
1333 8662 49981 90590 -1385 -85425 -133390 -96865 -95178 -43367 -60595 -25373 11881 50613
1321 50613 48397 -21246 -48858 -74308 -29903 -82180 -107363 -105616 -87620 -45687 36249 35661 -30278
1308 -30278 15578 23294 -16988 -11219 -45324 -50862 -38483 -58891 -43583 -12941 -66159 -28149
1296 -28149 -42099 -53185 -32085 -61246 -29066 2626 -6262 -9868 -49774 -74439 -67939 -47001
1284 -47001 -48470 -58282 -6513 -9184 -3123 -2182 24972 66672 -20545 -64859 -28351 -23870 -59851
1271 -59851 -38827 -57379 6977 -1095 549 20448 -16686 -45 -35660 -85611 -25952 71933
1259 71933 143845 60235 -31404 -50323 -5636 -26259 -2158 72421 -38863 -93873 -59880 -52243
1247 -52243 -42318 39371 82635 81835 598 -30553 -53145 -25662 4615 2753 -41543 8493 -31697
1234 -31697 -50758 34030 37712 -18236 5963 -63984 -98765 -58982 -72926 2967 -82593 -117287
1222 -117287 -130565 -94445 -14114 3970 8890 28281 -22973 -53962 -40781 -5571 -15915 31846
1210 31846 -39160 -97570 -98000 -70188 -39705 19361 31784 -35652 1415 -24039 -10043 503
1198 503 8435 -25965 12126 -75644 -61019 -47027 -84879 -125421 -29339 72745 53990 18729
1186 18729 -12752 -94361 -100530 -131975 -42577 -1507 22455 53566 60036 40745 -57377 -48035
1174 -48035 19696 53655 96519 79052 56108 15478 -23141 -24689 -57404 -24231 -16839 24653
1162 24653 45815 35928 -24256 -33391 -29796 886 -27571 3826 -35101 -52727 -74352 -61628
1150 -61628 -14839 18381 19810 -14720 -12584 -16202 44837 -26937 -43899 27344 -24566 -40788
1138 -40788 -39525 -30583 -56887 8350 -3182 11576 5706 -3748 -52512 -63419 -40363 -25290 -16353
1125 -16353 -63218 120 -13992 -60471 -37026 4995 890 19634 21773 -19644 41544 6361
1113 6361 -45780 -76681 -59746 -24592 -65335 -56763 -20320 -10475 -714 -5431 -77325 -26969 -19921
1100 -19921 -41604 -50539 -48338 -27226 32784 12676 244 25966 -67805 -125256 -103688 -3494
1088 -3494 -11926 6260 26224 -2688 -17846 -60130 -45378 -4344 18855 -15837 -10629 -26645
1076 -26645 -105052 -108347 -88799 13857 -14098 -83033 -20066 -3083 -28172 10072 -35580 -51647
1064 -51647 -29971 -48165 -20871 -70416 -62014 2517 70426 70318 99110 92667 67997 31067 30569
1051 30569 2679 14035 -90525 -106467 -57020 -47731 37587 -7106 -30633 -11591 -30474 -57602
1039 -57602 -81029 26165 106800 89724 53496 22531 24980 49934 11040 -27609 -45007 -65130
1027 -65130 11652 -13075 -79435 6362 -38305 -40716 38319 2048 7618 22712 20520 -12272
1015 -12272 -11297 -36029 38787 69418 59315 -22273 -73607 -46581 -77162 -39383 38951 25632
1003 25632 39760 91801 74701 55766 -6397 -1451 -23765 -62407 -53453 44949 -24791 -11970
991 -11970 -13789 21979 68018 1398 22791 -7083 -1647 -14455 29707 38456 -15535 -40198 12038
978 12038 27304 52922 58580 66707 -25281 -51687 -14692 -5418 29204 28282 -32059 -98322 -30511
965 -30511 2272 26481 9478 -13996 11814 -37866 -39786 -131799 -147375 -111712 -46475 -61627
953 -61627 -96880 -4246 -32107 -29717 35061 -9302 27956 41624 14936 -7524 27620 44047
941 44047 47265 70991 76855 41438 -8831 -50341 -79272 -25258 23379 -930 -32179 -5683
929 -5683 -29841 -12183 28464 39946 -1468 29535 80381 2305 1625 22195 5035 38590 30454
916 30454 56961 49976 3725 -47991 -53662 -21458 31271 14970 1073 -14760 -15055 -18072 17778
903 17778 7555 -575 -51692 -23683 -48608 29644 39991 20631 33959 24111 51203 -29640
891 -29640 -40941 -4227 -1840 5230 4993 -5285 55663 54839 21866 17569 -18752 -26923 -48285 -60388
877 -60388 7923 -2427 -7807 -50574 -14891 18792 9828 -14559 13888 40770 45176 39794 -4523
864 -4523 -25343 -55258 -16775 32789 -21845 53229 10581 -51547 -36736 -36447 -59172 -53051 -36132
851 -36132 -18993 50263 48114 11774 58095 8530 -25170 -19919 -34028 1376 10239 57339 70833
838 70833 87987 68795 -12677 1386 36452 29584 64393 82377 60304 96681 74818 8171
826 8171 16579 10474 -10416 46544 97505 38420 -59041 -10937 -76456 -67847 8049 48116 67793
813 67793 -15140 -46947 -63009 -46033 -96074 -1467 -32314 -38362 6950 20430 45002 26428
801 26428 -23967 -41375 -86384 -51138 -27016 -21772 13670 -42450 -21006 73113 40703 33001
789 33001 11164 16590 -3199 1801 30474 29444 50402 38977 16079 -10946 -32959 10189 3186
776 3186 34760 68940 41715 1676 402 14519 -31778 -32736 -14976 -35601 -48491 -2296 -24222
763 -24222 -54686 3276 31122 -20081 -19127 -61097 -41264 -32349 -51221 2510 56109 40289 59401
750 59401 65796 58275 1795 41575 92165 123378 71863 50593 86861 27202 -36885 76008
738 76008 62129 -2891 -7424 -16994 -42590 -30379 8860 32646 34152 -14529 16537 17660 3229
725 3229 11270 25947 -24373 7934 70791 76976 1662 -30694 57892 21608 35673 32469 9236
712 9236 65126 42642 4897 -13747 26284 48644 34499 -19713 18025 96290 24412 28190
700 28190 18445 -50573 -34607 -46315 -51020 -29448 -43832 -689 -29278 9634 38396 -21506
688 -21506 -35223 -3263 -1917 -45176 -1428 50524 17480 42241 94095 43993 25699 42307
676 42307 4159 428 36839 -37522 -3852 30824 38977 3988 563 17263 72654 59800 8068
663 8068 38803 121647 109806 20504 7691 -34260 -10342 35617 100214 125013 30227 13997
651 13997 7355 71276 58697 -1744 42093 77094 107051 84632 14415 -41822 -9778 -37245
639 -37245 -97976 -32613 -6384 3610 48080 42003 -58353 -63911 -47324 -24682 28831 1025
627 1025 782 67246 89449 120574 48984 -35664 -9208 -3985 54493 82918 101974 74359 32223
614 32223 9595 16658 47105 -56656 -56924 29932 144383 88240 26312 71715 93607 58485
602 58485 33725 74508 53652 63568 17434 -6529 -22463 46896 16953 37837 -21877 -2273
590 -2273 45580 14542 11676 -36868 -22096 34072 48344 -994 -18284 51830 15043 -6793
578 -6793 28165 -3319 11946 1141 32336 -17131 9982 65502 45910 84977 91235 41158
566 41158 1869 -66171 -74680 -121137 -90361 -29619 -23233 56702 55439 27661 43730 28446 24578
553 24578 -10516 -39109 -18602 -5036 72683 73629 4054 -5112 35388 21889 67595 52379 38806
540 38806 81063 63911 412 -9891 -6425 -47624 -9613 21346 47730 13239 -9349 39315
528 39315 9783 18944 73572 18200 4754 1086 -18953 -39559 44965 32115 -40450 9466
516 9466 765 31963 35465 32445 35594 51112 31083 13516 -57457 -24393 -41 22013 44288
503 44288 8407 45236 79753 88039 54623 73069 105485 74180 87994 87977 99220 61614 56281
490 56281 54477 23207 -16865 17761 34036 42826 97594 102139 53319 40620 16019 -41213 -57206
477 -57206 -51114 6294 32505 15478 -24631 -1493 -62850 -21884 -591 23402 20321 -12273
465 -12273 34926 59208 80684 58900 86265 58703 52430 76627 20834 79792 68973 82886
453 82886 72951 -482 -10747 -17546 271 -7892 46990 64777 34904 109106 47503 18943 16119
440 16119 17378 33970 7803 45545 73960 18490 -3880 -5530 44189 97991 88739 66528 23048
427 23048 -17857 -5457 -27080 -15793 70695 93232 57874 127277 102930 123873 37018 31505
415 31505 13893 -43814 -12432 -37532 760 44957 68082 108274 74315 -2331 57751 1650
403 1650 11550 99932 109389 19039 38297 39735 53070 94628 95667 47663 -4958 -6435 62606
390 62606 6425 -13432 71119 25139 59051 29659 11317 45480 103242 61420 9287 17567
378 17567 -52252 -4801 25767 -1887 54768 -12698 -26882 20960 -44480 19758 -43695 -120
366 -120 -16940 7563 74259 21484 118766 76034 45340 89776 109497 72002 51065 50929 80957
353 80957 85456 55753 53597 21472 30926 54524 65762 52562 75018 8629 10358 46031 80169
340 80169 40579 49841 38343 13270 -3095 38661 63733 123919 97373 36078 41009 4832
328 4832 -6338 -33773 45528 27907 63203 102455 82470 80391 60129 88041 98567 66054
316 66054 56888 62478 61477 98068 108019 96701 50708 63816 72427 87975 55583 47935 22963
303 22963 2908 55221 23983 62615 50735 -5448 39232 984 4032 30960 -23813 -4121
291 -4121 53614 80292 9790 21677 70012 61654 22864 43362 10171 94334 139339 132804 98026
278 98026 97441 110209 88969 102276 115039 116570 109871 55375 78224 67791 36017 -33449 -43665
265 -43665 10656 60403 39071 29896 58789 73043 65351 3477 71040 89812 97987 61487 51532
252 51532 37609 51717 49403 49385 19155 -86897 -81741 -69801 -61803 33095 82868 5352 -40565
239 -40565 9218 46676 46089 45530 61173 54365 13884 22547 -4928 50165 63212 109692 126396
226 126396 21004 5589 1388 33015 3124 3324 14058 -4579 -3840 18775 -21118 -19588 29449
213 29449 58003 42088 12236 74555 114528 82800 81588 33587 54019 90689 76774 109441
201 109441 130685 151707 103929 99903 77678 48360 52143 72644 93502 81325 42938 68907
189 68907 53815 40231 81559 61388 72295 51086 37033 67072 110222 113460 142099 110151
177 110151 31066 11998 33811 62889 69326 145625 142855 136753 112326 90727 72545 82107 75019
164 75019 104906 138430 84581 47112 43206 60425 46557 71927 89956 71693 54719 53226
152 53226 -2454 24902 46828 60002 96455 115598 81090 43793 64293 39412 1563 28406
140 28406 80100 97781 53018 24264 -29115 -8507 18007 31182 20883 9325 64452 37671
128 37671 11717 24246 3513 78517 114107 47989 15547 38016 56365 58598 59502 82693 59458
115 59458 50196 67171 62496 20109 6760 42963 53196 22126 44755 76977 66647 54202
103 54202 44494 54437 83834 63346 26264 -9540 13083 61119 86156 118225 111988 73461 100931
90 100931 96890 54340 84332 71537 59282 51070 71530 1562 32131 50207 36575 93901
78 93901 135185 83424 78004 100718 74157 55093 87471 105768 148420 130429 108954 82151
66 82151 46112 75385 70271 69960 66102 103431 98697 78513 122556 100213 87377 71093 91571
53 91571 54279 42670 64646 58284 46313 43519 77959 70345 70973 65293 56914 54580 70389 101856
39 101856 44581 11166 33013 39949 27357 40420 13401 17664 78478 45878 85219 102180
27 102180 65256 80981 97678 105925 80793 72969 76006 59196 29274 40241 74244 56562 72415
14 72415 79718 52170 65860 97379 100496 75930 39202 70230 63594 57050 54866 73484 121650
1 121650 83534
0 83534
$$ Imaginary data points
##PAGE= N=2
##DATA TABLE= (X++(I..I)), XYDATA
16383 -1604741 -1568958 -1541328 -1575266 -1535864 -1494995 -1472711 -1484763 -1414888 -1378078 -1370096 -1320683
16372 -1320683 -1270800 -1238749 -1242296 -1254077 -1199374 -1176027 -1179282 -1155116 -1109385 -1095532 -1120616 -1071113
16360 -1071113 -1047597 -1005324 -962146 -976571 -973899 -899836 -900644 -904224 -869818 -860601 -820020 -784127
16348 -784127 -767335 -782099 -772558 -753387 -704444 -691100 -699465 -636856 -621403 -562692 -592651 -604956
16336 -604956 -594332 -547136 -532901 -523682 -487365 -441147 -460265 -460431 -460629 -385264 -321480 -287015
16324 -287015 -299971 -313823 -301303 -246885 -164406 -271553 -270605 -217553 -216688 -158849 -130632 -103531
16312 -103531 -81428 -92932 -105485 -103284 -72610 -32191 44604 98686 138486 130436 99650 117146
16300 117146 114388 174534 218435 183432 190619 242763 261922 221460 235786 248785 264853 300545
16288 300545 344223 390269 355952 385781 434553 458149 411676 425853 465286 476750 510582
16277 510582 524245 515435 555516 561023 561488 589546 660858 613074 588759 649497 663312 709236
16265 709236 728291 738339 748923 745890 700636 768056 781200 782476 770025 808847 855289 876263
16253 876263 913928 879237 885645 891968 852435 863076 895922 926676 947553 950730 927000 968154
16241 968154 1011868 1030527 1030060 1021257 1053448 1106626 1063768 1089987 1123081 1070194 1056322 1138380
16229 1138380 1177458 1212056 1172113 1201907 1211101 1258331 1285620 1240752 1248306 1209653 1208835 1281334
16217 1281334 1278776 1330368 1336712 1290164 1288771 1274144 1278702 1343425 1392592 1368539 1361686 1415573
16205 1415573 1397990 1347403 1399998 1406315 1361025 1363305 1352407 1345700 1391592 1411194 1462350 1465717
16193 1465717 1492057 1505565 1497985 1490056 1526981 1507260 1497989 1496275 1528204 1537828 1450322 1508076
16181 1508076 1526840 1501868 1553352 1525595 1596534 1582298 1618868 1690382 1700788 1655275 1662802
16170 1662802 1663415 1663959 1646794 1609477 1583455 1601924 1636054 1648717 1664700 1684369 1699782 1647103
16158 1647103 1688224 1708024 1743354 1714463 1723706 1720929 1741689 1765116 1724242 1732766 1727644 1696989
16146 1696989 1740526 1764316 1724965 1676877 1707032 1816906 1829035 1774739 1830127 1762659 1683749
16135 1683749 1751118 1793580 1799378 1788638 1785266 1792877 1824900 1802751 1858463 1854068 1877725 1922534
16123 1922534 1892548 1860585 1857760 1830973 1886875 1844791 1816353 1803865 1834801 1855336 1883076
16112 1883076 1853877 1833945 1855743 1876797 1837382 1781006 1849065 1853206 1814444 1814433 1805753 1828264
16100 1828264 1860608 1807471 1859752 1902420 1900293 1913608 1887404 1819996 1788988 1853956 1848829 1857200
16088 1857200 1862914 1874092 1883979 1859864 1940838 1923614 1877701 1910684 1922469 1897663 1875376 1841754
16076 1841754 1918297 1948999 1930238 1901806 1872850 1924665 1987442 1936081 1844190 1870871 1910377
16065 1910377 1919625 1855963 1818623 1849468 1884550 1864031 1950639 1968426 1904406 1931734 1923983 1903694
16053 1903694 1861573 1824437 1856407 1894738 1856233 1894204 1889318 1891724 1881287 1900289 1870343 1894889
16041 1894889 1875566 1952059 1907741 1916530 1927214 1907303 1900096 1892929 1950481 1949488 1960453 1962178
16029 1962178 1971257 2023438 1919537 1893576 1959707 1944768 1956442 1925893 1949068 1939418 1949564
16018 1949564 1988327 2006196 1971711 1978064 1933753 1917732 1950516 1948849 1916220 1892434 1861905 1893650
16006 1893650 1939596 1847738 1819755 1935356 1945421 1975364 1966124 1884097 1834921 1856605 1906783
15995 1906783 1862675 1844182 1866699 1936631 1904670 1909931 1969250 1909486 1908019 1943131 1902083 1899364
15983 1899364 1920416 1941369 1940393 1958636 1913663 1888955 1896139 1895947 1862222 1905602 1920644 1931129
15971 1931129 1916004 1953965 1979642 1961331 1971251 1997037 1964875 1926718 2000210 1951145 1947941 1947639
15959 1947639 1964101 1962313 1976514 1904615 1927468 1971110 1936825 1899699 1960658 1935484 1865653
15948 1865653 1933185 1926729 1956013 1999630 1973705 2010131 1946775 1908709 1954764 1964961 1944333
15937 1944333 1930964 1906769 1932250 1922407 1933011 1947567 1973498 1911744 1881193 1929836 2025669
15926 2025669 2051097 1997156 1948236 1982909 1922225 1901650 1951584 1924090 1857628 1904144 1946583
15915 1946583 1958514 1951946 2012635 2066299 2058088 1973728 1818835 1845257 1893591 1943890 1930494
15904 1930494 1922709 1951859 1914787 1914871 1883926 1892070 1895010 1916375 1892037 1911116 1917502 1948837 1928413
15891 1928413 1946283 1996408 1922871 2004131 2023441 1983061 1924177 1979221 2029959 2003874 1936090
15880 1936090 1996394 2002730 2012925 1973528 1914961 1884217 1913310 1942270 1978013 1939024 1958714
15869 1958714 1920630 1915097 1934700 1876326 1902609 1920080 1952961 2002588 1960357 1979916 2044140
15858 2044140 1964114 1932251 1932014 1897145 1944852 1956368 1975777 1898170 1967564 1951148 1941631 1972299
15846 1972299 1928847 1891444 1860203 1858226 1903697 1927654 1896302 1949015 1957373 1963201 1961581 1967929
15834 1967929 2002164 2021954 2025281 1990152 1976055 1924089 1910114 2004386 1982889 1979517 1978877 1955167
15822 1955167 1991689 2037077 1968548 2001814 2001347 1970462 1964081 1970628 1982207 1977696 1965918 1969792
15810 1969792 1942433 1979316 2019162 2021354 2027182 1913558 1951711 2016694 1931799 1907338 1919699
15799 1919699 1924977 1933053 1936414 1919856 1921926 1971130 1969947 1998750 1997183 1974143 1949452 1992102
15787 1992102 2019116 2064396 2005498 1994614 1998085 1997288 1974709 2007993 2084953 2023784 2022468 2013526
15775 2013526 1991588 1981493 2001068 1973486 1978649 1931916 1960447 1979355 1975643 2039746 2041524 2017705
15763 2017705 1956370 1938165 1979600 2038504 1983403 1978493 2006101 2015099 1980369 1974295 2000332 2003034
15751 2003034 2041759 1963543 2007696 1987762 1912836 1840913 1860357 1876701 1929008 1970223 1934184
15740 1934184 1954152 1990488 1964103 1977962 2031702 2000378 1975875 2011919 1970724 1980507 1963383
15729 1963383 1973049 2000792 1922381 1954920 1983828 1958421 2015285 2019788 1982218 1970387 1939604 1896955
15717 1896955 1920540 1954536 1971415 1988157 2021305 2062201 2009959 1969132 2025072 2044142 2025949
15706 2025949 2002860 1994935 2014139 1975959 1997048 2097318 2051261 1974541 1891319 1905905 1954832
15695 1954832 1924404 1975943 1977909 1937957 1904835 1973197 1984293 2037510 2049564 2005029 1967426
15684 1967426 1929346 1909432 1922659 1956319 1940552 1964319 1979903 2022789 2006411 2012067 2034114
15673 2034114 2036962 1984356 1976231 1961282 1959758 1927056 1912295 1996850 2010240 2083914 2023391 2001427
15661 2001427 2004542 2049097 2013552 1981702 1967948 1921042 1915945 1950158 1989563 2013752 1995215 1972584
15649 1972584 2005384 1963060 1979030 1998578 1994541 2029725 2001792 1956250 1985917 2019781 2022022 2000390
15637 2000390 2048569 2034856 1984175 2018243 1971473 2000008 2036823 1991043 2014765 1953771 1928684
15626 1928684 1945060 1969714 1906086 1964401 1981034 2002576 2050141 2080571 2073911 2072054 1995718 1924740
15614 1924740 1912072 1953568 2029033 2035232 2067602 2044447 2007505 1899716 1951201 1956583 1994561
15603 1994561 2020015 2015024 2000934 2004853 1974278 1992193 2007808 2044336 2030943 2056975 2054411 2053742
15591 2053742 2021844 2019807 2044939 2015542 2019486 1951554 1923082 1994653 2041723 1989283 2023026 2016920
15579 2016920 1997215 2045466 2037235 2061960 2052518 2042465 1977525 2001495 2016638 2062340 2103832 2072235
15567 2072235 2011499 2004743 2039227 1986518 1941106 1959910 2018561 2085995 2049094 2022027 2017735 1989863
15555 1989863 2047532 2049644 2018986 2058662 1988865 2037109 2030387 1962371 1947829 1950786 2012498 2019870
15543 2019870 1990632 1993899 1983149 1975668 2013563 1971269 2005029 2025963 2080809 2022917 1982677 2017800
15531 2017800 2075614 2031558 2053463 2032664 2078587 2041017 2068529 2053158 2033990 2025738 1992714
15520 1992714 2021061 2013684 1930415 1890702 1945279 2012879 2000766 2009443 2018586 2051895 2061799 2012870
15508 2012870 2005929 2005021 2039350 2023399 2040887 2062900 2010509 2032630 1975915 1978003 2010503 1987630
15496 1987630 2028124 2086017 2070786 1993580 2017270 2029918 2051523 2053259 2051425 2127984 2098713 2054054
15484 2054054 2038021 2037727 2063555 2023414 2018457 1985229 1987976 1990297 2008326 2026738 2081888 2028195
15472 2028195 1992495 2059993 2086695 2074864 2011854 2088813 2096943 2034074 2081845 2070834 2034373
15461 2034373 2038987 2086775 2083748 2094672 2116611 2096880 2075884 2009344 2053160 2012395 2085369 2120854
15449 2120854 2074651 2058702 2020494 2077432 2027405 2028947 2031971 2036176 1983600 1993366 2009750 2018458
15437 2018458 2094405 2019484 1983595 2031926 2056757 2063786 2077020 2146971 2144640 2072169 2095516 2095943
15425 2095943 2031035 2076862 2072795 2046982 2072390 2069674 2013179 2013560 2027958 2063329 2123825 2127189
15413 2127189 2143750 2127315 2102721 2079845 2026147 2067428 2082628 2018117 1961927 2000908 1995381
15402 1995381 2003049 1986629 2001774 1982938 1989865 2031576 2067815 2078576 2051924 2040561 2020824 2035745
15390 2035745 2050232 2028381 2007251 1996359 2009545 2008462 1995794 2068935 2078119 2078134 2060922 2064726
15378 2064726 2076511 2036065 2059628 2005186 1974867 1990257 2041335 2054442 2044330 2049138 1969231
15367 1969231 1995972 2044563 2061886 2058059 2100683 2058629 2034192 2065873 2027195 2068421 2075531 2162281
15355 2162281 2042940 2051262 2061070 2033063 2064808 2089828 2099413 2073558 2037516 2027115 2068325 2026197
15343 2026197 2044906 2054198 2009379 2085404 2071719 2010265 2005997 2016493 2070227 2038684 2074543 2053341
15331 2053341 2099657 2137731 2138606 2076462 2090593 2082499 2066771 2048677 2078886 2004147 1990409 2034512
15319 2034512 2093370 2051749 2080168 2116741 2111157 2123560 2080312 2021999 2048522 2098689 2069333
15308 2069333 2059666 2062187 2070449 2030457 2048148 2068204 2071485 2021130 2037787 2103366 2106347 2027819
15296 2027819 2056399 2091956 2055990 2090525 2125575 2105265 2066978 2076610 2065099 2077154 2102720
15285 2102720 2146245 2128768 2104716 2068745 2029650 2060808 2097042 2103346 2148920 2151729 2124556 2114175
15273 2114175 2088967 2113809 2172156 2123637 2089921 2081308 2045539 2045565 2042543 2086436 2176899 2132068
15261 2132068 2041115 2088955 2082273 2124018 2090287 2070268 2024843 2021321 2039157 2031088 2068038 2019558
15249 2019558 2083607 2133416 2164898 2129636 2080821 2027885 2033317 2117524 2123340 2075205 2086519 2087900
15237 2087900 2064259 2116009 2054977 2085469 2077760 2026776 1961790 2019125 2114704 2148626 2115423
15226 2115423 2106826 2067739 2089078 2113589 2133234 2118544 2054501 2089167 2088564 2067427 2093377 2112568
15214 2112568 2097711 2121449 2123005 2149173 2062224 2026721 2074221 2114267 2088865 2082557 2094493 2095661
15202 2095661 2096302 2050730 2032358 2106365 2097927 2085575 2099198 2132895 2134634 2068846 2062078 2027002
15190 2027002 2013097 2059006 2024950 2075262 2151017 2175209 2153689 2153310 2166204 2208311 2189891 2117892
15178 2117892 2062113 2117458 2107392 2116872 2138569 2103526 2093235 2062891 2096252 2191194 2204764
15167 2204764 2112650 2103662 2045413 2080815 2121161 2099336 2098407 2046860 2043564 2104260 2093281 2042559
15155 2042559 2008563 2062192 2094364 2153308 2103949 2105938 2060607 2053584 2099843 2115334 2074393 2080257
15143 2080257 2083754 2124780 2161647 2143035 2129367 2134330 2115784 2052006 2083947 2107376 2084242 2139509
15131 2139509 2161700 2198583 2146894 2129266 2159882 2181250 2210823 2123506 2065580 2160328 2144469
15120 2144469 2115146 2085117 2110051 2128828 2054078 2077885 2094353 2095463 2114301 2123535 2162913 2122717
15108 2122717 2097272 2107574 2136009 2161714 2127252 2138668 2150564 2209339 2140812 2142353 2170999
15097 2170999 2155412 2153078 2178416 2205936 2159539 2136313 2161691 2217314 2218956 2164348 2171784 2173977
15085 2173977 2152194 2093969 2035822 2077506 2156787 2160976 2105964 2103679 2073239 2063451 2067777 2065705
15073 2065705 2179594 2161294 2062694 2026438 2101835 2105811 2115987 2051516 2137518 2151640 2122944
15062 2122944 2114719 2178615 2163655 2121989 2185891 2178040 2141684 2188497 2149456 2130023 2118009 2107613
15050 2107613 2192451 2253720 2227726 2168135 2161152 2168188 2178220 2165605 2105871 2076504 2118689 2144128
15038 2144128 2139262 2112032 2126735 2174199 2171284 2135261 2082314 2106359 2089047 2111687 2156947 2148049
15026 2148049 2144913 2140370 2181834 2198867 2169974 2139589 2147037 2147979 2136457 2187362 2195166 2185078
15014 2185078 2188669 2156528 2111581 2087032 2109557 2114203 2128879 2153405 2086207 2135305 2187022 2143231
15002 2143231 2097307 2081450 2154446 2195293 2224698 2206414 2166576 2121295 2106991 2087634 2085566
14991 2085566 2136039 2192139 2172860 2137260 2037337 2130468 2085333 2071038 2074778 2188598 2188347 2210585
14979 2210585 2221378 2107606 2081308 2230980 2249569 2201329 2196666 2211337 2256513 2231014 2129312
14968 2129312 2097526 2117481 2081465 1993641 2049234 2125791 2101659 2123164 2126286 2190205 2162131
14957 2162131 2182019 2197332 2208863 2214560 2156878 2145345 2161269 2174466 2175610 2143912 2207549 2204394
14945 2204394 2201240 2163934 2178178 2155215 2215220 2191004 2124505 2189327 2157758 2138033 2194751
14934 2194751 2141841 2107347 2105697 2062312 2165718 2143989 2099627 2144131 2120789 2134577 2179431
14923 2179431 2188817 2117801 2129583 2219486 2212572 2146045 2138967 2199666 2171156 2134687 2125735 2082675
14911 2082675 2104784 2146952 2152460 2158751 2162767 2105201 2031777 2051706 2105849 2152831 2161305 2151719
14899 2151719 2103169 2152318 2188557 2242056 2237246 2182090 2152556 2170709 2241547 2191308 2174542
14888 2174542 2149975 2120937 2225381 2227184 2158319 2116909 2164742 2133301 2105589 2125627 2150736
14877 2150736 2179200 2103037 2126784 2215340 2247987 2191172 2167786 2173142 2133402 2165676 2177952
14866 2177952 2197504 2257060 2226893 2221171 2234420 2221363 2128411 2160787 2192563 2165010 2141106
14855 2141106 2089378 2148058 2190694 2237779 2240361 2180628 2186275 2158844 2205110 2213294 2096997 2089732
14843 2089732 2175856 2171384 2153651 2157494 2157954 2154615 2273573 2192794 2158262 2185035 2199126 2226538
14831 2226538 2195827 2207676 2234431 2182589 2160766 2157439 2134694 2193087 2221289 2212463 2185003 2192535
14819 2192535 2208290 2210132 2276442 2257515 2259362 2281881 2223400 2153285 2142151 2179501 2183087 2270703
14807 2270703 2271992 2227679 2205395 2218400 2249191 2226725 2211007 2129604 2209301 2204865 2211392 2214787
14795 2214787 2174301 2188254 2248340 2298485 2279614 2197392 2116945 2131958 2216473 2265186 2230126
14784 2230126 2194668 2217971 2313379 2254568 2222933 2221517 2173245 2196485 2225360 2229603 2251856 2211791
14772 2211791 2172555 2200229 2273616 2243683 2271112 2193252 2211924 2245267 2288198 2313827 2297306
14761 2297306 2235880 2210964 2203742 2211024 2213595 2194754 2241564 2203545 2199973 2173377 2153449 2184558
14749 2184558 2171343 2140123 2211999 2215715 2171370 2173341 2207158 2249357 2226811 2230944 2262276 2273790
14737 2273790 2191656 2216408 2286512 2228884 2181901 2190822 2234560 2244426 2232988 2189894 2148473 2202135
14725 2202135 2231515 2221302 2232610 2258244 2254000 2224809 2184776 2205250 2206184 2248987 2367944 2335513
14713 2335513 2264638 2279721 2192466 2179302 2157643 2184640 2211867 2239385 2272747 2280475 2251213
14702 2251213 2308989 2301277 2276065 2321027 2276376 2269831 2210066 2169399 2189836 2217583 2206578 2232074
14690 2232074 2175092 2210467 2285843 2244686 2271479 2273614 2249993 2241419 2210590 2229333 2222662 2291435
14678 2291435 2226073 2240929 2248493 2187817 2289861 2301181 2286986 2274254 2316022 2333983 2306644
14667 2306644 2260877 2278472 2297127 2287167 2261572 2305441 2304842 2253056 2191128 2237612 2333591 2320279
14655 2320279 2371323 2340847 2241551 2216805 2349494 2326563 2327429 2269050 2265731 2332300 2287868 2270486
14643 2270486 2258300 2228574 2276018 2225911 2277448 2257688 2177785 2218199 2210798 2209793 2225843 2203968
14631 2203968 2231100 2257592 2248949 2236213 2278577 2309964 2331413 2286071 2232849 2215542 2245754
14620 2245754 2283446 2235069 2308015 2269907 2246391 2212041 2238966 2267658 2248178 2300044 2239177
14609 2239177 2339562 2348554 2255413 2214065 2312785 2302936 2262088 2300788 2293605 2308146 2316961 2304044
14597 2304044 2222583 2269803 2265962 2302036 2242105 2322130 2349972 2303491 2297939 2289254 2251956 2283514
14585 2283514 2248626 2268140 2314515 2267194 2267651 2300896 2252102 2242021 2269340 2264444 2279533 2294018
14573 2294018 2282203 2248016 2306576 2324105 2303218 2320984 2354119 2287276 2285056 2332132 2348496
14562 2348496 2264127 2219069 2202430 2274783 2317695 2288708 2278691 2294220 2305579 2314305 2240970
14551 2240970 2216480 2263531 2270039 2261955 2270888 2197453 2247394 2221170 2261714 2313364 2267354 2233283
14539 2233283 2263164 2290916 2247962 2343235 2289314 2314100 2257220 2271444 2310030 2287023 2242206
14528 2242206 2181026 2270031 2382734 2406036 2315425 2272726 2273976 2335837 2257368 2231131 2290061
14517 2290061 2307322 2364677 2346492 2335789 2324230 2272075 2241178 2219830 2221686 2237518 2225692
14506 2225692 2273485 2321101 2329171 2311800 2380260 2357561 2326213 2385968 2346089 2276960 2250857
14495 2250857 2241382 2336912 2342309 2342563 2384441 2351718 2303010 2374290 2306661 2304754 2344598 2335980
14483 2335980 2327938 2327473 2344329 2329958 2298619 2282863 2251167 2255383 2239907 2228806 2252156 2281712
14471 2281712 2330089 2320734 2322747 2343517 2329711 2271136 2255306 2222329 2238587 2266772 2312340 2315731
14459 2315731 2349295 2330062 2285128 2288551 2302319 2362440 2312227 2323620 2360613 2359906 2399406 2333592
14447 2333592 2341375 2300461 2310067 2329314 2270567 2304761 2314153 2325259 2323239 2308022 2305715 2360500
14435 2360500 2340307 2245937 2248004 2328612 2338044 2352979 2351264 2327640 2342627 2340462 2373494 2304168
14423 2304168 2299312 2275117 2269008 2311971 2308336 2329080 2353766 2397093 2482238 2418025 2390029 2420082
14411 2420082 2274357 2231320 2303767 2374199 2322059 2272372 2263076 2295499 2323706 2318632 2343423
14400 2343423 2349680 2366237 2392458 2408036 2384213 2417713 2370497 2357214 2323116 2350080 2338404
14389 2338404 2345821 2410049 2372085 2344689 2344688 2314845 2347477 2378928 2361568 2365147 2334439 2299977
14377 2299977 2283258 2344927 2352420 2389232 2343221 2374564 2410231 2357232 2386953 2402726 2436437
14366 2436437 2423640 2324346 2343804 2354948 2284263 2350673 2340420 2359818 2338006 2391362 2376010
14355 2376010 2317731 2322904 2296344 2264617 2267184 2286875 2270693 2267906 2340929 2368367 2343316 2290103
14343 2290103 2279935 2277551 2244182 2266299 2344445 2413047 2405695 2333043 2304235 2385915 2429888 2445320
14331 2445320 2410893 2380734 2372970 2340703 2364524 2398799 2346383 2312347 2387546 2392982 2392846 2455036
14319 2455036 2480303 2426100 2390499 2338315 2332516 2389223 2390480 2364528 2289397 2260740 2287208 2313741
14307 2313741 2391093 2389909 2354280 2341660 2369474 2317583 2233055 2277114 2246117 2328760 2310919
14296 2310919 2330974 2321600 2341841 2327618 2363729 2403995 2421896 2337501 2371705 2398476 2411647
14285 2411647 2404866 2383256 2409726 2402766 2352897 2339659 2352605 2378174 2310363 2283839 2337658 2320542
14273 2320542 2357309 2396713 2383202 2305989 2290390 2337810 2312940 2285540 2373697 2388770 2378536
14262 2378536 2392289 2386653 2395924 2398282 2416714 2395238 2376805 2392345 2403559 2358395 2350738 2343880
14250 2343880 2339486 2356847 2386863 2454974 2465737 2509022 2472515 2402174 2396493 2341430 2400668 2440777
14238 2440777 2438012 2456567 2413027 2413247 2428997 2433387 2442263 2394984 2380555 2383584 2358987 2372861
14226 2372861 2379908 2459285 2406322 2397517 2428855 2414989 2409883 2466297 2455180 2477273 2460409 2409175
14214 2409175 2406526 2400042 2320128 2374501 2407040 2457789 2444297 2360709 2308041 2377784 2395590 2388806
14202 2388806 2361401 2367566 2400507 2435018 2413475 2437483 2421944 2426212 2430571 2440500 2458080 2463739
14190 2463739 2494941 2450765 2413456 2389520 2418657 2430802 2426241 2358662 2403209 2467074 2418442
14179 2418442 2386948 2367308 2305390 2364910 2371383 2451917 2446120 2388051 2422695 2444004 2403754 2411728
14167 2411728 2448738 2428808 2428419 2500745 2475472 2464726 2445489 2503952 2527948 2453957 2447336 2422293
14155 2422293 2410321 2441799 2453203 2417823 2382416 2407150 2444119 2339838 2363455 2403691 2370326
14144 2370326 2431371 2451565 2405325 2450957 2501207 2455847 2408141 2388819 2409139 2410408 2435353
14133 2435353 2423748 2370162 2360511 2354285 2410184 2461096 2511600 2459138 2447417 2454098 2480617 2527178
14121 2527178 2475506 2466559 2434092 2423247 2483105 2423127 2315074 2339369 2392604 2371477 2347010
14110 2347010 2398672 2369065 2316877 2324871 2375652 2344138 2360154 2397720 2436104 2421120 2410578
14099 2410578 2387344 2340265 2378331 2388099 2366143 2371310 2398379 2454850 2442115 2395090 2399564 2412318
14087 2412318 2478131 2488023 2519383 2513496 2461691 2442871 2388390 2411865 2411451 2487115 2490639 2448907
14075 2448907 2421364 2436100 2472845 2483064 2445339 2435176 2495915 2476321 2402136 2358985 2453548
14064 2453548 2443074 2452600 2459356 2479689 2499778 2512196 2488601 2414944 2431148 2407983 2410019 2437337
14052 2437337 2398308 2390653 2438143 2495503 2485342 2441098 2522320 2519537 2462972 2432700 2462509 2484971
14040 2484971 2461819 2428475 2440840 2464540 2415514 2465297 2501708 2528843 2526930 2472999 2444463
14029 2444463 2468068 2487710 2482357 2507325 2487213 2486956 2551744 2444554 2430677 2510102 2496635 2447355
14017 2447355 2415944 2471231 2500610 2444057 2444674 2421290 2462107 2468504 2462460 2496545 2509003 2459811
14005 2459811 2397542 2414305 2402740 2469476 2510397 2476217 2490364 2519520 2488988 2479499 2504120
13994 2504120 2475746 2434936 2476461 2499714 2432261 2427075 2460529 2504481 2570357 2538382 2415375
13983 2415375 2390593 2452325 2514600 2435927 2367707 2391697 2518892 2534950 2552346 2561012 2559735
13972 2559735 2512202 2453590 2443642 2490760 2519115 2524271 2521498 2461693 2485346 2535747 2596240 2533405
13960 2533405 2497540 2464898 2525806 2485317 2479359 2472721 2479503 2434731 2404819 2386330 2376719 2432819
13948 2432819 2472239 2442712 2465669 2512424 2516036 2471710 2509786 2511776 2483574 2505867 2476493 2459967
13936 2459967 2451788 2480131 2556911 2560781 2498903 2455353 2436737 2471009 2508931 2534568 2551981 2522624
13924 2522624 2494719 2444748 2530319 2540359 2561695 2561919 2564762 2624217 2552862 2542427 2494030 2524145
13912 2524145 2548017 2603724 2620693 2576530 2525162 2475075 2505633 2530563 2535670 2497478 2475032
13901 2475032 2518357 2500130 2548583 2550142 2602860 2611056 2533180 2458691 2413342 2468307 2544382 2560428
13889 2560428 2584758 2590863 2569823 2532827 2514927 2506907 2445831 2470422 2535806 2549079 2570734 2540349
13877 2540349 2508509 2541424 2594162 2568278 2607609 2561517 2582097 2615467 2591710 2592558 2637996 2637211
13865 2637211 2608766 2569453 2613174 2682967 2641427 2602308 2537763 2509830 2537165 2586489 2586752 2603079
13853 2603079 2596672 2585311 2556648 2600107 2589543 2600343 2624198 2578159 2547408 2557795 2573760
13842 2573760 2569464 2649703 2706739 2651406 2604980 2626485 2636004 2600745 2558336 2590122 2586085 2538668
13830 2538668 2574745 2583642 2573757 2546881 2565276 2615325 2588016 2604063 2631427 2577154 2528851 2557939
13818 2557939 2585076 2537220 2574448 2636839 2625319 2602533 2543673 2557466 2569851 2567459 2614519
$$ [...]
##END NTUPLES=NMR SPECTRUM
##END=
