##TITLE=1H_DE-80H_X3
 200.13MHz, d2o
 8 sc
 
 19ns.26.2.2025
##JCAMPDX= 6.0         $$ Bruker NMR JCAMP-DX V2.0
##DATA TYPE= NMR SPECTRUM
##DATA CLASS= NTUPLES
##ORIGIN= UXNMR, Bruker Analytische Messtechnik GmbH
##OWNER= pz
$$ XWIN-NMR		Version 3.5
$$ Wed Jun 11 11:37:53 2025 Russian Standard Time (UT+4h)  Yarkov@DPX200
##.OBSERVE FREQUENCY= 200.1313
##.OBSERVE NUCLEUS= ^1H
##.ACQUISITION MODE= SIMULTANEOUS
##.ACQUISITION SCHEME= undefined
##.AVERAGES= 8
##.DIGITISER RES= 18
##SPECTROMETER/DATA SYSTEM= spect
##.PULSE SEQUENCE= zg30
##.SOLVENT NAME= CDCl3
##.SHIFT REFERENCE= (INTERNAL, CDCl3, 0, 15.7039)
##AUDIT TRAIL= $$ (NUMBER, WHEN, WHO, WHERE, WHAT)
$$ ##TITLE= Audit trail, XWIN-NMR		Version 3.5
$$ ##JCAMPDX= 5.01
$$ ##ORIGIN= Bruker BioSpin GmbH
$$ ##OWNER= Yarkov
$$ C:/Bruker/XWIN-NMR/data/yarkov2/nmr/H-C/1/pdata/1/auditp.txt
$$ ##AUDIT TRAIL=  $$ (NUMBER, WHEN, WHO, WHERE, WHAT)
(   1,<2025-06-11 11:36:40.14 +0400>,<Yarkov>,<DPX200>,
      <created by zg, POWCHK disabled, PULCHK disabled
       configuration hash MD5:
       00 E9 B6 7A A2 85 ED C7 34 08 36 98 17 FE 4E 26
       data hash MD5: 16K
       F7 EE E6 F8 1F A7 88 12 6E 93 C5 C2 8D 45 76 E1>)
(   2,<2025-06-11 11:36:48.40 +0400>,<Yarkov>,<DPX200>,
      <Start of raw data processing
       efp BC_mod = 2 LB = 0.25 FT_mod = 6 PKNL = 1 PHC0 = -1710.501 PHC1 = 9.76656 SI = 16K 
       data hash MD5: 16K
       BE D8 06 90 2D C3 3F 5E 9C 79 B0 E6 9C B0 30 DA>)
(   3,<2025-06-11 11:36:54.76 +0400>,<Yarkov>,<DPX200>,
      <abs ABSG = 5 
       data hash MD5: 16K
       E8 85 E8 4F 6D 51 4D 75 52 62 84 F8 2E 69 AC 6B>)
(   4,<2025-06-11 11:37:23.53 +0400>,<Yarkov>,<DPX200>,
      <pk PHC0 = -4 PHC1 = 0 
       data hash MD5: 16K
       E2 3A 12 06 E8 79 3E 08 4E 58 75 22 D5 82 4D 85>)
$$ ##END=
$$ 
$$ hash MD5
$$ 23 B4 EB 52 2A B3 F7 5A C7 E5 77 8F C0 46 DC 30
##$RELAX= 
##$RELAX= 
##$RELAX= 
##$RELAX= 
##$RELAX= 
##$RELAX= 
$$ Bruker specific parameters
$$ --------------------------
##$DU= <C:/Bruker/XWIN-NMR>
##$EXPNO= 1
##$NAME= <H-C>
##$PROCNO= 1
##$TYPE= <nmr>
##$USER= <yarkov2>
##$AMP= (0..31)
100 100 100 100 100 100 100 100 100 100 100 100 100 100 100 100 100 100 
100 100 100 100 100 100 100 100 100 100 100 100 100 100 
##$AQSEQ= 0
##$AQ_mod= 1
##$AUNM= <au_zg>
##$AUTOPOS= <>
##$BF1= 200.13
##$BF2= 200.13
##$BF3= 200.13
##$BF4= 200.13
##$BF5= 200.13
##$BF6= 200.13
##$BF7= 200.13
##$BF8= 200.13
##$BYTORDA= 1
##$CFDGTYP= 0
##$CFRGTYP= 5
##$CHEMSTR= <none>
##$CNST= (0..31)
1 1 145 1 1 1 1 1 1 1 1 1 1 1 1 1 1 1 1 1 1 1 1 1 1 1 1 1 1 1 1 1 
##$CPDPRG= <>
##$CPDPRG1= <>
##$CPDPRG2= <>
##$CPDPRG3= <>
##$CPDPRG4= <mlev>
##$CPDPRG5= <mlev>
##$CPDPRG6= <mlev>
##$CPDPRG7= <mlev>
##$CPDPRG8= <mlev>
##$CPDPRGB= <>
##$CPDPRGT= <>
##$D= (0..31)
0 0.7 0 0 0 0 0 0 0 0 0 0.03 0 0 0 0 0 0 0 0 0 0 0 0 0 0 0 0 0 0 0 0 
##$DATE= 1749627399
##$DBL= (0..7)
120 120 120 120 120 120 120 120 
##$DBP= (0..7)
150 150 150 150 150 150 150 150 
##$DBP07= 0
##$DBPNAM0= <>
##$DBPNAM1= <>
##$DBPNAM2= <>
$$ [...]
##$SUBNAM3= <"">
##$SUBNAM4= <"">
##$SUBNAM5= <"">
##$SUBNAM6= <"">
##$SUBNAM7= <"">
##$SUBNAM8= <"">
##$SUBNAM9= <"">
##$SW= 18.0517328524113
##$SWIBOX= (0..15)
0 0 2 0 0 0 0 0 0 0 0 0 0 0 0 0 
##$SW_h= 3612.71676300578
##$TD= 16384
##$TD0= 1
##$TE= 0
##$TE2= 300
##$TE3= 300
##$TEG= 300
##$TL= (0..7)
0 120 120 120 120 120 120 120 
##$TP= (0..7)
150 150 150 150 150 150 150 150 
##$TP07= 0
##$TPNAME0= <>
##$TPNAME1= <>
##$TPNAME2= <>
##$TPNAME3= <>
##$TPNAME4= <>
##$TPNAME5= <>
##$TPNAME6= <>
##$TPNAME7= <>
##$TPOAL= (0..7)
0.5 0.5 0.5 0.5 0.5 0.5 0.5 0.5 
##$TPOFFS= (0..7)
0 0 0 0 0 0 0 0 
##$TUNHIN= 0
##$TUNHOUT= 0
##$TUNXOUT= 0
##$USERA1= <user>
##$USERA2= <user>
##$USERA3= <user>
##$USERA4= <user>
##$USERA5= <user>
##$V9= 5
##$VALIST= <valist>
##$VCLIST= <CCCCCCCCCCCCCCC>
##$VD= 0
##$VDLIST= <DDDDDDDDDDDDDDD>
##$VPLIST= <PPPPPPPPPPPPPPP>
##$VTLIST= <TTTTTTTTTTTTTTT>
##$WBST= 1024
##$WBSW= 4
##$XGAIN= (0..3)
0 0 0 0 
##$XL= 0
##$YL= 0
##$YMAX_a= 185389
##$YMIN_a= -185828
##$ZGOPTNS= <>
##$ZL1= 120
##$ZL2= 120
##$ZL3= 120
##$ZL4= 120
##$ABSF1= 15.47474
##$ABSF2= -2.577109
##$ABSG= 5
##$ABSL= 3
##$ALPHA= 0
##$AQORDER= 0
##$ASSFAC= 0
##$ASSFACI= 0
##$ASSFACX= 0
##$ASSWID= 0
##$AUNMP= <proc_1d>
##$AZFE= 0.1
##$AZFW= 0.1
##$BCFW= 0
##$BC_mod= 2
##$BYTORDP= 0
##$COROFFS= 0
##$CY= -3
##$DATMOD= 1
##$DC= 0
##$DFILT= <>
##$DTYPP= 0
##$F1P= 0
##$F2P= 0
##$FCOR= 1
##$FTSIZE= 16384
##$FT_mod= 6
##$GAMMA= 0
##$GB= 0
##$INTBC= 1
##$INTSCL= 3.241238e-09
##$ISEN= 128
##$LB= 0.25
##$LEV0= 0
##$LPBIN= 0
##$MAXI= 10000
##$MC2= 0
##$MEAN= 0
##$ME_mod= 0
##$MI= 1.114404
##$NCOEF= 0
##$NC_proc= -7
##$NLEV= 6
##$NOISF1= 3.799351
##$NOISF2= 2.8
##$NSP= 0
##$NTH_PI= 0
##$NZP= 0
##$OFFSET= 15.70392
##$PC= 1
##$PHC0= -1714.501
##$PHC1= 9.76656
##$PH_mod= 1
##$PKNL= yes
##$PPARMOD= 0
##$PSCAL= 0
##$PSIGN= 0
##$REVERSE= no
##$SF= 200.129963532113
##$SI= 16384
##$SIGF1= 3
##$SIGF2= 2
##$SINO= 0.751879
##$SIOLD= 32768
##$SREGLST= <19F.Aceton>
##$SSB= 0
##$STSI= 16384
##$STSR= 0
##$SW_p= 3612.71676300578
##$SYMM= 0
##$S_DEV= 0
##$TDeff= 16384
##$TDoff= 0
##$TI= <>
##$TILT= no
##$TM1= 0
##$TM2= 0
##$TOPLEV= 0
##$USERP1= <user>
##$USERP2= <user>
##$USERP3= <user>
##$USERP4= <user>
##$USERP5= <user>
##$WDW= 1
##$XDIM= 16384
##$YMAX_p= 304038578
##$YMIN_p= -880976
$$ End of Bruker specific parameters
$$ ---------------------------------
##NTUPLES= NMR SPECTRUM
##VAR_NAME=  FREQUENCY,     SPECTRUM/REAL,   SPECTRUM/IMAG
##SYMBOL=    X,             R,               I
##VAR_TYPE=  INDEPENDENT,   DEPENDENT,       DEPENDENT
##VAR_FORM=  AFFN,          ASDF,            ASDF
##VAR_DIM=   16384,         16384,           16384
##UNITS=     HZ,            ARBITRARY UNITS, ARBITRARY UNITS
##FACTOR=    0.220516191357247, 1,           1
##FIRST=     3142.82500983455, 0,            0
##LAST=      -469.891753171227, 0,           0
##MIN=       -469.891753171227, -880976,     0
##MAX=       3142.82500983455, 304038578,    0
$$ Real data points
##PAGE= N=1
##DATA TABLE= (X++(R..R)), XYDATA
$$ [...]
$$ plain form
5734 1113531 1023554 1024384 1119960 1277375 1312108 1228647 1134328 1086238 990196 1094966 1148666
5723 1148666 1181311 1363245 1239932 1167312 1053248 1096434 1195495 1222838 1308518 1390497 1313778
5712 1313778 1168201 1208270 1260014 1218093 1192689 1190676 1055653 1018510 1071999 1292113 1296122
5701 1296122 1297084 1215193 1118602 1220312 1148270 1048726 1087734 1262517 1229896 1129938 1221375
5690 1221375 1216410 1222348 1219515 1259330 1247832 1307998 1324790 1397801 1261241 1206141 1227118 1292750
5678 1292750 1295424 1373178 1515201 1427886 1470108 1482252 1404709 1265289 1371042 1398927 1559340
5667 1559340 1584232 1535502 1507766 1426829 1392326 1506634 1537035 1556368 1669199 1656416 1658650
5656 1658650 1679597 1787143 1790153 1698646 1629650 1768456 1847435 1937763 1824097 1782696 1757762
$$ packed form
5734A113531q9977Q30R5576J57415L4733q3461r4319m8090r6042J04770N3700
5723A148666L2645J81934j23313p2620j14064M3186R9061K7343Q5680Q1979p6719
5712A313778j45577M0069N1744m1921k5404k013j35023l7143N3489K20114M009
5701A296122R62q1891r6591J01710p2042r9544L9008J74783l2621r9958R1437
5690A221375m965N938k833L9815j1498O0166J6792P3011j36560n5100K0977O5632
5678A292750K674P7754J42023q7315M2222J2144p7543j39420J05753K7885J60413
5667A559340K4892m8730k7736q0937l4503J14308L0401J9333J12831j2783K234
5656A658650K0947J07546L010r1507o8996J38806P8979R0328j13666m1401k4934
$$ plain form
5645 1757762 1580258 1715334 1806965 1802307 1750772 1842117 1935140 1755138 1726778 1844200 1858681
5634 1858681 1853857 1882617 1897858 1991311 1840020 1875602 1902350 1945294 1912872 1985494 2150095
5623 2150095 2126488 2143797 2115115 2109620 1980898 1928269 2058538 2114725 2179722 2090349 2015095
5612 2015095 2073915 2106234 2243664 2286204 2271101 2135970 2176491 2168441 2170804 2246472 2326127
5601 2326127 2336781 2323440 2431449 2377904 2491350 2473117 2464338 2504021 2546239 2709827 2673265
5590 2673265 2592607 2630165 2685378 2468778 2665777 2727503 2670404 2709136 2800457 2940784 2919558
5579 2919558 2769435 2778177 2882658 3001066 2999494 3045251 3136577 3142246 3110764 3199888 3112747
5568 3112747 3149933 3284635 3293117 3409830 3632729 3598823 3540404 3695112 3697134 3655577 3728069
$$ packed form
5645A757762j77504J35076R1631m658n1535R1345R3023j80002k8360J17422J4481
5634A858681m824K8760J5241R3453j51291L5582K6748M2944l2422P2622J64601
5623B150095k3607J7309k8682n495j28722n2629J30269N6187O4997q9373p5254
5612B015095N8820L2319J37430M2540j5103j35131M0521q050K363P5668P9655
5601B326127J0654j3341J08009n3545J13446j8233q779L9683M2218J63588l6562
5590B673265q0658L7558N5213k16600J96999O1726n7099L8732R1321J40327k1226
5579B919558j50123Q742J04481J18408j572M5757R1326N669l1482Q9124q7141
5568C112747L7186J34702Q482J16713K22899l3906n8419J54708K022m1557P2492
$$ plain form
5557 3728069 3736286 3807112 3874791 3964969 3980386 4152105 4237816 4224306 4466355 4609542 4669333
5546 4669333 4706887 4848112 5008499 5086866 5344718 5496396 5476247 5625689 5708084 5972626
5536 5972626 6101131 6174868 6293087 6485919 6710705 6834302 6957672 7183783 7303168 7565150
5526 7565150 7752804 7926140 8071197 8467813 8765668 8756548 9115886 9584855 9877460 10087314
5516 10087314 10436239 10845953 11053285 11418545 11759266 12145503 12631700 12979907 13414308
5507 13414308 13738808 14249893 14813874 15376507 15871990 16411711 17170543 17837828 18453694
5498 18453694 19163294 20027870 20794117 21444208 22250426 23221529 24158173 25086245 26273493
5489 26273493 27440732 28543182 29764908 31186597 32834663 34426796 36087152 37927530
$$ packed form
5557C728069Q217P0826O7679R0178J5417J71719Q5711j3510K42049J43187N9791
5546D669333L7554J41225J60387P8367K57852J51678k0149J49442Q2395K64542
5536E972626J28505P3737J18219J92832K24786J23597J23370K26111J19385K61982
5526G565150J87654J73336J45057L96616K97855r120L59338M68969K92605K09854
5516A0087314L48925M09714K07332L65260L40721L86237M86197L48207M34401
5507A3414308L24500N11085N63981N62633M95483N39721P58832O67285O15866
5498A8453694P09600Q64576P66247O50091Q06218R71103R36644R28072J187248
5489B6273493J167239J102450J221726J421689J648066J592133J660356J840378
$$ plain form
5481 37927530 39974320 42113291 44258116 46705002 49595551 52544564 55648150 58874188
5473 58874188 62258522 65881198 69817533 73955049 78380197 82822181 87372413 92085556
5465 92085556 96781628 101202184 104851097 107867028 110138791 110973981 110532283 108988707
5457 108988707 106179693 102476767 98014571 93041450 87612792 82313006 77047891 71802867
5449 71802867 66932304 62504488 58383812 54448844 50852034 47665908 44549033 41668873
5441 41668873 39171892 36859913 34704326 32694248 31083056 29471540 27921944 26525972
5433 26525972 25115969 24007627 22919326 21800919 20793103 19855587 18951202 18289940 17767959
5424 17767959 17017367 16274608 15658474 15141736 14560540 14017796 13535751 13050969 12481931
$$ packed form
5481C7927530K046790K138971K144825K446886K890549K949013L103586L226038
5473E8874188L384334L622676L936335M137516M425148M441984M550232M713143
5465I2085556M696072M420556L648913L015931K271763Q35190m41698j543576
5457A08988707k809014l702926m462196m973121n428658n299786n265115n245024
5449G1802867m870563m427816m120676l934968l596810l186126l116875k880160
5441D1668873k496981k311979k155587k010078j611192j611516j549596j395972
5433B6525972j410003j108342j088301j118407j007816r37516r04385o61262n21981
5424A7767959p50592p42759o16134n16738n81196n42744m82045m84782n69038
$$ plain form
5415 12481931 12152973 11883965 11692297 11199048 10782225 10588378 10138783 9893902 9731923
5406 9731923 9514811 9354282 9216608 9014097 8724851 8413407 8188619 8031432 7997877 7846013
5396 7846013 7713200 7524605 7483921 7534745 7480059 7188915 7055867 6957792 6827672 6764956
5386 6764956 6637543 6691424 6684388 6605371 6674566 6600587 6465749 6394879 6490997 6610946 6593217
5375 6593217 6693927 6662565 6753065 6836556 6846995 6922007 6971760 6923451 7034670 7124574 7133563
5364 7133563 7101710 7149250 7181380 7084284 7170836 7208953 7205902 7234397 7290908 7225491 7285545 7379412
5352 7379412 7465282 7455572 7573262 7697108 7795483 7916675 8087847 8177746 8348380 8556033
5342 8556033 8753848 8840316 8889190 8999364 9076823 9180667 9209214 9238037 9363048 9284630 9220422
$$ packed form
5415A2481931l28958k69008j91668m93249m16823j93847m49595k44881j61979
5406I731923k17112j60529j37674k02511k89246l11444k24788j57187l3555j51864
5396G846013j32813j88595m0684N0824n4686k91144j33048r8075j30120o2716
5386F764956j27413N3881p036p9017O9195p3979j34838p0870R6118J19949j7729
5375F593217J00710l1362R0500Q3491J0439P5012M9753m8309J11219Q9904Q989
5364G133563l1853M7540L2130r7096Q6552L8117l051K8495N6511o5417O0054R3867
5352G379412Q5870r710J17690J23846R8375J21192J71172Q9899J70634K07653
5342H556033J97815Q6468M8874J10174P7459J03844K8547K8823J25011p8418o4208
$$ plain form
5331 9220422 9200183 9249916 9190717 9209817 9324753 9441188 9582152 9590396 9779563 9977280 10369871
5320 10369871 10554795 10753817 10935979 10917961 10878828 10861037 10923524 11088186 10918286 10997586
5310 10997586 10857796 10713793 10726712 10612782 10506032 10430107 10422115 10229835 10352240 10454926
5300 10454926 10342087 10360826 10383014 10484970 10597765 10708133 10938095 10898839 11043834 11284587
5290 11284587 11248890 11125475 11115613 11029893 10998384 11073987 11018752 10946450 10670327 10253993 10076810
5279 10076810 9913872 9597640 9489315 9412603 9302511 9374835 9255499 9231343 9295084 9185977
5269 9185977 9283045 9357729 9374854 9200658 9063154 8988432 9058516 9145198 9016654 8741319 8523082
5258 8523082 8266840 7955422 7846639 7708287 7511863 7274987 7057099 6788719 6442447 6291860
$$ packed form
5331I220422k0239M9733n9199J9100J14936J16435J40964Q244J89167J97717L92591
5320A0369871J84924J99022J82162j8018l9133j7791O2487J64662j69900P9300
5310A0997586j39790j44003J2919j13930j06750p5925p992j92280J22405J02686
5300A0454926j12839J8739K2188J01956J12795J10368K29962l9256J44995K40753
5290A1284587l5697j23415r862q5720l1509P5603n5235p2302k76123m16334j77183
5279A0076810j62938l16232j08325p6712j10092P2324j19336k4156O3741j09107
5269I185977R7068P4684J7125j74196j37504p4722P0084Q6682j28544k75335k18237
5258H523082k56242l11418j08783j38352j96424k36876k17888k68380l46272j50587
$$ plain form
5248 6291860 6133486 5872579 5713210 5596638 5538695 5515353 5434349 5467477 5380927 5259999
5238 5259999 4966132 4895333 4884491 4789621 4589289 4435353 4344995 4195308 4114237 3990540
5228 3990540 3921459 3809889 3579182 3381036 3237338 3041016 2866758 2756187 2712744 2716249
5218 2716249 2620725 2452100 2475147 2282952 2179427 2101825 2133370 1928987 1891476 1824469 1791314
5207 1791314 1787284 1740177 1781990 1717258 1692397 1685024 1695938 1738666 1639625 1644339 1569886 1492701
5195 1492701 1422956 1224592 1291388 1304690 1332941 1268077 1198191 1145859 1100656 1288318 1320539
5184 1320539 1261417 1354713 1423005 1347487 1146962 1206881 1312164 1197396 1112069 1074263 1302924
5173 1302924 1203113 1072994 1002890 1097808 1140951 1135482 1143668 1015490 1126477 1042597 1056920
$$ packed form
5248F291860j58374k60907j59369j16572n7943k3342q1004L3128q6550j20928
5238E259999k93867p0799j0842r4870k00332j53936r0358j49687q1071j23697
5228C990540o9081j11570k30707j98146j43698j96322j74258j10571m3443L505
5218B716249r5524j68625K3047j92195j03525p7602L1545k04383l7511o7007l3155
5207A791314m030m7107M1813o4732k4861p373J0914M2728r9041M714p4453p7185
5195A492701o9745j98364O6796J3302K8251o4864o9886n2332m5203J87662L2221
5184A320539n9122R3296O8292p5518k00525N9919J05283j14768q5327l7806K28661
5173A302924r9811j30119p0104R4918M3143n469Q186j28178J10987q3880J4323
$$ plain form
5162 1056920 1063483 873396 1013655 1157418 947255 975311 985257 1004990 883725 841971 841250
5151 841250 1076798 1108169 1027786 995946 1035148 1150790 1164607 1038110 995908 862485 887817
5140 887817 931062 1005141 976077 855254 970729 882506 956796 930142 883761 918035 913296
5129 913296 924414 892988 884449 906414 820989 1020871 957683 915977 926280 932865 933679 841822
5117 841822 989675 921098 878167 964910 866700 932921 935978 877821 887818 926126 988090 984011
5105 984011 1042222 1076005 1006822 937153 887170 933338 867072 829860 827271 848405 980142 858283
5093 858283 833198 826677 900255 855667 811900 893167 846336 887110 804313 729865 824370 847716
5081 847716 862497 868081 906096 990518 912974 913407 988035 827836 838116 827307 983672 996202
$$ packed form
5162A056920O563j90087J40259J43763k10163K8056R946J9733j21265m1754p21
5151H41250K35548L1371q0383l1840L9202J15642J3817j26497m2202j33423K5332
5140H87817M3245P4079k9064j20823J15475q8223P4290k6654m6381L4274m739
5129I13296J1118l1426q539K1965q5425J99882o3188m1706J0303O585Q14r1857
5117H41822J47853o8577m2931Q6743r8210O6221L057n8157R997L8308O1964m079
5105I84011N8211L3783o9183o9669m9983M6168o6266l7212k589K1134J31737j21859
5093H58283k5085o521P3578m4588m3767Q1267m6831M0774q2797p4448R4505K3346
5081H47716J4781N584L8015Q4422p7544M33P4628j60199J0280j0809J56365J2530
$$ plain form
5069 996202 939192 981733 861563 968394 1013944 1015529 990943 913408 840291 953414 984973
5058 984973 968297 971491 1048767 1092818 1009841 1035722 879193 858927 957574 1070110 1096240
5047 1096240 1066516 1188428 1111063 978981 1006109 1135799 1139862 1118265 1089472 1154601 1263950
5036 1263950 1296256 1380191 1433078 1212502 1260785 1240232 1370522 1404244 1283547 1366236 1401911
5025 1401911 1438871 1451345 1533834 1511424 1481847 1564628 1527954 1459034 1666409 1724603 1637589
5014 1637589 1745720 1747804 1874064 2086378 2087741 2027599 2080542 2357710 2566790 2602865 2601448
5003 2601448 2695186 2760430 2866578 2909072 3081477 3013036 3285496 3489948 3611763 3856524
4993 3856524 3975817 3983394 3979962 4003456 3975073 3969140 4131253 4227481 4204795 4151194 4211882 4253965
$$ packed form
5069I96202n7010M2541j20170J06831M5550J585k4586p7535p3117J13123L1559
5058I84973j6676L194P7276M4051q2977K5881j56529k0266R8647J12536K6130
5047A096240k9724J21912p7365j32082K7128J29690M063k1597k8793O5129J09349
5036A263950L2306Q3935N2887k20576M8283k0553J30290L3722j20697Q2689L5675
5025A401911L6960J2474Q2489k2410k9577Q2781l6674o8920K07375N8194q7014
5014A637589J08131K084J26260K12314J363o0142N2943K77168K09080L6075j417
5003B601448R3738O5244J06148M2494J72405o8441K72460K04452J21815K44761
4993C856524J19293P577l432K3494k8383n933J62113R6228k2686n3601O0688M2083
$$ plain form
4981 4253965 4314191 4441780 4451694 4617827 4617860 4621289 4735996 4986120 5253011 5298753 5561860
4970 5561860 5659026 5744806 5978084 6304196 6663003 6866196 7137204 7415691 7622789 7836767
4960 7836767 8030711 8024031 8095827 8054160 8115964 7951960 7925134 7884323 7836241 7826332 7841841
4949 7841841 7799098 7823292 7720869 7804547 7890022 7885709 7987277 8111165 8177932 8206469 8267084
4938 8267084 8392710 8466618 8484204 8643928 8840187 8918731 9058364 9189582 9317745 9509708
4928 9509708 9609436 9753032 9802559 9837393 9732465 9501249 9266084 9291492 9191970 9158962 9127249
4917 9127249 9140156 8991011 8911282 8926050 8949275 8974679 8969289 9028525 8904213 8759977 8640063
4906 8640063 8510319 8407720 8153678 8039107 8008555 7818375 7645176 7643749 7716583 7574837
$$ packed form
4981D253965O0226J27589R914J66133L3L429J14707K50124K66891M5742K63107
4970E561860R7166Q5780K33278L26112L58807K03193K71008K78487K07098K13978
4960G836767J93944o680P1796m1667O1804j64004k6826m0811m8082r909J5509
4949G841841m2743K4194j02423Q3678Q5475m313J01568J23888O6767K8537O0615
4938H267084J25626P3908J7586J59724J96259P8544J39633J31218J28163J91963
4928I509708R9728J43596M9527L4834j04928k31216k35165K5408r9522l3008l1713
4917I127249J2907j49145p9729J4768K3225K5404n390N9236j24312j44236j19914
4906H640063j29744j02599k54042j14571l0552j90180j73199j427P2834j41746
$$ plain form
4896 7574837 7377318 7244250 7334146 7172642 6993303 7048894 7062114 6905131 6793111 6739600
4886 6739600 6531219 6557398 6624264 6576373 6532551 6571440 6478634 6554560 6609184 6577934 6487504
4875 6487504 6227391 5904117 5945344 5693775 5442909 5272014 4936384 4740057 4641783 4580698
4865 4580698 4467177 4147894 4029929 4086413 3869928 3853158 3702760 3523072 3600743 3545139
4855 3545139 3430963 3530788 3508421 3580078 3584964 3598293 3532550 3589671 3641921 3539936 3537247
4844 3537247 3639290 3466769 3374191 3252536 3164388 3168093 3070140 2959394 2967119 2844324 2669360
4833 2669360 2651257 2534087 2205720 2074084 2215684 2210001 2270204 2137768 2155338 2124185 2012631
4822 2012631 1953284 1884114 2022127 1979861 1907936 1787884 1845526 1997382 1925179 1779635 1809386
$$ packed form
4896G574837j97519j33068Q9896j61504j79339N5591J3220j56983j12020n3511
4886F739600k08381K6179O6866m7891m3822L8889r2806P5926N4624l1250r0430
4875F487504k60113l23274M1227k51569k50866j70895l35630j96327r8274o1085
4865D580698j13521l19283j17965N6484k16485j6770j50398j79688P7671n5604
4855C545139j14176R9825k2367P1657M886J3329o5743N7121N2250j01985k689
4844C537247J02043j72521r2578j21655q8148L705r7953j10746P725j22795j74964
4833B669360j8103j17170l28367j31636J41600n683O0203j32436J7570l1153j11554
4822B012631n9347o9170J38013m2266p1925j20052N7642J51856p2203j45544K9751
$$ plain form
4811 1809386 1903767 1983227 1967628 1843167 1915493 1951868 1781996 1765884 1852888 1843031 1831184
4800 1831184 1836502 1898948 1783658 1815043 1863394 1938557 1926345 1858878 1944968 2029225 1899023
4789 1899023 1960560 1971594 1872648 1975941 2019824 2108496 2112691 2062815 2042676 2090325 2051596
4778 2051596 1929469 2010791 2081364 2101818 2141553 2199106 2230763 2047181 2080491 2089296 2044370
4767 2044370 2146597 2168901 2256792 2179008 2080798 2151546 2183159 2125564 2127843 2140920 2208485
4756 2208485 2173068 2130061 2128451 2197233 2301413 2365433 2387517 2255684 2245485 2234084 2347416
4745 2347416 2280197 2196238 2215788 2037830 2008734 2148905 2079321 1824691 1953199 1909138 1726687
4734 1726687 1695914 1778014 1825114 1875526 1933656 1653518 1632180 1635726 1518169 1480487 1534920
$$ packed form
4811A809386R4381P9460j5599j24461P2326L6375j69872j6112Q7004r857j1847
4800A831184N318O2446j15290L1385M8351P5163j2212o7467Q6090Q4257j30202
4789A899023O1537J1034r8946J03293M3883Q8672M195m9876k0139M7649l8729
4778B051596j22127Q1322P0573K0454L9735N7553L1657j83582L3310Q805m4926
4767B044370J02227K2304Q7891p7784r8210P0748L1613n7595K279J3077O7565
4756B208485l5417m3007j610O8782J04180O4020K2084j31833j0199j1401J13332
4745B347416o7219q3959J9550j77958k9096J40171o9584k54630J28508m4061j82451
4734A726687l0773Q2100M7100N0412N8130k80138k1338L546j17557l7682N4433
$$ plain form
4723 1534920 1563612 1579844 1667195 1721793 1550660 1391684 1525879 1504335 1391666 1414124 1437901
4712 1437901 1466213 1400939 1478799 1517398 1348145 1298987 1321014 1272737 1355493 1414650 1372662
4701 1372662 1344864 1192361 1202808 1352383 1476907 1444346 1354729 1452315 1291632 1201257 1368259
4690 1368259 1349842 1338101 1358369 1306268 1379178 1406702 1341082 1367134 1377038 1462947 1398395 1395033
4678 1395033 1355169 1283759 1486985 1614263 1400412 1540904 1645026 1572549 1613187 1724350
4668 1724350 1776789 1905290 2205301 2257752 2498503 2665520 2848384 2994184 3398383 3849911
4658 3849911 4436871 4972244 5325745 5529357 5520988 5262188 4624037 4043819 3538870 3185216
4648 3185216 2778797 2470801 2122627 2047394 1830008 1713731 1602623 1499515 1466530 1356765
$$ packed form
4723A534920K8692J6232Q7351N4598j71133j58976J34195k1544j12669K2458K3777
4712A437901K8312o5274P7860L8599j69253m9158K2027m8277Q2756N9157m1988
4701A372662k7798j52503J0447J49575J24524l2561q9617R7586j60683r0375J67002
4690A368259j8417j1741K0268n2101P2910K7524o5620K6052R904Q5909o4552l362
4678A395033l9864p1410K03226J27278k13851J40492J04122p2477M0638J11163
4668A724350N2439J28501L00011N2451K40751J67017J82864J45800M04199M51528
4658C849911N86960N35373L53501K03612q369k58800o38151n80218n04949l53654
4648C185216m06419l07996l48174p5233k17386j16277j11108j03108l2985j09765
$$ plain form
4638 1356765 1356624 1238460 1128035 1072920 1113488 1114263 1182668 1188945 1186855 1045026 901129 845362
4626 845362 799054 649802 830521 1076391 1048473 1124234 1157192 969248 920344 1037191 950374
4615 950374 930339 870165 867659 921098 923921 942192 857482 911894 1027742 847420 821020 981455
4603 981455 787509 821172 924849 944271 979485 885621 961012 944614 938710 923840 933987
4592 933987 922587 803538 794509 899098 938734 956245 921497 955568 864759 877295 819712
4581 819712 838101 876501 757244 834254 956801 996771 865388 1112081 1035816 1005613 1062722
4570 1062722 992457 1038232 1069051 1118081 1156196 1177599 1189094 1286957 1311046 1442731 1367294
4559 1367294 1365456 1479214 1312474 1456859 1677237 1607218 1542440 1649213 1736475 1831439 2030037
$$ packed form
4638A356765j41j18164j10425n5115M0568P75O8405O277k090j41829j43897n5767
4626H45362m6308j49252J80719K45870k7918P5761L2958j87944m8904J16847q6817
4615I50374k0035o0174k506N3439K823J8271q4710N4412J15848j80322k6400J60435
4603I81455j93946L3663J03677J9422L5214r3864P5391j6398n904j4870J0147
4592I33987j1400j19049r029J04589L9636J7511l4748L4071r0809J2536n7583
4581H19712J8389L8400j19257P7010J22547L9970j31383K46693p6265l0203N7109
4570A062722p0265M5775L0819M9030L8115K1403J1495R7863K4089J31685p5437
4559A367294j838J13758j66740J44385K20378p0019o4778J06773Q7262R4964J98598
$$ plain form
4548 2030037 1918287 1950252 2062578 2131874 2239566 2420715 2561798 2673934 2987712 3381837
4538 3381837 3773075 4066604 4206495 4048024 3865035 3543032 3367434 3384033 3443113 3317982
4528 3317982 3433277 3595831 3723419 3924243 4052609 4438319 4731135 4855372 4974658 5077868
4518 5077868 5185346 5594015 5908627 6028111 6388049 6566748 6803456 6981804 7013202 7070881
4508 7070881 7253569 7284389 7401522 7649557 7715345 7559487 7246932 7068534 6897488 6667934
4498 6667934 6521960 6368664 6297674 6224886 6083047 5653700 5165156 4884043 4603400 4381492
4488 4381492 4113350 4031298 3712283 3465416 3310188 3028989 2796931 2629795 2365622 2360046
4478 2360046 2142293 1973869 1859562 1632054 1578148 1608779 1637266 1623494 1495890 1486846 1435951
$$ packed form
4548B030037j11750L1965J12326O9296J07692J81149J41083J12136L13778L94125
4538C381837L91238K93529J39891j58471j82989l22003j75598J6599N9080j25131
4528C317982J15295J62554J27588K00824J28366L85710K92816J24237J19286J03210
4518E077868J07478M08669L14612J19484L59938J78699K36708J78348L1398N7679
4508G070881J82688L0820J17133K48035O5788j55858l12555j78398j71046k29554
4498F667934j45974j53296p0990p2788j41839m29347m88544k81113k80643k21908
4488D381492k68142q2052l19015k46867j55228k81199k32058j67136k64173n576
4478B360046k17753j68424j14307k27508n3906L0631K8487j3772j27604r044n0895
$$ plain form
4467 1435951 1435668 1490712 1436524 1320625 1318995 1332647 1367895 1346606 1326354 1396901 1350956 1287193
4455 1287193 1225526 1184628 1095477 1104023 1147421 1220154 1296640 1122072 1157285 1184175 1260825
4444 1260825 1326747 1229520 1089322 1083718 1284521 1262256 1130012 1115032 1392103 1313334 1325123
4433 1325123 1336809 1352118 1282767 1221734 1423754 1356499 1239325 1263311 1215207 1130530 1092714
4422 1092714 1325067 1333979 1221269 1314894 1378072 1367063 1249881 1376236 1441268 1542378 1568707
4411 1568707 1377615 1372315 1323707 1386789 1450650 1449096 1343283 1329665 1319058 1244755 1195796
4400 1195796 1256227 1272875 1238652 1320183 1248803 1332153 1368646 1315776 1221732 1236320 1209740
4389 1209740 1143139 1140286 1075777 1138138 1137813 1198085 1212355 1248426 1266003 1170232 1125590 1117597
$$ packed form
4467A435951k83N5044n4188j15899j630J3652L5248k1289k0252P0547m5945o3763
4455A287193o1667m0898q9151Q546M3398P2733P6486j74568L5213K6890P6650
4444A260825O5922r7227j40198n604K00803k2265j32244j4980K77071p8769J1789
4433A325123J1686J5309o9351o1033K02020o7255j17174K3986m8104q4677l7816
4422A092714K32353Q912j12710R3625O3178j1009j17182J26355O5032J01110K6329
4411A568707j91092n300m8608O3082O3861j554j05813j3618j0607p4303m8959
4400A195796O0431J6648l4223Q1531p1380Q3350L6493n2870r4044J4588k6580
4389A209740o6601k853o4509O2361l25O0272J4270L6071J7577r5771m4642p993
$$ plain form
4377 1117597 1110830 1306529 1387924 1266465 1317797 1276532 1169515 1250871 1205295 1162054 1062825
4366 1062825 1141750 1165463 1200550 1338318 1311241 1116464 1162074 1205400 1163680 1240117 1219679
4355 1219679 1235062 1111436 1141948 1090129 981531 968824 1051849 1286636 1267031 1380350 1381192
4344 1381192 1409770 1535436 1465275 1419385 1407593 1397612 1422991 1549893 1400032 1370700 1330136
4333 1330136 1323847 1292619 1267137 1263342 1437213 1557177 1555951 1585171 1558538 1443005 1384144
4322 1384144 1557531 1445367 1436010 1541606 1500534 1671960 1679121 1629187 1526472 1520808 1587768
4311 1587768 1540998 1632145 1654734 1645742 1737034 1674408 1559675 1537298 1627487 1692865 1784244
4300 1784244 1703787 1721556 1830593 1853967 1805921 1819695 1917488 1901119 1964228 1975634 1965063
$$ packed form
4377A117597o767J95699Q1395j21459N1332m1265j07017Q1356m5576m3241r9229
4366A062825P8925K3713L5087J37768k7077j94777M5610M3326m1720P6437k0438
4355A219679J5383j23626L0512n1819j08598j2707Q3025K34787j9605J13319Q42
4344A381192K8578J25666p0161m5890j1792r981K5379J26902j49861k9332m0564
4333A330136o289l1228k5482l795J73871J19964j226K9220k6633j15533n8861
4322A384144J73387j12164r357J05596m1072J71426P161m9934j02715n664O6960
4311A587768m6770R1147K2589q992R1292o2626j14733k2377R0189O5378R1379
4300A784244q0457J7769J09037K3374m8046J3774R7793j6369O3109J1406j0571
$$ plain form
4289 1965063 1979195 2035597 2037805 1974723 2150394 2167861 2241668 2259743 2272855 2142591 2299204
4278 2299204 2328876 2134364 2281271 2526946 2639373 2542915 2629004 2612583 2716213 2751516
4268 2751516 2779504 2826282 2956392 2911143 3103941 3373400 3458084 3488331 3738477 3798028 3764957
4257 3764957 3850754 4072056 4325737 4381514 4536070 4701892 4922364 5232851 5434558 5580777
4247 5580777 5680360 5864628 6142339 6334114 6544976 6643213 6956969 7136439 7286651 7482894
4237 7482894 7665244 8034556 8394845 8909655 9291945 9518902 9511197 9595376 9588820 9564250 9619694
4226 9619694 9735472 9844402 10007500 10264060 10574393 11018485 11220063 11521390 11646344 11734786
4216 11734786 11816561 11640673 11458371 11296939 11245053 11234135 11054488 10983320 10972824 11135801
$$ packed form
4289A965063J4132N6402K208o3082J75671J7467P3807J8075J3112j30264J56613
4278B299204K9672j94512J46907K45675J12427r6458Q6089j6421J03630L5303
4268B751516K7988M6778J30110m5249J92798K69459Q4684L0247K50146N9551l3071
4257C764957Q5797K21302K53681N5777J54556J65822K20472L10487K01707J46219
4247E580777R9583J84268K77711J91775K10862R8237L13756J79470J50212J96243
4237G482894J82350L69312L60289N14810L82290K26957p705Q4179o556k4570N5444
4226I619694J15778J08930J63098K56560L10333M44092K01578L01327J24954Q8442
4216A1734786Q1775j75888j82302j61432n1886j0918j79647p1168j0496J62977
$$ plain form
4206 11135801 11259686 11295985 11483480 11488891 11434753 11183989 10964448 10767210 10586186 10420733
4196 10420733 10384792 10367146 10351309 10363312 10381383 10545822 10433308 10436815 10571574 10528355 10447087
4185 10447087 10447562 10508476 10527280 10309812 10451086 10663616 10783291 10913672 11008877 11210921
4175 11210921 11582346 11841193 11973206 12358074 12664834 12962770 13281747 13636091 14183234
4166 14183234 14594959 14882358 15351191 15734242 16216429 16850473 17230308 17714113 18407938
4157 18407938 19013088 19503172 20031798 20661061 21230123 21748146 22514778 23165814 23711583
4148 23711583 24272651 25051092 25850345 26620682 27454224 28000348 28723917 29310097 29860256
4139 29860256 30538620 31094903 31571565 32050461 32557072 32826674 33208967 33621726 34004159
$$ packed form
4206A1135801J23885L6299J87495N411n4138k50764k19541j97238j81024j65453
4196A0420733l5941j7646j5837J2003J8071J64439j12514L507J34759m3219q1268
4185A0447087M75O0914J8804k17468J41274K12530J19675J30381R5205K02044
4175A1210921L71425K58847J32013L84868L06760K97936L18977L54344N47143
4166A4183234M11725K87399M68833L83051M82187O34044L79835M83805O93825
4157A8407938O05150M90084N28626O29263N69062N18023P66632O51036N45769
4148B3711583N61068P78441P99253P70337Q33542N46124P23569N86180N50159
4139B9860256O78364N56283M76662M78896N06611K69602L82293M12759L82433
$$ plain form
4130 34004159 34362761 34480935 34552305 34585885 34496894 34120564 33850830 33485616 33216121 32899456
4120 32899456 32472798 32155638 32042471 31959585 31860477 31736944 31495938 31219569 30843726 30300438
4110 30300438 29636019 28930768 27996632 26996668 26061599 25292022 24573177 23919624 23068750
4101 23068750 22221085 21454594 20873987 20345711 19624627 18947945 18223561 17568460 16819637
4092 16819637 16287966 15790502 15270336 14860300 14471004 14052228 13730950 13443976 13324015
4083 13324015 13116896 12952130 12924416 12740426 12502833 12142458 11859244 11553672 11256864 10846456
4073 10846456 10466225 10122589 9814247 9411841 9037111 8829473 8588615 8318350 8034797
4064 8034797 7846364 7735719 7668472 7465088 7288316 7123642 6951445 6844175 6709852 6646654
$$ packed form
4130C4004159L58602J18174P1370L3580q8991l76330k69734l65214k69495l16665
4120C2899456m26658l17160j13167q2886r9108j23533k41006k76369l75843n43288
4110C0300438o64419p05251r34136r99964r35069p69577p18845o53553q50874
4101B3068750q47665p66491n80607n28276p21084o76682p24384o55101p48823
4092A6819637n31671m97464n20166m10036l89296m18776l21278k86974j19961
4083A3324015k07119j64766k7714j83990k37593l60375k83214l05572k96808m10408
4073A0846456l80231l43636l08342m02406l74730k07638k40858k70265k83553
4064H034797j88433j10645o7247k03384j76772j64674j72197j07270j34323o3198
$$ plain form
4054 6646654 6548949 6485447 6300422 6228394 6238104 6234241 6170116 6032015 6083001 6150679 6023367
4043 6023367 5964506 5979600 6025918 6144002 6132924 5997106 5991220 5826014 5751917 5794389 5835828
4032 5835828 5800204 5702678 5713232 5724842 5693435 5682284 5705848 5638404 5453026 5372378 5367852
4021 5367852 5226670 5150108 5111815 5035066 4964875 4994727 4998718 5003931 4977015 4992302 4967111 4919526
4009 4919526 5036015 5044114 5099838 5061797 4996306 5102412 5190002 5141027 5248314 5266080 5358149
3998 5358149 5318045 5416938 5592656 5681467 5792812 5847241 5938217 6148478 6187160 6239858 6440259
3987 6440259 6503321 6616492 6504378 6567294 6708477 6856889 6948810 7188103 7345887 7427924
3977 7427924 7596434 7917176 8026734 8150199 8285121 8318948 8415655 8520571 8640039 8620385
$$ packed form
4054F646654r7705o3502j85025p2028R710l863o4125j38101N0986O7678j27312
4043F023367n8861J5094M6318J18084j1078j35818n886j65206p4097M2472M1439
4032E835828l5624r7526J0554J1610l1407j1151K3564o7444j85378q0648m526
4021E367852j41182p6562l8293p6749p0191K9852L991N213k6916J5287k5191m7585
4009D919526J16489Q099N5724l8041o5491J06106Q7590m8975J07287J7766R2069
3998E358149m0104R8893J75718Q8811J11345N4429R0976K10261L8682N2698K00401
3987F440259O3062J13171j12114O2916J41183J48412R1921K39293J57784Q2037
3977G427924J68510L20742J09558J23465J34922L3827R6707J04916J19468j9654
$$ plain form
3967 8620385 8623271 8808823 8904888 8996481 9255147 9400604 9261093 9263755 9108841 9018332 9024640
3956 9024640 8975449 8989099 8975725 9109574 9265228 9380146 9453436 9417768 9451113 9594953 9683005
3945 9683005 9740823 10033281 10199244 10185736 10356602 10612234 10926666 11057821 11133922 11414866
3935 11414866 11541876 11780756 12037502 12262856 12517611 12862971 12959419 13036299 13104837 13121211
3925 13121211 13244076 13160103 13171657 13303187 13387108 13294162 13392053 13359434 13390066 13469813 13514921
3914 13514921 13770474 13880247 14042382 14130792 14168135 14345160 14566063 14859489 15109841 15312402
3904 15312402 15355302 15556222 15819161 16059993 16130440 16257924 16431180 16559337 16737292 16729361
3894 16729361 16745246 16911449 17010919 17032581 16897896 16864885 16811836 16630743 16715723 16830482
$$ packed form
3967H620385K886J85552R6065R1593K58666J45457j39511K662j54914r0509O308
3956I024640m9191J3650j3374J33849J55654J14918P3290l5668L3345J43840Q8052
3945I683005N7818K92458J65963j3508J70866K55632L14432J31155P6101K80944
3935A1414866J27010K38880K56746K25354K54755L45360R6448P6880O8538J6374
3925A3121211J22865q3973J1554J31530Q3921r2946R7891l2619L0632P9747M5108
3914A3514921K55553J09773J62135Q8410L7343J77025K20903K93426K50352K02561
3904A5312402M2900K00920K62939K40832P0447J27484J73256J28157J77955p931
3894A6729361J5885J66203R9470K1662j34685l3011n3049j81093Q4980J14759
$$ plain form
3884 16830482 16926977 17053141 17130414 17268157 17495329 17841192 17958633 18128303 18229399 18349347
3874 18349347 18533436 18784750 19019747 19351522 19573128 19789153 20070246 20287743 20800788
3865 20800788 21125906 21463205 21974490 22333992 23000651 23727823 24363950 25015594 25607899
3856 25607899 26339057 27125776 27871398 28847392 29728790 30607699 31646990 32898873 34353074
3847 34353074 35746191 37245667 38782093 40394189 42114450 43624267 44970679 46185806
3839 46185806 47320003 48354369 49327724 50315695 51318107 52430165 53629351 54988105
3831 54988105 56565382 58452596 60493008 62535030 64756937 67081405 69149193 71128738
3823 71128738 72983157 74621307 75774468 76591058 76989628 76971908 76661817 76102588 75197394
$$ packed form
3884A6830482R6495J26164P7273J37743K27172L45863J17441J69670J01096J19948
3874A8349347J84089K51314K34997L31775K21606K16025K81093K17497N13045
3865B0800788L25118L37299N11285L59502O66659P27172O36127O51644N92305
3856B5607899P31158P86719P45622R75994Q81398Q78909J039291J251883J454201
3847C4353074J393117J499476J536426J612096J720261J509817J346412J215127
3839D6185806J134197J034366R73355R87971J002412J112058J199186J358754
3831E4988105J577277J887214K040412K042022K221907K324468K067788J979545
3823G1128738J854419J638150J153161Q16590L98570j7720l10091n59229r05194
$$ plain form
3814 75197394 73991253 72749363 71646760 70536531 69450182 68320627 67184747 65955433
3806 65955433 64728459 63250011 61540972 59529805 57344235 54877234 52204676 49489763
3798 49489763 46590460 43689318 41014572 38446399 35894535 33454669 31300709 29300156
3790 29300156 27639242 26060229 24433297 23035092 21701590 20577158 19683748 18815292
3782 18815292 18180295 17545908 16856562 16312180 15677248 15258856 14920138 14548298 14248948
3773 14248948 13907699 13567631 13302483 13106104 12851257 12529304 12551794 12387476 12076096 12083831
3763 12083831 11934634 11662801 11514055 11478379 11214626 10890445 10873857 10812577 10567617 10517756
3753 10517756 10490382 10300548 10365477 10395111 10337120 10307997 10322046 10054518 10037060 10188484 10057617
$$ packed form
3814G5197394j206141j241890j102603j110229j086349j129555j135880j229314
3806F5955433j226974j478448j709039k011167k185570k467001k672558k714913
3798D9489763k899303k901142k674746k568173k551864k439866k153960k000553
3790B9300156j660914j579013j626932j398205j333502j124432q93410q68456
3782A8815292o34997o34387o89346n44382o34932m18392l38718l71840k99350
3773A4248948l41249l40068k65148j96379k54847l21953K2490j64318l11380P735
3763A2083831j49197k71833j48746l5676k63753l24181j6588o1280k44960m9861
3753A0517756k7374j89834O4929K9634n7991k9123J4049k67528j7458J51424j30867
$$ plain form
3742 10057617 9998245 10028908 10091165 10309725 10432577 10354852 10271599 10511172 10669888 10580793
3732 10580793 10622771 10773308 10901290 11063547 11274115 11392974 11469755 11577012 11739879 11877164
3722 11877164 11950145 12068184 12140063 12122048 12343339 12597937 12724278 12895516 13032360 13255283
3712 13255283 13595798 14012135 14351879 14661199 15095173 15499873 15939676 16456208 17012071
3703 17012071 17644512 18246214 18922142 19767253 20722650 21607470 22582051 23615567 24564376
3694 24564376 25480123 26541393 27455830 28291357 28982522 29464635 29924654 30098727 30078661
3685 30078661 30089517 30077718 29949355 29581732 29400767 29204033 29113152 29348789 29406170 29576369
3675 29576369 29895492 30413556 30826454 31345298 31903195 32704700 33495632 34321650 35251345
$$ packed form
3742A0057617n9372L0663O2257K18560J22852p7725q3253K39573J58716q9095
3732A0580793M1978J50537J27982J62257K10568J18859P6781J07257J62867J37285
3722A1877164P2981J18039P1879j8015K21291K54598J26341J71238J36844K22923
3712A3255283L40515M16337L39744L09320M33974M04700M39803N16532N55863
3703A7012071O32441O01702O75928Q45111R55397Q84820R74581J033516R48809
3694B4564376R15747J061270R14437Q35527O91165M82113M60019J74073k0066
3685C0078661J0856j1799j28363l67623j80965j96734r0881K35637N7381J70199
3675B9576369L19123N18064M12898N18844N57897Q01505P90932Q26018R29695
$$ plain form
3666 35251345 36352168 37402304 38443030 39755135 41041845 42425497 44053379 45871491
3658 45871491 47725928 49754036 51928094 54191794 56857545 59702344 62630512 66076793
3650 66076793 69841153 73822718 78079784 82965834 88047341 93538610 99492805 105572097
3642 105572097 111787814 117912269 123985986 129618659 134569659 138843896 142453182 145143026
3634 145143026 146702463 147505523 147589219 146928913 145773262 144094908 142166870 140029355 137677077
3625 137677077 135278835 132945146 130373859 127777375 124877795 121826416 118464243 114696770
3617 114696770 110695351 106532034 102148904 97327179 92485221 87537512 82584074 77603091
3609 77603091 72538044 67812059 63427057 59136839 55207364 51554016 48350663 45423135
$$ packed form
3666C5251345J100823J050136J040726J312105J286710J383652J627882J818112
3658D5871491J854437K028108K174058K263700K665751K844799K928168L446281
3650F6076793L764360L981565M257066M886050N081507N491269N954195O079292
3642A05572097O215717O124455O073717N632673M951000M274237L609286K689844
3634A45143026J559437Q03060Q3696o60306j155651j678354j928038k137515k352278
3625A37677077k398242k333689k571287k596484k899580l051379l362173l767473
3617A14696770m001419m163317m383130m821725m841958m947709m953438m980983
3609G7603091n065047m725985m385002m290218l929475l653348l203353k927528
$$ plain form
3601 45423135 42636556 40015636 37787391 35680838 33859278 32268304 30770515 29502266
3593 29502266 28201000 27077801 26063299 25154567 24532775 23872001 23327385 22746093 22264470
3584 22264470 21921287 21714955 21556821 21425422 21380415 21133985 21278202 21336671 21425088 21684147
3574 21684147 21907017 22085731 22275200 22424194 22638220 22814468 22755291 22730329 22383757 22074275
3564 22074275 21919105 21631049 21221065 20673626 20071066 19381393 18607421 17861487 17128934
3555 17128934 16264378 15487067 14684792 14177355 13566870 12893576 12555323 12048612 11623844
3546 11623844 11201410 10697201 10435855 10206082 9903870 9517431 9280829 9172934 9013673
3537 9013673 8917228 8723220 8636718 8544150 8454586 8393949 8125349 7960473 7855134 7650984
$$ packed form
3601D5423135k786579k620920k228245k106553j821560j590974j497789j268249
3593B9502266j301266j123199j014502r08732o21792o60774n44616n81292m81623
3584B2264470l43183k06332j58134j31399m5007k46430J44217N8469Q8417K59059
3574B1684147K22870J78714J89469J48994K14026J76248n9177k4962l46572l09482
3564B2074275j55170k88056m09984n47439o02560o89673p73972p45934p32553
3555A7128934q64556p77311q02275n07437o10485o73294l38253n06711m24768
3546A1623844m22434n04209k61346k29773l02212l86439k36602j07895j59261
3537I013673r6445j94008q6502r2568q9564o0637k68600j64876j05339k04150
$$ plain form
3527 7650984 7766866 7942083 7785470 7598388 7554972 7585516 7442412 7437896 7568441 7607964
3517 7607964 7521877 7306030 7312764 7244064 7296149 7201893 7137723 7192145 7063933 6906728 6882829
3506 6882829 7026160 7027693 7116452 7129409 7101502 7114617 7064728 6980745 7080794 7169915 7138749
3495 7138749 7018446 7081883 7183198 7218009 7272768 7422199 7621745 7762045 7802756 7897472
3485 7897472 7874449 7873187 8020617 8146595 8230569 8187509 8296984 8471789 8558217 8611524 8711528
3474 8711528 8733058 8886486 8996709 9320198 9481166 9596297 9682963 9944515 10249188 10489239
3464 10489239 10655650 10954241 11408192 11653105 11866231 12209121 12474185 12802214 13262227
3455 13262227 13739718 13995604 14480718 14867286 15267199 15805021 16337954 16958963 17595768
$$ packed form
3527G650984J15882J75217j56613j87082m3416L0544j43104m516J30545L9523
3517G607964q6087k15847O734o8700N2085r4256o4170N4422j28212j57205k3899
3506F882829J43331J533Q8759J2957k7907J3115m9889q3983J00049Q9121l1166
3495G138749j20303O3437J01315L4811N4759J49431J99546J40300M0711R4716
3485G897472k3023j262J47430J25978Q3974m3060J09475J74805Q6428N3307J00004
3474H711528K1530J53428J10223L23489J60968J15131Q6666K61552L04673K40051
3464A0489239J66411K98591M53951K44913K13126L42890K65064L28029M60013
3455A3262227M77491K55886M85114L86568L99913N37822N32933O21009O36805
$$ plain form
3446 17595768 18298986 18837292 19461531 20133714 21027018 21743475 22430268 23052183 23608595
3437 23608595 24270506 24815576 25186000 25557426 25888321 26306302 26605050 26929565 27260835
3428 27260835 27701690 28279694 28643713 29056618 29621928 29996059 30406630 30645428 31098565
3419 31098565 31561273 32097752 32697248 33372195 34050157 34729052 35701333 36862446 38350991
3410 38350991 39941700 41650475 43703325 45903715 48206164 50667133 53347418 56051522
3402 56051522 58822634 61489668 64063845 66564854 68862312 71061690 73245605 75359772
3394 75359772 77332268 79124426 81036312 83069735 84998402 86934026 88903493 90887834
3386 90887834 92575092 94167653 95693580 96857316 97764171 98209153 98293563 98070536 97551862
$$ packed form
3446A7595768P03218N38306O24239O72183Q93304P16457O86793O21915N56412
3437B3608595O61911N45070L70424L71426L30895M17981K98748L24515L31270
3428B7260835M40855N78004L64019M12905N65310L74131M10571K38798M53137
3419C1098565M62708N36479N99496O74947O77962O78895R72281J161113J488545
3410C8350991J590709J708775K052850K200390K302449K460969K680285K704104
3402E6051522K771112K667034K574177K501009K297458K199378K183915K114167
3394G5359772J972496J792158J911886K033423J928667J935624J969467J984341
3386I0887834J687258J592561J525927J163736R06855M44982Q4410k23027n18674
$$ plain form
3377 97551862 96715645 95746783 94439745 92887351 91445784 89986646 88668446 87206554
3369 87206554 86056180 84899230 83911544 82789310 81581239 80474953 79374742 78290508
3361 78290508 77113013 75913251 74820384 73920075 73432924 72952483 72558462 72307087 72355256
3352 72355256 72487501 72573897 72791827 72794630 72802579 72769088 72638409 72462339 72049443 71651897
3342 71651897 71194765 70741698 70149752 69425632 68671152 67813621 66839877 65615540 64286021
3333 64286021 62871828 61121425 59440665 57717060 55766369 53799020 51809510 49929624
3325 49929624 48004117 46410326 45127993 44205395 43292358 42287874 40864667 39088694
3317 39088694 37191559 35414713 33759835 32340223 31152338 29996533 29102340 28504207
$$ packed form
3377I7551862q36217r68862j307038j552394j441567j459138j318200j461892
3369H7206554j150374j156950r87686j122234j208071j106286j100211j084234
3361G8290508j177495j199762j092867r00309m87151m80441l94021k51375M8169
3352G2355256J32245Q6396K17930K803P949l3491j30679j76070m12896l97546
3342G1651897m57132m53067n91946p24120p54480q57531r73744j224337j329519
3333F4286021j414193j750403j680760j723605j950691j967349j989510j879886
3325D9929624j925507j593791j282333r22598r13037j004484j423207j775973
3317C9088694j897135j776846j654878j419612j187885j155805q94193n98133
$$ plain form
3309 28504207 28084826 27730143 27466269 27301443 27304979 27481575 27809963 28084571 28508215 29031361
3299 29031361 29661728 30325779 31032067 31843382 32996471 34239030 35467140 36350505 36825594
3290 36825594 37124748 37112743 36795629 36407301 36092335 35795648 35503750 35609989 35803596 35694365
3280 35694365 35728702 35452344 35135757 34710699 34325871 33692823 33033443 32451574 31861780 31466907
3270 31466907 30748992 30083859 29460577 28945305 28584409 28239648 27857201 27588667 27478166
3261 27478166 27436984 27318079 27228703 27237072 27267306 27542364 27739122 28126919 28509057 29178630
3251 29178630 29974887 30699830 31526197 32644075 33818919 35280469 36904313 38522197 40122429
3242 40122429 41865658 43753518 45163588 46234312 47193614 47904772 48264771 48226588 47913113
$$ packed form
3309B8504207m19381l54683k63874j64826L536J76596L28388K74608M23644N23146
3299B9031361O30367O64051P06288Q11315J153089J242559J228110Q83365M75089
3290C6825594K99154j2005l17114l88328l14966k96687k91898J06239J93607j09231
3280C5694365L4337k76358l16587m25058l84828o33048o59380n81869n89794l94873
3270C1466907p17915o65133o23282n15272l60896l44761l82447k68534j10501
3261B7478166m1182j18905q9376Q369L0234K75058J96758L87797L82138O69573
3251B9178630P96257P24943Q26367J117878J174844J461550J623844J617884J600232
3242D0122429J743229J887860J410070J070724R59302P11158L59999l8183l13475
$$ plain form
3233 47913113 47428935 46548778 45548754 44648816 43657635 42793661 42044290 41421358 40906110
3224 40906110 40628969 40780108 41032730 41439911 42079548 42907494 43920229 45165495 46525613
3215 46525613 48063604 49864323 51817957 53792377 56022115 58345986 60744935 63159163
3207 63159163 65503389 67739076 69771580 71507323 73216052 74528896 75408917 75938203
3199 75938203 76012584 75577130 74527277 73118028 71189168 69040800 66290222 63386182 60245749
3190 60245749 57174737 54200160 51106986 48010462 44938673 41837979 38605823 35910541
3182 35910541 33291487 30917044 28746891 26865816 25263605 23938935 22602999 21217973
3174 21217973 20176298 19236724 18444697 17785839 17021494 16553320 15957089 15599205 15156891
$$ packed form
3233D7913113m84178q80157j000024q99938r91181q63974p49371o22932n15248
3224D0906110k77141J51139K52622M07181O39637Q27946J012735J245266J360118
3215D6525613J537991J800719J953634J974420K229738K323871K398949K414228
3207F3159163K344226K235687K032504J735743J708729J312844Q80021N29286
3199G5938203P4381m35454j049853j409249j928860k148368k750578k904040l140433
3190F0245749l071012k974577l093174l096524l071789l100694l232156k695282
3182C5910541k619054k374443k170153j881075j602211j324670j335936j385026
3174B1217973j041675r39574p92027o58858p64345m68174n96231l57884m42314
$$ plain form
3165 15156891 14799716 14588739 14457312 14470106 14617345 14626379 14398644 14147831 13882444 13181364
3155 13181364 12504838 12050640 11444544 11112107 10860541 10512509 10322511 10063252 9940737
3146 9940737 9806828 9733989 9561248 9422793 9391454 9434837 9527987 9247580 9274056 9252589 9109707
3135 9109707 8882494 8855086 8583973 8236704 8077460 7881923 7619958 7468773 7289571 7045676
3125 7045676 6889605 6690957 6561745 6360989 6316977 6234699 6209964 6140147 5946644 5935228
3115 5935228 5856835 5835723 5758585 5781149 5771071 5874390 5823552 5848421 5785909 5722419 5708821
3104 5708821 5710711 5812667 5830361 5656515 5658188 5593977 5631136 5631058 5481404 5433639 5438722 5443196
3092 5443196 5425336 5368421 5511274 5540854 5415481 5336262 5420148 5315680 5225960 5274991 5309716
$$ packed form
3165A5156891l57175k10977j31427J2794J47239R034k27735k50813k65387p01080
3155A3181364o76526m54198o06096l32437k51566l48032j89998k59259j22515
3146I940737j33909p2839j72741j38455l1339M3383R3150k80407K6476k1467j42882
3135I109707k27213k7408k71113l47269j59244j95537k61965j51185j79202k43895
3125G045676j56071j98648j29212k00756m4012q2278k4735o9817j93503j1416
3115E935228p8393k1112p7138K2564j0078J03319n0838K4869o2512o3490j3598
3104E708821J890J01956J7694j73846J673o4211L7159p8j49654m7765N083M474
3092E443196j7860n6915J42853K9580j25373p9219Q3886j04468q9720M9031L4725
$$ plain form
3081 5309716 5410646 5267942 5272774 5421331 5464786 5416739 5333153 5255520 5344214 5524513 5526240
3070 5526240 5590983 5622070 5590688 5606352 5507194 5642916 5723322 5777865 5816124 5912902 5964315
3059 5964315 6029640 6130465 6233582 6326395 6439951 6488450 6585013 6525492 6628567 6775579
3049 6775579 6871834 7062085 7298617 7502516 7588926 7694783 7840383 8041559 8198586 8317830
3039 8317830 8461732 8753593 9099879 9302493 9400553 9685249 9847181 10127892 10468049 10685306
3029 10685306 10831068 10927980 11187463 11339230 11721271 12067987 12381105 12578524 12929774 13503754
3019 13503754 14103478 14743917 15295236 15979027 16830308 17542345 18270194 18737503 19099765
3010 19099765 19537821 19864967 20254108 20552645 21075950 21627768 22114711 22615278 23372110
$$ packed form
3081E309716J00930j42704M832J48557M3455m8047q3586p7633Q8694J80299J727
3070E526240O4743L1087l1382J5664r9158J35722Q0406N4543L8259R6778N1413
3059E964315O5325J00825J03117R2813J13556M8499R6563n9521J03075J47012
3049F775579R6255J90251K36532K03899Q6410J05857J45600K01176J57027J19244
3039H317830J43902K91861L46286K02614R8060K84696J61932K80711L40157K17257
3029A0685306J45762R6912K59483J51767L82041L46716L13118J97419L51250N73980
3019A3503754N99724O40439N51319O83791Q51281P12037P27849M67309L62262
3010A9099765M38056L27146L89141K98537N23305N51818M86943N00567P56832
$$ plain form
3001 23372110 24195770 25002268 25825262 26857797 27949284 29215269 30447266 31986781 33742014
2992 33742014 35509975 37737015 39736090 42045402 44504217 47194799 50175533 53362712
2984 53362712 56890036 60681443 64839453 69421467 74480322 80108455 86522955 94235834
2976 94235834 103645115 114504292 126035005 136825037 144275090 146818580 144197415 137535154
2968 137535154 128348888 118393061 108910898 100517467 93529305 88023512 83818220 80556835
2960 80556835 78229045 76347420 74975912 74192320 73913746 74050275 74461347 75430276 76968666
2951 76968666 78963111 81305557 83993262 86953256 90029557 93104319 96153850 99153937
2943 99153937 102101658 105496339 109082442 113310415 118158548 123717164 130118938 137589820
$$ packed form
3001B3372110Q23660Q06498Q22994J032535J091487J265985J231997J539515J755233
2992C3742014J767961K227040J999075K309312K458815K690582K980734L187179
2984E3362712L527324L791407M158010M582014N058855N628133O414500P712879
2976I4235834R409281J0859177J1530713J0790032P450053K543490k621165o662261
2968A37535154r186266r955827r482163q393431o988162n505793m205292l261385
2960H0556835k327790j881625j371508p83592k78574J36529M11072R68929J538390
2951G6968666J994445K342446K687705K959994L076301L074762L049531L000087
2943I9153937K947721L394681L586103M227973M848133N558616O401774P470882
$$ plain form
2935 137589820 146010602 155518154 166269811 178232152 191515450 206266340 222468575
2928 222468575 240289573 259132495 277468949 292794848 302248734 304038578 297337919
2921 297337919 283309891 264100697 242323870 219956603 198506366 178730938 160748019
2914 160748019 144978222 131392835 119616839 109208295 100036299 92084739 84923620
2907 84923620 78542643 72905845 67875466 63485038 59550448 55946832 52695447 49715672
2899 49715672 46865001 44151462 41691946 39231860 37140567 35129069 33248202 31609003
2891 31609003 29919567 28378158 27109377 25797538 24626344 23541167 22601047 21773718
2883 21773718 20752041 20104630 19176468 18496842 17786020 17096279 16470296 15886328 15310771
$$ packed form
2935A37589820Q420782R507552J0751657J1962341J3283298J4750890J6202235
2928B22468575J7820998J8842922J8336454J5325899R453886J789844o700659
2921B97337919j4028028j9209194k1776827k2367267k1450237j9775428j7982919
2914A60748019j5769797j3585387j1775996j0408544r171996p951560p161119
2907H4923620o380977n636798n030379m390428l934590l603616l251385k979775
2899D9715672k850671k713539k459516k460086k091293k011498j880867j639199
2891C1609003j689436j541409j268781j311839j171194j085177r40120q27329
2883B1773718j021677o47411r28162o79626p10822o89741o25983n83968n75557
$$ plain form
2874 15310771 14707218 14275124 13728751 13158986 12875533 12394295 11863144 11509002 11111531
2865 11111531 10785006 10549213 10337157 10132852 9681389 9460365 9338373 8977515 8605432
2856 8605432 8348838 8089751 7698338 7396515 7191630 7156769 7016876 6824215 6629926 6526500
2846 6526500 6461095 6295659 6018969 5921535 5863228 5592582 5383584 5363551 5305501 5184809
2836 5184809 5136113 5132566 5146534 5019913 4902811 4871228 4701476 4545401 4428886 4369304 4258973
2825 4258973 4221860 4049941 3907960 3816262 3826090 3866636 3743198 3515426 3437796 3363785 3286391
2814 3286391 3119134 3022721 2973216 2933131 2763951 2825254 2884484 2840772 2740253 2590095 2573602
2803 2573602 2596607 2606524 2620274 2613033 2590991 2527912 2538023 2568759 2302823 2185328 2229610
$$ packed form
2874A5310771o03553m32094n46373n69765k83453m81238n31151l54142l97471
2865A1111531l26525k35793k12056k04305m51463k21024j21992l60858l72083
2856H605432k56594k59087l91413l01823k04885l4861j39893j92661j94289j03426
2846F526500o5405j65436k76690r7434n8307k70646k08998k0033n8050j20692
2836E184809m8696l547J3968j26621j17102l1583j69752j56075j16515n9582j10331
2825D258973l7113j71919j41981r1698R828M0546j23438k27772p7630p4011p7394
2814C286391j67257r6413m9505m0085j69180O1303N9230m3712j00519j50158j6493
2803B573602K3005R917J3750p241k2042o3079J0111L0736k65936j17495M4282
$$ plain form
2792 2229610 2165206 2116449 2124462 2072628 2093438 2063847 2119220 2093463 1960470 1978910 1970157 1897934
2780 1897934 1823698 1941158 1932816 1867760 1681063 1635473 1674409 1714409 1623968 1717056 1590270
2769 1590270 1481968 1457268 1367878 1481438 1471898 1290678 1244192 1318488 1299976 1330231 1264932
2758 1264932 1239555 1074680 939507 915223 1037271 1006640 1089497 1014965 890206 849441 922152
2747 922152 1041661 1208639 1016430 899835 795568 752486 806030 816744 916434 872764 844012
2736 844012 944937 941842 957424 914840 874925 879556 889120 927836 889071 858221 860081 850646
2724 850646 751344 738708 871052 808324 762269 700359 577028 689001 736967 745401 711094
2713 711094 782674 926295 912498 919316 871266 681189 741276 647972 560153 721690 744712
$$ packed form
2792B229610o4404m8757Q013n1834K0810k9591N5373k5757j32993J8440q753p2223
2780A897934p4236J17460q342o5056j86697m5590L8936M0000r0441R3088j26786
2769A590270j08302k4700q9390J13560r540j81220m6486P4296j8512L0255o5299
2758A264932k5377j64875j35173k4284J22048l0631Q2857p4532j24759m0765P2711
2747I22152J19509J66978j92209j16595j04267m3082N3544J0714R9690m3670k8752
2736H44012J00925l095J5582m2584l9915M631R564L8716l8765l0850J860r435
2724H50646r9302j2636J32344o2728m6055o1910j23331J11973M7966Q434l4307
2713G11094P1580J43621j3797O818m8050j90077O0087r3304q7819J61537K3022
$$ plain form
2702 744712 881214 835883 754863 751192 856169 910932 953272 932259 800715 1001079 1044701
2691 1044701 956154 1017472 1142293 1298840 1268908 1263222 1255907 1213092 1093748 1033811 948952
2680 948952 822922 927717 991097 900381 952000 910361 792276 900995 812259 810777 784380
2669 784380 828741 885909 885856 814661 735393 828359 1005881 951305 935535 815553 834282 867238
2657 867238 787941 851871 874588 865397 931941 915676 854939 891506 1095031 1198195 1239205
2646 1239205 1280880 1239958 1287890 1419673 1584023 1540945 1449013 1489359 1579170 1573296 1393983
2635 1393983 1338690 1384815 1303897 1063804 1062974 956515 801009 962234 843904 741980 852377
2624 852377 684501 477120 598590 482015 496518 557228 675561 595683 592736 561514 558547
$$ packed form
2702G44712J36502m5331q1020l671J04977N4763M2340k1013j31544K00364M3622
2691A044701q8547O1318J24821J56547k9932n686p315m2815j19344n9937q4859
2680I48952j26030J04795O3380r0716N1619m1639j18085J08719q8736j482k6397
2669G84380M4361N7168n3p1195p9268R2966J77522n4576j5770j19982J8729L2956
2657H67238p9297O3930K2717r191O6544j6265o0737L6567K03525J03164M1010
2646A239205M1675m0922M7932J31783J64350m3078r1932M0346Q9811n874j79313
2635A393983n5293M6125q0918k40093q30j06459j55506J61225j18330j01924J10397
2624H52377j67876k07381J21470j16575J4503O0710J18333p9878k947l1222k967
$$ plain form
2613 558547 412556 438020 499701 421667 365225 408083 376237 235742 211705 199665 303230
2602 303230 327967 321711 338004 443655 343071 122561 100710 185341 119728 2297 56162
2591 56162 170491 138645 -2476 -24286 89514 136509 157144 150355 217785 153404 98621
2580 98621 40556 122619 191124 137814 15339 23002 26780 27607 19712 61976 264365 190356
2568 190356 142933 66117 40388 28366 16762 103421 103351 100049 27591 179249 148311 161455
2556 161455 132458 -1429 64689 148239 115559 92608 99191 163000 41804 -102072 -126768
2545 -126768 16971 -51095 17800 -158490 -78139 46719 137847 219670 143651 153000 28436
2534 28436 30898 74635 112182 84339 50938 74534 108859 91646 -16537 -70522 304 44149
$$ packed form
2613E58547j45991K5464O1681p8034n6442M2858l1846j40495k4037j2040J03565
2602C03230K4737o256J6293J05651j00584k20510k1851Q4631o5613j17431N3865
2591E6162J14329l1846j41121k1810J13800M6995K0635o789O7430o4381n4783
2580I8621n8065Q2063O8505n3310j22475P663L778Q27p895M2264K02389p4009
2568A90356m7423p6816k5729j2022j1604Q6659p0l302p2458J51658l0938J3144
2556A61455k8997j33887O6118Q3550l2680k2951O583O3809j21196j43876k4696
2545a26768J43739o8066O8895j76290Q0351J24858R1128Q1823p6019R349j24564
2534B8436K462M3737L7547k7843l3401K3596L4325j7213j08183n3985P0826M3845
$$ plain form
2522 44149 186881 158242 -65477 -80577 -9928 -74506 -48947 -186256 -189829 -126580 141099
2511 141099 117895 134178 -37212 -29059 -3428 -63950 -19776 -850 -40898 -162297 -79605
2500 -79605 68384 8721 15866 -12620 -44980 -28637 22033 120843 61488 102979 99513 -31260
2488 -31260 -132734 -89162 5126 -21619 -19130 -49185 -5718 -31550 70061 23593 -34508 -11387
2476 -11387 56838 121564 -87434 17986 55668 -13267 -16005 -35892 12824 46443 106450 103966
2464 103966 -28001 -770 40955 33374 43552 159595 174539 96844 90293 -62773 -27381
2453 -27381 24323 -9832 31053 39089 64521 -33764 -54184 -8303 85516 155324 37482 91447
2441 91447 24079 -45864 -60489 37226 45470 57163 5188 -57534 125828 1635 24531 18348
$$ packed form
2522D4149J42732k8639k23719j5100P0649o4578K5559j37309l573O3249K67679
2511A41099k3204J6283j71390Q153K5631o0522M4174J8926m0048j21399Q2692
2500g9605J47989n9663P145k8486l2360J6343N0670R8810n9355M1491l466j30773
2488c1260j01474M3572R4288k6745K489l0055M3467k5832J01611m6468n8101K3121
2476a1387O8225O4726k08998J05420L7682o8935k738j9887M8716L3619O0007k484
2464A03966j31967K7231M1725p581J0178J16043J4944p7695o551j53066L5392
2453b7381N1704l4155M0885Q036K5432r8285k0420M5881R3819O9808j17842N3965
2441I1447o7368o9943j4625R7715Q244J1693n1975o2722J83362j24193K2896o183
$$ plain form
2429 18348 -5773 -34971 93679 22587 36319 40449 1696 54589 -56170 -205137 -237656
2418 -237656 -249416 -175646 -89728 -132996 -84586 -58757 -24144 -199112 -32721 7239 -75524
2407 -75524 -115642 -117864 -48906 63843 143665 150758 70605 42477 203988 125893 153467 199952
2395 199952 210060 151210 195657 87037 -17002 1665 107963 121614 -10855 40723 -1339
2384 -1339 1873 -29779 -22355 132553 43811 72403 -26979 999 41509 -68137 -43457 -86209
2372 -86209 -187746 -181172 -117346 -24351 -45468 5676 121212 -200838 -212884 -199210 -154452
2361 -154452 20928 -88667 -194987 -154948 -193968 -114061 102084 45375 -11443 -11603 49367
2350 49367 -53844 14692 39625 28554 -10799 -21650 -59623 -33856 67406 38642 128986
$$ packed form
2429A8348k4121k9198J28650p1092J3732M130l8753N2893j10759j48967l2519
2418b37656j1760P3770Q5918m3268M8410K5829L4613j74968J66391L9960q2763
2407g5524m0118k222O8958J12749P9822P093q0153k8128J61511p8095K7574M6485
2395A99952J0108n8850M4447j08620j04039J8667J06298J3651j32469N1578m2062
2384a339L212l1652P424J54908q8742K8592r9382K7978M0510j09646K4680m2752
2372h6209j01537O574O3826R2995k1117N1144J15536l22050j2046J3674M4758
2361a54452J75380j09595j06320M0039l9020P9907K16145n6709n6818j60O0970
2350D9367j03211O8536K4933j1071l9353j0851l7973K5767J01262k8764R0344
$$ plain form
2339 128986 35293 -135108 -130180 -31060 -12846 -33556 -80799 -77179 -8955 -84661 -135227 -28355
2327 -28355 -100312 -73270 32177 -21911 -101938 -174723 -155727 -438 51516 28495 60266
2316 60266 98079 104320 124327 141028 119969 30591 -20790 -70394 66217 24129 -58554 -122336
2304 -122336 -98429 -15425 104727 185712 -34550 -7698 -53027 21565 138740 144558 40742
2293 40742 -125297 -86992 36470 -12994 1363 40394 29345 23151 8982 -65722 -82759 -61495
2281 -61495 -96912 46616 -8854 -36091 19298 100198 57107 -3242 -42241 -171043 -35704
2270 -35704 77303 -28493 -104353 -35130 13265 -63997 -3766 -1234 -30163 -81397 -34404 41306
2258 41306 55843 30785 -31676 -108640 -130893 -139522 -64743 19828 -22451 6463 -50489 -88476
$$ packed form
2339A28986r3693j70401M928R9120J8214k0710m7243L620O8224p5706n0566J06872
2327b8355p1957K7042J05447n4088q0027p2785J8996J55289N1954k3021L1771
2316F0266L7813O241K0007J6701k1059q9378n1381m9604J36611m2088q2683o3782
2304a22336K3907Q3004J20152Q0985k20262K6852m5329P4592J17175N818j03816
2293D0742j66039L8305J23462m9464J4357L9031j1049o194j4169p4704j7037K1264
2281f1495l5417J43528n5470k7237N5389Q0900m3091o0349l8999j28802J35339
2270c5704J13007j05796p5860O9223M8395p7262O0231K532k8929n1234M6993P5710
2258D1306J4537k5058o2461p6964k2253q629P4779Q4571m2279K8914n6952l7987
$$ plain form
2246 -88476 77567 52952 14640 -60119 107044 127784 93534 137945 43223 -88217 -74818
2235 -74818 127412 173998 226529 254451 285158 150461 142166 120090 103758 182762 162390 106985
2223 106985 200220 267493 221690 268911 110664 94362 92594 220168 294806 318786 478395
2212 478395 375281 306013 502398 418352 382114 386156 311051 374730 327464 415170 676796
2201 676796 620092 465231 512945 439126 465792 537498 627738 622837 557536 627786 722236 880505
2189 880505 974887 929192 894922 837749 922301 965820 950564 981285 973423 1102974 1200663 1238410
2177 1238410 1204908 1356054 1517615 1598755 1715250 1654943 1970763 1910554 1989784 2040387 2233033
2166 2233033 2315068 2364079 2607335 2588179 2625693 2786373 3011406 3183776 3210119 3571827
$$ packed form
2246h8476J66043k4615l8312p4759J67163K0740l4250M4411r4722j31440J3399
2235g4818K02230M6586N2531K7922L0707j34697q295k2076j6332P9004k0372n5405
2223A06985R3235O7273m5803M7221j58247j6302j768J27574P4638K3980J59609
2212D78395j03114o9268J96385q4046l6238M042p5105O3679m7266Q7706K61626
2201F76796n6704j54861M7714p3819K6666P1706R0240m901o5301P0250R4450J58269
2189H80505R4382m5695l4270n7173Q4552M3519j5256L0721p862J29551R7689L7747
2177A238410l3502J51146J61561Q1140J16495o0307L15820o0209P9230N0603J92646
2166B233033Q2035M9011K43256j9156L7514J60680K25033J72370K6343L61708
$$ plain form
2156 3571827 3708169 3935488 4207486 4525749 4901824 5297901 5989458 6593640 7095503 7720211
2146 7720211 8309074 8930976 9623930 10173998 10888348 11941790 12905166 13950154 15289310
2137 15289310 17012724 19310906 22561030 27004773 32448246 38243379 40887499 40016640
2129 40016640 36435147 31749960 26433318 21919067 18303007 15092198 12839328 11056898
2121 11056898 9630543 8571327 7748232 7013030 6549304 6048809 5573018 5063201 4587584
2112 4587584 4168374 3690858 3300128 2988217 2635439 2589652 2331042 2219339 2117943 1948774
2102 1948774 1905024 1931156 1723521 1542742 1515677 1404803 1196826 1157000 1162837 1060142 928961
2091 928961 1016918 953050 861842 955998 895694 775292 733785 713808 632189 671909 601862
$$ packed form
2156C571827J36342K27319K71998L18263L76075L96077O91557O04182N01863O24708
2146G720211N88863O21902O92954N50068P14350J053442R63376J044988J339156
2137A5289310J723414K298182L250124M443743N443473N795133K644120q70859
2129D0016640l581493m685187n316642m514251l616060l210809k252870j782430
2121A1056898j426355j059216q23095p35202m63726n00495m75791n09817m75617
2112D587584m19210m77516l90730l11911l52778m5787k58610j11703j01396j69169
2102A948774m3750K6132k07635j80779k7065j10874k07977l9826N837j02695j31181
2091I28961Q7957o3868r1208R4156o0304j20402m1507j9977q1619L9720p0047
$$ plain form
2080 601862 437709 398938 531383 687395 542879 382026 382842 321468 376360 421605 421362
2069 421362 333987 384729 230105 103216 106256 181408 199240 194279 217280 221194 157826 101943
2057 101943 85349 96018 111771 21070 6861 89321 -21220 80661 136928 169277 35500
2046 35500 -38625 9584 18148 18343 5797 -62252 68125 39535 41369 58635 21484 126289
2034 126289 47735 24727 -47897 -154139 -40264 35889 -60522 -90696 -24733 40529 53571
2023 53571 49342 64930 32619 -143293 -84239 18710 -58146 3651 85319 -34890 -73984
2012 -73984 6481 7802 -120311 -50922 19248 -197237 -141223 -55117 1071 35344 -112863
2001 -112863 -64850 -63249 -56376 -45798 -4813 -11725 33414 -116770 -124839 -34633 -114138 -209609
$$ packed form
2080F01862j64153l8771J32445J56012j44516j60853Q16o1374N4892M5245k43
2069D21362q7375N0742j54624j26889L040P5152J7832m961K3001L914o3368n5883
2057A01943j6594J0669J5753r0701j4209Q2460j10541J01881N6267L2349j33777
2046C5500p4125M8209Q564J95j2546o8049J30377k8590J834J7266l7151J04805
2034A26289p8554k3008p2624j06242J13875P6153r6411l0174O5963O5262J3042
2023E3571m229J5588l2311j75912N9054J02949p6856O1797Q1668j20209l9094
2012g3984Q0465J321j28113O9389P0170k16485N6014Q6106N6188L4273j48207
2001a12863M8013J601O873J0578M0985o912M5139j50184q069R0206p9505r5471
$$ plain form
1989 -209609 -264546 -217450 -319036 -435545 -269595 -200736 -200014 -202145 -253962 -175277 -199390 -143865
1977 -143865 -75645 -167479 -224489 -136273 -144108 -157171 -117011 -137566 -123346 -188066 -165974 -238673
1965 -238673 -216150 -258396 -320207 -362388 -328041 -368821 -344828 -294063 -121285 -186382 -311729
1954 -311729 -291212 -303149 -341727 -390873 -354149 -363659 -206406 -305913 -255508 -264235 -203209 -145439
1942 -145439 -295890 -257614 -269860 -296999 -384676 -428406 -382300 -417904 -344707 -293580 -292239 -362322
1930 -362322 -404373 -373508 -354168 -212093 -275153 -227328 -318997 -321217 -441991 -483684 -433616
1919 -433616 -275669 -235294 -273800 -239982 -284211 -297317 -371594 -278077 -230766 -84824 -285476
1908 -285476 -291873 -258430 -356245 -286444 -362039 -295871 -291290 -376969 -394086 -294959 -250360 -194114
$$ packed form
1989b09609n4937M7096j01586j16509J65950O8859P22k131n1817P8685k4113N5525
1977a43865O8220r1834n7010Q8216p835j3063M0160k0555J4220o4720K2092p2699
1965b38673K2523m2246o1811m2181L4347m0780K3993N0765J72778o5097j25347
1954c11729K0517j1937l8578m9146L6724r510J57253r9507N0405q727O1026N7770
1942a45439j50451L8276j2246k7139q7677m3730M6106l5604P3197N1127J341p0083
1930c62322m2051L0865J9340J42075o3060M7825r1669k220j20774m1693N0068
1919d33616J57947M0375l8506L3818m4229j3106p4277R3517M7311J45942k00652
1908b85476o397L3443r7815O9801p5595O6168M581q5679j7117R9127M4599N6246
$$ plain form
1896 -194114 -206000 -84229 -161273 -282744 -256461 -363487 -404310 -282666 -259116 -117406 -163626
1885 -163626 -302406 -219048 -152538 -190684 -135025 -208875 -225993 -199654 -280802 -256902 -374014
1874 -374014 -275960 -350779 -401933 -447865 -330649 -303895 -277548 -188320 -98009 -266934 -232523
1863 -232523 -122535 -142109 -217012 -125098 -295031 -255842 -289888 -292556 -219902 -106669 -235904
1852 -235904 -247858 -192621 -202879 -321763 -387762 -364787 -183842 -241148 -408734 -423270 -436514
1841 -436514 -287961 -205813 -255650 -281594 -281015 -363508 -347872 -324032 -268746 -269580 -314139 -236856
1829 -236856 -175478 -151343 -137930 -288599 -345646 -451214 -325262 -249862 -121680 -224799 -358435
1818 -358435 -375611 -221930 -120573 -103833 -256059 -262856 -327846 -268738 -238197 -215116 -229809
$$ packed form
1896a94114j1886J21771p7044j21471K6283j07026m0823J21644K3550J41710m6220
1885a63626j38780Q3358O6510l8146N5659p3850j7118K6339q1148K3900j17112
1874c74014R8054p4819n1154m5932J17216K6754K6347Q9228R0311j68925L4411
1863b32523J09988j9574p4903R1914j69933L9189l4046k668P2654J13233j29235
1852b35904j1954N5237j0258j18884o5999K2975J80945n7306j67586j4536j3244
1841d36514J48553Q2148m9837k5944N79q2493J5636K3840N5286q34m4559P7283
1829b36856O1378K4135J3413j50669n7047j05568J25952P5400J28182j03119j33636
1818c58435j7176J53681J01357J6740j52226o797o4990N9108L0541K3081j4693
$$ plain form
1807 -229809 -266424 -268791 -418236 -485489 -444429 -341428 -310991 -290050 -322132 -334241 -260532
1796 -260532 -251975 -343760 -443091 -247702 -233242 -286258 -353236 -379292 -412684 -328844 -290449 -271472
1784 -271472 -282564 -507396 -313599 -321154 -447592 -520391 -622961 -484034 -272172 -234540 -330065
1773 -330065 -363975 -447498 -311071 -160204 -54675 -168216 -249272 -304469 -334243 -364701 -416519
1762 -416519 -405991 -340322 -234814 -344193 -405070 -351536 -338894 -351457 -253873 -146329 -214677
1751 -214677 -242796 -183282 -320352 -314020 -391404 -317733 -240340 -245299 -161268 -254465 -281621 -184945
1739 -184945 -313108 -432647 -388081 -373685 -321821 -392306 -285302 -191952 -249964 -241236 -272440
1728 -272440 -245136 -272635 -204458 -167630 -194443 -301124 -305066 -313099 -354386 -309504 -245500 -260840
$$ packed form
1807b29809l6615k367j49445o7253M1060J03001L0437K0941l2082j2109P3709
1796b60532Q557r1785r9331J95389J4460n3016o6978k6056l3392Q3840L8395J8977
1784b71472j1092k24832J93797p555j26438p2799j02570J38927K11862L7632r5525
1773c30065l3910q3523J36427J50867J05529j13541q1056n5197k9774l0458n1818
1762d16519J0528O5669J05508j09379o0877N3534J2642j2563R7584J07544o8348
1751b14677k8119N9514j37070O332p7384P3671P7393m959Q4031r3197k7156R6676
1739a84945j28163j19539M4566J4396N1864p0485J07004R3350n8012Q728l1204
1728b72440K7304k7499O8177L6828k6813j06681l942q033m1287M4882O4004j5340
$$ plain form
1716 -260840 -244180 -289628 -303723 -300552 -329008 -268659 -341921 -323841 -263888 -235142 -304598 -351201
1704 -351201 -396660 -490324 -446647 -293948 -243488 -357963 -412790 -402441 -464401 -460555 -347497
1693 -347497 -347723 -437049 -514320 -446386 -435681 -274687 -280451 -340142 -368800 -307676 -357510 -568658
1681 -568658 -472179 -459244 -440724 -339140 -413071 -459659 -494799 -507213 -503657 -344652 -328706
1670 -328706 -238528 -229721 -192248 -288232 -375133 -346238 -483534 -332583 -328959 -360512 -313570 -443713
1658 -443713 -277770 -187510 -395589 -399440 -419963 -359866 -390900 -367806 -365015 -350646 -254527 -271794
1646 -271794 -340848 -460984 -403278 -245660 -269111 -202660 -342067 -337643 -309762 -307419 -395389
1635 -395389 -275690 -364512 -592305 -479279 -274467 -298868 -315910 -327170 -275474 -301302 -360342
$$ packed form
1716b60840J6660m5448j4095L171k8456O0349p3262J8080N9953K8746o9456m6603
1704c51201m5459r3664M3677J52699N0460j14475n4827J0349o1960L846J13058
1693c47497k26q9326p7271O7934J0705J60994n764n9691k8658O1124m9834k11148
1681e68658R6479J2935J8520J01584p3931m6588l5140j2414L556J59005J5946
1670c28706R0178Q807L7473r5984q6901K8895j37296J50951L624l1553M6942j30143
1658d43713J65943R0260k08079l851k0523O0097l1034K3094K791J4369R6119j7267
1646b71794o9054j20136N7706J57618k3451O6451j39407M424K7881K343q7970
1635c95389J19699q8822k27793J13026K04812k4401j7042j1260N1696k5828n9040
$$ plain form
1624 -360342 -333448 -371983 -325706 -221424 -281413 -394845 -458528 -460076 -499459 -427229 -362626
1613 -362626 -362264 -274343 -205518 -168751 -244563 -253839 -317136 -161463 -138711 -392730 -454897 -231492
1601 -231492 -229818 -107730 -203348 -424671 -435824 -370461 -321814 -378928 -271790 -229721 -278023
1590 -278023 -313749 -453647 -490694 -383300 -373818 -515452 -658486 -705818 -577967 -428443 -422557
1579 -422557 -448049 -338366 -316808 -126621 -286762 -391624 -386707 -274683 -346915 -255904 -232411
1568 -232411 -412749 -342005 -343723 -414494 -448976 -408248 -477274 -440949 -420367 -264296 -188414
1557 -188414 -190889 -259944 -342750 -348083 -388479 -388538 -230513 -223206 -422319 -387466 -334123 -427683
1545 -427683 -514925 -524079 -494098 -419405 -362046 -410966 -391997 -392220 -418549 -307857 -159950 -410877
$$ packed form
1624c60342K6894l8535M6277J04282n9989j13432o3683j548l9383P2230O4603
1613c62626L62Q7921O8825L6767p5812r276o3297J55673K2752k54019o2167K23405
1601b31492J674J22088r5618k21323j1153O5363M8647n7114J07138M2069m8302
1590b78023l5726j39898l7047J07394R482j41634j43034m7332J27851J49524N886
1579d22557k5492J09683K1558J90187j60141j04862M917J12024p2232R1011K3493
1568b32411j80338P0744j718p0771l4482M0728o9026L6325K0582J56071P5882
1557a88414k475o9055q2806n333m0396n9J58025P307j99113L4853N3343r3560
1545d27683q7242r154K9981P4693N7359m8920J8969k23k6329J10692J47907k50927
$$ plain form
1533 -410877 -411160 -386473 -312430 -247880 -418147 -330988 -357315 -286991 -283107 -384046 -287578 -349107
1521 -349107 -494414 -390010 -400378 -459643 -490938 -580745 -468619 -466796 -474870 -511135 -400934
1510 -400934 -444668 -415956 -357788 -389113 -419362 -299778 -306642 -347332 -431280 -318397 -317857 -289010
1498 -289010 -243408 -240820 -157367 -415204 -426813 -452209 -441116 -473706 -590209 -449759 -270721
1487 -270721 -261577 -337268 -418257 -403477 -416932 -381901 -437644 -460221 -440682 -477656 -441464 -365878
1475 -365878 -421786 -384687 -350685 -417806 -330909 -343181 -376282 -392725 -399257 -350978 -272924 -239156
1463 -239156 -251266 -230635 -222386 -303690 -314652 -158853 -225337 -280892 -362490 -351138 -263481 -235994
1451 -235994 -283607 -294648 -392716 -536087 -634580 -438439 -355247 -566706 -605668 -564642 -474943
$$ packed form
1533d10877k83K4687P4043O4550j70267Q7159k6327P0324L884j00939R6468o1529
1521c49107j45307J04404j0368n9265l1295q9807J12126J823q074l6265J10201
1510d00934m3734K8712N8168l1325l0249J19584o864m0690q3948J12883N40K8847
1498b89010M5602K588Q3453k57837j1609k5396J1093l2590j16503J40450J79038
1487b70721R144p5691q0989J4780j3455L5031n5743k2577J9539l6974L6192P5586
1475c65878n5908L7099L4002o7121Q6897j2272l3101j6443o532M8279P8054L3768
1463b39156j2110K0631Q249q1304j0962J55799o6484n5555q1598J1352Q7657K7487
1451b35994m7613j1041r8068j43371r8493J96141Q3192k11459l8962M1026Q9699
$$ plain form
1440 -474943 -357044 -341855 -398398 -367156 -450980 -501083 -433014 -409190 -449598 -289344 -321883
1429 -321883 -473320 -509802 -410364 -378133 -371422 -346531 -432640 -444887 -378355 -459914 -363914 -183226
1417 -183226 -332744 -293003 -370705 -444109 -545121 -549963 -441294 -430048 -501557 -568392 -482565
1406 -482565 -319468 -345074 -465144 -432507 -303648 -241950 -347576 -514755 -474860 -312799
1396 -312799 -346075 -455515 -349823 -283020 -373373 -437707 -410764 -424964 -375219 -438691 -480159
1385 -480159 -437739 -350232 -232394 -301717 -318644 -243859 -259840 -372566 -487865 -452042 -466403
1374 -466403 -498735 -443820 -460534 -493352 -477357 -420038 -383653 -309050 -363206 -450755 -474659 -388061
1362 -388061 -571862 -522095 -446095 -299664 -395025 -397030 -380218 -486544 -453193 -548939 -542585
$$ packed form
1440d74943J17899J5189n6543L1242q3824n0103O8069K3824m0408J60254l2539
1429c21883j51437l6482R9438L2231O711K4891q6109j2247O6532q1559R6000J80688
1417a83226j49518L9741p7702p3404j01012m842J08669J1246p1509o6835Q5827
1406d82565J63097k5606j20070L2637J28859O1698j05626j67179L9895J62061
1396c12799l3276j09440J05692O6803r0353o4334K6943j4200M9745o3472m1468
1385d80159M2420Q7507J17838o9323j6927P4785j5981j12726j15299L5823j4361
1374d66403l2332N4915j6714l2818J5995N7319L6385P4603n4156q7549k3904Q6598
1362c88061j83801M9767P6000J46431r5361k005J6812j06326L3351r5746O354
$$ plain form
1351 -542585 -397810 -348298 -439335 -432063 -513179 -479017 -437302 -414404 -347073 -288363 -355123 -449475
1339 -449475 -550097 -614182 -626497 -540451 -506821 -535117 -502901 -445897 -464427 -545031 -440134
1328 -440134 -423876 -344185 -467257 -411223 -360006 -540615 -470329 -383308 -444689 -471751 -419794
1317 -419794 -481081 -548666 -513615 -336010 -347648 -398717 -214321 -323043 -401020 -384770 -379870
1306 -379870 -365187 -472549 -378914 -480936 -474954 -370261 -466099 -516967 -399263 -489299 -485004
1295 -485004 -381333 -412419 -426759 -555176 -447794 -326589 -403125 -469977 -582136 -473914
1285 -473914 -364092 -320793 -439846 -427951 -416880 -400107 -376366 -515213 -541086 -345197 -350378
1274 -350378 -399006 -354119 -451577 -404328 -437220 -429467 -473460 -437187 -392600 -409343 -449525 -534018
$$ packed form
1351e42585J44775M9512r1037P272q1116L4162M1715K2898O7331N8710o6760r4352
1339d49475j00622o4085j2315Q6046L3630k8296L2216N7004j8530q0604J04897
1328d40134J6258P9691j23072N6034N1217j80609P0286Q7021o1381k7062N1957
1317d19794o1287o7585L5051J77605j1638n1069J84396j08722p7977J6250M900
1306c79870J4683j07362R3635j02022N982J04693r5838n0868J17704r0036M295
1295d85004J03671l1086j4340j28417J07382J21205p6536o6852j12159J08222
1285d73914J09822M3299j19053J1895J1071J6773K3741j38847k5873J95889n181
1274c50378m8628M4887r7458M7249l2892P753m3993L6273M4587j6743m0182q4493
$$ plain form
1262 -534018 -429662 -387928 -459805 -404782 -288154 -299627 -376466 -280114 -470949 -509162 -549872
1251 -549872 -562381 -594147 -633836 -501696 -549123 -487343 -474433 -506821 -594909 -588206 -516775 -383972
1239 -383972 -519277 -544146 -500729 -525120 -457678 -459641 -509549 -492456 -522356 -649822 -603851
1228 -603851 -410757 -482869 -442805 -494926 -433905 -477324 -624461 -537787 -606137 -632346 -590301
1217 -590301 -406429 -483911 -489277 -479249 -452711 -366146 -397718 -542237 -570573 -515177 -586393
1206 -586393 -616705 -525347 -492491 -349830 -209085 -392592 -467064 -374655 -509186 -526897 -401859
1195 -401859 -343426 -467364 -450035 -522245 -696674 -571975 -467662 -495372 -538455 -555704 -496478
1184 -496478 -478916 -484928 -519368 -441167 -436400 -509562 -442316 -509947 -532550 -478696 -337168 -361707
$$ packed form
1262e34018J04356M1734p1877N5023J16628j1473p6839R6352j90835l8213m0710
1251e49872j2509l1766l9689J32140m7427O1780J2910l2388q8088O703P1431J32803
1239c83972j35305k4869M3417k4391O7442j963m9908J7093k9900j27466M5971
1228f03851J93094p2112M0064n2121O1021m3419j47137Q6674o8350k6209M2045
1217e90301J83872p7482n366J0028K6538Q6565l1572j44519k8336N5396p1216
1206e86393l0312R1358L2856J42661J40745j83507p4472R2409j34531j7711J25038
1195d01859N8433j23938J7329p2210j74429J24699J04313k7710m3083j7249N9226
1184d96478J7562o012l4440P8201M767p3162O7246o7631k2603N3854J41528k4539
$$ plain form
1172 -361707 -389383 -384135 -465621 -636078 -586697 -384838 -572038 -493273 -422952 -445466 -543669
1161 -543669 -554509 -522624 -601806 -514819 -412620 -374680 -382947 -313874 -270106 -306245 -408135
1150 -408135 -494835 -391595 -459824 -646920 -601476 -488063 -453128 -477922 -407582 -428699 -392225
1139 -392225 -305592 -338418 -489084 -549778 -672779 -594708 -489356 -410868 -472998 -559638 -567863
1128 -567863 -516358 -584812 -578573 -548210 -485277 -322167 -428075 -453780 -439402 -477158 -441122
1117 -441122 -453598 -650907 -645047 -579921 -420429 -397865 -554098 -566758 -485083 -377158 -376315
1106 -376315 -483409 -436674 -564739 -600227 -518095 -373215 -396167 -402706 -347433 -389243 -465745
1095 -465745 -427155 -305688 -318252 -289622 -515254 -608262 -564120 -445388 -416552 -466557 -460177
$$ packed form
1172c61707k7676N248q1486j70457M9381K01859j87200P8765P0321k2514r8203
1161e43669j0840L1885p9182Q6987J02199L7940q267O9073M3768l6139j01890
1150d08135q6700J03240o8229j87096M5444J13413L4935k4794P0340k1117L6474
1139c92225Q6633l2826j50666o0694j23001P8071J05352P8488o2130q6640q225
1128e67863N1505o8454O239L0363O2933J63110j05908k5705J4378l7756L6036
1117d41122j2476j97309N860O5126J59492K2564j56233j2660Q1675J07925Q43
1106c76315j07094M6735j28065l5488Q2132J44880k2952o539N5273m1810p6502
1095d65745L8590J21467j2564K8630k25632r3008M4142J18732K8836n0005O380
$$ plain form
1084 -460177 -543959 -392977 -294793 -385756 -424665 -435062 -428478 -424216 -438581 -449716 -385267 -318157
1072 -318157 -194717 -356875 -524984 -507174 -452922 -393439 -455218 -518227 -492032 -462944 -375928
1061 -375928 -422133 -479293 -494018 -422432 -414413 -500146 -618240 -544234 -572973 -647151 -630930 -559106
1049 -559106 -523532 -362963 -272459 -371486 -412919 -451126 -479279 -496875 -549579 -779245 -779499 -680570
1037 -680570 -597579 -467296 -510579 -570785 -591972 -632915 -587662 -522309 -614423 -602504 -468522
1026 -468522 -457924 -404177 -392274 -416836 -425794 -512229 -528614 -506371 -457844 -375444 -423563 -425019
1014 -425019 -424574 -335464 -423482 -446610 -446434 -442218 -478693 -502406 -497487 -401939 -373937 -435835 -438737
1001 -438737 -396585 -491182 -589953 -639756 -673977 -598404 -542519 -468853 -523663 -618642 -545891 -432505
$$ packed form
1084d60177q3782J50982R8184r0963l8909j0397O584M262j4365j1135O4449O7110
1072c18157J23440j62158j68109J7810N4252N9483o1779o3009K6195K9088Q7016
1061c75928m6205n7160j4725P1586Q019q5733j18094P4006k8739p4178J6221P1824
1049e59106L5574J60569R0504r9027m1433l8207k8153j7596n2704k29666k54R8929
1037f80570Q2991J30283m3283o0206k1187m0943M5253O5353r2114J1919J33982
1026d68522J0598N3747J1903k4562q958q6435j6385K2243M8527Q2400m8119j456
1014d25019M45Q9110q8018k3128J76M216l6475k3713M919R5548K8002o1898k902
1001d38737M2152r4597r8771m9803l4221P5573N5885P3666n4810r4979P2751J13386
$$ plain form
989 -432505 -314343 -455516 -523279 -595732 -589620 -553073 -420859 -469963 -594011 -486994 -471807
978 -471807 -466341 -482142 -444290 -548719 -535088 -527853 -523483 -483081 -356571 -455852 -469669 -443726
966 -443726 -542267 -523289 -553853 -427497 -522763 -439013 -410174 -467547 -419210 -433844 -366897 -431706
954 -431706 -641046 -553787 -465887 -555321 -483394 -477337 -456945 -543305 -551782 -483503 -408228 -557980
942 -557980 -665103 -626622 -533547 -490450 -481583 -540670 -420739 -467406 -579365 -523813 -480068
931 -480068 -534484 -535243 -428819 -459415 -459764 -430391 -459317 -539492 -469511 -361848 -492909 -559013
919 -559013 -503397 -533208 -544773 -584425 -568237 -486540 -415181 -462989 -618564 -570657 -600082 -500555
907 -500555 -406802 -550002 -535483 -601155 -498587 -413342 -376246 -480075 -599530 -595688 -592707
$$ packed form
989d32505J18162j41173o7763p2453O112L6547J32214m9104j24048J07017J5187
978d71807N466j5801L7852j04429J3631P235M370M0402J26510r9281j3817K5943
966d43726r8541J8978l0564J26356r5266Q3750K8839n7373M8337j4634O6947o4809
954d31706k09340Q7259Q7900q9434P1927O057K0392q6360q477O8279P5275j49752
942e57980j07123L8481R3075M3097Q867n9087J19931m6667j11959N5552M3745
931d80068n4416p59J06424l0596l49K9373k8926q0175O9981J07663j31061o6104
919e59013N5616k9811j1565l9652J6188Q1697P1359m7808j55575M7907k9425R9527
907e00555R3753j43200J4519o5672J02568Q5245L7096j03829j19455L842K981
$$ plain form
896 -592707 -592944 -576823 -560779 -519725 -560858 -574983 -492496 -461456 -443302 -496454 -611808 -700347
884 -700347 -611537 -511265 -561235 -584412 -593359 -506268 -497102 -634280 -594791 -486383 -471482 -437421
872 -437421 -448347 -523493 -468033 -512037 -483483 -429082 -511484 -526079 -486503 -577075 -642887 -422428
860 -422428 -403911 -477282 -429076 -495456 -444920 -484718 -473439 -547869 -612094 -527960 -510556 -497594
848 -497594 -337602 -408283 -563996 -554905 -600902 -477698 -493815 -681705 -713003 -624649 -552211
837 -552211 -500289 -535531 -597481 -609652 -649216 -592989 -438565 -416637 -481746 -560659 -589459 -488413
825 -488413 -541384 -535950 -499188 -495143 -572914 -654670 -571800 -653484 -517834 -512750 -581570 -544592
813 -544592 -525253 -414796 -482893 -436038 -472582 -608473 -622635 -586561 -623644 -676951 -526561
$$ packed form
896e92707k37J6121J6044M1054m1133j4125Q2487L1040J8154n3152j15354q8539
884g00347Q8810J00272m9970k3177q947Q7091R166j37178L9489J08408J4901L4061
872d37421j0926p5146N5460m4004K8554N4401q2402j4595L9576r0572o5812K20459
860d22428J8517p3371M8206o6380N0536l9798J1279p4430o4225Q4134J7404J2962
848d97594J59992p0681j55713R091m5997J23204j6117j87890l1298Q8354P2438
837e52211N1922l5242o1950j2171l9564N6227J54424K1928o5109p8913k8800J01046
825d88413n2971N434L6762M045p7771q1756Q2870q1684J35650N084o8820L6978
813e44592J9339J10457o8097M6855l6544j35891j4162L6074l7083n3307J50390
$$ plain form
802 -526561 -533336 -641381 -599825 -652497 -639341 -663829 -590439 -565563 -546822 -436255 -569958
791 -569958 -640734 -514042 -576289 -634985 -564909 -491120 -618213 -705332 -586130 -507854 -528316
780 -528316 -453321 -404104 -416423 -488300 -586977 -559743 -473178 -556572 -672194 -616177 -742726
769 -742726 -702302 -612586 -563645 -515180 -445768 -451329 -470413 -563934 -563882 -500956 -446706 -430665 -620542
756 -620542 -702662 -532088 -625646 -634799 -558882 -482629 -505204 -500355 -550115 -426245 -448651 -549748
744 -549748 -562119 -605207 -679101 -614663 -540895 -591128 -544257 -548065 -490826 -500360 -495633 -607504
732 -607504 -735204 -681835 -681346 -692797 -565240 -650756 -632368 -550889 -451350 -418901 -595654 -611982
720 -611982 -593207 -582359 -573548 -499700 -526340 -574655 -682744 -582610 -479296 -368064 -404409
$$ packed form
802e26561o775j08045M1556n2672J3156k4488P3390K4876J8741J10567j33703
791e69958p0776J26692o2247n8696P0076P3789j27093q7119J19202P8276k0462
780e28316P4995M9217j2319p1877r8677K7234Q6565q3394j15622N6017j26549
769g42726M0424Q9716M8941M8465O9412n561j9084r3521N2O2926N4250J6041j89877
756f20542q2120J70574r3558r153P5917P6253k2575M849m9760J23870k2406j01097
744e49748j2371m3088p3894O4438P3768n0233M6871l808N7239r534M727j11871
732f07504j27700N3369M89j1451J27557q5516J8388Q1479R9539L2449j76753j6328
720f11982J8775J0848Q811P3848k6640m8315j08089J00134J03314J11232l6345
$$ plain form
709 -404409 -589504 -601802 -623880 -683117 -697333 -721207 -719278 -698201 -724912 -591363 -527270 -594093
697 -594093 -622123 -555750 -509716 -508551 -548375 -504632 -605455 -535779 -447364 -531192 -639144 -533694
685 -533694 -583333 -541159 -422236 -558424 -526138 -526160 -537209 -531047 -561543 -602420 -602181 -551691 -522227
672 -522227 -544726 -624009 -547163 -574256 -572418 -557430 -481822 -590208 -484571 -386536 -541076
661 -541076 -609734 -579741 -695877 -607650 -449171 -562580 -543906 -553819 -593931 -468232 -525540
650 -525540 -556952 -565036 -525028 -606780 -641605 -499014 -458610 -384314 -411571 -485082 -572406 -613034
638 -613034 -683493 -597727 -680757 -688637 -606315 -657528 -648342 -625997 -604512 -743689 -729138 -489015
626 -489015 -565931 -707185 -602194 -582768 -615784 -539076 -467078 -634421 -654533 -608869 -566533
$$ packed form
709d04409j85095j2298k2078n9237j4216k3874J929K1077k6711J33549O4093o6823
697e94093k8030O6373M6034J165l9824M3743j00823O9676Q8415q3828j07952J05450
685e33694m9639M2174J18923j36188L2286k2j1049O162l0496m0877K39N0490K9464
672e22227k2499p9283P6846k7093J838J4988P5608j08386J05637R8035j54540
661e41076o8658K9993j16136Q8227J58479j13409J8674r913m0112J25699n7308
650e25540l1412q084M0008q1752l4825J42591M0404P4296k7257p3511q7324m0628
638f13034p0459Q5766q3030p880Q2322n1213R186K2345K1485j39177J4551K40123
626d89015p6916j41254J04991J9426l3016P6708P1998j67343k0112M5664M2336
$$ plain form
615 -566533 -622979 -565509 -618827 -496753 -360022 -508339 -482052 -475652 -431546 -638253 -784913
604 -784913 -692566 -583566 -673636 -576709 -515911 -518031 -513915 -634649 -656577 -606696 -587472 -683897
592 -683897 -546567 -485464 -651478 -545829 -613218 -680873 -737507 -813172 -663270 -623074 -566142
581 -566142 -561744 -578795 -674543 -670639 -561373 -464490 -416535 -435745 -470321 -502803 -488251 -684982
569 -684982 -755697 -597867 -556402 -614403 -589822 -597582 -678347 -684106 -662214 -576541 -474760 -644673
557 -644673 -529575 -567100 -580627 -682029 -658680 -698427 -751229 -706282 -556108 -609162 -598190
546 -598190 -557732 -653953 -728362 -856620 -798327 -721218 -634161 -580378 -665986 -702939 -757779 -682521
534 -682521 -697611 -804910 -789217 -639754 -587189 -539854 -591270 -768445 -701653 -639589 -544642
$$ packed form
615e66533n6446N7470n3318J22074J36731j48317K6287O400M4106k06707j46660
604g84913R2347J09000r0070R6927O0798k120M116j20734k1928M9881J9224r6425
592f83897J37330O1103j66014J05649o7389o7655n6634p5665J49902M0196N6932
581e66142M398j7051r5748L904J09266R6883M7955j9210l4576l2482J4552j96731
569f84982p0715J57830M1465n8001K4581p760q0765n759K1892Q5673J01781j69913
557f44673J15098l7525j3527j01402K3349l9747n2802M4947J50174n3054J0972
546e98190M0458r6221p4409j28258N8293P7109Q7057N3783q5608l6953n4840P5258
534f82521j5090j07299J5693J49463N2565M7335n1416j77175O6792O2064R4947
$$ plain form
523 -544642 -514926 -603411 -642919 -593512 -637441 -656361 -724205 -536651 -424366 -530928 -779140
512 -779140 -688753 -651053 -685366 -513778 -531913 -582621 -738511 -709487 -701279 -653975 -705546 -754965
500 -754965 -632470 -633169 -615128 -595209 -599663 -608878 -666153 -764537 -737751 -646276 -480525 -515240
488 -515240 -421694 -574654 -698213 -607583 -564141 -637238 -648154 -650471 -599325 -524676 -577844 -588575
476 -588575 -561793 -549104 -537199 -607715 -562299 -674038 -767690 -685101 -561295 -545793 -682187
465 -682187 -806134 -660132 -593780 -652805 -591318 -574157 -646546 -592323 -710660 -698368 -574860
454 -574860 -574744 -534171 -707933 -733831 -680556 -593509 -542386 -603858 -736479 -654979 -630155 -682183
442 -682183 -659247 -623351 -597926 -683748 -666766 -625939 -606641 -592416 -564550 -618507 -557160 -532063
$$ packed form
523e44642K9716q8485l9508M9407m3929j8920o7844J87554J12285j06562k48212
512g79140R0387L7700l4313J71588j8135n0708j55890K9024Q208M7304n1571m9419
500g54965J22495o99J8041J9919m454r215n7275r8384K6786R1475J65751l4715
488e15240R3546j52960j23559R0630M3442p3097j0916k317N1146P4649n3168j0731
476e88575K6782J2689J1905p0516M5416j11739r3652Q2589J23806J5502j36394
465f82187j23947J46002O6352n9025O1487J7161p2389N4223j18337J2292J23508
454e74860J16M0573j73762k5898N3275Q7047N1123o1472j32621Q1500K4824n2028
442f82183K2936L5896K5425q5822J6982M0827J9298J4225K7866n3957O1347K5097
$$ plain form
430 -532063 -550251 -547085 -478184 -670880 -775046 -635805 -529008 -452379 -652195 -655414 -696315
419 -696315 -658887 -648310 -607402 -613151 -739195 -843222 -693488 -634682 -741505 -730162 -651342
408 -651342 -684258 -766946 -796050 -694305 -624288 -625121 -624478 -578311 -608893 -580231 -591146 -564168
396 -564168 -510738 -655675 -688824 -646854 -558515 -555172 -486732 -557578 -583180 -602895 -587666 -686995
384 -686995 -593044 -547454 -459071 -439697 -572953 -577559 -644490 -496686 -475777 -616193 -760299
373 -760299 -627120 -611994 -593931 -612509 -609892 -550271 -628033 -703470 -613061 -584625 -619949 -591390
361 -591390 -531902 -576629 -588511 -648361 -644192 -576891 -656556 -735997 -838111 -731314 -726589 -653097
349 -653097 -613490 -670694 -607931 -680271 -732389 -781760 -754483 -601616 -598314 -602056 -588196 -650804
$$ packed form
430e32063j8188L166O8901j92696j04166J39241J06797P6629j99816l219m0901
419f96315L7428J0577M0908n749j26044j04027J49734N8806j06823J1343P8820
408f51342l2916q2688k9104J01745P0017q33O43M6167l0582K8662j0915K6978
396e64168N3430j44937l3149M1970Q8339L343O8440p0846k5602j9715J5229r9329
384f86995R3951M5590Q8383J9374j33256m606o6931J47804K0909j40416j44106
373g60299J33179J5126J8063j8578K617N9621p7762p5437R0409K8436l5324K8559
361e91390N9488m4727j1882n9850M169O7301p9665p9441j02114J06797M725P3492
349f53097L9607n7204O2763p2340n2118m9371K7277J52867L302l742J3860o2608
$$ plain form
337 -650804 -622956 -564027 -579328 -647526 -672414 -574916 -577586 -679529 -676452 -735391 -732839 -515217
325 -515217 -446123 -546742 -576830 -665758 -664155 -762895 -684189 -608102 -659478 -659537 -648952 -699714
313 -699714 -666337 -716623 -779592 -639358 -524697 -479321 -701131 -759399 -668272 -741312 -754691
302 -754691 -740427 -653219 -690547 -663155 -589114 -627408 -793864 -777540 -562555 -498315 -515726
291 -515726 -671391 -739822 -772893 -566496 -606073 -574549 -513255 -596653 -479039 -491206 -646866
280 -646866 -708126 -549451 -590408 -740904 -702077 -572018 -661182 -753963 -649278 -652334 -607838
269 -607838 -603400 -759042 -733522 -691974 -621147 -589310 -646428 -597468 -485500 -535372 -588018 -513365
257 -513365 -615354 -615030 -569024 -467549 -527267 -617047 -597114 -693837 -854409 -880150 -705709
$$ packed form
337f50804K7848N8929j5301o8198k4888R7498k670j01943L077n8939K552K17622
325e15217O9094j00619l0088q8928J603r8740P8706P6087n1376n9J0585n0762
313f99714L3377n0286o2969J40234J14661M5376k21810n8268R1127p3040j3379
302g54691J4264Q7208l7328K7392P4041l8294j66456J6324K14985O4240j7411
291e15726j55665o8431l3071K06397l9577L1524O1294q3398J17614j2167j55660
280f46866o1260J58675m0957j50496L8827J30059q9164r2781J04685l056M4496
269f07838M438j55642K5520M1548P0827L1837n7118M8960J11968m9872n2646P4653
257e13365j01989L24M6006J01475n9718q9780J9933r6723j60572k5741J74441
$$ plain form
246 -705709 -557771 -645959 -553317 -678594 -683772 -631873 -702498 -672312 -628500 -619259 -631213 -613964
234 -613964 -673987 -647607 -629599 -648673 -551798 -595203 -690110 -707456 -766180 -814791 -880976 -812249
222 -812249 -834520 -746166 -754884 -751335 -812371 -840405 -630779 -627872 -619101 -586506 -627598 -695900
210 -695900 -685043 -631178 -726299 -779112 -791284 -743295 -503526 -425978 -499921 -646968 -645695 -731062
198 -731062 -664437 -630652 -618764 -578475 -523000 -533687 -590382 -540451 -493378 -571142 -646141 -564947
186 -564947 -542282 -562883 -727068 -855585 -743142 -655844 -597913 -575417 -670208 -655859 -652274
175 -652274 -630081 -553856 -593873 -636404 -546282 -503688 -578935 -582578 -529535 -548648 -636528 -634831
163 -634831 -594000 -580777 -667387 -759379 -729678 -779151 -839482 -722353 -635458 -688756 -582220
$$ packed form
246g05709J47938q8188R2642j25277n178N1899p0625L0186M3812R241j1954J7249
234f13964o0023K6380J8008j9074R6875m3405r4907j7346n8724m8611o6185O8727
222h12249k2271Q8354q718L549o1036k8034K09626K907Q771L2595m1092o8302
210f95900J0857N3865r5121n2813j2172M7989K39769P7548p3943j47047J273q5367
198g31062O6625L3785J1888M0289N5475j0687n6695M9931M7073p7764p4999Q1194
186e64947K2665k0601j64185j28517J12443Q7298N7931K2496r4791J4349L585
175f52274K2193P6225m0017m2531R0122M2594p5247l643N3043j9113q7880J697
163f34831M0831J3223q6610r1992K9701m9473o0331J17129Q6895n3298J06536
$$ plain form
152 -582220 -606363 -587569 -678969 -827504 -731429 -575212 -612542 -581099 -585564 -572276 -543474 -471357
140 -471357 -514623 -559666 -649078 -619962 -645449 -646495 -556771 -556593 -699131 -733793 -681907 -614130
128 -614130 -662266 -654364 -619801 -622777 -662531 -524808 -508073 -578015 -627105 -575552 -555160 -571413
116 -571413 -537142 -542869 -670294 -553910 -520268 -660512 -506879 -583683 -596540 -681336 -609906
105 -609906 -592442 -490666 -537864 -623790 -667360 -582987 -529480 -567746 -576078 -525116 -536402 -562498
93 -562498 -667528 -618724 -633281 -702384 -737157 -655213 -699134 -637219 -600320 -576935 -519104 -549698
81 -549698 -548435 -621631 -524750 -607881 -747882 -667477 -491848 -643634 -792662 -708649 -673044
70 -673044 -675920 -604012 -548676 -562830 -597171 -490977 -518450 -583464 -569254 -568660 -515128 -534265
$$ packed form
152e82220k4143J8794r1400j48535R6075J56217l7330L1443m465J3288K8802P2117
140d71357m3266m5043q9412K9116k5487j046Q9724J78j42538l4662N1886O7777
128f14130m8136P902L4563k976l9754J37723J6735o9942m9090N1553K0392j6253
116e71413L4271n727j27425J16384L3642j40244J53633p6804j2857q4796P1430
105f09906J7464J01776m7198q5926m3570Q4373N3507l8266q332N0962j1286k6096
93e62498j05030M8804j4557o9103l4773Q1944m3921O1915L6899K3385N7831l0594
81e49698J263p3196R6881q3131j40001Q0405J75629j51786j49028Q4013L5605
70f73044k876P1908N5336j4154l4341J06194k7473o5014J4210N94N3532j9137
$$ plain form
58 -534265 -512215 -588509 -632137 -476584 -511982 -508036 -493698 -493186 -448423 -458281 -461358 -555319 -643443
45 -643443 -553203 -499808 -483206 -433715 -418356 -424514 -452877 -561206 -570833 -578657 -484178 -495791
33 -495791 -498020 -532394 -591492 -511913 -585570 -609370 -542765 -457929 -500084 -527410 -516121 -492795
21 -492795 -450880 -482055 -486158 -563330 -539312 -468924 -487276 -393556 -402646 -497160 -480363 -461545
9 -461545 -522622 -545671 -579485 -495518 -470730 -490886 -575171 -536617 -518143
0 -518143
$$ packed form
58e34265K2050p6294m3628J55553l5398L946J4338N12M4763r858l077r3961q8124
45f43443R0240N3395J6602M9491J5359o158k8363j08329r627p824R4479j1613
33d95791k229l4374n9098P9579p3657k3800O6605Q4836m2155k7326J1289K3326
21d92795M1915l1175m103p7172K4018P0388j8352R3720r090r4514J6797J8818
9d61545o1077k3049l3814Q3967K4788k0156q4285L8554J8474
0e18143
$$ Imaginary data points
##PAGE= N=2
##DATA TABLE= (X++(I..I)), XYDATA
$$ plain form
16383 -1736141 -1718820 -1716249 -1733734 -1638285 -1587602 -1615407 -1632716 -1611112 -1559040 -1551754 -1494520 -1394807
16371 -1394807 -1393039 -1369911 -1398244 -1377485 -1363538 -1378626 -1360603 -1359139 -1260137 -1226382 -1339963
16360 -1339963 -1310878 -1308841 -1236671 -1126294 -1101122 -1104411 -1059427 -1053590 -1058268 -990221 -903408 -934235
16348 -934235 -952869 -950369 -866730 -773931 -746977 -753260 -782518 -804635 -773400 -750834 -838119 -877286
16336 -877286 -716241 -608388 -573760 -580221 -620417 -602574 -616734 -540250 -491219 -469497 -316415
16325 -316415 -411662 -401277 -424199 -395457 -401950 -402074 -293189 -322002 -369982 -350888 -211413 -270500
16313 -270500 -321257 -162623 -204202 -241028 -190875 -181770 -120545 -117119 -214173 -145461 -32137
16302 -32137 18935 -11451 5237 30775 50806 38394 -20117 36940 -12225 26623 139405
$$ packed form
16383a736141J7321K571j7485R5449N0683k7805j7309K1604N2072P286N7234R9713
16371a394807J768K3128k8333K0759J3947j5088J8023J464R9002L3755j13581
16360a339963K9085K037P2170J10377K5172l289M4984N837m678O8047Q6813l0827
16348i34235j8634K500Q3639R2799K6954o283k9258k2117L1235K2566q7285l9167
16336h77286J61045J07853L4628o461m0196J7843j4160P6484M9031K1722J53082
16325c16415r5247J0385k2922K8742o493j24J08885k8813m7980J9094J39475n9087
16313b70500n0757J58634m1579l6826N0153R105O1225L426r7054O8712J13324
16302c2137N1072l0386J6688K5538K0031j2412n8511N7057m9165L8848J12782
$$ plain form
16291 139405 196532 318460 250924 237577 253474 158732 173265 223884 206516 290312 443439
16280 443439 459164 405350 347376 396255 283135 316429 337688 349312 471499 634975 549331
16269 549331 554323 657614 660924 633973 649741 631861 508500 603273 658258 587440 614731
16258 614731 677183 771392 810313 938822 928453 880870 816891 908527 842535 847594 959621
16247 959621 920444 1001985 996067 960349 972042 958603 1062068 909495 907047 1068548 919562
16236 919562 901125 984418 1129466 1202226 1012455 952308 986649 1052893 1052514 1054936 1176406
16225 1176406 1064433 1173151 1208888 1095647 1158195 1109938 966850 1141263 1163301 1136611
16215 1136611 1232471 1245517 1155260 1259924 1262580 1152668 1142174 1258380 1320526 1348110 1360379
$$ packed form
16291A39405N7127J21928o7536j3347J5897r4742J4533N0619j7368Q3796J53127
16280D43439J5725n3814n7974M8879j13120L3294K1259J1624J22187J63476q5644
16269E49331M992J03291L310k6951J5768j7880j23361R4773N4985p0818K7291
16258F14731O2452R4209L8921J28509j0369m7583o3979R1636o5992N059J12027
16247I59621l9177Q1541n918l5718J1693j3439J03465j52573k448J61501j48986
16236I19562j8437Q3293J45048P2760j89771o0147L4341O6244l79K422J21470
16225A176406j11973J08718L5737j13241O2548m8257j43088J74413K2038k6690
16215A136611R5860J3046r0257J04664K656j09912j0494J16206O2146K7584J2269
$$ plain form
16204 1360379 1365490 1430184 1252132 1309987 1371303 1291550 1269633 1237950 1276203 1314807 1343302
16193 1343302 1338438 1413736 1378351 1339279 1340695 1420974 1467716 1466627 1381795 1367547 1293132 1428957
16181 1428957 1567403 1490312 1538587 1498277 1429885 1371676 1405488 1469563 1459158 1443506 1628567
16170 1628567 1568596 1514599 1501196 1500469 1615108 1666825 1674576 1623580 1677162 1608306 1542470 1585957
$$ packed form
16204A360379N111O4694j78052N7855O1316p9753k1917l1683L8253L8604K8495
16193A343302m864P5298l5385l9072J416Q0279M6742j089q4832j4248p4415J35825
16181A428957J38446p7091M8275m0310o8392n8209L3812O4075j0405j5652J85061
16170A628567n9971n3997j3403p27J14639N1717P751n0996N3582o8856o5836M3487
$$ [...]
##END NTUPLES=NMR SPECTRUM
##END=
