##TITLE=1H_DE-80H_X3
 200.13MHz, d2o
 8 sc
 
 19ns.26.2.2025
##JCAMPDX= 6.0         $$ Bruker NMR JCAMP-DX V2.0
##DATA TYPE= NMR SPECTRUM
##DATA CLASS= NTUPLES
##ORIGIN= UXNMR, Bruker Analytische Messtechnik GmbH
##OWNER= pz
$$ XWIN-NMR		Version 3.5
$$ Wed Jul 16 14:20:41 2025 Russian Standard Time (UT+4h)  Yarkov@DPX200
##.OBSERVE FREQUENCY= 200.1313
##.OBSERVE NUCLEUS= ^1H
##.ACQUISITION MODE= SIMULTANEOUS
##.ACQUISITION SCHEME= undefined
##.AVERAGES= 8
##.DIGITISER RES= 18
##SPECTROMETER/DATA SYSTEM= spect
##.PULSE SEQUENCE= zg30
##.SOLVENT NAME= CDCl3
##.SHIFT REFERENCE= (INTERNAL, CDCl3, 0, 15.5442)
##AUDIT TRAIL= $$ (NUMBER, WHEN, WHO, WHERE, WHAT)
$$ ##TITLE= Audit trail, XWIN-NMR		Version 3.5
$$ ##JCAMPDX= 5.01
$$ ##ORIGIN= Bruker BioSpin GmbH
$$ ##OWNER= Yarkov
$$ C:/Bruker/XWIN-NMR/data/yarkov2/nmr/H-C/1/pdata/1/auditp.txt
$$ ##AUDIT TRAIL=  $$ (NUMBER, WHEN, WHO, WHERE, WHAT)
(   1,<2025-07-16 14:19:37.09 +0400>,<Yarkov>,<DPX200>,
      <created by zg, POWCHK disabled, PULCHK disabled
       configuration hash MD5:
       00 E9 B6 7A A2 85 ED C7 34 08 36 98 17 FE 4E 26
       data hash MD5: 16K
       BE 73 63 C9 BD 63 53 9F 0D EB C8 70 47 80 0E 1A>)
(   2,<2025-07-16 14:19:43.98 +0400>,<Yarkov>,<DPX200>,
      <Start of raw data processing
       efp BC_mod = 2 LB = 0.25 FT_mod = 6 PKNL = 1 PHC0 = -1360.525 PHC1 = 12.79091 SI = 16K 
       data hash MD5: 16K
       6A 7A 92 E5 30 20 59 77 11 D5 C0 6E 7A 64 AC DB>)
(   3,<2025-07-16 14:19:49.85 +0400>,<Yarkov>,<DPX200>,
      <abs ABSG = 5 
       data hash MD5: 16K
       67 E3 B5 54 CC 7B 17 7F 3B 8A A8 13 9C 60 23 50>)
(   4,<2025-07-16 14:20:05.15 +0400>,<Yarkov>,<DPX200>,
      <pk PHC0 = -2.449121 PHC1 = 7.6 
       data hash MD5: 16K
       D2 FB 33 DB 31 2A F4 00 4A 4D 4D EE EF 88 9C 15>)
$$ ##END=
$$ 
$$ hash MD5
$$ B1 E5 A6 16 5B C5 A0 15 36 94 27 93 9B 6B 2A 6A
##$RELAX= 
##$RELAX= 
##$RELAX= 
##$RELAX= 
##$RELAX= 
##$RELAX= 
$$ Bruker specific parameters
$$ --------------------------
##$DU= <C:/Bruker/XWIN-NMR>
##$EXPNO= 1
##$NAME= <H-C>
##$PROCNO= 1
##$TYPE= <nmr>
##$USER= <yarkov2>
##$AMP= (0..31)
100 100 100 100 100 100 100 100 100 100 100 100 100 100 100 100 100 100 
100 100 100 100 100 100 100 100 100 100 100 100 100 100 
##$AQSEQ= 0
##$AQ_mod= 1
##$AUNM= <au_zg>
##$AUTOPOS= <>
##$BF1= 200.13
##$BF2= 200.13
##$BF3= 200.13
##$BF4= 200.13
##$BF5= 200.13
##$BF6= 200.13
##$BF7= 200.13
##$BF8= 200.13
##$BYTORDA= 1
##$CFDGTYP= 0
##$CFRGTYP= 5
##$CHEMSTR= <none>
##$CNST= (0..31)
1 1 145 1 1 1 1 1 1 1 1 1 1 1 1 1 1 1 1 1 1 1 1 1 1 1 1 1 1 1 1 1 
##$CPDPRG= <>
##$CPDPRG1= <>
##$CPDPRG2= <>
##$CPDPRG3= <>
##$CPDPRG4= <mlev>
##$CPDPRG5= <mlev>
##$CPDPRG6= <mlev>
##$CPDPRG7= <mlev>
##$CPDPRG8= <mlev>
##$CPDPRGB= <>
##$CPDPRGT= <>
##$D= (0..31)
0 0.7 0 0 0 0 0 0 0 0 0 0.03 0 0 0 0 0 0 0 0 0 0 0 0 0 0 0 0 0 0 0 0 
##$DATE= 1752661176
##$DBL= (0..7)
120 120 120 120 120 120 120 120 
##$DBP= (0..7)
150 150 150 150 150 150 150 150 
##$DBP07= 0
##$DBPNAM0= <>
##$DBPNAM1= <>
$$ [...]
##$SUBNAM3= <"">
##$SUBNAM4= <"">
##$SUBNAM5= <"">
##$SUBNAM6= <"">
##$SUBNAM7= <"">
##$SUBNAM8= <"">
##$SUBNAM9= <"">
##$SW= 18.0517328524113
##$SWIBOX= (0..15)
0 0 2 0 0 0 0 0 0 0 0 0 0 0 0 0 
##$SW_h= 3612.71676300578
##$TD= 16384
##$TD0= 1
##$TE= 0
##$TE2= 300
##$TE3= 300
##$TEG= 300
##$TL= (0..7)
0 120 120 120 120 120 120 120 
##$TP= (0..7)
150 150 150 150 150 150 150 150 
##$TP07= 0
##$TPNAME0= <>
##$TPNAME1= <>
##$TPNAME2= <>
##$TPNAME3= <>
##$TPNAME4= <>
##$TPNAME5= <>
##$TPNAME6= <>
##$TPNAME7= <>
##$TPOAL= (0..7)
0.5 0.5 0.5 0.5 0.5 0.5 0.5 0.5 
##$TPOFFS= (0..7)
0 0 0 0 0 0 0 0 
##$TUNHIN= 0
##$TUNHOUT= 0
##$TUNXOUT= 0
##$USERA1= <user>
##$USERA2= <user>
##$USERA3= <user>
##$USERA4= <user>
##$USERA5= <user>
##$V9= 5
##$VALIST= <valist>
##$VCLIST= <CCCCCCCCCCCCCCC>
##$VD= 0
##$VDLIST= <DDDDDDDDDDDDDDD>
##$VPLIST= <PPPPPPPPPPPPPPP>
##$VTLIST= <TTTTTTTTTTTTTTT>
##$WBST= 1024
##$WBSW= 4
##$XGAIN= (0..3)
0 0 0 0 
##$XL= 0
##$YL= 0
##$YMAX_a= 513264
##$YMIN_a= -463234
##$ZGOPTNS= <>
##$ZL1= 120
##$ZL2= 120
##$ZL3= 120
##$ZL4= 120
##$ABSF1= 15.4483
##$ABSF2= -2.603549
##$ABSG= 5
##$ABSL= 3
##$ALPHA= 0
##$AQORDER= 0
##$ASSFAC= 0
##$ASSFACI= 0
##$ASSFACX= 0
##$ASSWID= 0
##$AUNMP= <proc_1d>
##$AZFE= 0.1
##$AZFW= 0.1
##$BCFW= 0
##$BC_mod= 2
##$BYTORDP= 0
##$COROFFS= 0
##$CY= -3
##$DATMOD= 1
##$DC= 0
##$DFILT= <>
##$DTYPP= 0
##$F1P= 0
##$F2P= 0
##$FCOR= 1
##$FTSIZE= 16384
##$FT_mod= 6
##$GAMMA= 0
##$GB= 0
##$INTBC= 1
##$INTSCL= 3.241238e-09
##$ISEN= 128
##$LB= 0.25
##$LEV0= 0
##$LPBIN= 0
##$MAXI= 10000
##$MC2= 0
##$MEAN= 0
##$ME_mod= 0
##$MI= 1.114404
##$NCOEF= 0
##$NC_proc= -5
##$NLEV= 6
##$NOISF1= 3.799351
##$NOISF2= 2.8
##$NSP= 0
##$NTH_PI= 0
##$NZP= 0
##$OFFSET= 15.54416
##$PC= 1
##$PHC0= -1362.974
##$PHC1= 20.39091
##$PH_mod= 1
##$PKNL= yes
##$PPARMOD= 0
##$PSCAL= 0
##$PSIGN= 0
##$REVERSE= no
##$SF= 200.129995506321
##$SI= 16384
##$SIGF1= 3
##$SIGF2= 2
##$SINO= 0.751879
##$SIOLD= 32768
##$SREGLST= <19F.Aceton>
##$SSB= 0
##$STSI= 16384
##$STSR= 0
##$SW_p= 3612.71676300578
##$SYMM= 0
##$S_DEV= 0
##$TDeff= 16384
##$TDoff= 0
##$TI= <>
##$TILT= no
##$TM1= 0
##$TM2= 0
##$TOPLEV= 0
##$USERP1= <user>
##$USERP2= <user>
##$USERP3= <user>
##$USERP4= <user>
##$USERP5= <user>
##$WDW= 1
##$XDIM= 16384
##$YMAX_p= 447359605
##$YMIN_p= -248903
$$ End of Bruker specific parameters
$$ ---------------------------------
##NTUPLES= NMR SPECTRUM
##VAR_NAME=  FREQUENCY,     SPECTRUM/REAL,   SPECTRUM/IMAG
##SYMBOL=    X,             R,               I
##VAR_TYPE=  INDEPENDENT,   DEPENDENT,       DEPENDENT
##VAR_FORM=  AFFN,          ASDF,            ASDF
##VAR_DIM=   16384,         16384,           16384
##UNITS=     HZ,            ARBITRARY UNITS, ARBITRARY UNITS
##FACTOR=    0.220516191357247, 1,           1
##FIRST=     3110.85264877937, 0,            0
##LAST=      -501.864114226408, 0,           0
##MIN=       -501.864114226408, -248903,     0
##MAX=       3110.85264877937, 447359605,    0
$$ Real data points
##PAGE= N=1
##DATA TABLE= (X++(R..R)), XYDATA
$$ [...]
8245c3745k8566L771K6693k9253j2885L634L826N635m514K1329K6313k2828J5120
8232b5470K7433l0314J3524J1599k370P534k1582l1539L891M953J0534l801J6051
8219a9557k6028Q867J6257p976J2348J0865k481n662K7912l5508k2491q532Q269
8206d3717j9046L6497L0384k1178l4317j2642K0708K9142J9230K8307l1018M1208
8194D3558M833J55936j78923k74307R9848L704K9081q806M2085k884J6255j057
8182g0677k164L2813O45k7146L1574L4161j6903j6501l0595k4296J6496L8385
8170c4208J0731j2321q010L0702k304k3353K4372J3058r20j7726j2824Q563L293
8157b0947M346k596k3432K003l4030L3968M2901j9072K4771R175k8974O077J2940
$$ plain form
8245 -33745 -62311 -58540 -31847 -61100 -73985 -70351 -66525 -60890 -65404 -44075 -17762 -40590 -25470
8232 -25470 1963 -28351 -14827 -3228 -5598 1936 -19646 -51185 -47294 -42341 -31807 -35608 -19557
8219 -19557 -45585 -36718 -20461 -28437 -16089 -5224 -7705 -13367 14545 -20963 -43454 -51986 -43717
8206 -43717 -62763 -26266 4118 -17060 -51377 -64019 -43311 -14169 5061 33368 2350 43558
8194 43558 48391 204327 25404 -248903 -149055 -145351 -116270 -125076 -82991 -85875 -69620 -70677
8182 -70677 -72841 -40028 -39383 -66529 -34955 -794 -17697 -34198 -64793 -89089 -72593 -34208
8170 -34208 -23477 -35798 -43808 -13106 -15410 -38763 -14391 -1333 -2253 -19979 -32803 -24240 -20947
8157 -20947 -16601 -19197 -42629 -40626 -74656 -40688 2213 -16859 7912 17087 -11887 -5810 7130
8144G130k1702j1534M401o818N57J8972k1333j4848j9886J0739P592L838K432
8131d0460J6510N929m4448k5461j280M6794K1148o934k384j6034K881q175l452
8118e5366P207R344L2763L5128l4377k9939M6488j7950l8952K845J6123J476j3339
8105c8549O477K752j4839K5714Q514j1392n426k3230L1731j4498J2722n298j4697
8092d0019J6017J3104k8198j9921L1790M7551l7705k6672N036m0863l96J8717
8080f1559K2979l5081K4097J8754j9483o041L3068M586l057m285j5325j3882K2925
8067c2304Q552J2641j2636j6889j3537L672k3231J4621P915j7667O278O124o738
8054f3199j5017L0926Q575J4844N067J0588j9548j0930K7748l1966j7220k783
$$ plain form
8144 7130 -14572 -26106 -21705 -28523 -27966 -8994 -30327 -45175 -65061 -54322 -46730 -42892 -40460
8131 -40460 -23950 -18021 -62469 -87930 -89210 -42416 -21268 -28202 -30586 -46620 -43739 -51914 -55366
8118 -55366 -48159 -38815 -6052 29076 -5301 -35240 11248 -6702 -45654 -42809 -26686 -25210 -38549
8105 -38549 -32072 -29320 -44159 -18445 -9931 -21323 -26749 -49979 -18248 -32746 -20024 -25322 -40019
8092 -40019 -24002 -10898 -39096 -59017 -27227 20324 -17381 -44053 -39017 -79880 -80276 -61559
8080 -61559 -38580 -73661 -49564 -30810 -50293 -56334 -23266 -18680 -21737 -26022 -41347 -55229 -32304
8067 -32304 -23752 -11111 -23747 -40636 -54173 -50501 -73732 -59111 -51196 -68863 -62585 -56461 -63199
8054 -63199 -78216 -47290 -38715 -23871 -18804 -8216 -27764 -38694 -10946 -42912 -60132 -62915
8042f2915r464J1081q346J7481N746K0946O647L274M16m829k1053j6835j8413
8029g6264J460N881Q409j0686L8984K3334k9356L036o644K875r99M044m566K4518
8015a5974j6615k672L7480j4496k2415l202K4393O370P446l432k8439j5776M3720
8002c612K667P508m3669k1238p833Q703q008j784K5039j5541j523J6190j1725
7989e4826q837K9522k61j7376n171L1643j1782P569P743k9782R116r492k3581
7976g5515J3401L741k839J7537K001k461J2858k3605k1286O206J5965R656K4998
7963a9343p618q875J4786n996J9651J703j7323K4424J0827n9641j6548K9246m699
7950c9406K7304p502l823r857j1554J59N4191j4720k375n776l4562K6836k434
$$ plain form
8042 -62915 -72379 -61298 -69644 -52163 -46417 -25471 -18824 -15550 -15134 -19963 -41016 -57851 -76264
8029 -76264 -74804 -68923 -60514 -71200 -32216 -8882 -38238 -35202 -41846 -38971 -39970 -35926 -40492 -15974
8015 -15974 -32589 -35261 2219 -12277 -34692 -37894 -13501 -7131 315 -3117 -31556 -47332 -3612
8002 -3612 -945 6563 -37106 -58344 -66177 -57474 -65482 -67266 -42227 -57768 -59291 -43101 -54826
7989 -54826 -63663 -34141 -34402 -51778 -56949 -25306 -37088 -29519 -21776 -51558 -42442 -51934 -75515
7976 -75515 -62114 -58373 -61212 -43675 -41674 -44135 -31277 -54882 -76168 -69962 -53997 -44341 -19343
7963 -19343 -26961 -35836 -21050 -27046 -7395 -5692 -23015 1409 12236 -47405 -63953 -34707 -39406
7950 -39406 -12102 -19604 -23427 -33284 -44838 -44679 9512 -5208 -7583 -13359 -47921 -21085 -23519
7937b3519J7322o392O362j003q865J9936j9417j8165p840o422l3927J3899K8489
7924c9542l3208J7235m202J0329K0197j7302J1333K0879n660j6959j7554j8504
7912g2958r933q2J2486M1357M09k753k7478o889M0140l128O262q260J3132K890
7898a4805j3545k9451N877Q172K1024j2865p257p567Q626K4281j4676R046P73
7885b2367N049K9323j4717l1708j5922O569r105l0542K3022J7219Q121j9695J0207
7872d4546M8880k1277k9127j0485Q65Q614n31L5681Q37l4590J5656N0207m3137
7859b2953J0143K3614l4579j9178M885o958K1540O522K8789k409j6014J3968n283
7846B087m3831J7038L1651l3298j5625q482L8795L281J2728R59k7961k2704j6120
$$ plain form
7937 -23519 -6197 -12589 -6227 -7230 -16095 3841 -15576 -33741 -41581 -48003 -81930 -68031 -39542
7924 -39542 -72750 -55515 -59717 -49388 -29191 -46493 -35160 -14281 -19941 -36900 -54454 -72958
7912 -72958 -82891 -82973 -70487 -29130 -28721 -31474 -58952 -65841 -25701 -28829 -22567 -30827 -17695 -14805
7898 -14805 -28350 -57801 -51924 -43752 -22728 -35593 -42850 -50417 -41791 -17510 -32186 -23140 -22367
7885 -22367 -17318 12005 -2712 -34420 -50342 -43773 -52878 -83420 -60398 -43179 -35058 -54753 -44546
7872 -44546 4334 -16943 -46070 -56555 -55690 -47076 -47607 -11926 -11089 -45679 -30023 20184 -22953
7859 -22953 -12810 10804 -23775 -42953 -38068 -45026 -23486 -16964 11825 9416 -6598 7370 2087
7846 2087 -41744 -24706 6945 -26353 -41978 -50460 -11665 -8384 4344 5303 -22658 -45362 -61482
7833f1482K6260J6791L5359l02m4506r674K0085N696J6148K630N38Q057n0368
7820c4768j0940P967j23j941L5883J2487o2730Q132L6593m988m38m4246K3683
7807c5429r1324M168Q5444m1424M0943J142L7946K1656m2096R722o564j2970j0979
7794c9765K1502k866k42J6594j4986J0482n569q737K2128q88l180J2974j4130
7781f683k9440J0248M0677j3731l4526K5283N801j4322j908j6022J9021K346K7690
7768A4434J0847l9136J2484j651j2694J2428M7732P245n1729J5859l9244N327
7756a8098j7261Q154L9974J8202j4152k1386o472m1734L567q711j350M5240j5895
7743b9922k8325J5119k847k768Q006J9193K0559L0610n4074n1148K5008J6728
$$ plain form
7833 -61482 -35222 -18431 16928 16626 -27880 -37554 -17469 -11773 4375 7005 7543 15600 -34768
7820 -34768 -45708 -37741 -37864 -39805 -3922 8565 -54165 -46033 -9440 -14428 -14866 -59112 -35429
7807 -35429 -126753 -122585 -37141 -78565 -37622 -36480 1466 23122 -18974 -9252 -15816 -28786 -39765
7794 -39765 -18263 -21129 -21371 -4777 -19763 -9281 -14850 -23587 -1459 -2347 -5527 7447 -6683
7781 -6683 -36123 -25875 14802 1071 -33455 -8172 -2371 -16693 -18601 -34623 -15602 -13256 14434
7768 14434 25281 -13855 -1371 -3022 -15716 -3288 44444 51689 -40 15819 -23425 -18098
7756 -18098 -35359 -27205 12769 30971 16819 -4567 -11039 -52773 -49206 -57917 -59267 -14027 -29922
7743 -29922 -58247 -43128 -45975 -48743 -40737 -21544 -985 29625 -24449 -75597 -50589 -33861
7731c3861N931n278K6983J3199l7054m638K8856j2385j0606k315k1959O488m584
7718e1223j242l276K7617p844p807L3015J6482J9079P999m3447k3598Q01k5072
7705e8516L0639K6202k226k1646n083J3655J6048p345R940l0293l7002J4204j4221
7692f5644N9605K6060o522k3288J1171j8374k8571L1561P334j8740M621K3288
7680B501L1340j9906l3527R196K2569j9012o340k749n875R403J8438q277n864
7667h103J7979l4571k369J5498l8532N113K9957L1502L2037n283j0869m0008j680
7654i329j121K6637N493j3482j7363j4876j021J0734l814l863p007K0937o156
7641a4231J893M975J303K2682k9260j8488J9923J7345k5524j0198n508L1925J729
$$ plain form
7731 -33861 -27930 -33208 -6225 6974 -30080 -34718 -5862 -18247 -28853 -31168 -53127 -46639 -51223
7718 -51223 -52465 -55741 -28124 -35968 -43775 -10760 5722 24801 32800 -10647 -34245 -33444 -58516
7705 -58516 -27877 -1675 -3901 -25547 -30630 -16975 -927 -8272 1668 -28625 -65627 -51423 -65644
7692 -65644 -6039 20021 13499 -9789 1382 -16992 -45563 -14002 -6668 -25408 -20787 2501
7680 2501 33841 13935 -19592 -10396 12173 -6839 -13179 -15928 -21803 -12400 6038 -2239 -8103
7667 -8103 9876 -24695 -27064 -11566 -50098 -44985 -15028 16474 48511 43228 32359 -7649 -9329
7654 -9329 -10450 16187 21680 8198 -9165 -24041 -25062 -14328 -18142 -22005 -29012 -8075 -14231
7641 -14231 -12338 -7363 -6060 16622 -12638 -31126 -11203 6142 -19382 -29580 -35088 -3163 -1434
7628a434l6320L3246L305O622m4172j795L1879n697K0942j3082j3373K819J1598
7615e462k9054j354M2039Q548k6552K1519J7918K965k6276O27j5879k1064k2834
7602e4859L0966J7716K2457J4628n084L368j0816k4902J9253J3536J753J2220
7590D0236j2645o683q939J4795j5475L281N121J7275l646Q601j5333o713k1110
7577a235q286J7760j9408j8837n631L77k0814J4135L2104j0066K8031p080k009
7564i59L0983J1816m3613J1990l341K960K1227K199L129r718o558J4293j9145
7551A5263j3585K4047k1353Q459K714k4575J8574j5122J16o632J305J4770r078
7538e097K1678J1786n495j3770Q296j031K6708J1155n0621n615J1581R97m8579
$$ plain form
7628 -1434 -37754 -4508 -1203 5419 -38753 -40548 -8669 -14366 6576 -6506 -19879 -17060 -5462
7615 -5462 -34516 -35870 6169 14717 -11835 9684 27602 30567 4291 4918 -10961 -32025 -54859
7602 -54859 -23893 -6177 16280 30908 25824 29192 18376 -6526 12727 26263 28016 40236
7590 40236 27591 20908 11969 26764 11289 14570 19691 36966 33320 41921 26588 19875 -1235
7577 -1235 -9521 8239 -11169 -30006 -35637 -35260 -56074 -41939 -9835 -19901 8130 1050 -959
7564 -959 30024 41840 -1773 10217 6876 9836 31063 33262 36391 26673 20115 34408 15263
7551 15263 1678 25725 4372 12831 15545 -9030 9544 -5578 -5462 -12094 -10789 3981 -5097
7538 -5097 16581 28367 22872 9102 17398 16367 43075 54230 3609 -2006 9575 10572 -38007
7525c8007P131J5162P209J4392J0227j0966L304l118k5674L4357q747M5315j4755
7512C5830k1304k6430N852J5494m7526J6785K7907j2349O907O362j7767j3013
7500b3252L0651j3499p602K8682K8225M916n9595k0796K0255m030r815J1822J5091
7487A053J0839K0149l202j3821J4095m5831l2828M4305Q021K2376j1859k4109
7475a0812j406K0036k9685J2833L2675J7336l8476j5661M156L7386k9235o43K5079
7462B3583j6181N1169J2827l2662o916j0155K014K2142k0285p469j1980j1614
7450e527J951Q792L2998q145n991q091m7294K2797J1622J2839k4409j5437K5534
7437A639Q806j3882k0690j0447M9582j2273J736k282j661m310J8043K2060J2533
$$ plain form
7525 -38007 -30876 -15714 -8505 5887 16114 5148 8452 5334 -20340 14017 5270 50585 35830
7512 35830 14526 -11904 -6052 9442 -38084 -21299 6608 -5741 1166 7528 -10239 -23252
7500 -23252 7399 -6100 -13702 14980 43205 48121 -11474 -32270 -12015 -16045 -25860 -14038 1053
7487 1053 11892 32041 28839 15018 29113 -16718 -49546 -5241 2780 25156 13297 -10812
7475 -10812 -12218 7818 -21867 -9034 23641 40977 2501 -13160 -9004 28382 -853 -1496 23583
7462 23583 7402 58571 71398 38736 31820 21665 23679 45821 25536 18067 6087 -5527
7450 -5527 -3576 5216 38214 30069 24078 15987 -31307 -8510 3112 15951 -8458 -23895 1639
7437 1639 10445 -3437 -24127 -34574 15008 2735 4471 2189 528 -3782 14261 36321 48854
7424D8854n101m4497l2365P155K7752K3958J9645k6403N792j9257k790K9196j6888
7411A5051M77m081j0697K5118J2179l8653L035K2380j0046l680J2361O625N811
7398C5880M215J9863J0963r960j5246j7419j8402n997K2801J2451k4681k0736
7386f268J2157O873m884j9256j8826K5056r336L7792j8505J2471q69j9859r722
7373a3176o49j2228K1693L1491o429K0061k2999K08j0391K428M183J0211r047
7360A5356r88P685l104k0875J260K5720l807j4441K1935k2431J5078J102j8323
7347D167K1930l617N569L2100l1416k4562K425O720l0933r331K4080Q206J0172
7334A5510O760o650k335L9764p894l9746J2303K0407j3987l861L530l697L7546
$$ plain form
7424 48854 43753 -744 -33109 -25954 1798 25756 45401 18998 24790 5533 2743 31939 15051
7411 15051 15528 11447 750 25868 38047 -606 2429 24809 14763 11083 23444 30069 35880
7398 35880 40095 59958 70921 60961 45715 28296 9894 3897 26698 39149 14468 -6268
7386 -6268 5889 12762 7878 -11378 -30204 -5148 -14484 23308 4803 17274 16405 -3454 -13176
7373 -13176 -13825 -26053 -4360 27131 20702 40763 17764 17972 7581 10009 14192 24403 15356
7360 15356 14368 22053 18949 -1926 -666 25054 21247 6806 28741 6310 21388 22490 4167
7347 4167 26097 22480 28049 60149 28733 4171 6596 13316 -17617 -26948 -2868 5338 15510
7334 15510 22270 15620 13285 53049 45155 5409 17712 38119 24132 20271 23801 20104 57650
7321E7650j8751M828l6675r587j1385K3803J364j5422N2401o086l3003j1196K5108
7308B3049L3019n241R04O862l3791J0532j1554j3733j40J5835p51J0483o886L493
7294C2081o598K0309j6928M75L364k2680o792L7051N625m059J1576j0617L0235
7281G3042p465p788K113j9401k4361M945k0117j421J92L1657K4450k1874K0341
7268E4313r904k8121n223k451M2706N493k5428j1788j2913k6818P107O3672M475
7255E5120o652l93k6950j8381N477P783J2546J589n60J9887O489l9746J8708K7533
7241F2450k6845J2645J7805m2718L242J8434K3417l8979n836M6676J3574l6934
7229D6931o649K9729J6163K717m5993J8067o527L3549J6417l2975O938j2568o456
$$ plain form
7321 57650 38899 43727 7052 -2535 -13920 9883 11247 -4175 48226 42140 9137 -2059 23049
7308 23049 56068 50827 51731 58593 24802 35334 23780 10047 9907 25742 24991 35474 28588 32081
7294 32081 25483 45792 28864 29339 32703 10023 3231 40282 45907 41848 53424 42807 73042
7281 73042 65577 57789 59902 40501 16140 21085 968 -453 -261 31396 55846 33972 54313
7268 54313 44409 16288 11065 8614 51320 56813 31385 19597 6684 -20134 -13027 50645 55120
7255 55120 48468 48075 21125 2744 8221 16004 28550 30139 29579 49466 55955 16209 34917 62450
7241 62450 35605 48250 66055 23337 26579 45013 68430 29451 23615 70291 83865 46931
7229 46931 40282 70011 86174 88891 42898 60965 54438 87987 104404 71429 78367 65799 59343
7216E9343M885k1871p188P461k8072J2938J4952j1535o548K7784J9489n275m95
7203F5868j4328k3346j5740Q438L0097K4104k4663j5619l0831k6889J9750L8723
7191C5564L4392j64J2571j046k2685J2312J7008Q137l8074J2011J1326q283L1196
7178A04265k8885k5653J4811M143j0793L218l867L625P408J4418K3789l6908L57
7165F9928k425j1003J1266k2194j829J1080j7907O011N518N981k1031J3073K1381
7152F7849R367m7073K3148K2300J4846k0371j0701J1742l421J2224k5123j9896
7140C4891J3007R103L853l969j3233K3011n469l3176N5J4214p107M1177K8946
7127A05303J7059o631j6551j2364k347J1471r833J9768n81n5406j3765K2736J5364
$$ plain form
7216 59343 64228 42357 35169 42630 14558 27496 42448 30913 24365 52149 71638 66363 65868
7203 65868 51540 28194 12454 20892 50989 75093 50430 34811 3980 -22909 -3159 35564
7191 35564 69956 69792 82363 81317 58632 70944 87952 96089 58015 70026 81352 73069 104265
7178 104265 75380 49727 64538 68681 57888 61106 57239 60864 68272 82690 106479 69571 69928
7165 69928 67503 56500 67766 45572 43743 54823 36916 42927 48445 54426 33395 46468 67849
7152 67849 77216 30143 53291 75591 90437 70066 59365 71107 67686 79910 54787 34891
7140 34891 47898 57001 60854 56885 43652 66663 61194 28018 28073 42287 35180 76357 105303
7127 105303 122362 115731 99180 86816 84469 95940 86107 105875 105294 49888 36123 58859 74223
7114G4223j006J8636j0641r071j9275j305K6282L8316k6324j0339o009J5690j6504
7101G2673j0953K7356R862l2987j379M995J8509N819J1386j9647l293j4193j4170
7088E3978L1877p555Q489J4492J067K2253n824j5241j2916J4409n172j7637j9783
7075F2437N685n669M8881J2269j5700k235K295R288m0313N2718m524j789l2635
7062I0708L0990J0137J4014k150j0136j7855p408k679j9512R631M2018k6547k6002
7049H5209J6876m86J480M4565J807L291j0977j4191j522k5367k0297k7081J6094
7036F9401K5736J6960q352K4528J0009r707j1279k4978J6522K380l1120j0260
7024F9840r594K0254J1458L1796q583k3184Q585Q103L6199o955k3829j0993J0459
$$ plain form
7114 74223 73217 91853 81212 72141 52866 51561 77843 116159 89835 79496 73487 89177 72673
7101 72673 61720 89076 98938 65951 64572 69567 88076 93895 105281 85634 82341 68148 53978
7088 53978 85855 78300 86789 101281 102348 124601 118777 103536 90620 105029 99857 82220 62437
7075 62437 68122 62453 111334 123603 107903 105668 107963 117251 76938 129656 125132 123343 90708
7062 90708 121698 131835 145849 143699 133563 115708 108300 105621 86109 95740 137758 111211 85209
7049 85209 102085 101599 103079 147644 149451 152742 141765 127574 126052 100685 80388 53307 69401
7036 69401 95137 112097 103745 128273 138282 128575 117296 92318 108840 111220 80100 69840
7024 69840 60246 80500 91958 123754 115171 91987 100572 108675 144874 137919 114090 103097 113556
7011A13556j2063P036k4609r482j48J4061J2298K2589O9373k6154m3847Q962k843
6998A28729r185J0874J380k2477J550K6186K7236O443j8764Q920r876j1472r332
6985A30212J8008K6063j2861k5096N455q395p256K0849k3068L146J6264p297m34
6972A35590j2324j5868J1223P919R613K1266j5494j5568J186L0782m4997L202
6960A16530L7550j0094l5703j8615K6311R74l803K71N562k2840J4489K0105j0892
6947A19845M4903J2055l6950N419n692r04L1840m4118j3617R544J622K2847P714
6934A54508K1031k4921N27o878J519K3696L890J8291k7160j6534K0347N155o258
6921A67213Q245J838m109q411k3744J1598k9328k0786M4452J5367k2623L5770
$$ plain form
7011 113556 101493 108529 83920 74438 74290 88351 100649 123238 192611 166457 122610 131572 128729
6998 128729 119544 130418 131798 109321 110871 137057 164293 170736 151972 160892 151016 139544 130212
6985 130212 148220 174283 161422 136326 141781 133386 126130 146979 123911 127057 143321 136024 135590
6972 135590 123266 107398 118621 126540 136153 157419 141925 126357 127543 158325 113328 116530
6960 116530 154080 143986 108283 89668 115979 116953 113150 113421 118983 96143 110632 130737 119845
6947 119845 164748 176803 139853 145272 139580 138676 170516 126398 112781 122325 123947 146794 154508
6934 154508 175539 150618 151145 144267 145786 169482 173372 191663 164503 147969 168316 173471 167213
6921 167213 175458 177296 173187 164776 141032 152630 123302 102516 146968 162335 139712 175482
6909A75482K0480k8290k3961k2477M4680L7716j2429k8472J214k8373J8155j258
6897A52467L5656L374l0832N26L0013m7350k0539L3140P052L8529j5281k978J3360
6884A97137o673K728J5571k6520n495R500r639R841J1156k8548K5628j1170J1512
6871A95028J193l3858j8388K9874J0976j9273L3533n47n0504J8030L1743r022
6859A88785k7760J7244J7820j2305j5969J4401K5818l0986l3688N3475k4832J7523
6847A89526n031L066K7997l2130L7698j6346j8056L6840L9825j3913l4230j6425
6835A98821L6573R905j9903l8161J9516J7244J2079j7754k4360M1280J0867k1929
6823B24178j6392M111K8458j155N275j0641J2175j729j8899K5050l2215l5757
$$ plain form
6909 175482 195962 167672 143711 121234 165914 203630 191201 162729 163943 135570 153725 152467
6897 152467 188123 191497 160665 161191 191204 143854 123315 156455 163507 202036 186755 183777 197137
6884 197137 190464 193192 208763 182243 176748 186248 176609 186450 197606 169058 194686 183516 195028
6871 195028 196221 162363 143975 173849 184825 165552 199085 198538 148034 166064 197807 188785
6859 188785 161025 178269 196089 183784 167815 182216 208034 177048 143360 196835 172003 189526
6847 189526 184495 187561 215558 183428 221126 204780 186724 223564 263389 249476 215246 198821
6835 198821 235394 245299 225396 187235 206751 223995 236074 218320 193960 235240 246107 224178
6823 224178 207786 211897 240355 239200 244475 233834 246009 244280 225381 250431 218216 182459
6811A82459K3665m120j5098M5544j2406r349J0466m700j715M621J4649J1367J6228
6798B61611l989k0744L974J5116m453k2930n291J7798p907J0557L319m857J2138
6785B54342J188j3445j4934p447j585K2062k1613k3231M5186K3496m430O786o1827
6772B04548p285M5936n582O588K6195k101k6010M532j8409L6603L0801J7637o879
6759C06574O574K5736k1858k3154k0169j2005J9732O087j0915J0490k467n010
6747B79615K5276J4017j7946k3218j017K7775k630O234K5903k4407k0662J3841
6735C02781j5387J748J9362K1829J5299r244k4735k5093L2810L3839j2190j5318
6723C25701J7948k7715n689j239j6834J3307K2345r380M045L2592J3400R026j6091
$$ plain form
6811 182459 206124 202004 186906 232450 220044 210695 221161 216461 214746 219367 234016 245383 261611
6798 261611 257622 236878 240852 255968 251515 228585 223294 241092 233185 243742 247061 242204 254342
6785 254342 255530 242085 227151 219704 218119 240181 218568 195337 240523 264019 259589 266375 204548
6772 204548 197263 243199 237617 244205 270400 268299 242289 246821 228412 265015 295816 313453 306574
6759 306574 313148 338884 317026 293872 273703 261698 281430 287517 276602 287092 284625 279615
6747 279615 304891 318908 300962 277744 276727 304502 301872 308106 334009 309602 288940 302781
6735 302781 287394 289142 308504 330333 345632 336388 311653 286560 319370 353209 341019 325701
6723 325701 343649 315934 310245 309006 292172 305479 327824 318444 322489 355081 368481 377507 361416
6710C61416K9088m4191K901J731j5079R89K9858K6848L507P187j9049R7o33j50
6696C84520o3K0198q904o30j2938N2727J6056l9739k275j785l621k4272K3290
6683D02564J9226j2021J0954P976j4939K125M212j8493K3268K7782j6166P632
6671D44120k2584J3133K2020l360l0523K5328K1100J321n198J204p723p840J5797
6658D66795o918J2337L320K975J5523j4262K4654n787j1308N33K106L5921M4273
6645E70162k1763k2550M9461j1861p044N613M65j6460Q630J8016j5007r657L8990
6632E86995L324j1647J0539P956J5095J2408K649L2002K1292J3359o122L3875
6620G21725J7604M187R498K2839K3559O8959Q338J6127M5248N4465K2317N5497
$$ plain form
6710 361416 390504 346313 349214 350945 335866 336855 366713 393561 397068 404255 385206 385303 384670 384520
6696 384520 384457 404655 395751 395121 382183 434910 450966 411227 408952 407167 403546 379274 402564
6683 402564 421790 409769 420723 428699 413760 415885 420097 401604 424872 452654 436488 444120
6671 444120 421536 434669 456689 453329 422806 448134 469234 470555 465357 466561 458838 450998 466795
6658 466795 459877 472214 475534 478509 494032 479770 504424 498637 487329 487862 489968 525889 570162
6645 570162 548399 525849 575310 563449 556405 562018 562483 546023 554653 572669 557662 548005 586995
6632 586995 590319 578672 589211 597167 612262 624670 627319 659321 680613 693972 687850 721725
6620 721725 739329 743516 753014 775853 799412 868371 876709 892836 938084 992549 1014866 1070363
6608A070363M8146l0785K0290Q307K642j1537R240n4028j1347M9363N403K2051
6596A128108K6537M000L1209J0556Q761N6006k2097K0414o374k6489o219p19M2818
6583A266511O524j8895l7083j1976k4493j0518k2848J4567J6189J337j0106R300
6571A178509L216Q412L6852J1265p061l9936k6879o1783j3476j4230n3174l5069
6559I86646j2948j4305p1461k0645J8859K5351n949l8432j22R637L702k8643l2666
6546H19024L4697J1544K208j4845j5209M291K0581J3037p474o341K607j1552O921
6533H59489K8502j6882J836J7300M241j0421K3927K1473l6057l30j7313K219J1669
6520H89653J3284j312l3186n368L3092K0108M2773K825l4814n03p478L9919K2788
$$ plain form
6608 1070363 1118509 1087724 1108014 1116321 1118963 1107426 1116666 1062638 1051291 1100654 1106057 1128108
6596 1128108 1154645 1158645 1189854 1200410 1209171 1265177 1243080 1263494 1257120 1230631 1224412 1223693 1266511
6583 1266511 1273035 1254140 1217057 1205081 1180588 1170070 1147222 1161789 1177978 1179315 1169209 1178509
6571 1178509 1181725 1190137 1226989 1238254 1231193 1191257 1164378 1102595 1089119 1074889 1021715 986646
6559 986646 973698 959393 887932 867287 886146 911497 905548 867116 866994 876631 880333 851690 819024
6546 819024 853721 865265 867473 852628 837419 841710 862291 875328 867854 861513 864120 852568 859489
6533 859489 887991 871109 872945 890245 894486 884065 907992 929465 893408 893078 875765 877984 889653
6520 889653 902937 901625 868439 863071 896163 916271 959044 961869 927055 926552 919074 958993 981781
6507I81781r783k9382o486K6896k7803N1792o873K296Q423R252J9509k5693M4233
6494A038162R306j1192l6659k248K2406K8347R444j2795n143P115K4345J3209
6482A084297j7833L6641j4878k727K0559q677O0342P438j2187L2574J1980k3436
6470A174093K6087P839K7873K5216L203K0210J0488Q936K2858K0990k202q428
6458A337163j1126j2718K0372N1929r07K665L6077j1057K1367L3381p175K8272
6446A488243R506J8906L5507K8072j8498j6708L5783q921j2751L2692l659K5079
6434A613251j2091K3783M2543L36j6275K3546J7017J2181M3917K1769K9500R792
6422A809269K3539K9283k5494N234O1366q18L998M0541j5997M0171J658Q959M3417
$$ plain form
6507 981781 971998 942616 936130 963026 935223 987015 980142 982438 990861 1000113 1019622 993929 1038162
6494 1038162 1047468 1036276 999617 997369 1019775 1048122 1057566 1044771 1039628 1046743 1071088 1084297
6482 1084297 1066464 1103105 1088227 1085500 1106059 1097382 1157724 1165162 1152975 1185549 1197529 1174093
6470 1174093 1200180 1208019 1235892 1261108 1264311 1284521 1295009 1303945 1326803 1347793 1345591 1337163
6458 1337163 1326037 1313319 1333691 1385620 1384713 1387378 1423455 1412398 1433765 1467146 1459971 1488243
6446 1488243 1497749 1516655 1552162 1580234 1561736 1545028 1580811 1571890 1559139 1591831 1588172 1613251
6434 1613251 1601160 1624943 1667486 1667822 1651547 1675093 1692110 1704291 1748208 1769977 1799477 1809269
6422 1809269 1832808 1862091 1836597 1841831 1903197 1902379 1906377 1946918 1930921 1971092 1972750 1981709 2025126
6409B025126M3186K1066J6871J1989K8201M3828n321k83N1738O0981k6925J5681
6397B286138L3095J3441L6611K4715J9024K8756L3511J4729K1432J8881J0861
6386B541194K7583J9981J6942K2290j7110M6994M5037J2346L557L2716J0735j2107
6374B750158M7464N3058M4509K7010N2632L1310O6398N9885M6452M2900L7637
6363C259413L8310O6351Q1247N7419P2370M5083N9847O8762N5464Q0877O3475
6352C948618J14064L4874N5783R2153J19647J11836Q5013Q0199N8786N1599J06898
6341D859470Q8303K3848O2355J6633Q9290R7908R8220J11464J30812J67623J18626
6330E864552J35684J59238K01803J72323K11171K08202K32447J83143K04195K63259
$$ plain form
6409 2025126 2068312 2089378 2106249 2118238 2146439 2190267 2184946 2184663 2236401 2297382 2270457 2286138
6397 2286138 2319233 2332674 2369285 2394000 2413024 2441780 2475291 2490020 2511452 2530333 2541194
6386 2541194 2568777 2588758 2605700 2627990 2610880 2657874 2702911 2715257 2718814 2751530 2762265 2750158
6374 2750158 2797622 2850680 2895189 2922199 2974831 3006141 3072539 3132424 3178876 3221776 3259413
6363 3259413 3297723 3364074 3445321 3502740 3575110 3620193 3680040 3748802 3804266 3885143 3948618
6352 3948618 4062682 4097556 4153339 4245492 4365139 4476975 4561988 4642187 4700973 4752572 4859470
6341 4859470 4947773 4971621 5033976 5050609 5139899 5237807 5336027 5447491 5578303 5745926 5864552
6330 5864552 6000236 6159474 6361277 6533600 6744771 6952973 7185420 7368563 7572758 7836017
6320G836017K42306K26960K53790L13656L22214K68006K43626K15365K34715K13012
6310A0369667K15711L02475L43052L82628L89642L99818M44923M57967M72838
6301A3778721N27275N41613O18162O78595P48890P79914Q21576Q68361R46638
6292B0309745J037646J156536J404528J634036J962310K161653K322417K557648
6284C4546519K782422K724876K477391K550374L020411L535774M133725M768273
6276F0539765N648272O696959P121030P381940P685090O047354J816412j010126
6268A01926696o45995L93375M28636q23391j742804q36462N80573K085112L544402
6259A04910142L696166J965352J382291K869637M242952M288964L112805J664174
$$ plain form
6320 7836017 8078323 8305283 8559073 8872729 9194943 9462949 9706575 9921940 10156655 10369667
6310 10369667 10585378 10887853 11230905 11613533 12003175 12402993 12847916 13305883 13778721
6301 13778721 14305996 14847609 15465771 16144366 16893256 17673170 18494746 19363107 20309745
6292 20309745 21347391 22503927 23908455 25542491 27504801 29666454 31988871 34546519
6284 34546519 37328941 40053817 42531208 45081582 48101993 51637767 55771492 60539765
6276 60539765 66188037 72884996 80006026 87387966 95073056 101120410 102936822 101926696
6268 101926696 101280701 101674076 102102712 101279321 99536517 98700055 99280628 101365740 104910142
6259 104910142 108606308 110571660 111953951 114823588 119066540 123355504 126468309 128132483
6251A28132483J07988j865969k848779k205434j058521r09653j799313k025661
6243A15527141j302801j868561l825654l875645k233511p76114l13429o26210
6235A00705216j94687J107727K253939K997618J467799l061360o268109o155041
6227I2853102n286113n708089p639648r168808q471210o706284n229246m206908
6219D0436796l463556k852523k369852j994851j757862j493135j339521j199358
6211B3966138j113310j009115r05818q97105q50678p41121o84716n84351m97066
6202A6682858m84665m24258m35146l81930m65046n32377n04495m22753m20712
6193A2611476m18670m45478m58003m17380l72056l25993k91592k95559k77265
$$ plain form
6251 128132483 128240471 126374502 123525723 121320289 120261768 119352115 117552802 115527141
6243 115527141 114224340 112355779 108530125 104654480 102420969 101644855 101331426 100705216
6235 100705216 100510529 101618256 103872195 106869813 108337612 105276252 99008143 92853102
6227 92853102 87566989 81858900 74219252 65050444 56579234 49872950 44643704 40436796
6219 40436796 36973240 34120717 31750865 29756014 27998152 26505017 25165496 23966138
6211 23966138 22852828 21843713 20937895 20040790 19190112 18448991 17764275 17179924 16682858
6202 16682858 16198193 15773935 15338789 14956859 14491813 13959436 13454941 13032188 12611476
6193 12611476 12192806 11747328 11289325 10871945 10499889 10173896 9882304 9586745 9309480
6184I309480k76756k63077j59234j79758k10350j96213j26091j69073j40443j31882
6174G456603l5182p3030j5134J994l883k570N1150M9776l2416j77596j91001j96041
6162F832670j46015j51865k45235k58791j60541j40051j46487j07294r6408p1073
6152E308910q6200o0484n7612l2612n6303k2506o5428l1082o9145q8584m2546
6141D696408n0868o2417r1248k8824n6584o3640q822l1855q3529o4913p0181r0055
6129C993472q5511j31454r6427r1870n8799r5384o2138o3246m7303o9997o1888
6118C129455o7343m1609k8388o9185r6166m5481j1521j6006j6978k1211j3160
6107B702407m6337n9963l2172j0146j9058k1888l8781K0916l3259n8956O592J826
$$ plain form
6184 9309480 9032724 8769647 8610413 8430655 8220305 8024092 7898001 7728928 7588485 7456603
6174 7456603 7421421 7348391 7333257 7335251 7331368 7328798 7379948 7429724 7397308 7219712 7028711 6832670
6162 6832670 6686655 6534790 6289555 6030764 5870223 5730172 5583685 5476391 5379983 5308910
6152 5308910 5222710 5162226 5104614 5072002 5015699 4993193 4927765 4896683 4827538 4738954 4696408
6141 4696408 4645540 4583123 4491875 4463051 4406467 4342827 4334005 4302150 4218621 4153708 4083527 3993472
6129 3993472 3907961 3776507 3680080 3588210 3529411 3434027 3371889 3308643 3261340 3191343 3129455
6118 3129455 3062112 3020503 2992115 2922930 2826764 2781283 2769762 2753756 2736778 2715567 2702407
6107 2702407 2656070 2596107 2563935 2553789 2534731 2512843 2474062 2494978 2461719 2402763 2409355 2411181
6095B411181j3699m6532j8978k0771m6600k2011k7651n54k7037P429l568l2574
6083B158635j8571l044m56m673j6122n437J0082j3897J1931j9300p254J9078p58
6070B110214j1294K1786M7149K2945O6215J4765N9045j2376k3930L1084L301J6547
6058B345451O210k316j713l098m6359j6544L1346J2467j0978l2461J6596J0016
6046B308617N6N770J0433J3314J2633J0262m912k919j7402N154k3975L441l9483
6033B280989j8215K2167p592m2612q27j5572J6499l9619j2505M245p616j8682
6021B160660j2048m490J378l2929m0595j458j1727j7740Q259m646o3405j8973
6009A962286l009l9518j8172l7085N97o90k9510m7445j9196p992R401J1642n1272
$$ plain form
6095 2411181 2397482 2350950 2331972 2311201 2264601 2242590 2214939 2214385 2187348 2194777 2191209 2158635
6083 2158635 2140064 2137020 2136564 2131891 2115769 2110332 2120414 2106517 2118448 2099148 2091894 2110972 2110214
6070 2110214 2098920 2120706 2167855 2190800 2257015 2271780 2330825 2318449 2294519 2325603 2328904 2345451
6058 2345451 2351661 2349345 2347632 2344534 2298175 2281631 2312977 2325444 2314466 2282005 2298601 2308617
6046 2308617 2308673 2314443 2324876 2338190 2350823 2361085 2356173 2353254 2335852 2341006 2317031 2320472 2280989
6033 2280989 2262774 2284941 2277349 2234737 2233910 2218338 2234837 2195218 2182713 2186958 2179342 2160660
6021 2160660 2148612 2144122 2145500 2112571 2071976 2070518 2058791 2041051 2049310 2044664 1981259 1962286
6009 1962286 1959277 1919759 1901587 1864502 1865099 1864409 1834899 1787454 1768258 1760266 1769667 1781309 1730037
5996A730037K3866K7479j03Q304j6152k6191M0200j0102L8467J7889k0756J2547
5984A825485M2898J441k116K1263P501m444l1348m4463r270K0388J435j9865Q241
5971A817146j1711k223K1026J5125M0055n38L5809L2676K8530J4191L3339L9157
5959B062582j7379Q161l9710m0643K0953L8742m430J8755j4196j0154P455L2246
5947B062382M0338k9055J7009L9237L4451O0848M5287M6538K1989J0192Q533L4938
5935B392687K1463J8388K4015k719L6422L5130K5249L7001L5048k824J0775p49
5923B629886j2832J7020m386M9586M3640J9833L7312K8334J5119K7324M0616K6272
5911B917724K9268R257j6978Q335j0146m9633J7638K1674j866q219J1977K9761
$$ plain form
5996 1730037 1753903 1781382 1781279 1789583 1773431 1747240 1787440 1777338 1815805 1833694 1812938 1825485
5984 1825485 1868383 1869824 1867708 1888971 1896472 1892028 1860680 1816217 1806947 1827335 1828770 1808905 1817146
5971 1817146 1805435 1803212 1824238 1839363 1879418 1878880 1914689 1947365 1975895 1990086 2023425 2062582
5959 2062582 2045203 2053364 2013654 1973011 1993964 2032706 2028276 2047031 2032835 2022681 2030136 2062382
5947 2062382 2102720 2073665 2090674 2129911 2164362 2225210 2270497 2317035 2339024 2349216 2357749 2392687
5935 2392687 2414150 2432538 2456553 2453834 2490256 2525386 2550635 2587636 2622684 2619860 2630635 2629886
5923 2629886 2617054 2634074 2629688 2679274 2722914 2742747 2780059 2808393 2823512 2850836 2891452 2917724
5911 2917724 2946992 2956249 2939271 2947606 2937460 2887827 2905465 2927139 2925273 2917054 2929031 2958792
5899B958792J0062Q174Q069J9746K8733J0325L4224p74k2815L3347M8013j4258
5887C121638k3615j2199K4836k2808n9592r097o4526q925p430J3007J447R553
5875B962289K0420l0702N952L4372J4980M799L0177K9253J9499J9221J4305J6577
5863C141142L1005J9755M3952L3179J889J6681K7376Q225K0833L8189K1261K6966
5851C430453Q168K9991L7891q635J361N590L6439L5600P0003L6789L9672M0993
5839C764315M5584L7674R754O8470P1457P7741P6914O5718Q1102Q6477N5772R2553
5827D533531O9714K7585M102P8106Q3408N1717N1517J6501Q1481O6935Q0237Q9724
5815E234558Q1521Q2879P3326L8481O8855P3468J09684J18469Q7843R7595J30597
$$ plain form
5899 2958792 2968854 2977028 2985097 3004843 3033576 3043901 3078125 3077351 3054536 3087883 3135896 3121638
5887 3121638 3098023 3085824 3110660 3087852 3028260 3019163 2954637 2945712 2938282 2951289 2952736 2962289
5875 2962289 2982709 2952007 2957959 2992331 3007311 3012110 3042287 3071540 3091039 3110260 3124565 3141142
5863 3141142 3172147 3191902 3235854 3269033 3270922 3287603 3314979 3323204 3344037 3382226 3403487 3430453
5851 3430453 3438621 3468612 3506503 3497868 3499229 3504819 3541258 3576858 3646861 3683650 3723322 3764315
5839 3764315 3809899 3847573 3857327 3925797 3997254 4074995 4151909 4217627 4298729 4385206 4440978 4533531
5827 4533531 4603245 4630830 4634932 4713038 4796446 4848163 4899680 4916181 4997662 5064597 5144834 5234558
5815 5234558 5316079 5398958 5472284 5510765 5579620 5653088 5762772 5881241 5969084 6066679 6197276
5804F197276Q9933J47795J40641J50669J84091J77652J37721J54972J99261J92615
5794G772626K14896K27230K19235K40365K53467K64048L21236K77074L16446K45936
5784A0352559K27221K25926K16128K73072K95089L64827L49553L68189L58078
5775A3030642L89158L84945L75702M36397M43902M85330M97126O08461O52577
5766A7304240P11498O79651P08959Q07392R03094R42791J073063J263224J415697
5757B5809609J565420J766945J990730K195109K430626K646872K951918L386323
5749D4743552L885744M701331N536526O484335P195495P470468P608524P142753
5741I4768728M924552J843751Q86811J645115K221780J749857R05323J216998
$$ plain form
5804 6197276 6287209 6435004 6575645 6726314 6910405 7088057 7225778 7380750 7580011 7772626
5794 7772626 7987522 8214752 8433987 8674352 8927819 9191867 9513103 9790177 10106623 10352559
5784 10352559 10579780 10805706 11021834 11294906 11589995 11954822 12304375 12672564 13030642
5775 13030642 13419800 13804745 14180447 14616844 15060746 15546076 16043202 16651663 17304240
5766 17304240 18015738 18695389 19404348 20211740 21114834 22057625 23130688 24393912 25809609
5757 25809609 27375029 29141974 31132704 33327813 35758439 38405311 41357229 44743552
5749 44743552 48629296 53330627 58867153 65351488 72546983 80017451 87625975 94768728
5741 94768728 99693280 101537031 102423842 104068957 106290737 108040594 108945917 110162915
5733A10162915K180289K036762J379545Q77804J79812K99007J069963J721353
5725A19907450K324243K619332L183028L960594L163205P99743n28850J86577
5717A35615322J246775P52626q33856j398289j750695k987284l686850l339239
5709A23618510k296262j504101j527428j350873n88856k76643m4000J23097j228511
5700A14924933l365433m101422l672241l251837l584076m256534l939594l171007
5692H5582789l395998m196606m135759l439719l465565m145428m549095m208268
5684E4046351l494491k968523k626354k213983j710422j323170j085460r81967
5676C7641981q39104o61135m67463l02252j97694L220K14112M38820Q36948J266553
$$ plain form
5733 110162915 112343204 114379966 115759511 116637315 116817127 117116134 118186097 119907450
5725 119907450 122231693 124851025 128034053 131994647 135157852 135957595 135428745 135615322
5717 135615322 136862097 137614723 136780867 135382578 133631883 130644599 126957749 123618510
5709 123618510 121322248 119818147 118290719 116939846 116350990 116074347 116030347 116153444 114924933
5700 114924933 111559500 107458078 103785837 100534000 96949924 92693390 88753796 85582789
5692 85582789 82186791 77990185 73854426 70414707 66949142 62803714 58254619 54046351
5684 54046351 50551860 47583337 44956983 42743000 41032578 39709408 38623948 37641981
5676 37641981 36802877 36141742 35674279 35372027 35174333 35177553 35391665 35830485 36667433 37933986
5666C7933986J552022J724317J839659J602325R50195J09880m85186o36607n69222
5657D4021369p23520r41283j023093p93969l03496K12098M77769O34483R09636
5648D2469994J338433J921593K413615K757522L003992L102150K582346J407702
5640F0997347O69790M6315m60993p37387j100306j801951k450163k220920j367133
5631E1574599o76187n81693o89730m08535K51080P97296J296707J586712J578269
5622E4728518J655475J870762K038086J885256O87749j236968k475886k734590
5614E6418402k555915k788186l353915l477492l036980k234049j468282q99927
5606C6603656o52490o68863p92770n54021l67998m84723o73437o61269m23250
$$ plain form
5666 37933986 39486008 41210325 43049984 44652309 45602504 45712384 45227198 44590591 44021369
5657 44021369 43297849 42356566 41333473 40539504 40236008 40448106 40925875 41560358 42469994
5648 42469994 43808427 45730020 48143635 50901157 53905149 57007299 59589645 60997347
5640 60997347 61667137 61713452 61252459 60515072 59414766 57612815 55162652 52941732 51574599
5631 51574599 50898412 50316719 49626989 49218454 49469534 50266830 51563537 53150249 54728518
5622 54728518 56383993 58254755 60292841 62178097 62865846 61628878 59152992 56418402
5614 56418402 53862487 51074301 47720386 44242894 41205914 38971865 37503583 36603656
5606 36603656 35951166 35282303 34489533 33935512 33567514 33082791 32409354 31748085 31324835
5597C1324835k07000l46254q53614r11537o06470o47229j028964j425979j371021
5588B3926767j109888j035559j063059r97463p80898n77936l91893k54613j98546
5579A7516912l2263Q939P1026J58673K07169J7166r9392j9471M5968p223k27664
5568A7639840n33478n92215n20592n82912p05556q13022p49896n91970n92406
5559A1957793n40039l66324l07927k11953j78444j90248j37150j41429j15637
5550I768642q0751r1320m5692J3109N3758Q9215J39445J46281J52298J39839M1609
5539A0326433n9663j7842n7269j68267k54839k89078k47464j91769k05410k01916
5529H632916j55289j70342j41645j60136j68771q3008p3523o9273n0582n7074
$$ plain form
5597 31324835 31117835 30771581 29917967 29006430 28399960 27752731 26723767 25297788 23926767
5588 23926767 22816879 21781320 20718261 19720798 18939900 18361964 17970071 17715458 17516912
5579 17516912 17484649 17493588 17564614 17723287 17930456 17947622 17848230 17828759 17874727 17867504 17639840
5568 17639840 17106362 16514147 15993555 15410643 14705087 13892065 13142169 12550199 11957793
5559 11957793 11417754 11051430 10743503 10531550 10353106 10162858 10025708 9884279 9768642
5550 9768642 9687891 9596571 9550879 9563988 9617746 9706961 9846406 9992687 10144985 10284824 10326433
5539 10326433 10266770 10248928 10191659 10023392 9768553 9479475 9232011 9040242 8834832 8632916
5529 8632916 8477627 8307285 8165640 8005504 7836733 7753725 7680202 7610929 7560347 7503273
5519G503273q5218j7531R229N268j5481n1210j21920j35664j16069j31393j58354
5508F684930j57086k28811j82331j27963j09279q7954r6511o8516q6246q1199
5498E459034o1211j9442l3249n2447l6755l9693q6299k9088j0475n1438l0988
5487E007949n0849l9177l0181n6068q3711k5067m0652n3157n5752p6019k5035
5476D472281k603j8379l0570l8426N634J9635K3846l5686J3605J0899J5511J5542
5464D451289k0030J4809O9852O3631M2242J3719J5542P337O4905N5996N5430K5550
5452D860272K5670J40634P9280R465R1739J13331P4469Q4806P4819R1068Q6876
5441E732429P2838O0470P5926Q6959J00484R3781J25929J19904J47927K41272
$$ plain form
5519 7503273 7418055 7400524 7409753 7415021 7399540 7348330 7226410 7090746 6974677 6843284 6684930
5508 6684930 6527844 6299033 6116702 5988739 5879460 5791506 5694995 5626479 5540233 5459034
5498 5459034 5397823 5378381 5345132 5292685 5255930 5216237 5129938 5100850 5090375 5038937 5007949
5487 5007949 4957100 4917923 4887742 4831674 4747963 4722896 4682244 4629087 4573335 4497316 4472281
5476 4472281 4469678 4451299 4420729 4382303 4387937 4407572 4431418 4395732 4409337 4420236 4435747 4451289
5464 4451289 4431259 4446068 4515920 4579551 4621793 4635512 4651054 4658391 4723296 4779292 4834722 4860272
5452 4860272 4885942 5026576 5105856 5115321 5207060 5320391 5394860 5479666 5554485 5645553 5732429
5441 5732429 5805267 5865737 5941663 6028622 6129106 6222887 6348816 6468720 6616647 6857919
5431F857919J93488J72979K27219K84114K86452K75389K58381K87235L72009L32789
5421I547974L90158M02613N12052N29373N97200O41575O75827P62781Q50049J002844
5411A5912446J082925J192488J345433J465700J647468J840134J996646K146280
5403B8629520K297216K357405K304745K144256J839678J356035P31004J25871
5395D1785730l06887o17388q37703r87603j025758q05515m94231n7560M28683
5386C7081768Q11662J210207J504234J795253J966993J919875J742873J599166
5378D9632031J373976J074263O60654n662o50749j291826j749670k102339k273490
5369D4667188k335701k364757k188479j961342j562040j211690q39123m42462
$$ plain form
5431 6857919 7051407 7224386 7451605 7735719 8022171 8297560 8555941 8843176 9215185 9547974
5421 9547974 9938132 10340745 10852797 11382170 11979370 12620945 13296772 14059553 14909602 15912446
5411 15912446 16995371 18187859 19533292 20998992 22646460 24486594 26483240 28629520
5403 28629520 30926736 33284141 35588886 37733142 39572820 40928855 41659859 41785730
5395 41785730 41478843 40861455 40023752 39036149 38010391 37204876 36710645 36653085 37081768
5386 37081768 37893430 39103637 40607871 42403124 44370117 46289992 48032865 49632031
5378 49632031 51006007 52080270 52740924 52735262 52084513 50792687 49043017 46940678 44667188
5369 44667188 42331487 39966730 37778251 35816909 34254869 33043179 32204056 31761594
5361C1761594j54565Q5548L00706M08846M10277L35443K05889r0313n33860r67597
5351C1761968j342615j538404j740467j859149j849643j879400j742784j518253
5343A8291253j282980j126100r34130q14149p08001o72251n55633m77362m73966
5334A1246681m05546l74636m11260l66543l08551l16115l01108k37910k21936
5325H303076k64942k29361k41355k07170j78919j54259j36483j38366j59055j00736
5315F492430j07920q9064r2701q2632n6519p6824k1283l4971l2133k0987q1862
5304E795534m5914N502J7547k676K6259Q9640M3402Q8240J01811K8290l4835n6066
5292F056734m7262m6163o4427j18749j09396j26046q7416l2896K281Q447J7361
$$ plain form
5361 31761594 31607029 31692577 31993283 32402129 32812406 33147849 33353738 33263425 32729565 31761968
5351 31761968 30419353 28880949 27140482 25281333 23431690 21552290 19809506 18291253
5343 18291253 17008273 15882173 14948043 14133894 13425893 12753642 12198009 11720647 11246681
5334 11246681 10841135 10466499 10055239 9688696 9380145 9064030 8762922 8525012 8303076
5325 8303076 8038134 7808773 7567418 7360248 7181329 7027070 6890587 6752221 6593166 6492430
5315 6492430 6384510 6295446 6202745 6120113 6063594 5986770 5965487 5930516 5898383 5877396 5795534
5304 5795534 5749620 5755122 5772669 5769993 5796252 5885892 5929294 6017534 6119345 6147635 6112800 6056734
5292 6056734 6009472 5963309 5898882 5780133 5670737 5544691 5457275 5424379 5426660 5435107 5452468
5281E452468j1987M6537K5693R0650J22955J37767J19497O1655Q6724J22701J21336
5270F375996J71302J96356L33837L33295L71856L74893L41890K52713Q5715q1338
5260H756515j83788j80139j97713l28171l78784m72895l87650k83607k54051j88837
5250E900880j49541j12594r8007j06755l3401O2948M4657O2435J03673J11771
5240E786066J01058J69168K27000K56341K97236L31388L99459M02656M24869L66841
5230H762082J34269m8377q7311j08772j51300k42515m01576m39236l87312l27282
5220F702670k03661k21018k47790k06351j29399p8479n9569m9824j8853K2864
5210E510590P99N4973J4318O5800N7469R6336O8684R1771R6625J36058J18587
$$ plain form
5281 5452468 5440481 5487018 5512711 5603361 5726316 5864083 5983580 6045235 6131959 6254660 6375996
5270 6375996 6547298 6743654 7077491 7410786 7782642 8157535 8499425 8752138 8837853 8756515
5260 8756515 8572727 8392588 8194875 7866704 7487920 7015025 6627375 6343768 6089717 5900880
5250 5900880 5751339 5638745 5540738 5433983 5400582 5463530 5508187 5570622 5674295 5786066
5240 5786066 5887124 6056292 6283292 6539633 6836869 7168257 7567716 7970372 8395241 8762082
5230 8762082 8896351 8847974 8760663 8651891 8500591 8258076 7856500 7417264 7029952 6702670
5220 6702670 6499009 6277991 6030201 5823850 5694451 5615972 5556403 5506579 5487726 5510590
5210 5510590 5511389 5566362 5580680 5646480 5703949 5800285 5868969 5960740 6057365 6193423 6312010
5199F312010J41143O3874M935l7303P531K642o1657j12751q3973j17884q7535
5188F031032n0461o6130n1701q7330n5301J0819J1853l8764m6648l9340o8309
5177E549720j9144k7280l4121o5232o7658k744K5844O6585R1688N5986J47753
5166E721397J80265J86669J91489K50973K56173K48634J90290K04926J72282J95233
5156G798331J93683J75104J32760J78511J54075J77869J73269J94401J20446Q3395
5146I381844J18389J15310J15277J05563J34134J56139J55663J56558K18073K29001
5136A0885951K15864K35688K70586K69959K99295L29500L58323M55303N94807
5127A3915276N34917N36353N00363N54515M92591N77381O52248O97974P48562
$$ plain form
5199 6312010 6453153 6517027 6521962 6484659 6492190 6494832 6433175 6320424 6236451 6118567 6031032
5188 6031032 5980571 5914441 5862740 5775410 5720109 5730928 5742781 5704017 5657369 5618029 5549720
5177 5549720 5530576 5503296 5469175 5403943 5336285 5333541 5359385 5425970 5517658 5573644 5721397
5166 5721397 5901662 6088331 6279820 6530793 6786966 7035600 7225890 7430816 7603098 7798331
5156 7798331 7992014 8167118 8299878 8478389 8632464 8810333 8983602 9178003 9298449 9381844
5146 9381844 9500233 9615543 9730820 9836383 9970517 10126656 10282319 10438877 10656950 10885951
5136 10885951 11101815 11337503 11608089 11878048 12177343 12506843 12865166 13320469 13915276
5127 13915276 14450193 14986546 15486909 16041424 16534015 17111396 17763644 18461618 19210180
5118A9210180Q26241R27231J052937J268780J301142Q70749L72091J99287J68554
5109B6197192J01610J10456L24916N48412P49056R05174J034983J237589J379394
5100C2588782J571668J735914J981673K286538K537004K807914L130002L282451
5092E1921946L617285M099495M643181N403007O466270P751363R311928J0421063
5084A03635538J1424944J3207417J3564032R423785O840102Q428454J0249896
5077A76774168J1142802J0900575J3338665K0476015K8653256L5848959L8758141
5070C35892581L9638204M1620959L0207861m193204k8761351k4502120j8510446
5063C71392484k5914003m3279815n2579672m3069795l0897063k3181726j7947288
$$ plain form
5118 19210180 20036421 20963652 22016589 23285369 24586511 25457260 25829351 26028638 26197192
5109 26197192 26298802 26409258 26734174 27282586 28031642 28936816 29971799 31209388 32588782
5100 32588782 34160450 35896364 37878037 40164575 42701579 45509493 48639495 51921946
5092 51921946 55539231 59638726 64281907 69684914 76151184 83902547 93214475 103635538
5084 103635538 115060482 128267899 141831931 151255716 158095818 166524272 176774168
5077 176774168 187916970 198817545 212156210 232632225 261285481 297134440 335892581
5070 335892581 375530785 417151744 447359605 443166401 414405050 389902930 371392484
5063 371392484 345478481 302198666 249618994 206549199 175652136 152470410 134523122
5056A34523122j4446959j1483783r303261p684787o617365n737388n033067m440736
5048F9775776m072446l681940l371112l058387k897116k655596k453473k175826
5040D5409880k028895j858037j743373j628270j539151j357522j249682j170767
5032C2834183j117916r67833q55876p14889p62403p28544o64709o07033n48844
5023B5866136n02762m88364l08949j75032r2350p178J663o79804j122865r22043
5013B1568452p46196p09600r80602j139323r08246p36509n63902m80205m69932
5004A4833937m66021m20483l79297l64807l71144l79264m13142l17866l06363
4995A1415550k95557k51363k60537k20286k31231k22288k03779j88486j81823
$$ plain form
5056 134523122 120076163 108592380 99289119 91604332 84986967 79249579 74216512 69775776
5048 69775776 65703330 62021390 58650278 55591891 52694775 50039179 47585706 45409880
5040 45409880 43380985 41522948 39779575 38151305 36612154 35254632 34004950 32834183
5032 32834183 31716267 30748434 29892558 29177669 28415266 27686722 27022013 26414980 25866136
5023 25866136 25363374 24875010 24566061 24391029 24298679 24291501 24293164 23613360 22490495 21568452
5013 21568452 20822256 20112656 19132054 17992731 17084485 16347976 15784074 15303869 14833937
5004 14833937 14367916 13947433 13568136 13203329 12832185 12452921 12039779 11721913 11415550
4995 11415550 11119993 10868630 10608093 10387807 10156576 9934288 9730509 9542023 9360200
4986I360200j56205j15495j40219j30546j05278j48493j32955j30082r3805r2046
4976H115076q2831n9308q3976m5095k7423l3768k8037J382J874o8789j06263j13536
4964G469306j07819r7050p6093j40237j08664j59339j49476j14409q9277j34340
4954F292602r3085j02365p1003q5667j52576j55672j06791j24525j39492j38569
4944E122857j41403q1183r1516r3767o1068o5964n0202r3387m4495m7947m4896
4933D307029l6081p6060n2592n9519m1521n9828m8670l4897n2887q465n4948l1014
4921C750547j8189m3159m8614l1242j3689k3235m5391p6080o1046k546m9625j3914
4909C323817P305Q691k264R098J3056J0858M418J1073n3190n8895J8207K9460
$$ plain form
4986 9360200 9203995 9088500 8948281 8817735 8712457 8563964 8431009 8300927 8207122 8115076
4976 8115076 8032245 7972937 7888961 7843866 7816443 7782675 7754638 7756020 7757894 7689105 7582842 7469306
4964 7469306 7361487 7264437 7188344 7048107 6939443 6780104 6630628 6516219 6426942 6292602
4954 6292602 6199517 6097152 6026149 5940482 5787906 5632234 5525443 5400918 5261426 5122857
4944 5122857 4981454 4900271 4808755 4714988 4653920 4587956 4537754 4444367 4399872 4351925 4307029
4933 4307029 4270948 4194888 4142296 4082777 4041256 3981428 3932758 3897861 3844974 3836509 3781561 3750547
4921 3750547 3732358 3689199 3640585 3609343 3595654 3572419 3527028 3450948 3389902 3387356 3337731 3323817
4909 3323817 3331122 3339813 3337549 3346647 3359703 3370561 3374979 3386052 3332862 3273967 3292174 3321634
4897C321634J0168j7552p6614k8261n968M070j6593j8373K6306o0786j8365j3062
4885C106604j7284L1233p804j7373L5794K4131j2882R233J330J8229K1788K6255
4873C219254M7678P2019Q1519O2383O5186J23183J50422R0892Q6269J29018J34554
4862D262377K33062L09105K77574L07860L38889L60976L41495M08120N38582O86062
4852H064102Q58964J001797J043591J144150J254712P74585j49070l56309k08829
4843A3427693l25924q34081j317369j329553j034982r32769q37035p27949n81598
4834E506433m69201l53010l05304k48022k17026j93099j58554j00484j06920j30677
4824C224136q4332j08347p6885j11372o8996p9519n0792n4584n8083o2974m1397
$$ plain form
4897 3321634 3331802 3314250 3237636 3209375 3203407 3207477 3190884 3172511 3198817 3138031 3119666 3106604
4885 3106604 3089320 3120553 3112749 3095376 3131170 3155301 3142419 3151652 3152982 3171211 3192999 3219254
4873 3219254 3266932 3338951 3420470 3482853 3548039 3671222 3821644 3912536 3998805 4127823 4262377
4862 4262377 4495439 4804544 5082118 5389978 5728867 6089843 6431338 6839458 7378040 8064102
4852 8064102 8923066 9924863 10968454 12112604 13367316 14141901 13992831 13636522 13427693
4843 13427693 13101769 12267688 10950319 9620766 8585784 7653015 6815980 6088031 5506433
4834 5506433 5037232 4684222 4378918 4130896 3913870 3720771 3562217 3461733 3354813 3224136
4824 3224136 3139804 3031457 2954572 2843200 2774204 2694685 2643893 2589309 2531226 2468252 2426855
4813B426855l8044l5284n1809k0794k9158m0430m3244k0274l5491l7885j1478
4802B062964m0084m0233o5184j6981k6214j2875m0461l4618j6611n0811M919k5048
4790A698763O079k2428m6599j3584r815K379l0167J4412j8315o2428k5570N258
4778A497985K7961M2359J53j2748J760r829K7814K3847L7946M1950L8641K8269
4766A746108O2483Q5864P4001K1247L3029K6730L3354J25835N8416J04809R1543
4755B463419J54875K00955K18345K28455J59481M5453r1507j35665j02516j41011
4745C000284k03792k82519k48798j91697j49986j26978r2261o3216q4727p7208
4735A479102m9278j5136l1694l5035j1895j8756l7779j4614j9852m6090n450J0862
$$ plain form
4813 2426855 2388811 2353527 2301718 2280924 2251766 2211336 2168092 2147818 2112327 2074442 2062964
4802 2062964 2022880 1982647 1917463 1900482 1874268 1861393 1820932 1786314 1769703 1718892 1723811 1698763
4790 1698763 1704842 1682414 1635815 1622231 1612416 1614795 1584628 1599040 1580725 1518297 1492727 1497985
4778 1497985 1525946 1568305 1568458 1555710 1557470 1547641 1575455 1599302 1637248 1679198 1717839 1746108
4766 1746108 1808591 1894455 1968456 1989703 2022732 2049462 2082816 2208651 2267067 2371876 2463419
4755 2463419 2618294 2819249 3037594 3266049 3425530 3470983 3379476 3243811 3141295 3000284
4745 3000284 2796492 2513973 2265175 2073478 1923492 1796514 1704253 1641037 1556310 1479102
4735 1479102 1429824 1414688 1382994 1347959 1336064 1317308 1279529 1264915 1245063 1198973 1193523 1204385
4723A204385l0480l3744k1756j636n279k8405N416j5467k7051K04l621j8161l0349
4710I94056j8744j4196Q325k5375K2032K138j408J763l2775M625J6807n6728l2804
4697H67716Q406R088j1529J11N112m3236j346m0275m4946R399J7657o670j6743
4684G52744q163m290r572j510K3789j3794k2791k5409O037L933N5042l6401k2240
4671F97375M961j7477J2160J4319l0611l7464K4282N584j450j4686K2710j8812
4659F60891l5541Q932k0783L1916J5157J613l7023J4727n461k6930K986J1935
4647F22419O136M694j3790m4537R099J1529L2711J3594m1236K1024L5834j3999
4635F43478j3854j642J3525P585j0307q534L0547k0915k0787j3866J5401j246
$$ plain form
4723 1204385 1173905 1140161 1118405 1116769 1111490 1083085 1088501 1073034 1045983 1046187 1042566 1024405 994056
4710 994056 975312 961116 969441 944066 966098 968236 966828 968591 935816 940441 957248 900520 867716
4697 867716 876122 885210 873681 873792 878904 835668 834322 794047 749101 758500 776157 769487 752744
4684 752744 744581 740291 730719 729209 752998 739204 716413 691004 697041 700974 756016 719615 697375
4671 697375 702336 684859 697019 711338 680727 643263 667545 673129 671679 656993 679703 660891
4659 660891 625350 634282 613499 645415 660572 662185 625162 639889 634428 607498 610484 622419
4647 622419 628555 633249 619459 574922 584021 595550 628261 641855 600619 621643 657477 643478
4635 643478 629624 627982 641507 649092 638785 630251 660798 639883 619096 605230 620631 619385
4623F19385j7306q030N297j1015r718J1424K3321m5851j1780L1720k5272Q760
4611E70935K6302j2163j7879l4081l2826j841L1782J000J6998k5799j6477m701
4599E01250K8545l992j8452K0934k1739J2142M826M767J896M267l1880J6793m692
4586E14665k8482k0691M3125O675j0337l7720j2465K6573j2496M276K0048j5905
4574D77266j5685j4278L639L9267K1343j6055k2317J14M6306j463l625K5361j9561
4561E20312Q603o171l1553J73j1101J9597J1169k8076O203j9320J1086R399L4434
4548E24755L273l0051j7904L0111m681J7116J3636j573n6038J7706J9695K8647
4536E44692k346k042n583l1327L0532N3802j7755l9401O086l9718l8659L6177
$$ plain form
4623 619385 602079 594049 599346 588331 578613 590037 613358 567507 555727 587447 562175 570935
4611 570935 597237 585074 567195 533114 500288 498447 530229 531229 548227 522428 505951 501250
4599 501250 529795 525803 507351 528285 506546 518688 523514 528281 530177 534444 502564 519357 514665
4586 514665 486183 465492 508617 515292 504955 467235 454770 481343 468847 473123 493171 477266
4574 477266 461581 447303 450942 490209 511552 495497 473180 473294 519600 518137 514512 539873 520312
4561 520312 528915 522744 491191 491364 480263 499860 511029 482953 489156 469836 480922 490321 524755
4548 524755 528028 497977 480073 510184 505503 522619 536255 534682 478644 496350 516045 544692
4536 544692 542346 540304 534721 503394 533926 587728 569973 530572 536658 496940 458281 494458
4524D94458k9211K8064kj5234p366m4375J999O834n679k0051K6555N185j4375
4511D26802r515n100k867r485q958K2255L0964N351n388k5634j4208J3539o094
4498D11662K1492M4036k2197p648j3521Q326L3388k3207j5158j128o60l2118J5684
4485D18951j2774J050j5754j1872N327K2419P62J2013j7043J7317k3807j9503
4473C77086J600r969p668O061M274K2631k4309J6075j2407P408l473k140J0139
4460C85308J273J0899J1063m415j5997o891j8431N231J7026K475j4781j1144K2158
4447C83774J3831P793M2202N639m7794r913K1456m928k5032R133J7813k0945L7844
4434D30873m235j4048j603K1330j5720j1532K1713L568j8198j2424l8078K3196
$$ plain form
4524 494458 465247 493311 493309 478075 470709 426334 428333 435167 429488 409437 435992 441177 426802
4511 426802 417287 412187 409320 399835 390877 413132 444096 449447 444059 418425 404217 417756 411662
4498 411662 433154 477190 454993 447345 433824 442150 475538 452331 437173 436045 435385 403267 418951
4485 418951 406177 407227 391473 379601 384928 407347 408109 420122 403079 420396 396589 377086
4473 377086 378686 368717 361049 367110 371384 394015 369706 385781 373374 380782 377309 375169 385308
4460 385308 386581 397480 408543 404128 388131 381240 362809 368040 385066 387541 372760 361616 383774
4447 383774 397605 405398 447600 453239 405445 395532 416988 412060 387028 396161 413974 393029 430873
4434 430873 426638 412590 410987 432317 416597 405065 426778 430346 412148 399724 361646 384842
4422C84842L1474m2645j9244K7764J3871k1755j0024K1701p662j0201M5311P904
4410D21336m2243K5916k485k9155r414K2342j25j2213n71j6901P955J6432L315
4397C84189j8643J9246j0361q053N5694j967m7653P192Q330K95J277n391J1702
4384C95857K0125j5208l5853k7666Q577J2496N313K9709L477m1910K3499M3665
4372D22081j6890l254l2523j0115p622K3054j0297r170J7364j1578p996K1413
4360C74467J5302j7791O3609l254l0695M2578M862K7186l0641k1980l4398L858
4348C93103J5371k8023j4834R878L1550o262P639Q862K07k0613j3074K0344k089
4335D02059j2330J2105k592p623N084K3968J0761K284l1780O878N660k1082P208
$$ plain form
4422 384842 416316 373671 354427 382191 396062 374307 364283 385984 378322 368121 413432 421336
4410 421336 379093 405009 402524 373369 363955 386297 386172 373959 373388 356487 364442 380874 384189
4397 384189 365546 384792 374431 366378 422072 420105 372452 379644 387974 388269 389546 384155 395857
4384 395857 415982 400774 364921 337255 345832 358328 363641 393350 396827 354917 378416 422081
4372 422081 405191 401937 369414 359299 351677 374731 364434 355264 372628 361050 353054 374467
4360 374467 389769 371978 435587 432333 401638 444216 449078 476264 445623 423643 389245 393103
4348 393103 408474 380451 365617 375495 407045 400783 408422 417284 417491 396878 383804 404148 402059
4335 402059 389729 401834 399242 391619 396703 420671 431432 433716 401936 408814 414474 393392 400600
4322D00600j847K4681k8667j6298L618k1656L6026O820m934K0519k367j8411K986
4309D01070N688k98J0760j0477N384J5634M044O20m0441P339k679l7509k0947
4296C38188J4367Q030K1224K251k0119K0071J1570L3461k1361k6885L62O815j4340
4283C73634j6101j0313L687j4401K5104K8655q175k5815k4375K4755R514j0536
4271C55633k0000p278j403n012K0698R986j5520j8682M0658L4867k258l2933J610
4258C60366J7355K0314m0057m1792K7322L2892N2818j7148K0l7365o584j1537
4246C56604k8659M1761m279J3030K5741j0775K4056m4082j5219L2340j1082m649
4234C74787J8036R268k5419m8759R397J1859J215n979j090j4639p411K0720K961
$$ plain form
4322 400600 398753 423434 394767 378469 382087 360431 396457 403277 398343 418862 416495 398084 401070
4309 401070 406758 406460 417220 406743 412127 427761 431805 432425 391984 399323 396644 359135 338188
4296 338188 352555 360585 381809 384060 363941 384012 395582 429043 407682 380797 381159 387974 373634
4283 373634 357533 347220 350907 336506 361610 390265 382090 356275 331900 356655 366169 355633
4271 355633 335633 328355 326952 321940 342638 352624 337104 318422 359080 393947 391689 358756 360366
4258 360366 377721 398035 357978 316186 343508 376400 429218 412070 412090 374725 368141 356604
4246 356604 327945 369706 365427 378457 404198 393423 417479 373397 358178 390518 379436 374787
4234 374787 392823 402091 376672 327913 337310 349169 350384 344405 343315 328676 321265 341985 344946
4221C44946q543O552o240l4876O775M0177M6513j9014k4905j4647J3192J8525
4209C68455m4889J2061J7574K778J1729J4224o482j8151p976j0166J9428K5132
4197C83717k6621J2414K180J448K084j4789k6352J1499J5121J3419j0865K5322
4185C88577k409j6692J6935p096K9900m120l0523M369N6850k645l16M397m500
4172D32727K5821j7183n726O4087M2526m128J4084j0488k8557K2800o195K0552
4160E50320N547j7151nn3784K2944l051j5807K5024O190K0117j9445l1957J573
4147D90515q589l5689k8782J5115O654J5407j704j753j1441R976N527k0429M0185
4134D74992k7475K6698k3855j2179j1342O664K400J5116L181J8894K0785Q352
$$ plain form
4221 344946 336403 342955 336715 301839 308614 348791 395304 376290 351385 336738 349930 368455
4209 368455 323566 335627 353201 355979 367708 381932 375450 357299 349323 339157 358585 383717
4197 383717 357096 369510 371690 373138 375222 360433 334081 345580 360701 374120 363255 388577
4185 388577 386168 369476 386411 379315 409215 405095 374572 378941 435791 433146 432830 437227 432727
4172 432727 458548 441365 435639 499726 542252 538124 552208 541720 513163 535963 529768 550320
4160 550320 555867 538716 538711 484927 507871 504820 489013 514037 520227 540344 520899 488942 490515
4147 490515 481926 446237 417455 432570 439224 454631 452927 451174 439733 449709 455236 434807 474992
4134 474992 447517 474215 450360 438181 426839 433503 435903 451019 454200 473094 493879 502231
4122E02231n9967j5678n952j137J3221J8843O31n917L6960J0123r504q252j1577
4109D64025M5727L6394m084J1583k1138M49M1405J3766L541k8799J4512Q213R809
4096E95403L1695P64L879Q970J5067q04J1727j5464J7260l925R963l8779L3872
4083F69628M5197o236p431K035J0875L157L8120K8580k933j1681P243K9300l84
4070H05470L856K4863L8582L808K799J1784M0339N3634N1322L1107K5848J4585
4058A107997O1707O8806L4295N2370P9565J639M3611O7802L7259L8413K5140Q6921
4046A705525K0445J1529Q0491P2626Q8826N1238J15907J10204J04858J49319J72276
4035B683244K32816K56459L09269L05227L96632N20413N56941O27969O45885L46967
$$ plain form
4122 502231 442264 426586 420634 419497 432718 451561 452192 446275 483235 493358 483854 475602 464025
4109 464025 509752 546146 542062 553645 532507 532956 574361 588127 591668 562869 577381 585594 595403
4096 595403 627098 627862 631741 640711 655778 654974 666701 651237 668497 664572 674535 635756 669628
4083 669628 714825 708589 701158 703193 714068 717225 755345 783925 780992 769311 776554 805854 805470
4070 805470 809326 834189 872771 876579 879378 891162 931501 985135 1036457 1067564 1093412 1107997
4058 1107997 1169704 1238510 1272805 1325175 1404740 1406379 1449990 1517792 1555051 1593464 1618604 1705525
4046 1705525 1725970 1737499 1817990 1890616 1979442 2030680 2146587 2256791 2361649 2510968 2683244
4035 2683244 2916060 3172519 3481788 3787015 4183647 4704060 5261001 5888970 6534855 6881822
4025F881822l4817k93699m86780m47864l65724l44163k95920k98696k52279l01909
4015C759971k64015k39588k10064j92429j64186j50945j19684r3983j63089j43559
4005B018429q1428o3821j10897m7497p7429p7890p7525j5740k7210p2911l8293
3994A327788n7127n4106k0307k4890m0879k5871j4795r164m441k4199p3848k1243
3982I56918j8944n1984M871O167l7191r565j2012n2124J3797j7128l1877r885
3970G41043k8555J5791P063J3749j1313k1274j1926j7085l6377l6353J2093J0871
3958F37727l1504J9429J2611O754m2456q643J7561k2905N936K2164n242j3691
3946E97741l321k0544j2825j4569R817p283k2921J453j3433j2106P902K3240j0307
$$ plain form
4025 6881822 6847005 6553306 6066526 5618662 5252938 4908775 4612855 4314159 4061880 3759971
4015 3759971 3495956 3256368 3046304 2853875 2689689 2538744 2419060 2325077 2161988 2018429
4005 2018429 1937001 1873180 1762283 1714786 1637357 1559467 1481942 1466202 1438992 1366081 1327788
3994 1327788 1270661 1216555 1196248 1171358 1130479 1104608 1089813 1080649 1076208 1052009 978161 956918
3982 956918 937974 885990 890861 897028 859837 850272 838260 786136 799933 782805 750928 741043
3970 741043 712488 728279 735342 749091 737778 716504 704578 687493 651116 614763 626856 637727
3958 637727 606223 625652 638263 645017 602561 593918 611479 588574 594510 616674 611432 597741
3946 597741 594420 573876 561051 546482 556299 549016 526095 527548 514115 502009 509911 533151 522844
3933E22844k1075j2273n47j3667j3744N4573j8052K076j7342J601J9118l5113
3921D68399K0140Q140j7318K5215M87k7409q87J0021j7911k0072K2546R831J144
3908D82326l0382K6115k2350j1840M966J2964p88K0238j1722k5309R902k7320
3896D26800k22n684k1364r021L6674K3497L9511k7493J045k1673m6910K1719P211
3883D24090p140M2510N119k1359K4962l248l9638L2270l241N38J7745j5264K373
3870D59717Q029K5289j5174j0489J8751M6007l1654J9021k130k7920j8656j9432
3858D51359J7220Q103J5561K2028k4474j4684K9656J7154j0076J9943k5979k9596
3846D76215K5316j9938l3332L4191K356M18J937J7611P135J7481J8214k525k3070
$$ plain form
3933 522844 501769 489496 488949 475282 461538 516111 498059 500135 482793 484394 503512 468399
3921 468399 488539 496679 479361 504576 505063 477654 476767 486788 468877 448805 471351 481182 482326
3908 482326 451944 478059 455709 443869 448835 461799 461011 481249 469527 444218 454120 426800
3896 426800 426578 420894 399530 390509 427183 450680 490191 462698 463743 442070 395160 416879 424090
3883 424090 416950 459460 464579 443220 468182 464934 425296 457566 454325 454863 472608 457344 459717
3870 459717 467746 493035 477861 467372 486123 532130 500476 519497 517367 489447 470791 451359
3858 451359 468579 476682 492243 514271 489797 475113 504769 521923 511847 531790 505811 476215
3846 476215 501531 481593 448261 482452 484808 485226 487163 504774 511909 529390 547604 545079 522009
3833E22009j9807r902k7154K7872L8753k0512l6062K6684J451Q962j7020j746
3821D93528j3438M6159j4651l322k4572K3983K6535m375n135O613J7661j0538
3809E38448j6615k8821K8801K2498k478K6523L2261M735M702R315L6048j7209
3797F38208n366k3847l045j534k4792J9474L0323k29k6213n462l4309K8712O201
3784E98121q380M5605K890J0582j4832K5697M897O567J5764M8789j2389l9704
3772F83607J2760M5068J0824k4193K7999J2383J1187n668M839j9265L2141j5272
3760G76410j4558j5711N276Q208r072K7948m809k9167J5195J5254M2872M6527
3748H64373l756k6087K5687K1084L4305K6303m723J5982J895O286j9086k165p759
$$ plain form
3833 522009 502202 492300 465146 493018 531771 511259 475197 501881 503332 512294 495274 493528
3821 493528 480090 526249 511598 508276 483704 507687 534222 529847 524712 531325 548986 538448
3809 538448 521833 493012 521813 544311 541833 568356 600617 605352 610054 619369 655417 638208
3797 638208 632842 608995 605950 604416 579624 599098 629421 629192 602979 597517 563208 591920 598121
3784 598121 589741 635346 638236 648818 633986 659683 664580 671147 686911 735700 723311 683607
3772 683607 696367 741435 752259 728066 756065 768448 779635 773967 778806 759541 791682 776410
3760 776410 761852 746141 751417 759625 750553 778501 773692 744525 759720 774974 817846 864373
3748 864373 860617 834530 860217 881301 915606 941909 937186 953168 955063 961349 942263 940098 932339
3735I32339J9685j771L6004K621k2237M6085k7860K17J7056o792j0152j3954L952
3722I75193J3839j687M416l474j7080O251L2550O0517N983n538J3485K7912K1180
3709A133547K1127j0738o018o150K2204K4445j6186l7942K3202J0137k7434j9340
3697A110854p82j1335k6717j019K123j7222l054K1189j2278m2899J8773J9611
3685A057244J2729j7313l4125J5379l3859L950J9630r370M0585j3106J8089K0452
3673A080285r890J3672j2309l6948K169m911j4756j4996j0458J8574j4975J5289
3661A010746R246j4991O350M714K1036k5131m3314l5334m2252k2100j3902K2847
3649H77915N034j0610j7488K1637L0196p612P111K2251L31k3424k8522L6301J6588
$$ plain form
3735 932339 952024 950253 986257 988878 966641 1012726 984866 985083 1002139 995347 985195 971241 975193
3722 975193 989032 987345 991761 988287 971207 977458 1010008 1070525 1076508 1070970 1084455 1112367 1133547
3709 1133547 1154674 1143936 1137918 1131768 1153972 1178417 1162231 1124289 1147491 1157628 1130194 1110854
3697 1110854 1110072 1098737 1072020 1071001 1073124 1055902 1052848 1074037 1061759 1018860 1037633 1057244
3685 1057244 1069973 1052660 1018535 1033914 1000055 1004005 1023635 1014265 1054850 1041744 1059833 1080285
3673 1080285 1070395 1084067 1071758 1034810 1036979 1032068 1017312 1002316 991858 1010432 995457 1010746
3661 1010746 1019992 1005001 1011351 1016065 1037101 1011970 968656 933322 891070 868970 855068 877915
3649 877915 882949 872339 854851 876488 906684 899072 906183 928434 928765 905341 876819 913120 929708
3636I29708j8165j6133o661m283j0132j9328J9027K1493j291k056L4124J4889
3624I41192j5038K8952K78L1753K3513m2458p766K3397p433K0259M0765J9807
3612A057221M6307M8950K3805N6775O0830O4967M8293Q6981J13328J11103J40097
3601A858657J83603J40567R7058l2111r1857m9093l8930n0452j48731j70623j07220
3590A590868n7958m9624l8121l0540k5558q92L6899N4009M1652K4025O1130N3283
3578A659173R0436K0797J04237R7126R4282J16771J97717K69153K65169K57816
3568C172677L14037K20730m9541j85844j48112j10934q5606k60933l52886k34918
3558B278670k09323j12732o4286k4562o8979m0448k1211j0715j1663K0138J5554
$$ plain form
3636 929708 911543 895410 888749 884466 874334 855006 874033 895526 894235 892179 926303 941192
3624 941192 926154 955106 955384 987137 1010650 968192 960426 983823 976390 996649 1037414 1057221
3612 1057221 1103528 1152478 1176283 1233058 1293888 1358855 1407148 1494129 1607457 1718560 1858657
3601 1858657 2042260 2182827 2279885 2247774 2155917 2106824 2067894 2017442 1868711 1698088 1590868
3590 1590868 1532910 1483286 1445165 1414625 1389067 1388175 1425074 1479083 1520735 1544760 1605890 1659173
3578 1659173 1749609 1770406 1874643 1971769 2066051 2182822 2380539 2649692 2914861 3172677
3568 3172677 3486714 3707444 3657903 3472059 3323947 3213013 3127407 2866474 2513588 2278670
3558 2278670 2069347 1956615 1892329 1867767 1798788 1758340 1737129 1726414 1714751 1734889 1750443
3547A750443o610L6852O0701k3372o828K6192M8991R6188J13595J02625J20743
3536B319520J34054Q1928Q306p5394r6860n5930m8996p3691j25708j61154j27877
3525A778198m0047l6077j1554l093l3172k1207j9559M7912j2395k2372k3712M669
3513A607591K1286p446k5389l0451p4901l64k377k9943l2845l9531K451j8155
3501A369926l1798M706J0597j1405J8557N332j2707m659L1191L0330j0925K6644
3489A425789O0445L878K4820J9914L4996o527j2866K4858Q478J6379K8806p357
3477A621613l499m2531l0618P15n402j3368J3995q318k614j4215N432j9602J0638
3464A512226K9039P42M548K6738L2075K3023N857L3410M9102K5640K5256L5646
$$ plain form
3547 1750443 1743833 1780685 1841386 1818014 1811186 1837378 1886369 1982557 2096152 2198777 2319520
3536 2319520 2453574 2535502 2543808 2468414 2371554 2315624 2266628 2192937 2067229 1906075 1778198
3525 1778198 1738151 1702074 1690520 1687427 1654255 1633048 1613489 1661401 1649006 1626634 1602922 1607591
3513 1607591 1628877 1621431 1596042 1565591 1490690 1490326 1487949 1458006 1425161 1385630 1388081 1369926
3501 1369926 1338128 1342834 1353431 1342026 1360583 1365915 1353208 1348549 1379740 1410070 1399145 1425789
3489 1425789 1486234 1490112 1514932 1534846 1569842 1563315 1550449 1575307 1583785 1600164 1628970 1621613
3477 1621613 1618114 1575583 1544965 1545680 1540278 1526910 1540905 1532587 1529973 1515758 1521190 1501588 1512226
3464 1512226 1541265 1542007 1546555 1573293 1605368 1628391 1634248 1667658 1716760 1742400 1767656 1803302
3452A803302L6176K9148N6652M9672P5660K2683K7778L5928J7983J797J1070O1727
3440B229576K6889K3400N461m6944K7471N9163M2132N9354O0156O1511Q4451O9787
3428B702407J03859Q7431J09450J63353J43276J81182J89577J99445K10190K33946
3418D324116K29453K86665L07492L40524L94408M15943M83795M59408M46073M42240
3408H130117K62682j4593j23100j27732j68605k85365m59804n12962m22125l42660
3398E935853k88960k79335k35885j37712o9215k2058N2403M9047J48951J92050
3388E345139K00687K26593K83486L67565M02986M50097N66769P04115Q01404Q60182
3378A0209023Q56299R50943P19862J81530j59938k46924k29842m05015p63281
$$ plain form
3452 1803302 1839478 1868626 1925278 1974950 2050610 2073293 2101071 2136999 2154982 2156779 2167849 2229576
3440 2229576 2256465 2279865 2285326 2238382 2265853 2325016 2367148 2426502 2486658 2548169 2632620 2702407
3428 2702407 2806266 2893697 3003147 3166500 3309776 3490958 3680535 3879980 4090170 4324116
3418 4324116 4553569 4840234 5147726 5488250 5882658 6298601 6782396 7241804 7687877 8130117
3408 8130117 8392799 8378206 8255106 8127374 7958769 7673404 7213600 6700638 6278513 5935853
3398 5935853 5646893 5367558 5131673 4993961 4924746 4902688 4955091 5004138 5153089 5345139
3388 5345139 5545826 5772419 6055905 6423470 6826456 7276553 7843322 8547437 9348841 10209023
3378 10209023 11065322 12016265 12736127 12917657 12757719 12510795 12280953 11875938 11112657
3369A1112657r79390q52491o87901n92637m66642m13100l06275j83446j31685
3360F499090m3649N7859J65433J97061K88046L35755L88067M55836M74762L44596
3350I162856L18474L89449N37228N79062N31076O24256P11077P37523O30132N58743
3340A4779876P02436N62639l16450r88932r08158o84939o62089r58003j224103
3331A0302277r84732o34012m39023k43542l9795K2177O7111M3891m4318n6778
3321G993256j4016O4404J00864P6516J58982L43845N19516N83734O11385P07774
3311A1146260M78411l81830o97730n03987m24138n42614r19955j097276q80871
3302F176270o31525m97378l83372l32130k75718j88743j91342j81896j55490j68402
$$ plain form
3369 11112657 10133267 9280776 8592875 8000238 7533596 7120496 6814221 6630775 6499090
3360 6499090 6455441 6513300 6678733 6875794 7163840 7499595 7887662 8343498 8818260 9162856
3350 9162856 9481330 9870779 10408007 10987069 11518145 12142401 12853478 13591001 14221133 14779876
3340 14779876 15482312 16044951 15728501 14739569 13831411 13146472 12484383 11526380 10302277
3331 10302277 9317545 8683533 8244510 8000968 7961173 7983350 8050461 8094352 8050034 7993256
3321 7993256 7979240 8043644 8144508 8221024 8380006 8723851 9243367 9827101 10438486 11146260
3311 11146260 11624671 11242841 10545111 10041124 9616986 9074372 8154417 7057141 6176270
3302 6176270 5544745 5047367 4663995 4331865 4056147 3867404 3676062 3494166 3338676 3170274
3292C170274q2262j02036j22469j29122j25550n1900q4702n4643j9440n1879o4599
3281B281672o3548p6063o0640m2965j4260o5149k3430k5716p4925l1485o0782
3270A742709l2282m3073k8362J4738l9499m7387l1487m0233k7585k303k4969l1899
3258A408368l4883j3124O228j0897r527n3413k5206o870m479j0158n035j2355
3246A228649j142k0401O107l7877j8130L27k1579j4124j8020K250q828k881j1364
3233A082987k7058N0464o184j4303l0989l4041K6268k6140P591l385r209l4629
3221I81372K8404l044n1319N563K8039l238k6528n3628K6945L4327j7447O90k2133
3208I28003l231p048j0478Q408q044J6977M953k2066Q402L0052j8741q838K1690
$$ plain form
3292 3170274 3088012 2985976 2863507 2734385 2608835 2556935 2472233 2417590 2398150 2346271 2281672
3281 2281672 2218124 2142061 2081421 2038456 2024196 1959047 1935617 1909901 1834976 1803491 1742709
3270 1742709 1710427 1667354 1638992 1653730 1614231 1566844 1535357 1495124 1467539 1465236 1440267 1408368
3258 1408368 1373485 1360361 1366589 1355692 1346165 1292752 1267546 1260676 1256197 1246039 1241004 1228649
3246 1228649 1227507 1207106 1213213 1175336 1157206 1157533 1135954 1121830 1103810 1106060 1097232 1094351 1082987
3233 1082987 1055929 1106393 1100209 1085906 1054917 1020876 1047144 1021004 1028595 1025210 1016001 981372
3221 981372 1009776 1006732 955413 960976 989015 985777 959249 905621 932566 966893 949446 950136 928003
3208 928003 924772 917724 907246 915654 907610 924587 929540 907474 915876 945928 927187 918349 940039
3195I40039R37j2463Q750q98j9709Q306N696R182J616K0020M598j7942L6950K4614
3181A009696k537M0560J7232L2330M5774Q774J6527M4078J7971L0395M6303O0819
3169A367922N3671L6558R3978J08919P5570P8848P0249O006j9160%j2243j6634
3157A843684j3966l1568k1510l418k4064m6363q430j1239j7685n6587P456l2795
3145A583515j4983K1546K001K7652N9468O1126N646O3977N4423O6745R1100J08462
3133B130678J23261J61631J04439M2641M1545Q72k6536j7995l5410o3642p7484
3122B384000l2521k9504l7764n2336m9898q9863n7474n6130n7601p6083q7576
3111A757250l4877l0183l5215k8950q768n411J7304K4602K2508M6713M856O922
$$ plain form
3195 940039 940976 928513 937263 936365 916656 924962 930658 939840 941456 961476 966074 948132 985082 1009696
3181 1009696 1007159 1047719 1064951 1097281 1143055 1151829 1168356 1212434 1230405 1260800 1307103 1367922
3169 1367922 1421593 1458151 1552129 1661048 1736618 1815466 1885715 1891721 1872561 1872561 1860318 1843684
3157 1843684 1829718 1798150 1776640 1773222 1749158 1702795 1694365 1683126 1665441 1608854 1616310 1583515
3145 1583515 1568532 1590078 1592079 1619731 1679199 1740325 1745971 1809948 1864371 1931116 2022216 2130678
3133 2130678 2253939 2415570 2520009 2562650 2604195 2605067 2578531 2560536 2525126 2461484 2384000
3122 2384000 2351479 2321975 2284211 2231875 2181977 2092114 2034640 1978510 1920909 1844826 1757250
3111 1757250 1722373 1692190 1656975 1628025 1619257 1613846 1631150 1655752 1678260 1724973 1729829 1736751
3099A736751Q181o165K7443L8046m0098m165P35k1289k4077q2333n809J3577J1217
3086A652014k1665l3418m7691j8409k6773l4414K5113j8104m9361r544k1512l9377
3074A356859m128r678l0547k6066j6350j3761K4408k1440o8138j1664R276k1443
3062A167328M129j985J1840j0237k6359K2243j3220M6557r19l9703P1437j2317
3050A218794j9807k0863l518N596n2282j100K5973j044q983l5527n2199l74j7288
3037A037378R084j1449k2690j7960J880o0514l0450L0033J0510j1282J6638l0055
3025I21123l4005K934j0892j8316k513j0171K7891k4125j7675l3471k9233n585
3013G65962j322m246j3597k7557Q725j5271j8079j9307J9571j0147j2790K0606
$$ plain form
3099 1736751 1744932 1738767 1766210 1804256 1764158 1759993 1760728 1739439 1715362 1633029 1627220 1640797 1652014
3086 1652014 1630349 1596931 1549240 1530831 1504058 1469644 1494757 1476653 1427292 1417748 1396236 1356859
3074 1356859 1352731 1343053 1312506 1286440 1270090 1256329 1280737 1259297 1191159 1179495 1188771 1167328
3062 1167328 1171457 1169472 1181312 1171075 1144716 1166959 1153739 1200296 1199377 1159674 1231111 1218794
3050 1218794 1198987 1178124 1174606 1180202 1127920 1126820 1152793 1151749 1142766 1107239 1055040 1054666 1037378
3037 1037378 1046462 1035013 1012323 994363 996243 935729 905279 935312 945822 934540 951178 921123
3025 921123 887118 890052 879160 860844 858331 848160 876051 851926 834251 800780 771547 765962
3013 765962 764640 760394 746797 719240 727965 712694 694615 675308 694879 684732 671942 692548
3001F92548l6051l161K1373P73k7608R580j1919j8154R20k1370J0536q687J4912
2988F23692j9184k2789K4308p816l91r146j7508J2150J8508m6003l238j9672L0173
2975E63084j5870k6897K0499q631m5558j0123J608q442K4670L4521N84m3397o589
2962D79459j137J232L449K6614j3873m4153M6425j2307k2034P040N3275l3083
2950D90907m0481k5255M883m50K0783n588j0620O290P713k239j1803L4083L4336
2937E02559l9177k0857l1141L2797M7294k3344j8708p1464J6597J7282m738L3001
2925D40101j8370l1619j4252L0427L4265L971l5640K1602M155n0716J2083Q020
2913D04027j5679m701l1394J1781K3234K180L4498N479r780l30k9924O825j4569
$$ plain form
3001 692548 656497 653336 674709 675482 647874 657454 645535 627381 628301 606931 617467 608780 623692
2988 623692 604508 581719 606027 598211 597820 588674 571166 583316 601824 555821 552583 532911 563084
2975 563084 547214 520317 540816 532185 486627 476504 478112 469670 494340 528861 529445 486048 479459
2962 479459 478322 479554 483003 509617 495744 451591 498016 485709 463675 470715 523990 490907
2950 490907 450426 425171 430054 429604 450387 444799 434179 440469 448182 445943 434140 468223 502559
2937 502559 463382 442525 411384 444181 491475 468131 449423 377959 394556 411838 407100 440101
2925 440101 421731 390112 375860 406287 440552 444523 408883 430485 434640 383924 396007 404027
2913 404027 388348 383647 352253 364034 387268 389448 423946 429425 419645 419315 389391 396216 381647
2900C81647l2658L6547L0085J7457J0977k0293j3651k6412J8956M2981m0909m4015
2888C60712k3003j778M085k197j3564L8847o372J7844N1753l1019k5478j4982
2876C54848o223K2656J0156j3285j4092l644j5120K0478j1461K6643j8712J7863
2864C70107L930J4352l6261N276j6779j3699K9252J2093j1051q761k177L1437
2852C77719k337j2570k1092K0406K2356l0280L897l2722K4769J1028J7389L2129
2840D10692j7862n8116O147J1486k5420K9292k636j8950N146j9137k354K5023
2828C43311K2041j1685l0010K4790J0665m6420J5548N173J6252q526j0352P983
2816C38770j8265J1836L3969n5041k2687M9029L642o944k103M6l895J5018p559
$$ plain form
2900 381647 348989 385536 415621 433078 444055 423762 410111 383699 402655 445636 404727 360712
2888 360712 337709 335931 340016 337819 324255 363102 356730 374574 426327 395308 369830 354848
2876 354848 348625 371281 381437 368152 354060 350416 335296 355774 344313 370956 352244 370107
2864 370107 374037 388389 352128 357404 340625 326926 356178 368271 357220 348459 346282 377719
2852 377719 375382 362812 341720 362126 384482 354202 358099 325377 350146 361174 378563 410692
2840 410692 392830 334714 340861 352347 326927 356219 353583 334633 339779 320642 318288 343311
2828 343311 365352 353667 323657 348447 359112 312692 328240 333413 349665 341139 330787 338770
2816 338770 320505 332341 366310 311269 288582 337611 341253 334309 332206 332252 328357 343375 335816
2803C35816K2436J677l9449P275j2989j677K2353l7039r2R701r054J7270j579
2790C14649m584K1538q466q100k5691L068K3490J6799j2217k7271L9140q636K6102
2777C49821k6092j0600l1288K478j4235M9845M770n054J4516j78l1566j1690K4303
2764C15030j4271J4686q123k209J9495K2680J1303n227l1020j2738Q465j391Q097
2751C24777k8805M4923p953k2288L2942q314j4387j0996L704j6245Q772O185L1556
2738C43871k2229R140l1350J0964J6982k1409K3515k015Q815K9666m776m1251
2726C19923k1796L3315k7060l4398Q643R746l532K4241j3341k084J0996Q988J3022
2713C26663k681r478J2341q54J7031j6553j9109k8244l281J9449k993K7666J2269
$$ plain form
2803 335816 358252 359929 320480 327755 314766 313089 335442 298403 298311 308012 298958 316228 314649
2790 314649 310065 331603 323137 315037 289346 292414 315904 332703 320486 293215 332355 323719 349821
2777 349821 323729 313129 281841 284319 270084 319929 324699 319645 334161 333983 302417 290727 315030
2764 315030 300759 315445 307322 305113 324608 347288 358591 353364 322344 309606 318071 316680 324777
2751 324777 295972 340895 332942 310654 343596 335282 320895 309899 313603 297358 306130 312315 343871
2738 343871 321642 330782 299432 310396 327378 305969 329484 327469 336284 365950 361174 319923
2726 319923 298127 331442 304382 269984 278627 288373 284841 309082 295741 293657 304653 313641 326663
2713 326663 323982 314504 326845 325991 343022 326469 307360 279116 275835 295284 292291 319957 332226
2700C32226l499l2396K1940J1376J186l1589K6883K824q421k629p984Q597j1042
2687C07472J1276K0309j7829J7255L510K180j9200L382J3604k1144p245j3788
2675B99782N145L431R168k4271r824J1508J3866k075j0689L0510M602j4721k4408
2662B92024k269K608l1247L4370J2999J0283R68Q508Q171n061p675j1654j0868
2649C01157K0488k4239j8005L1743L3818l4340m1826L2994j5077k9665L7794k2214
2637B72628j5463L0673r624K6103r983Q776p193J3068l2592k9222N701J8258J5419
2624B86549j5152l7864j368J3541L5425J8233K7374J6029k8059l745r627j1561
2612B89775l7231L3831k655j2707K2268J7384J0640J4109j5911J0956L2909l4651
$$ plain form
2700 332226 328727 296331 318271 329647 330833 299244 326127 328951 320530 317901 309917 318514 307472
2687 307472 318748 339057 321228 338483 341993 344173 324973 328355 341959 320815 313570 299782
2675 299782 304927 308358 317526 293255 283431 294939 308805 306730 296041 326551 331153 316432 292024
2662 292024 289755 292363 261116 295486 308485 318768 319736 328244 336415 331354 323679 312025 301157
2649 301157 321645 297406 279401 311144 344962 310622 268796 301790 286713 257048 294842 272628
2637 272628 257165 287838 278214 304317 294334 303110 295917 308985 276393 247171 252872 271130 286549
2624 286549 271397 233533 232165 245706 281131 299364 326738 342767 314708 310963 301336 289775
2612 289775 252544 286375 283720 271013 293281 310665 321305 335414 319503 330459 363368 328717
2600C28717n235O890j1277r358O913k1770m3462J7273K2810k3362K3555J5642
2588C07336j9208j4628J4513J5196J1670K9248k8156l08J803Q143j8678K136L9340
2575C48407j4770k2080K1722j8184k8489l394P512J0478K0380j6394j513j9614
2563B84061L832J519P900K7748K2169j5795P04l854j2901K514j2292l019L058
2550C05644K6922m218j6721J1322q99p621p34q671K8818K5048o76n2437j7497
2537B88280L1506R336N811k4910k3890k5151L334M1463l334j6035j1432K0802
2525B95780P843K4440k6956l1555J6267J4820k374J9223m315k2835K0235L4493
2513C45066J0101m7862J5918n38n8623M73k2655L8508J5299l7226k8529N6367
$$ plain form
2600 328717 323482 330372 319095 309737 316650 294880 251418 268691 291501 268139 291694 307336
2588 307336 288128 273500 288013 303209 314879 344127 315971 315663 317466 325609 306931 309067 348407
2575 348407 333637 311557 333279 315095 286606 283212 290724 301202 321582 305188 303675 284061
2563 284061 287893 289412 297312 325060 347229 331434 332138 328284 315383 317897 305605 302586 305644
2550 305644 332566 328348 311627 322949 322050 314429 313695 305024 333842 358890 358214 305777 288280
2537 288280 319786 329122 334933 310023 286133 260982 264316 305779 302445 286410 274978 295780
2525 295780 303623 328063 301107 269552 285819 300639 298265 317488 313173 290338 310573 345066
2513 345066 355167 307305 323223 322685 264062 264535 241880 280388 295687 258461 229932 286299
2501B86299J7606l625j9620Q761J3686j8979N1000J4982j7970m831k8686j0181
2489B88442J0856l2058j47K2867O953K3617m316n858P59r364J9365j4559j2379
2476B94178O178k6655J7494J0725k6816L6138K3990q697j9218k774j2431p839
2464B84273R110K6706J1161j5982k7613J255J7850k235N183k1655J955l1763K9757
2451B88002J6427j698o092l8712r92J4663J1739p282L2436K3413n573j5315q055
2438C02961m905k1812o576K0473Q852j0446N654P737J6377j7585n576K7364j15
2425C22403k7883q0K4574j2985K3616n044O474j8677k5306n671J9711r073J3646
2412C05705K867M3R893j3909J3728R026k5758j7531K3152L8351o422L11k2150
$$ plain form
2501 286299 303905 300280 280660 289421 303107 284128 335128 350110 332140 327309 298623 288442
2489 288442 299298 267240 267093 289960 296913 320530 316214 310356 311115 301751 321116 306557 294178
2476 294178 300356 273701 291195 301920 275104 311242 335232 326535 307317 304543 292112 284273
2464 284273 293383 320089 331250 315268 287655 288910 306760 304525 309708 288053 290008 258245 288002
2451 288002 304429 302731 296639 257927 256935 271598 283337 276055 308491 331904 326331 311016 302961
2438 302961 298056 276244 269668 290141 298993 288547 294201 301938 318315 300730 295154 322518 322403
2425 322403 294520 294440 319014 306029 329645 324601 331075 312398 287092 281421 301132 292059 305705
2412 305705 308572 308615 318508 304599 318327 327353 301595 284064 307216 345567 339145 339456 317306
2399C17306n089K9304l8217m1325L6853r823M268L975O664n117O209J5705j9791
2386C00922O966L362j969r849r199L7164M654R672J5173k9946n948o639k1934
2373B92429J743R120L111J0457m326L43J3928m10j9010L6228k1962p815L221L3621
2359C50678j4512m930J8930L063J3364n69l4028K6776J245k1448N1235k5132R161
2346C73833j7203Q664j2949R328K1077K7273J046k4701j6362K0148L0842j6969
2334D04027j5934J6536J5629j0768M0381J0956J5313o214P625L0195P14J7804
2322E26264K5680j1387J7629m077j7542l654J6586J3282K5102k3674K2228K1050
2310F07487J961Q661K1836N346K8395M4205K2912J4868K5405M1154M6223P4173
$$ plain form
2399 317306 312217 341521 303304 261979 298832 289009 293277 297252 303916 298799 305008 320713 300922
2386 300922 307888 311250 309281 299432 290233 327397 332051 341723 356896 326950 321002 314363 292429
2373 292429 294172 303292 306403 316860 312534 312877 326805 326395 307385 343613 321651 313836 317057 350678
2359 350678 336166 331236 350166 353229 366593 366024 331996 358772 360017 338569 389804 364672 373833
2346 373833 356630 365294 352345 361673 382750 410023 411069 386368 370006 390154 420996 404027
2334 404027 388093 404629 420258 409490 449871 460827 476140 469926 477551 507746 508460 526264
2322 526264 551944 540557 558186 554109 536567 532913 549499 562781 587883 564209 586437 607487
2310 607487 609448 618109 639945 645291 673686 717891 740803 755671 781076 822230 868453 942626
2298I42626M7373L9852N2326R5592Q5968J01140J32002J45640J19033J45829J80965
2287B088346J64781J86800K28901K55772L34918M80250O12175P47649P08809O98015
2277F506416Q96831N93120l98937o00627l30499k71710m37496r10588r23545o12238
2267C510727m10444l04577k71023j98436j64398j71175r7467q7035j02306o4602
2257A639264n4896q7222r3026p2649l6849m5080p9716n4519l9116m9836k9197
2246I97158l1855l2097q913k9663m4073L1479q785o8511p29l072m6747k2903k4767
2233G06522L908L3218m5486n2815J8353Q983j4012l6781O75o106j9471N735k487
2220F00236k8786l9507l3888L7637M5527j0409l9308j5921K8452r539k6561Q195
$$ plain form
2298 942626 989999 1029851 1082177 1177769 1263737 1364877 1496879 1642519 1761552 1907381 2088346
2287 2088346 2253127 2439927 2668828 2924600 3259518 3739768 4351943 5099592 5808401 6506416
2277 6506416 7403247 7996367 7597430 6996803 6666304 6394594 5957098 5046510 4122965 3510727
2267 3510727 3100283 2795706 2524683 2326247 2161849 1990674 1893207 1806172 1703866 1639264
2257 1639264 1584368 1497146 1404120 1331471 1294622 1249542 1169826 1115307 1076191 1026355 997158
2246 997158 965303 933206 924293 894630 850557 882036 873251 804740 804011 800939 754192 731289 706522
2233 706522 710430 743648 698162 645347 663700 672683 658671 621890 622565 616459 596988 602723 600236
2220 600236 571450 531943 498055 535692 581219 570810 531502 515581 544033 534494 507933 516128
2208E16128j3268J542k0504j3496j0429L830n731j5415J6019k189o191K1802j6575
2195D55523j1826N862k3225r837J7729k4357n962J1883J3880j6399J2522r849
2183D15944L82o181J072J7071J6129l606k0382M582j4778k1100L7897L4464m659
2170D56835m2349j9495N486p077j0315K9114j6405l7160M3637J6225K1988l5634
2158D04850k0945o2977M891j477O55L2886L927j1676n730L2997J3801m606j0411
2145C76185O754K5832L22l0869l9787J1655P19K4032l67K1708k0588L782j1467
2132C67911n060j6062P255m979J0720J4806O049j6396r426N215M68J3310j4129
2119C59682m215j1539l934j2292j8425J4759K743l067K2434J7604j9576o360M987
$$ plain form
2208 516128 502860 504402 483898 470402 459973 463803 458072 442657 458676 456487 450296 472098 455523
2195 455523 443697 449559 426334 416497 434226 409869 403907 415790 429670 413271 425793 415944
2183 415944 416326 410145 411217 428288 444417 440811 420429 425011 410233 389133 427030 461494 456835
2170 456835 414486 394991 400477 393400 383085 412199 395794 358634 402271 418496 440484 404850
2158 404850 383905 320928 325819 324342 324997 357883 361810 350134 344404 377401 391202 386596 376185
2145 376185 382939 408771 409093 378224 338437 350092 350811 374843 374476 396184 375596 379378 367911
2132 367911 362851 346789 354044 349065 359785 374591 380640 364244 354818 360033 360501 373811 359682
2119 359682 355467 343928 339994 327702 309277 324036 326779 323712 346146 363750 344174 337814 342801
2106C42801j8532j0797L72L3418k712o008k2819J6161j2838j1460J4302L3880
2094C55768p090k0901L5248k2355j9971K7604j7987r502K525J0972m1941J1509
2082C03879K2820j208K2915L168n500k0840K775j0362j9492L5674j2846j4155
2070C06828K8922k2257p786N958j0002k947J5636j4294r866L6330j9855K539k1949
2057B87257J8122O511K7620L7406k7051l1087P861j9681L807L0303P275k9679
2045C18664k5693J8314k1785J3416J7259l846j0757n869M479J2824J2213L486
2033C32705q515j2350K8167j150m7641K0326L159j0771q089K7514j5996j5957
2021B91402J6962k9586J4964J7381r622P144j5376L8047j085R227k3393k5051
$$ plain form
2106 342801 324269 313472 313844 347262 344550 338542 315723 331884 319046 307586 321888 355768
2094 355768 348678 327777 363025 340670 320699 348303 330316 320814 323339 334311 292370 303879
2082 303879 326699 325491 348406 351574 346074 325234 328009 317647 298155 333829 320983 306828
2070 306828 335750 313493 305707 311665 301663 298716 314352 300058 290192 326522 306667 309206 287257
2057 287257 305379 311890 339510 376916 349865 318778 326639 306958 310765 341068 348343 318664
2045 318664 292971 311285 289500 302916 320175 316329 305572 299703 304182 317006 329219 332705
2033 332705 324190 311840 340007 338857 291216 311542 314701 303930 295841 323355 307359 291402
2021 291402 308364 278778 293742 311123 301501 308645 293269 331316 330231 339458 316065 291014
2009B91014J3473n40l2809J9253N0014O877K1438k8302j1944r504p985j588J2034
1996C21431L601K0260m215j5119p183r85O403j5231R608o943r246j6627J4750
1983C00504L5188l4962k3371J3376N224K6210n499j6696j2505Q420N3763n295
1971C44357k1970J5517j0045j8718r829K8706R580k0157M0545m3339n104j7657
1959B91886L1505J637k3571k2610J1977R514m7926L4904J971o589o512J1550K2494
1946C10230q793j0780J4659j2774K4899j0283j6527k9187N966j4564Q015N3684
1934C14545J7768k0160K631k7588l435q678k0927q152j1918O798M844L1012o026
1921B70714L8465L4738O141l0232J6159k5158m1550J474j336K0412r643j0646
$$ plain form
2009 291014 304487 303947 271138 290391 340405 347282 368720 340418 328474 318970 310985 309397 321431
1996 321431 325032 345292 341077 325958 318775 317790 324193 308962 318570 311627 302381 285754 300504
1983 300504 335692 300730 277359 290735 295959 322169 316670 299974 287469 295889 349652 344357
1971 344357 322387 337904 327859 309141 299312 328018 337598 317441 357986 314647 309543 291886
1959 291886 323391 325028 301457 278847 290824 300338 252412 287316 289287 282698 276186 287736 310230
1946 310230 301437 290657 305316 292542 317441 307158 290631 261444 267410 252846 260861 314545
1934 314545 332313 312153 314784 287196 283761 275083 254156 246004 234086 240884 245728 276740 270714
1921 270714 309179 343917 350058 319826 335985 310827 269277 270751 269415 289827 280184 269538
1909B69538q39K6867J3121l4915k0112L2663M397k3962j724j5277j4823N1946
1897B86880m4263R560K1683l819K9147J8997j2875k4072J859K204j3028J088j3304
1884B60057N859J8371K238L1609k2431Q619Q650j0649l780j1189m1733L6080N631
1871B87332j2323J0773J114N394O402j0530J6169j1388M46p171j44q040K2278
1858C00312k269j1079o907K4358R848j5051j7166Q258R676n448N066N161K4856
1845C29615p905l0463m861J6597J7042p063j2593N622k1460J514J4504r706j817
1832B89026K1654P166Q690J423l3017l0668J793K1464K4545r130J5120l1440j3604
1819B73022j0456q041K4503R941j0624k6998K4191J3694J9557j3836k5217O843
$$ plain form
1909 269538 268699 295566 308687 273772 253660 286323 290720 266758 265034 249757 234934 286880
1897 286880 242617 252177 273860 270041 299188 318185 305310 281238 283097 285301 272273 273361 260057
1884 260057 265916 284287 286525 318134 295703 304322 312972 302323 298543 287354 245621 281701 287332
1871 287332 275009 285782 286896 292290 298692 288162 304331 292943 293389 286218 286074 278034 300312
1858 300312 298043 286964 280057 304415 314263 299212 282046 290304 299980 294532 299598 304759 329615
1845 329615 321710 291247 286386 302983 320025 312962 300369 305991 284531 286045 300549 290843 289026
1832 289026 310680 317846 326536 327959 294942 264274 266067 287531 312076 302946 318066 286626 273022
1819 273022 262566 254525 279028 288969 278345 251347 275538 289232 308789 294953 269736 276579
1807B76579J4668j507l7777K8294K8402j6561l4351j3227J0116K6709m154j6715
1795B60476n272K6696J5357q656j710k7682r656L1817M655J0032j7479R701o839
1782B81440j5535q473K6997q07l753J8886l9888l462J118K3146J1840l5492m007
1769B52010K9970n088j2180J4613r151P940j3826K2988j636K4958k577k6083J2885
1756B94823O075j9884k1129O859K8000j550m6764L022J7963J2132K574l960k0279
1743B57882J5195L3270K691j8428o045J3750j9435j3952p102j2547O435r721J0109
1730B52102m973J3030J5422n27M938j4494J8710J4900K532j5810j1683k5L500
1717B77622K3744k4577K65M096J4885k709J5325n3529J1682J8134q898L7763K5522
$$ plain form
1807 276579 291247 289740 251963 280257 308659 292098 257747 244520 254636 281345 277191 260476
1795 260476 255204 281900 297257 288601 286891 259209 249553 281370 286025 296057 278578 288279 281440
1782 281440 265905 257432 284429 283622 279869 298755 258867 255405 256523 279669 291509 256017 252010
1769 252010 281980 276892 264712 279325 270174 278114 264288 287276 285640 310598 308021 281938 294823
1756 294823 300898 281014 259885 266744 294744 293194 246430 249452 267415 279547 282121 278161 257882
1743 257882 273077 306347 309038 290610 284565 298315 278880 264928 257826 245279 251714 241993 252102
1730 252102 247129 260159 275581 275054 279992 265498 284208 299108 301640 285830 274147 274122 277622
1717 277622 301366 276789 277054 281150 296035 293326 308651 255122 266804 284938 276040 313803 339325
$$ [...]
##END NTUPLES=NMR SPECTRUM
##END=
