##TITLE=1H_DE-80H_X3
 200.13MHz, d2o
 8 sc
 
 19ns.26.2.2025
##JCAMPDX= 6.0         $$ Bruker NMR JCAMP-DX V2.0
##DATA TYPE= NMR SPECTRUM
##DATA CLASS= NTUPLES
##ORIGIN= UXNMR, Bruker Analytische Messtechnik GmbH
##OWNER= pz
$$ XWIN-NMR		Version 3.5
$$ Wed Mar 11 10:38:26 2026 Russian Standard Time (UT+4h)  Yarkov@DPX200
##.OBSERVE FREQUENCY= 200.1313
##.OBSERVE NUCLEUS= ^1H
##.ACQUISITION MODE= SIMULTANEOUS
##.ACQUISITION SCHEME= undefined
##.AVERAGES= 8
##.DIGITISER RES= 18
##SPECTROMETER/DATA SYSTEM= spect
##.PULSE SEQUENCE= zg30
##.SOLVENT NAME= DMSO
##.SHIFT REFERENCE= (INTERNAL, DMSO, 0, 15.4913)
##AUDIT TRAIL= $$ (NUMBER, WHEN, WHO, WHERE, WHAT)
$$ ##TITLE= Audit trail, XWIN-NMR		Version 3.5
$$ ##JCAMPDX= 5.01
$$ ##ORIGIN= Bruker BioSpin GmbH
$$ ##OWNER= Yarkov
$$ C:/Bruker/XWIN-NMR/data/yarkov2/nmr/H-C/1/pdata/1/auditp.txt
$$ ##AUDIT TRAIL=  $$ (NUMBER, WHEN, WHO, WHERE, WHAT)
(   1,<2026-03-11 10:37:28.62 +0400>,<Yarkov>,<DPX200>,
      <created by zg, POWCHK disabled, PULCHK disabled
       configuration hash MD5:
       00 E9 B6 7A A2 85 ED C7 34 08 36 98 17 FE 4E 26
       data hash MD5: 16K
       0F 19 06 62 8E 3F 7B 87 5D 1E D6 1A 88 2C 3F 11>)
(   2,<2026-03-11 10:37:34.98 +0400>,<Yarkov>,<DPX200>,
      <Start of raw data processing
       efp BC_mod = 2 LB = 0.25 FT_mod = 6 PKNL = 1 PHC0 = -5299.148 PHC1 = 6.821927 SI = 16K 
       data hash MD5: 16K
       0F DF 5A 20 5D 9B AA 5F 22 E2 A7 D0 DD 72 58 4B>)
$$ ##END=
$$ 
$$ hash MD5
$$ 2F 4B 3A 1E 74 E2 33 9E 33 5C CC AD 4D 70 3E 59
##$RELAX= 
##$RELAX= 
##$RELAX= 
##$RELAX= 
##$RELAX= 
##$RELAX= 
$$ Bruker specific parameters
$$ --------------------------
##$DU= <C:/Bruker/XWIN-NMR>
##$EXPNO= 1
##$NAME= <H-C>
##$PROCNO= 1
##$TYPE= <nmr>
##$USER= <yarkov2>
##$AMP= (0..31)
100 100 100 100 100 100 100 100 100 100 100 100 100 100 100 100 100 100 
100 100 100 100 100 100 100 100 100 100 100 100 100 100 
##$AQSEQ= 0
##$AQ_mod= 1
##$AUNM= <au_zg>
##$AUTOPOS= <>
##$BF1= 200.13
##$BF2= 200.13
##$BF3= 200.13
##$BF4= 200.13
##$BF5= 200.13
##$BF6= 200.13
##$BF7= 200.13
##$BF8= 200.13
##$BYTORDA= 1
##$CFDGTYP= 0
##$CFRGTYP= 5
##$CHEMSTR= <none>
##$CNST= (0..31)
1 1 145 1 1 1 1 1 1 1 1 1 1 1 1 1 1 1 1 1 1 1 1 1 1 1 1 1 1 1 1 1 
##$CPDPRG= <>
##$CPDPRG1= <>
##$CPDPRG2= <>
##$CPDPRG3= <>
##$CPDPRG4= <mlev>
##$CPDPRG5= <mlev>
##$CPDPRG6= <mlev>
##$CPDPRG7= <mlev>
##$CPDPRG8= <mlev>
##$CPDPRGB= <>
##$CPDPRGT= <>
##$D= (0..31)
0 0.7 0 0 0 0 0 0 0 0 0 0.03 0 0 0 0 0 0 0 0 0 0 0 0 0 0 0 0 0 0 0 0 
##$DATE= 1773211048
##$DBL= (0..7)
120 120 120 120 120 120 120 120 
##$DBP= (0..7)
150 150 150 150 150 150 150 150 
##$DBP07= 0
##$DBPNAM0= <>
##$DBPNAM1= <>
##$DBPNAM2= <>
##$DBPNAM3= <>
##$DBPNAM4= <>
##$DBPNAM5= <>
##$DBPNAM6= <>
##$DBPNAM7= <>
##$DBPOAL= (0..7)
0.5 0.5 0.5 0.5 0.5 0.5 0.5 0.5 
##$DBPOFFS= (0..7)
0 0 0 0 0 0 0 0 
##$DE= 6
##$DECBNUC= <off>
##$DECIM= 32
##$DECNUC= <off>
##$DECSTAT= 4
##$DIGMOD= 1
##$DIGTYP= 9
##$DL= (0..7)
0 120 120 120 120 120 120 120 
##$DP= (0..7)
$$ [...]
##$SUBNAM2= <"">
##$SUBNAM3= <"">
##$SUBNAM4= <"">
##$SUBNAM5= <"">
##$SUBNAM6= <"">
##$SUBNAM7= <"">
##$SUBNAM8= <"">
##$SUBNAM9= <"">
##$SW= 18.0517328524113
##$SWIBOX= (0..15)
0 0 2 0 0 0 0 0 0 0 0 0 0 0 0 0 
##$SW_h= 3612.71676300578
##$TD= 16384
##$TD0= 1
##$TE= 0
##$TE2= 300
##$TE3= 300
##$TEG= 300
##$TL= (0..7)
0 120 120 120 120 120 120 120 
##$TP= (0..7)
150 150 150 150 150 150 150 150 
##$TP07= 0
##$TPNAME0= <>
##$TPNAME1= <>
##$TPNAME2= <>
##$TPNAME3= <>
##$TPNAME4= <>
##$TPNAME5= <>
##$TPNAME6= <>
##$TPNAME7= <>
##$TPOAL= (0..7)
0.5 0.5 0.5 0.5 0.5 0.5 0.5 0.5 
##$TPOFFS= (0..7)
0 0 0 0 0 0 0 0 
##$TUNHIN= 0
##$TUNHOUT= 0
##$TUNXOUT= 0
##$USERA1= <user>
##$USERA2= <user>
##$USERA3= <user>
##$USERA4= <user>
##$USERA5= <user>
##$V9= 5
##$VALIST= <valist>
##$VCLIST= <CCCCCCCCCCCCCCC>
##$VD= 0
##$VDLIST= <DDDDDDDDDDDDDDD>
##$VPLIST= <PPPPPPPPPPPPPPP>
##$VTLIST= <TTTTTTTTTTTTTTT>
##$WBST= 1024
##$WBSW= 4
##$XGAIN= (0..3)
0 0 0 0 
##$XL= 0
##$YL= 0
##$YMAX_a= 69522
##$YMIN_a= -63667
##$ZGOPTNS= <>
##$ZL1= 120
##$ZL2= 120
##$ZL3= 120
##$ZL4= 120
##$ABSF1= 0
##$ABSF2= 0
##$ABSG= 0
##$ABSL= 0
##$ALPHA= 0
##$AQORDER= 0
##$ASSFAC= 0
##$ASSFACI= 0
##$ASSFACX= 0
##$ASSWID= 0
##$AUNMP= <proc_1d>
##$AZFE= 0.1
##$AZFW= 0.1
##$BCFW= 0
##$BC_mod= 2
##$BYTORDP= 0
##$COROFFS= 0
##$CY= -3
##$DATMOD= 1
##$DC= 0
##$DFILT= <>
##$DTYPP= 0
##$F1P= 0
##$F2P= 0
##$FCOR= 1
##$FTSIZE= 16384
##$FT_mod= 6
##$GAMMA= 0
##$GB= 0
##$INTBC= 1
##$INTSCL= 3.241238e-09
##$ISEN= 128
##$LB= 0.25
##$LEV0= 0
##$LPBIN= 0
##$MAXI= 10000
##$MC2= 0
##$MEAN= 0
##$ME_mod= 0
##$MI= 1.114404
##$NCOEF= 0
##$NC_proc= -8
##$NLEV= 6
##$NOISF1= 3.799351
##$NOISF2= 2.8
##$NSP= 0
##$NTH_PI= 0
##$NZP= 0
##$OFFSET= 15.49127
##$PC= 1
##$PHC0= -5299.148
##$PHC1= 6.821927
##$PH_mod= 1
##$PKNL= yes
##$PPARMOD= 0
##$PSCAL= 0
##$PSIGN= 0
##$REVERSE= no
##$SF= 200.130006089882
##$SI= 16384
##$SIGF1= 3
##$SIGF2= 2
##$SINO= 0.751879
##$SIOLD= 32768
##$SREGLST= <19F.Aceton>
##$SSB= 0
##$STSI= 16384
##$STSR= 0
##$SW_p= 3612.71676300578
##$SYMM= 0
##$S_DEV= 0
##$TDeff= 16384
##$TDoff= 0
##$TI= <>
##$TILT= no
##$TM1= 0
##$TM2= 0
##$TOPLEV= 0
##$USERP1= <user>
##$USERP2= <user>
##$USERP3= <user>
##$USERP4= <user>
##$USERP5= <user>
##$WDW= 1
##$XDIM= 16384
##$YMAX_p= 507620834
##$YMIN_p= -872747
$$ End of Bruker specific parameters
$$ ---------------------------------
##NTUPLES= NMR SPECTRUM
##VAR_NAME=  FREQUENCY,     SPECTRUM/REAL,   SPECTRUM/IMAG
##SYMBOL=    X,             R,               I
##VAR_TYPE=  INDEPENDENT,   DEPENDENT,       DEPENDENT
##VAR_FORM=  AFFN,          ASDF,            ASDF
##VAR_DIM=   16384,         16384,           16384
##UNITS=     HZ,            ARBITRARY UNITS, ARBITRARY UNITS
##FACTOR=    0.220516191357247, 1,           1
##FIRST=     3100.26797251002, 0,            0
##LAST=      -512.44879049576, 0,            0
##MIN=       -512.44879049576, -872747,      0
##MAX=       3100.26797251002, 507620834,    0
$$ Real data points
##PAGE= N=1
##DATA TABLE= (X++(R..R)), XYDATA
$$ [...]
5341B280289K44394r7464j80144j72256K00441k9823l55352J26142N9567J33161
5331B208955O3566K02118k13663p6190k8154Q5799P0003l0166j36850K69928K72805
5320B688151M7303o4445m4828j69276J41448K5030j29376L09616J78470j10169
5310B871924j03640j85399m9930J96855J11255j97606l08123K8693M41700k7393
5300B778336j08312K26531j88443N0905j15647P8426M00810O4819j60536l22673
5290B704216L761j11347L73462J93935j26734K24593j09455L763m25998R7693
5280B827889J04360L0626K96553K88544o6397J34578k04174k16819J78933K32134
5270C606227J31422j4303p7865J13768K30699j02722K4558p8905J4087k04457
$$ plain form
5341 2280289 2524683 2427219 2247075 2074819 2275260 2245437 1890085 2016227 2075794 2208955
5331 2208955 2272521 2474639 2260976 2184786 2156632 2242431 2312434 2282268 2145418 2415346 2688151
5320 2688151 2735454 2671009 2626181 2456905 2598353 2623383 2494007 2803623 2982093 2871924
5310 2871924 2768284 2582885 2532955 2729810 2841065 2643459 2335336 2364029 2805729 2778336
5300 2778336 2670024 2896555 2708112 2759017 2643370 2721796 3122606 3187425 3026889 2704216
5290 2704216 2707977 2596630 2970092 3164027 3037293 3261886 3152431 3156194 2730196 2827889
5280 2827889 2932249 2962875 3259428 3547972 3481575 3616153 3411979 3195160 3374093 3606227
5270 3606227 3737649 3723346 3645481 3759249 3989948 3887226 3911784 3832879 3846966 3642509
5260C642509l47528K09692J73039M28193j59502q4649L87048j45914K03952j04425
5250D202415J7247J90145k38054J92920K8958K56785m5510k0008Q7696N74728
5240E247322Q9516j20581J58860P7811N7778K76635j39979k12631K91460j49821
5230E576370m9635J67550J89694j36842J45896K34553K10083l10436O3659K16429
5220F307321J24504K47541m5619J96048J21643o435l4722J69980J81871R2838
5210G354970r450n4918K98262J29752K50155K20376k00422J86568J73149P4512
5200H422954J81596K67478O5964m7912K24973Q2787O2384J17415L22287M76226
5190A0176152J78906L5140Q4421M14669L83720M21721J67557K21875M89735J43053
$$ plain form
5260 3642509 3294981 3504673 3677712 4105905 3946403 3861754 4248802 4102888 4306840 4202415
5250 4202415 4219662 4409807 4171753 4364673 4393631 4650416 4604906 4584898 4672594 5247322
5240 5247322 5336838 5216257 5375117 5452928 5510706 5787341 5647362 5434731 5726191 5576370
5230 5576370 5526735 5694285 5883979 5747137 5893033 6127586 6337669 6027233 6090892 6307321
5220 6307321 6431825 6679366 6633747 6829795 6951438 6945003 6910281 7080261 7262132 7354970
5210 7354970 7345520 7290602 7588864 7718616 7968771 8189147 7988725 8175293 8348442 8422954
5200 8422954 8604550 8872028 8937992 8890080 9115053 9197840 9260224 9377639 9699926 10176152
5190 10176152 10355058 10390198 10474619 10889288 11273008 11694729 11862286 12084161 12573896 12716949
5180A2716949J19168M24876N10471K67269K30103N95692J52202M31492O24758
5171A6072980L44399N79532Q34317N44555M52787N63158M39626P88103P25567
5162B1345024O00617O00875R89009J115742R08836R60171J070321J172420J319645
5153C0082660J079981J268959J323031J629784J655027J739659J912089K001907
5145D2693097K104474K355922K465919K837376L014757L332015L493276L331981
5137F5628817L575578M189656M401339M726811N042679N079745M987233N695891
5129A03327749N531090N443673M765972M033680L715551L244081K098478J295848
5121A33456122Q0163q33140k119238k708733l616227m317171m487600n179401
$$ plain form
5180 12716949 12836117 13260993 13771464 14038733 14268836 14864528 15016730 15448222 16072980
5171 16072980 16417379 16996911 17831228 18375783 18828570 19391728 19831354 20619457 21345024
5162 21345024 21945641 22546516 23535525 24651267 25560103 26520274 27590595 28763015 30082660
5153 30082660 31162641 32431600 33754631 35384415 37039442 38779101 40691190 42693097
5145 42693097 44797571 47153493 49619412 52456788 55471545 58803560 62296836 65628817
5137 65628817 69204395 73394051 77795390 82522201 87564880 92644625 97631858 103327749
5129 103327749 108858839 114302512 119068484 123102164 126817715 130061796 132160274 133456122
5121 133456122 133536285 132703145 130583907 127875174 124258947 119941776 115454176 110274775
5113A10274775n093237n319089n319432n040084m823206m783467m712232m284278
5105G0899750l822547l739719l432935l205430k957696l052481k610741k300932
5097D5777269k196932j998182j947728j914795j833198j609199j279962j507270
5089C1490003j148331j267787j311433r03479n49854p89732r04487j048360p37844
5080B2828696p32525m92257p08734r88498m69639k72363o09569o42083o60659
5071A7252369l90209o05762j54388l56349n03466j96520k20750m13870m89063
5062A3921992k83335k7825m64167j91809l09981n38967m01732j34555P1120k60823
5052A1379918k14796k59279k40174k61252j88831k19796k56687K5456O5041j1276
$$ plain form
5113 110274775 105181538 99862449 94543017 89502933 84679727 79896260 75184028 70899750
5105 70899750 67077203 63337484 59904549 56699119 53741423 50688942 48078201 45777269
5097 45777269 43580337 41582155 39634427 37719632 35886434 34277235 32997273 31490003
5089 31490003 30341672 29073885 27762452 26858973 26309119 25519387 24614900 23566540 22828696
5080 22828696 22096171 21603914 20895180 19906682 19437043 19164680 18555111 17913028 17252369
5071 17252369 16862160 16256398 16102010 15745661 15242195 15045675 14824925 14411055 13921992
5062 13921992 13638657 13610832 13146665 12954856 12644875 12105908 11704176 11569621 11640741 11379918
5052 11379918 11165122 10905843 10665669 10404417 10215586 9995790 9739103 9764559 9829600 9818324
5042I818324j58407k83620j39185k18412j87561j01164Q3621n0837k86102k51184
5032H225473m5930o3847P7191n4545j39062l05999J46181j09064p3464M5785r3374
5021G609345p8516L8564J65393K566j34700l30857L2170j9000m7643J12482P4296
5010G424100M5751O1596l0729j6854j6062J15838k32327N3909K16511L00187o7986
4999G853934j06656J93283L23975O52690L71047N34403N69156N67739J91554K44746
4989A1395871l87486k01770m94763m3396k23095J28228N20918O8522J67939R4347
4979A1025315L27949K54602L28519N85478O64162N28562O20213Q56986J228856
4970A6420642J227854J407071J781500L023640M349254N704852P446433Q901331
$$ plain form
5042 9818324 9659917 9376297 9237112 9018700 8831139 8729975 8813596 8762759 8476657 8225473
5032 8225473 8179543 8115696 8192887 8138342 7999280 7693281 7839462 7730398 7656934 7702719 7609345
5021 7609345 7530829 7569393 7734786 7737352 7602652 7271795 7303965 7284965 7237322 7349804 7424100
5010 7424100 7469851 7531447 7500718 7483864 7467802 7583640 7351313 7405222 7621733 7921920 7853934
4999 7853934 7747278 7940561 8264536 8917226 9288273 9822676 10391832 10959571 11151125 11395871
4989 11395871 11008385 10806615 10311852 10268456 10045361 10173589 10694507 10763029 10930968 11025315
4979 11025315 11353264 11607866 11936385 12521863 13186025 13714587 14334800 15191786 16420642
4970 16420642 17648496 19055567 20837067 23860707 28209961 33914813 41361246 50262577
4962E0262577R039665O691826L183276l76895l923286n762214p102070o561081
4954D5451798n162005n043990l655968k766760k072480j602349r21166j86435
4946B4040645j09591Q4722M20960M88455Q78091J324773J182071J513670K381946
4937C2205742L365981M768424O926110J0158376J4264886J8028593J8459668J4062483
4929A22240263O570097j812460r281688j3970527j5341944j4246241j2336921
4922F1820579r950023p433054n818876m358844l517440k591848k038996j421512
4914B4689986j089718j204260o03482k36320R3614K22106N21838Q10615J477947
4905B4682326K158543K576242M287435N577033O941988P280861N733846K781470
$$ plain form
4962 50262577 59302242 65994068 69177344 68800449 64877163 59114949 52012879 45451798
4954 45451798 40289793 35245803 31589835 28823075 26750595 25148246 24227080 24040645
4946 24040645 23931054 24015776 24436736 24925191 25803282 27128055 28310126 29823796 32205742
4937 32205742 35571723 40340147 47266257 57424633 71689519 89718112 108177780 122240263
4929 122240263 128810360 126997900 117716212 103745685 88403741 74157500 61820579
4922 61820579 51870556 44437502 38618626 34259782 30742342 28150494 26111498 24689986
4914 24689986 23600268 22396008 21792526 21556206 21649820 21871926 22393764 23204379 24682326
4905 24682326 26840869 29417111 33704546 39281579 46223567 53504428 59238274 62019744
4897F2019744p60707m057111o107491o794880o640775n810130m638901m184939
4889B3024810l253131k412762j877512j691217j365288p67563r37949p94707n51151
4880I373530p45573m73769j496j03037n23250o2101l45337l36842n7131m4865
4870F680129k61865m10060j53013J15635o9546l25911n9480J8151M08215p9151
4860E863104M02899L6864L43602L54788K00090M09515K89368K58884p9163m2237
4850H037714r2344m04262n25738p7816l7564k13477O006L24037J993M78583N06881
4839H004013J21034N15615N52194L63902P26559J513101K090000M086339Q204766
4830B6177523J3504581J6437075J1710071K062088l574346r184982j1763362j0410480
$$ plain form
4897 62019744 61259037 57201926 51094435 44299555 37658780 31848650 27209749 23024810
4889 23024810 19771679 17358917 15481405 13790188 12424900 11657337 10719388 9924681 9373530
4880 9373530 8627957 8154188 8152692 8049655 7526405 7464304 7118967 6782125 6724994 6680129
4870 6680129 6418264 6008204 5855191 5970826 5901280 5575369 5515889 5534040 5942255 5863104
4860 5863104 6266003 6302867 6646469 7001257 7201347 7610862 7900230 8159114 8079951 8037714
4850 8037714 7945370 7541108 7015370 6937554 6899990 6686513 6692519 7016556 7018549 7497132 8004013
4839 8004013 8125047 8640662 9192856 9556758 10283317 11796418 13886418 17972757 26177523
4830 26177523 39682104 56119179 67829250 69891338 66316992 57132010 45368648 34958168
4822C4958168p843162n446512m162872l021859k005568j493989j211376l58835
4814I413995o32396m99289p6276j83034J17438O23812O79260Q10908J07413j68002
4804A0193829m15610p59064j107585r00100o21792j36344m35300m40790k35788
4795E141456j19923O1306j62506K65539o2924l8967J11804L22J05696L35707N63017
4784F200527K69598Q44204J256130J644131J888996J467272P10610l68538r34205
4775A2978725j199555j429815j426645j434655r65303l43083o50224l79660k21573
4766D928212k72124L28148R607j28663j62607M96M12944l4859J48131L68963K76317
4755E874565M95368M04135Q77892R89482N55313j63463M5o08731r21144p01382
$$ plain form
4822 34958168 27115006 21668494 17505622 14483763 12478195 10984206 9772830 9413995
4814 9413995 8781599 8282310 8206034 8023000 8140438 8764250 9443510 10254418 10361831 10193829
4804 10193829 9778219 9019155 7911570 7011470 6389678 6253334 5818034 5377244 5141456
4795 5141456 5021533 5082839 4920333 5185872 5122948 5083981 5195785 5196107 5301803 5637510 6200527
4784 6200527 6470125 7314329 8570459 10214590 12103586 13570858 14281468 13912930 12978725
4775 12978725 11779170 10349355 8922710 7488055 6522752 6179669 5529445 5149785 4928212
4766 4928212 4656088 4984236 4993843 4865180 4702573 4703069 5116013 5081154 5229285 5598248 5874565
4755 5874565 6369933 6774068 7651960 8641442 9196755 9033292 9033337 8424606 7503462 6802080
4745F802080o50865m86960k01674l70970l37112j20752k31334r8807j6225J02668
4735D390049k26129N3196M7896j61994m69375O736J43625J16712K93621l07159
4725C887178l5638J53043R3165j73462O7180J5676j77177j00570J58556m7442
4715C840509N7272J91373J21434R9617m77725L0514K03320j92807L1312N27173
4705D431992K23482J9229j05463R2314j46792l48999K13061K33675k45974n61487
4695C805038l59044P1587l06424K75180J02812k69942k08066J48723p2888q805
4685C178171J60497R0882J60874L70591J05042p8339l6607J64752R2801p6714
4675D131950n5706k86021l98017M3642J34566J38845L98576k9467k3671J06765
$$ plain form
4745 6802080 6151215 5664255 5462581 5091611 4754499 4633747 4402413 4303606 4287381 4390049
4735 4390049 4163920 4217116 4265012 4103018 3633643 3640379 3784004 3900716 4194337 3887178
4725 3887178 3851540 4004583 4097748 3924286 3991466 4007142 3829965 3729395 3887951 3840509
4715 3840509 3897781 4089154 4210588 4310205 3832480 3862994 4066314 3873507 3904819 4431992
4705 4431992 4655474 4674703 4569240 4661554 4514762 4165763 4378824 4612499 4366525 3805038
4695 3805038 3445994 3517581 3211157 3486337 3589149 3319207 3111141 3259864 3186976 3178171
4685 3178171 3338668 3429550 3590424 3961015 4066057 3987718 3951111 4115863 4208664 4131950
4675 4131950 4076244 3790223 3392206 3435848 3570414 3709259 4107835 4078368 4054697 4161462
4665D161462J13703j751K4580m85324l86762M8386k4099M1304K41317m4088j09941
4654C578787r3424K88729J5279Q6904M3246J14002J83300k81432J04942o5278
4644C975055J50044k5743j97795J09115L09774K85159M58668K07410K47434M47230
4634E966351M09286P15382O08554J471072J762858K653231M336732L765606J432892
4625B3121964O7682j260275k935238l044486k108867j655391j204164q15370l89596
4616I776259J95045M74215M13903J100846J672166J922269K069413K057880J508308
4607B1190304J190746R33267R40983J787523K583296L210709L014075J911774
4599C6762677M76033j43924l45050L75258J331358L009826L393979K014694L53277
$$ plain form
4665 4161462 4275165 4273414 4297994 3812670 3425908 3474294 3450195 3491499 3732816 3688728 3578787
4654 3578787 3485363 3774092 3789371 3876275 3919521 4033523 4216823 3935391 4040333 3975055
4644 3975055 4125099 4099356 3901561 4010676 4320450 4605609 5064277 5271687 5519121 5966351
4634 5966351 6375637 7091019 7699573 9170645 10933503 13586734 17923466 21689072 23121964
4625 23121964 23189646 21929371 18994133 15949647 13840780 12185389 10981225 10165855 9776259
4616 9776259 9971304 10445519 10859422 11960268 13632434 15554703 17624116 19681996 21190304
4607 21190304 22381050 23314317 24255300 26042823 28626119 31836828 34850903 36762677
4599 36762677 37238710 37094786 36749736 37124994 38456352 41466178 44860157 46874851 47228128
4590D7228128j815807k436352k650292k066397m17322N6633O4071r55490j910215
4581C5096957k662430k957332k589478k049370j459286q24069q97030j677298
4573A9980664k047945j980097k114022k257351j690891j257431j194961r93941
4565F444025o98130n48620l18620k15971j94980k24627k89640n2958j25103p8735
4555C696641j39422l44077k39316r5963j2129k50472J0596m5292k22226j0020
4545B348320J60331k23569n8874j31027j75177J34258J22745j12675k20055L1405
4535A875682L02991j14033R075l65404N7484J77593K7310j1036K9176l46291p2003
4524A570544K2740q5930K97426k19975j10637J24808M8802p7265j72270k03552
$$ plain form
4590 47228128 45412321 42975969 40325677 38259280 37841958 37898591 37962662 37007172 35096957
4581 35096957 32434527 29477195 26887717 24838347 23379061 22554992 21657962 19980664
4573 19980664 17932719 15952622 13838600 11581249 9890358 8632927 7437966 6444025
4565 6444025 5745895 5197275 4878655 4662684 4467704 4243077 3953437 3900479 3775376 3696641
4555 3696641 3557219 3213142 2973826 2877863 2865734 2615262 2625858 2580566 2358340 2348320
4545 2348320 2508651 2285082 2226208 2095181 1920004 2054262 2177007 2064332 1844277 1875682
4535 1875682 2178673 2064640 2073715 1708311 1765795 1943388 1970698 1959662 1988838 1642547 1570544
4524 1570544 1593284 1507354 1804780 1584805 1474168 1598976 1647778 1570513 1398243 1194691
4514A194691K04604J46998o5458J165J5331M0540J90073l60387j12079j83274
4504A072204O1000J23418N4330l9874l42004j08452K97291J57640j6419j46931
4494A112203k80039P1104J62537r9216j30084j64727J28026q4172J37267p3734
4484G79165o2441J84376J6861o2940j02146J36833j80852k4598M12109r0686J30849
4473A136530r5186R6756J70943j24855k37227P7658J12826Q4518J6661j46347
4463A092277K82087l71738l7083O6854l02708k32450L41530L1377N3025Q8853
4453A012024k83117j33865K67283M4585K0366M8420k09193j0895j04701M2970
4443F93877K36970K5403l8499j29215J63523J1290J45553N062j25967q7270j7765
$$ plain form
4514 1194691 1399295 1546293 1480835 1482000 1497331 1537871 1727944 1367557 1255478 1072204
4504 1072204 1133204 1256622 1310952 1271078 929074 820622 1117913 1275553 1259134 1112203
4494 1112203 832164 903268 1065805 966589 836505 671778 799804 715632 852899 779165
4484 779165 716724 901100 917961 855021 752875 889708 708856 684258 1096367 1005681 1136530
4473 1136530 1041344 1138100 1309043 1184188 946961 1024619 1137445 1221963 1238624 1092277
4463 1092277 1374364 1002626 965543 1032397 729689 497239 838769 870146 923171 1012024
4453 1012024 728907 595042 862325 906910 927276 975696 766503 755608 650907 693877
4443 693877 930847 956250 917751 788536 952059 963349 1108902 1113964 987997 900727 882962
4432H82962q8473m9948J93400k36596j7763p7495P3426k4526k73459k64766K78158
4421C94920K38066K06653o7268o2927j54208L2110J20745k7546O2774l33030K07577
4410F17866M7183r3149L61314k93718l65317j0341L0455k3047J17630P2604P1055
4399E32535k4906l1078J15667p4499N6206j4089p4321k27392K13910N1371o6833
4388D56571q673J87486j64423J74392J47414n5613j02619k45256p9540J88202
4378D97941k28517k9315M91976p506k23029J86952j04508o6890P9701K5216l9061
4367E82960j55928Q5405l19455N45247n4274q1357l2354j027J76612k27937j0180
4356E07712m8823J18343P8217j821j12778Q8314J63530j86016o0840J97106J13285
$$ plain form
4432 882962 794489 744541 937941 701345 683582 606087 679513 654987 381528 116762 394920
4421 394920 632986 839639 772371 709444 555236 587346 708091 680545 743319 410289 617866
4410 617866 665049 571900 933214 639496 274179 263838 294293 271246 388876 461480 532535
4399 532535 507629 476551 592218 517719 573925 559836 485515 258123 472033 523404 456571
4388 456571 447898 635384 470961 645353 792767 737154 634535 389279 309739 497941
4378 497941 269424 240109 732085 724579 501550 688502 583994 517104 596805 622021 582960
4367 582960 427032 512437 192982 738229 683955 602598 570244 569217 745829 517892 507712
4356 507712 458889 577232 655449 653628 540850 629164 792694 606678 545838 742944 856229
4345H56229L9244n2145j59078j00538O5482j9817L3905K27356J02353r5875q5549
4334H11567j12410k58016J82948L1695o0155j90545R9458M6158J77630M3921J4153
4323G86404n9386m25151K51562l5238Q6814K59248J39509l37641J28410M0454
4313H34985J10589r0709N5311K08655q1529k16190p1046K50771j56002k44875
4303E99960M3616L1089j61926K6866O0849J71292l3649O543K18310K57140k55048
4292I65042k5850m0867J1146j32394o2466M85195O4526J65855o122k23092J95245
4281A396218L01481q0730l41881m0587N7912j59480N1439o188K1357j30398J07910
4270A177053j93297O1960J11159j51351J57472k33345J39237l3730L3665L8201
$$ plain form
4345 856229 895473 843328 684250 583712 649194 629377 663282 890638 992991 897116 811567
4334 811567 699157 441141 624089 655784 595629 405084 504542 550700 728330 772251 786404
4323 786404 727018 301867 553429 518191 605005 864253 1003762 666121 794531 834985
4313 834985 945574 854865 910176 1118831 1037302 821112 750066 1000837 844835 599960
4303 599960 643576 674665 512739 539605 600454 771746 738097 744640 962950 1220090 965042
4292 965042 939192 898325 909471 777077 714611 1199806 1264332 1430187 1424065 1200973 1396218
4281 1396218 1697699 1616969 1275088 1234501 1292413 1132933 1184372 1178184 1199541 1069143 1177053
4270 1177053 983756 1045716 1156875 1005524 1162996 929651 1068888 1035158 1068823 1107024
4260A107024M940j150J9692J16713O698J34917j0111k72747O8385J46841K57734
4249A578936l7979q4655J33602Q3107J32772L34139K84908j8873K4506J36684
4239B567147K59724K50385L83510N49064Q05530J340573K443654M693509O527716
4230A9820812N295500J481026j201853l386506m619343m246123l482655k316797
4222G344061j369603j130812q44878q46640l42823k12759j46543k00386l12302
4213A937315K6614j52968q3712j2980P933P8453k8123l20298k6080N6968k18607
4202A264515l3274J74285k02864J14615J21078M9227L4447l63787j17556K8934
4192A069620N0727K9928k37812J47122N3790J88014j48934J57801l1512j77231
$$ plain form
4260 1107024 1111964 1110814 1130506 1247219 1253917 1388834 1378723 1105976 1174361 1321202 1578936
4249 1578936 1540957 1456302 1589904 1673011 1805783 2139922 2424830 2405957 2430463 2567147
4239 2567147 2826871 3077256 3460766 4009830 4815360 6155933 8599587 13293096 19820812
4230 19820812 25116312 26597338 25395485 22008979 17389636 13143513 9660858 7344061
4222 7344061 5974458 4843646 3998768 3152128 2809305 2596546 2450003 2249617 1937315
4213 1937315 1963929 1810961 1727249 1714269 1722202 1800655 1772532 1452234 1426154 1483122 1264515
4202 1264515 1231241 1405526 1202662 1317277 1438355 1487582 1522029 1158242 1040686 1069620
4192 1069620 1120347 1150275 912463 1059585 1113375 1301389 1152455 1310256 1278744 1101513
4182A101513j33291j07733P5225L61527l77638j53633K29844l17473O7938k5392
4172G20887J24756q8572O0998N5888j51118K22966J84228k73498M5700q6507R9301
4161I15029Q5658j46588r0821J60726K36277j71026j84156Q438K40370O4589k74809
4150H43687j03820K17487j32030p2682K6841j92378J60991L45134n4814N4643
4140A093059O7439j95601l3046K16090P871j90564l15575j77827N7244L11758
4130H40848j52288k0476J65831j37465J77391K6799j26648q1526j26493O5858
4120F31831L29660j50807j27889R3304j11205j79976M68028J51149N5539L7569
4110A197203P324m8621j05817k52372k22890J00752k33553j6209J53943k04166
$$ plain form
4182 1101513 968222 860489 935714 1297241 919603 765970 995814 678341 746279 720887
4172 720887 845643 757071 818069 873957 722839 945805 1130033 856535 902235 815728 915029
4161 915029 1000687 854099 763278 924004 1160281 989255 805099 813537 1053907 1118496 843687
4150 843687 739867 957354 825324 752642 779483 587105 748096 1093230 1038416 1093059
4140 1093059 1160498 964897 931851 1147941 1155812 965248 649673 471846 529090 840848
4130 840848 688560 668084 833915 696450 873841 900640 773992 692466 565973 631831
4120 631831 961491 810684 682795 776099 664894 484918 952946 1104095 1159634 1197203
4110 1197203 1204527 1155906 1050089 797717 574827 675579 442026 425817 579760 375594
4100C75594K80958q0030j07451K76411r2474J14951R4273P4696R1061k21527N6658
4089H63120R4602J06923k0807n9088R073P9479q8427j12973M991K6252m9735Q7651
4077I41061L35831K37391J070k4414M4356j15518L70j02223J78774N1870Q5633
4066A634201J26010J14281L28491Q09279Q72432J610962K735847L080135J743474
4057A3055112m6829q15106j822486k279166j631995j265639o91446p90365m60345
4048C251735l08039l24718m8098N7956m26333n30579n3771J16320J95460m2699
4038A887234m3868j87664J35876K12161j55428l39138o6730m0920J44329l28769
4028A217083r3635j34709j12521J48364K42836k60304j78884J80708k14931J60328
$$ plain form
4100 375594 656552 576522 469071 745482 653008 767959 862232 936928 1027989 806462 863120
4089 863120 957722 1064645 1043838 984750 993823 1073302 984875 871902 876893 903145 853410 941061
4077 941061 1276892 1514283 1515353 1490939 1535295 1419777 1420147 1317924 1496698 1548568 1634201
4066 1634201 1760211 1874492 2202983 3012262 3884694 5495656 8231503 11311638 13055112
4057 13055112 13008283 12193177 10370691 8091525 6459530 5193891 4502445 3712080 3251735
4048 3251735 2943696 2618978 2570880 2628836 2202503 1671924 1618153 1734473 1929933 1887234
4038 1887234 1843366 1655702 1791578 2003739 1848311 1509173 1442443 1401523 1545852 1217083
4028 1217083 1123448 988739 876218 1024582 1267418 1007114 828230 1008938 794007 954335
4018I54335Q729L7092j53185R2065j8931j79196r0174k7994P3103L77011j10565
4007I62290p8520J21466J2947P7957l9426j21940k06055J31222J5365j50840l39443
3996C85023P6960J26463r0352Q7297k5960Q4452k8854k4077m4935K71552k3328
3985G94241j21771J8165k39469l123K26365J16160R123k3250q9708k0388N3952
3974G20297L09734j68799l0271P6167J52293k41309j93950j3909O6966J60310
3964H37529K8418J68865N3863M31498q2874L2973M14700L11216M94816R51509
3954C642513K270017K989234J888778J42288p05892j275618j931354j228281j449740
3945D341945r23123l91561m07365l89510l59185R6659k08444q1235O6555j12246
$$ plain form
4018 954335 963064 1000156 846971 939036 920105 740909 650735 622741 695844 1072855 962290
4007 962290 883770 1005236 1018183 1096140 1056714 934774 728719 859941 875306 724466 385023
3996 385023 461983 588446 498094 585391 559431 643883 615029 590952 546017 817569 794241
3985 794241 672470 690635 451166 448043 674408 790568 799691 776441 686733 666345 720297
3974 720297 1030031 861232 830961 907128 1059421 818112 624162 610253 677219 837529
3964 837529 865947 1034812 1088675 1520173 1437299 1470272 1884972 2196188 2691004 3642513
3954 3642513 5912530 8901764 10790542 10932830 10226938 8951320 7019966 5791685 4341945
3945 4341945 3418822 3027261 2619896 2230386 1871201 1967860 1759416 1678181 1744736 1632490
3935A632490j47102K78547N395J83506r631J84077o9625j72451J02555L07486
3925B295247M12833J302355J987349K540880J850312L99094m03805j332267j755341
3916G296657j716110j472233j005312n35770l30920l39587m89987p2656J12837
3907A446919j75509l86520M1958k9717j04724R1159q483n878k06535Q6829N5190
3896H04689o4459j39554l0714j4933q8284J03174m3789J46820J24627R7078K56456
3885A151111k06440k59816j37751k9964j35711O9317Q0271N3586K592n4150p0925
3874D62120j18882R5844k04867k2925K5129j35666J22549J25203k6016N104j71619
3863A55974K59413k12069J19762m2021j01285m7353R0371j40344j46197L45586
$$ plain form
3935 1632490 1485388 1763935 1769330 1952836 1943205 2127282 2057657 1885206 1987761 2295247
3925 2295247 2708080 4010435 5997784 8538664 10388976 10788070 10384265 9051998 7296657
3916 7296657 5580547 4108314 3103002 2567232 2236312 1896725 1406738 1334082 1446919
3907 1446919 1271410 884890 926848 897131 792407 883566 875083 869205 662670 749499 804689
3896 804689 740230 600676 569962 555029 466745 569919 526130 672950 797577 894655 1151111
3885 1151111 944671 684855 547104 517140 381429 450746 531017 584603 587195 533045 462120
3874 462120 343238 439082 234215 211290 236419 100753 223302 348505 322489 327593 155974
3863 155974 415387 203318 323080 281059 179774 132421 222792 82448 -63749 281837
3853B81837J23576n2857p9255K84026K4101l88273J83161k0471K8847M4452k0931
3842D08213r6429o3359O2219Q8550Q0092j40787q4117N505j833J55028j49877
3831B63205L04356n5413k76416J98587j72089P726n2420J22876j63568k12033
3821c5189j35703K99657K46738J1095J31840R695k19099k18211r4363M7251L16175
3810C59886J6026L2828O9349k96738L54044J50049j74338r4111j16839P9345K02122
3799E81623L9722k14461r7117o1295k5088j96219M51911k37092k09952Q7085J824
3788A20941J47333K6417l0005J00396K19342l0763k03243p223J71323k49421n4263
3777B10834m4537K08797J65267J21557k52237p3940L01638k44466O7382Q2542
$$ plain form
3853 281837 405413 352556 273301 557327 581428 193155 376316 355845 384692 429144 408213
3842 408213 311784 248425 310644 399194 479286 338499 254382 259887 258054 413082 263205
3831 263205 567561 512148 235732 434319 262230 269956 217536 340412 176844 -35189
3821 -35189 -170892 128765 375503 386598 518438 528133 309034 90823 -3540 43711 359886
3810 359886 375912 408740 478089 181351 535395 685444 511106 416995 300156 379501 581623
3799 581623 621345 406884 309767 248472 223384 27165 479076 241984 32032 119117 120941
3788 120941 268274 294691 264686 365082 584424 553661 350418 343195 514518 265097 210834
3777 210834 166297 375094 540361 661918 409681 335741 637379 392913 460295 542837
3767E42837k88062J74618k08950Q613M0157K06313j03117j68210Q5525N5867k25633
3756A19958n4881j82651K74322M42102j8127n1590j74950l73798k50593m2206
3746c12414J29440K17052J02064J12601J77948k15963k63659K7555Q2137Q6706
3736A43467k71382J79583N5689n0834J15356R0971j02138m9304m575J66094M7324
3725C20251j2688J03668q1932L036J22674j23516k32509j19940M9715j26258J44161
3714D6662R2108J06797J59250j32471p086J33198j96966L4991L6406j51956M27469
3703E48402j9529k33276k08331o5902J01145R4283J17341k29341j71282K17656
3693A51166k21221r8082M62408K42639k44030j53383Q232L53668j78799j9315
$$ plain form
3767 542837 254775 429393 220443 229056 269213 475526 372409 204199 289724 345591 119958
3756 119958 65077 -117574 156748 598850 580723 529133 354183 -19615 -270208 -312414
3746 -312414 -182974 34078 136142 248743 426691 210728 -52931 -25376 56761 143467
3736 143467 -127915 51668 107357 56523 171879 262850 160712 111408 106833 272927 320251
3725 320251 307563 411231 329299 332335 455009 331493 98984 -20956 28759 -97499 46662
3714 46662 138770 245567 404817 272346 265260 398458 201492 236483 272889 120933 548402
3703 548402 528873 295597 87266 21364 122509 216792 334133 104792 -66490 151166
3693 151166 -70055 -168137 294271 536910 292880 139497 147729 501397 322598 303283
3683C03283L13590k38791m42297J0131J88803K35358j72416k23284L52877k22921
3673A04333L6614L00951o2425k61671o0690R7614J38237j65548K67020k3091m8449
3662C22895k23215o8423L07827R0698R6987l6647r0827m2076o5903l2143j15605
3651A43568Q900J06984J75851o8479j28229j86490K2317j43983L75O6234L14516
3640C11564m1552j06942J21813j59794J85589k85431j61288R8754J42376M02001
3630E07090l26054J1634J32129k13696Q7340k63639J34355j81114N7363J21888
3620F7296J77657P1401O6924J66919j64214K1867n1209j34286j46087L8220k8392
3609H6096j7161j20798K9785J87522j2133K54143j12081m9770Q3292J77283l0614
$$ plain form
3683 303283 616873 378082 -64215 -54084 134719 370077 197661 -25623 327254 104333
3673 104333 140947 441898 379473 117802 57112 154726 292963 127415 394435 371344 322895
3662 322895 99680 31257 339084 429782 526769 490122 399295 357219 291316 259173 143568
3651 143568 152468 259452 435303 366824 238595 52105 74422 -69561 -69186 -2952 311564
3640 311564 270012 163070 284883 125089 310678 25247 -136041 -37287 105089 507090
3630 507090 181036 192670 324799 111103 198443 -65196 69159 -111955 -54592 67296
3620 67296 244953 316354 383278 550197 385983 407850 356641 222355 76268 114488 86096
3609 86096 68935 -51863 -22078 165444 153311 407454 295373 245603 328895 506178 475564
3598D75564j29052m151J83518K16846o4031j74102J27979N8916K8578k747M464
3587G21782M2143k23508Q1943l2622j06753K37213O9100r9952j33875j75747j74408
3576B05316Q7651J05129K0046J10947k20131j23606K25992K08673p1956N9891
3566F07952J4170O0535k14652o937R3052L34615j23341q6900L02488R2836j29335
3555I44483j8022o5562j79553L694q6224O5837l9307J25835l90213R4789Q4291
3544E40048j28934k9002K59688j12279k43968L77426k41589k35415J17824K46936
3534E50735n9132j5607J86344O0812K04189K1204j88555K50241k60616k32200
3524E17415J06761j05534J61383R7110l17073J03063L6974j53954J1854m6159
$$ plain form
3598 475564 346512 342361 525879 742725 678694 504592 632571 691487 720065 717318 721782
3587 721782 763925 540417 622360 589738 482985 720198 789298 689346 555471 379724 205316
3576 205316 292967 398096 418142 529089 308958 185352 411344 620017 548061 607952
3566 607952 622122 682657 468005 461068 554120 888735 765394 678494 980982 1073818 944483
3555 944483 926461 860899 681346 685040 598816 664653 625346 751181 360968 455757 540048
3544 540048 411114 382112 641800 529521 285553 662979 421390 185975 303799 550735
3534 550735 491603 475996 662340 723152 927341 948545 759990 1010231 749615 517415
3524 517415 624176 518642 680025 777135 460062 563125 600099 446145 457999 411840
3514D11840P2282j35548J16478j44541k19892L78869K60413q6563o3230k78773
3504C11335J10859J07522J57725n2582k02676J46931j33099K5174j84766l12231
3494b5808J24458K02485q3949J86944L73223l22396L9462K67853j56455k26302
3484C79515K5795K1121K60784L3434k61572o1062m8829K74242K87224j5407k37850
3473F57395k12589M6257N23K03968J00592q3127j79100M2188J00739j59161O2095
3462E79780K14791k03349K80489k37765J05396J22518k66212k4872R4086K36027
3452I00889k41766j18622M0809K71016j20011K8690J02175J10216k44572k60901
3442D67923J90023o389p423p5306j24088K7555J11607k67617r2688J69249J16275
$$ plain form
3514 411840 484122 348574 465052 320511 100619 479488 739901 653338 590108 311335
3504 311335 422194 529716 687441 634859 432183 579114 446015 471189 286423 -25808
3494 -25808 98650 301135 217186 404130 777353 454957 494419 762272 605817 379515
3484 379515 405310 426431 687215 720649 459077 398015 349186 623428 910652 895245 657395
3473 657395 444806 491063 491586 695554 796146 713019 533919 576107 676846 517685 579780
3462 579780 794571 591222 871711 633946 739342 861860 595648 570776 664862 900889
3452 900889 659123 540501 581310 852326 732315 761005 863180 973396 728824 467923
3442 467923 657946 651557 644134 568828 444740 472295 583902 316285 223597 392846 509121
3431E09121k0055J93702K6152k77740j0792J17624j11497k34527j87503K36620
3421B41105M50409l67902l1813k68672q999p8894L66140M0367m3036j02470j13783
3410H2452J69134J18597l3435J21248P6497M0310J04580j10097k16861o837j4132
3399C31456q2851J20397k3478K18142K2602j85912r0738o2329O8247p7439j65281
3388G2816L3790q9210J11344J42718j32020m3517j07073N3151L91995Q0983l0509
3377D84468m5093k23240p8553j5613K18613K32933O381j06618r6270J14742L68855
3366H60605k19243K45556J49919j99830m2445p6415j60836n11716Q4171K32706
3356C62472N7433q6399j89444J73165k6004O7975j64496O7657J2094r579q2565
$$ plain form
3431 509121 489066 682768 708920 431180 420388 538012 426515 191988 4485 241105
3421 241105 691514 323612 291799 23127 14128 -64766 301374 341741 298705 196235 82452
3410 82452 251586 370183 336748 457996 534493 574803 679383 569286 352425 345588 331456
3399 331456 248605 369002 345524 563666 586268 400356 309618 247289 315536 238097 72816
3388 72816 106606 17396 128740 271458 139438 95921 -11152 41999 433994 514977 484468
3377 484468 439375 216135 137582 121969 340582 573515 579896 473278 377008 491750 860605
3366 860605 641362 886918 1036837 837007 794562 718147 557311 45595 129766 362472
3356 362472 419905 333506 144062 317227 291223 359198 194702 262359 274453 264874 182309
3345A82309L5502K49335j38852P0907p3751m8714J15203J71404k4139N02837j41673
3334I00368J93471Q5082n7568k34898k60205k09384l20522P541K86802M5765J29483
3323E65935r5104j86415J05523j22424k37481k5647o0806L1748o472K95548L20356
3312E84761j63458K01222q9781m93823J50655J21474l80501M4702L86086j38576
3302B22761j312M3897K49835K30086q9957k17480j87461m1565J0168J57977l37007
3291C9942L1078J89335K06915J71047l34115n6801j1420r9699m9927Q2188O311
3280A74854J73019J36024k34170N9424j60649K1127K33495j55596l3926R1606
3270C05208j35389Q6054K05864j36487N597l7469k3404m3555j84288J6148J90781
$$ plain form
3345 182309 217811 467146 328294 399201 325450 276736 391939 563343 539204 1042041 900368
3334 900368 1093839 1178921 1121353 886455 626250 416866 96344 103885 390687 436452 565935
3323 565935 470831 284416 389939 267515 30034 4387 -56419 -24671 -31143 264405 584761
3312 584761 421303 622525 532744 38921 189576 311050 -69451 -24749 361337 222761
3302 222761 221449 265346 515181 745267 655310 437830 250369 208804 218972 376949 39942
3291 39942 71020 260355 467270 638317 304202 247401 235981 136282 86355 168543 174854
3280 174854 347873 483897 249727 309151 148502 169629 403124 247528 213602 305208
3270 305208 169819 255873 461737 325250 330847 293378 269974 226419 42131 58279 249060
3259B49060O3063l8881j80790m3356J52814j01877j60417k8470P009L8847J50186
3248A07188J79984P1615J40278p3000k47939n5139j48348J11468L31830l27353
3238I0584j99228L45546j57543m1349l1395J00772L13461j31226k89298J91999
3228A92323p9591Q9436j73299m4796K48273n8058J93771o9732m0787m4552q7287
3217A25701O6144Q1508J11024L6589q0001j70474N6173J98849m0711l5470L0545
3206C79877P8147N9348j43655P9424j04992j07164J70152m0780J15965j95583
3196B90739k78788M2063J15240N6109J5489J9388j46178J55044O0940K5784j8366
3185C37464j53672m7846K02277Q61j74890J87939K32646m6094J48810j25464l50367
$$ plain form
3259 249060 312123 273242 92452 49096 201910 100033 -60384 -88854 -81845 -42998 107188
3248 107188 287172 358787 499065 426065 178126 122987 -25361 86107 417937 90584
3238 90584 -108644 236902 79359 38010 6615 107387 420848 289622 324 192323
3228 192323 112732 202168 28869 -15927 232346 174288 368059 298327 257540 212988 125701
3217 125701 191845 273353 384377 420966 340965 170491 226664 425513 384802 349332 379877
3206 379877 458024 517372 373717 453141 348149 240985 411137 370357 486322 290739
3196 290739 11951 54014 169254 225363 240852 260240 114062 269106 330046 355830 337464
3185 337464 183792 135946 338223 339084 164194 352133 584779 538685 687495 562031 211664
3174B11664k39317J70738k5895J05930J27055K3004j09265J27337k07274N9052
3164B43029K50298m6873J35411M8074J38486j34310j80884j24585j15749j06516
3154A06381N619J21434j71587J34084j28003Q670J18394j16353J01284L5972R6661
3143C12556J29912m6043k59602M6458K66519R5091J84496J7314m42845j17290
3133A86566q0794L45036K63504k11317O4963K23384j22105k16204l11272J33803
3123B75564O7920j1790P6382j67449L7226M04709O1979j92734k51733m0498K6442
3112B86018m9278j05978Q1466j10452j90885L2129K34626K57585j91208o3212
3102A80811J72817j58750j82787p1193M28061K67815j46466k44231j23604l3442
$$ plain form
3174 211664 -27653 143085 117190 223120 350175 373179 263914 391251 183977 243029
3164 243029 493327 446454 581865 629939 768425 634115 453231 328646 212897 106381
3154 106381 112000 233434 61847 195931 67928 76598 194992 78639 179923 215895 312556
3143 312556 442468 396425 136823 183281 449800 544891 729387 746701 303856 186566
3133 186566 105772 450808 714312 502995 567958 791342 669237 453033 141761 275564
3123 275564 343484 331694 408076 240627 277853 682562 744541 551807 300074 259576 286018
3112 286018 236740 130762 212228 101776 -89109 -56980 177646 435231 244023 180811
3102 180811 353628 194878 12091 -59102 368959 636774 490308 246077 122473 89031
3092H9031L64078K79680M2939l94169O1065q0744p741L57719l40041l06194q2307
3081a6684K41565L19863J48224j05711P275P1833j5570j07033j58743j01259j44766
3070A38994m9012P7417J54287l7876n5617k68785K73818J59018J58319N9795l91192
3059B19166K1858N5189k9728j73361K55051N5188K8074P1112j96835J67673m5090
3048D28297n5198k49755N8670J25530K4742k32061n1607J91053j94086J01164
3038A46749N1271j27765l3303o152k35951K12476N3756K6345k31188K02540K79199
3027C37977O7349l05957r2735p7015J67893K10009j22972Q1754K8547p6786m5735
3016A72329n4945J46523l4205M1456R9682j30545k36579M6309N4382j31906J45827
$$ plain form
3092 89031 453109 732789 775728 381559 442624 361880 354139 711858 371817 65623 -16684
3081 -16684 224881 544744 692968 587257 594532 666365 650795 543762 385019 283760 138994
3070 138994 89982 167399 321686 283810 228193 -40592 233226 392244 550563 610358 219166
3059 219166 241024 296213 266485 93124 348175 403363 431437 502549 305714 473387 428297
3048 428297 373099 123344 182014 307544 332286 100225 48618 239671 45585 146749
3038 146749 198020 70255 36952 30800 -205151 7325 61081 87426 -143762 58778 337977
3027 337977 405326 99369 6634 -70381 97512 307521 184549 266303 294850 218064 172329
3016 172329 117384 263907 229702 271158 370840 240295 3716 50025 104407 -27499 118328
3005A18328j63186Q1375L67027l64278j21835J33389p431n6943R406O9416J62130
2994B27398Q7557j06434o6835j39090M4861P9723P4938o9202k91409n2332J23800
2983h7025J65034Q7907k6039J71002K0997k05018J53796m3009k76079L9791K025
2972C382Q3309L10242O7004k65263J22131M6353k4531r7054J72649k50013m18082
2961b49873J98375K39038j64704J35654j13754j52723J00811Q1189k0720k7698
2951B5595L16050O7945k48941m8764J09878o0563k64583R588o8360j71177L46301
2940A2969o165l862J90411j25776j13045p3337Q450K46724j20919L00853M7546
2929C63849m6270k58464K6465J37741k47725k2803J89744p2337K42309o466k44786
$$ plain form
3005 118328 -44858 36517 403544 39266 -82569 50820 43389 -13554 -4148 65268 227398
2994 227398 314955 208521 141686 2596 47457 127180 202118 132916 -158493 -210825 -87025
2983 -87025 78009 165916 139877 310879 331876 126858 280654 237645 -38434 1357 3382
2972 3382 86691 396933 463937 198674 320805 367158 342627 245573 418222 168209 -249873
2961 -249873 -51498 187540 22836 158490 44736 -107987 -7176 74013 53293 25595
2951 25595 341645 409590 160649 111885 221763 161200 -103383 -93795 -162155 -333332 12969
2940 12969 6804 2942 193353 67577 -45468 -118805 -110355 136369 15450 316303 363849
2929 363849 317579 59115 85580 223321 -24404 -47207 142537 70200 312509 306043 61257
2918F1257J37137J8990K151j46731j508J8699J30946k24999K24635Q4636J727
2907C06940K55723j75366q7594k6825L3956j30191j1232j16882J34364J16012
2897B98905K6859k59430j07194j0796j59124M5630J15327K2615J00790M8842K6099
2886A48523O2188P000K0221p1379J3936o3047J39072Q0155o0442r7104N3131q5906
2874A46348J56779l0907j66686p1951q9865j10102J0554O5307K26143j68701J02071
2863F8990M5258j776J11928k51878K15053P0489j11312L1701O6149R64J36934
2852C82500p4530j00959J77028j74274m5509R1875m3619j49788k8479Q4833K0259
2841A39337j21453M13941J09756k00938j37012J9456j44028M0446O2872Q3923
$$ plain form
2918 61257 198394 217384 219535 72804 71296 89995 220941 -4058 220577 305213 306940
2907 306940 562663 387297 299703 272878 306834 176643 165411 48529 182893 298905
2897 298905 325764 66334 -40860 -51656 -210780 -165150 -49823 -27208 73582 122424 148523
2886 148523 210711 217711 237932 166553 180489 117442 256514 336669 276227 179123 232254 146348
2874 146348 303127 272220 105534 33583 -56282 -166384 -155830 -90523 135620 -33081 68990
2863 68990 114248 112472 224400 -27478 187575 258064 146752 178453 244602 245566 382500
2852 382500 307970 207011 384039 209765 164256 256131 212512 62724 34245 119078 139337
2841 139337 17884 431825 541581 340643 203631 223087 79059 119505 182377 266300
2831B66300J89574J9227k85822o3647n458j1633J42134J30056n5803l34124J46197
2820A37001J67745j37778k27683K21688m15932L2179M38040k99177j0504J02599
2810H178J26880J9231j10588J87124R7851k67777K77226j69134j44037j9823N8770
2799F3901r7722J44838K6049J9285J9810j83567N059J32862Q5993l39172J90424
2788F7760J76577j12759K6723K22746j59991j41034J62331K28621L0442j78181
2778C23235l5324k08133m89j27745K10807M6347k4547J70045J56066p2218m56808
2767a8764K09489J45055p0070n7588Q5811J87755J6812j09027L4053m26428K40633
2756B37731k98978Q5985K61997q4721k62610M9985J425J46634J86690Q8633r800
$$ plain form
2831 266300 455874 475101 189279 125632 120174 108541 250675 380731 324928 -9196 137001
2820 137001 304746 166968 -60715 160973 -254959 -222780 215260 -83917 -94421 8178
2810 8178 135058 154289 43701 230825 328676 60899 338125 168991 24954 5131 63901
2799 63901 -33821 111017 137066 156351 176161 -7406 -2347 130515 216508 -122664 67760
2788 67760 244337 131578 158301 381047 221056 80022 242353 470974 501416 323235
2778 323235 287911 79778 79289 -48456 162351 208698 184151 354196 510262 438044 -18764
2767 -18764 190725 335780 265710 208122 293933 481688 498500 389473 423526 -2902 237731
2756 237731 -61247 24738 286735 202014 -60596 -10611 -9186 137448 324138 412771 402971
2745D02971p5021n9466K93956K5022L4465l20094l1060j22912J19851L69798j26265
2734E11245r8213k53124r5795O10557j13683l729k5827q7860j73065L652J97009
2723D71167j09101J78114j56889o7048k59723Q9689j43178J2584K09195K2319
2713B47129j88215j56989m0486M12802J21606q6972O8583l27977K05495J24540
2703C79516r5067j39100J11550J93947k06885k97749J90331l9060N669M63900
2693E67052j15843J49211j31399j87077J9120P3292j35284K06988j91251N0036
2683C04845R5694q947j93171L0050l7987J29850K1993m0649r4952J60034J20183
2672D86943n0768m00420O0218M14043J6333m20364j44760K43786J80968K53823
$$ plain form
2745 402971 327950 268484 562440 587462 621927 301833 270773 147861 267712 637510 511245
2734 511245 413032 159908 64113 674670 560987 557258 531431 443571 270506 274158 471167
2723 471167 362066 540180 383291 316243 56520 146209 3031 15615 224810 247129
2713 247129 58914 -98075 -138561 274241 395847 308875 377458 49481 254976 379516
2703 379516 284449 145349 256899 450846 243961 -53788 136543 97483 103152 567052
2693 567052 451209 600420 469021 281944 301064 374356 239072 446060 254809 304845
2683 304845 400539 391592 198421 228471 190484 320334 342327 301678 206726 366760 486943
2672 486943 436175 35755 95973 510016 526349 105985 -38775 205011 385979 639802
2662F39802J32564k82182j43026r4246q3309J79281q3186k902O536R3830L9362
2651D02524j9196O2958M2738j06906K74159j29509j59030N1070k2175j85004L6896
2640B48525K98666k64325j2865O7002O7772k86389J2989J62682K54807q7920j27373
2629C33571m6424K06900K9779l79007J08677K09474r0270K50715J31871k62607
2619D92679j95610J60102Q4075j35345K63961J33004k39432O9671J61543M0942
2609H35590Q551l07525j99369k04767N53675o2629O1860k77812R5745K53357J70981
2598I27657j80067m6815J67696J56098O89795L33181L90885L02102j44968n72252
2588B023312l20618q0519m52775j22388J82032r9418K883m954k00521j00113j96334
$$ plain form
2662 639802 772366 490184 347158 252912 169603 348884 265698 262796 269332 363162 402524
2651 402524 383328 446286 489024 382118 656277 526768 367738 418808 396633 211629 248525
2640 248525 547191 282866 270001 337003 404775 118386 131375 294057 548864 460944 333571
2629 333571 287147 494047 523826 144819 253496 462970 372700 623415 755286 492679
2619 492679 297069 457171 541246 405901 669862 802866 563434 633105 794648 835590
2609 835590 844141 536616 337247 132480 686155 623526 685386 407574 503319 756676 927657
2598 927657 747590 700775 868471 1024569 1714364 2047545 2438430 2740532 2595564 2023312
2588 2023312 1702694 1622175 1169400 1047012 1229044 1129626 1132509 1127555 927034 826921 630587
2577F30587k83013Q9815P6512R4066Q8864P3791p8530j59963P3249r9932j58550
2566C46896J90122K454m3856K68628j83921J8265j34507L9934R467r7116K7217
2555D43583O0042M6463J6033n281j25979J1387J02024L6813l5237k94272K26132
2544D81708j18028M7994L23481l24872J52768p9467n2901N3286j18087m9067o227
2533C10588K24734K31384k2931p8281o1712J4826k88647L18168J25793J45579
2523I19501J90048J18494j55094r5069J1806Q5959j81583k64724r669P6938m2173
2512F54434K28899K09039j55689J373J01449K99500Q820M7131j32898J13437O9447
2501A444942r365K6920n3627j70615M5916J08644M8762k42269j21657l35591J13014
$$ plain form
2577 630587 347574 437389 513901 607967 696831 770622 692092 532129 605378 505446 346896
2566 346896 537018 539472 495616 764244 580323 598588 464081 504015 513482 416366 443583
2555 443583 503625 550088 566121 560840 434861 446248 548272 585085 549848 255576 481708
2544 481708 363680 411674 735155 410283 563051 483584 430683 483969 365882 316815 310588
2533 310588 535322 766706 743775 665494 603782 618608 329961 648129 773922 919501
2523 919501 1109549 1228043 1072949 977880 989686 1075645 894062 629338 619669 696607 654434
2512 654434 883333 1092372 936683 938056 1039505 1339005 1347825 1394956 1262058 1375495 1444942
2501 1444942 1435577 1462497 1408870 1238255 1284171 1392815 1441577 1199308 1077651 742060 855074
2490H55074J76693K07409K45019R4325j07298k75283l2418j26865n5668N6618
2480A037606J86268K20790N4137j8185k97885j9454N1950p6584K09065K27242
2470A574950j61821k30375J71029j5838M10833J76685l16924k76699j42915o8923
2460A120002j08323L34113J16144J84945M223n1472L06475l12882Q091o5150J16680
2449A652846P079j36172J00884p001J91585j42496J2509K96128Q0590O9265K33548
2438B358765k73060N0227K5603j89255M8909K85241J18840p6784l0503q2481n9022
2427B176480R6912L16933J66066M9996k77516J28943M4121m2281J09699J84795
2417B954148k49619J68985J36212k56102P6532K9386j74822L7707R176n8360R5017
$$ plain form
2490 855074 1031767 1239176 1484195 1578520 1471222 1195939 1163521 1036656 980988 1037606
2480 1037606 1223874 1444664 1498801 1480616 1182731 1163277 1215227 1138643 1347708 1574950
2470 1574950 1413129 1182754 1353783 1337945 1748778 1925463 1608539 1331840 1188925 1120002
2460 1120002 1011679 1345792 1461936 1646881 1651104 1599632 1906107 1593225 1601316 1536166 1652846
2449 1652846 1659925 1523753 1624637 1617636 1809221 1666725 1679234 1975362 2055952 2125217 2358765
2438 2358765 2085705 2135932 2161535 1972280 2021189 2306430 2425270 2348486 2317983 2235502 2176480
2427 2176480 2273392 2590325 2756391 2806387 2528871 2657814 2701935 2659654 2769353 2954148
2417 2954148 2704529 2873514 3009726 2753624 2830156 2859542 2684720 2722427 2731603 2673243 2768260
2406B768260O2159J12412j64084O650O3130J58264r3198J07418K85041J92131
2396C498183K5417J94725L88379J81677r7625J39102J56848l73202K23389K16764
2386D553657j29322j96777P9273P9699O88116J92812K19343M26092R3380r5485
2376E910788M80177J47213J2568K39607M1217J71485K66242o9245n691J04886
2366G299247J3867J57244L16093M31172L61377N39174N37748P17321P73683L48874
2356A1495800O24376O28482L99319J35140L29800L49284N80139N45069R42012
2347A6029421J157630J008415J267384J786896K352697M472919M485119M167709
2339C6728190K341729J703208Q57148J206607J863242L887467N213872Q535049
$$ plain form
2406 2768260 2830419 2942831 2778747 2785397 2848527 3006791 2913593 3021011 3306052 3498183
2396 3498183 3523600 3718325 4106704 4288381 4190756 4329858 4486706 4113504 4336893 4553657
2386 4553657 4424335 4227558 4306831 4386530 5074646 5267458 5486801 5912893 6006273 5910788
2376 5910788 6390965 6538178 6550746 6790353 6831570 7003055 7269297 7200052 7194361 7299247
2366 7299247 7313114 7470358 7786451 8217623 8579000 9118174 9655922 10373243 11146926 11495800
2356 11495800 12120176 12748658 13147977 13283117 13612917 13962201 14542340 15087409 16029421
2347 16029421 17187051 18195466 19462850 21249746 23602443 28075362 32560481 36728190
2339 36728190 39069919 40773127 41630275 42836882 44700124 48587591 53801463 62336512
2331F2336512J1704092J8208947L1200713O7092564J09608819J28563995P8905192
2324E07620834r037655n1784569q2616630q6926981o9855571m9334909l6068291
2317A21996228k6350415k0461869j4343315r143467n619129k489186p65619j225942
2309D1597286l049502l497881m053079l742471l160169k800591k445878j182482
2301A7665233r37468p65395p94498q59470r64376j134731j076720o87892o73116
2292I771567q8791j52336j8968L9736j28242r5221K47543l37608j54391m02687
2282H680602l54954m51131l80127l99731k10459k57293n14042k10740J02812k75897
2272E729040k09662l05103j93025l15044J98016M2040j08664j45777j81436j94414
$$ plain form
2331 62336512 74040604 92249551 123450264 190542828 300151647 428715642 507620834
2324 507620834 498583179 446798610 364181980 277254999 207399428 158064519 121996228
2317 121996228 95645813 75183944 60840629 51697162 46078033 43588847 42823228 41597286
2309 41597286 38547784 35049903 30996824 27254353 24094184 21293593 18847715 17665233
2301 17665233 16727765 15962370 15167872 14308402 13344026 12209295 11132575 10444683 9771567
2292 9771567 9682776 9530440 9511472 9551208 9422966 9327745 9575288 9237680 9083289 8680602
2282 8680602 8325648 7874517 7494390 7094659 6884200 6626907 6112865 5902125 6004937 5729040
2272 5729040 5519378 5214275 5021250 4706206 4904222 4946262 4837598 4691821 4510385 4315971
2262D315971j9763j12424N1284j49985k93122j91039m5275j51589K19931M2772
2252C666761j35106J01732q0282q0912j91731J46815m0506m09367k81854K0542
2242B716092n2959P5654q3008k7122k7284l58744q1484k56658K45769k8894k00280
2231A921082P8107P6257m45519J1102j85125j78871k49487n7672J60826L3453
2221A164153j843j07674J15023J18680j17128N5945k04990n2527j45629J50463
2211I74473j84243K25011L13134j57185n7118L18441J9237j73132j72429K2840
2201A129029Q7969r8188r1042P2463l21396j07286l40223L9297M46121k5946j98181
2190E92617J9887N6772K62637j18625j45190L34476m70714K9079N8383K1576J07919
$$ plain form
2262 4315971 4296208 4183784 4235068 4085083 3791961 3600922 3555647 3404058 3623989 3666761
2252 3666761 3531655 3633387 3553105 3472193 3280462 3427277 3386771 2977404 2695550 2716092
2242 2716092 2663133 2738787 2655779 2628657 2601373 2242629 2161145 1904487 2150256 2121362 1921082
2231 1921082 1999189 2075446 1629927 1641029 1455904 1277033 1027546 969874 1130700 1164153
2221 1164153 1162310 1054636 1169659 1288339 1171211 1227156 1022166 969639 824010 974473
2211 974473 790230 1015241 1328375 1171190 1114072 1432513 1451750 1278618 1106189 1129029
2201 1129029 1216998 1118810 1027768 1100231 778835 671549 331326 370623 816744 790798 592617
2190 592617 612504 669276 931913 813288 668098 1002574 531860 560939 619322 640898 748817
2179G48817J44236K7049m1168j89114k21984l52350J3417Q5684L45364Q3265j9250
2168F23966o8375q1369q7192K1226K7210k67001j08842N1747j55283J648L26900
2157B84635K18537j22833J66697q5429l66460P6512K92310j33066K79056m41999
2147A67960o7292j49241J67271M9586J62396Q5027J14259p5787K971j10521j00176
2136B46453N8315j75906j80006J37663P4374L5619J21710p2426j30881o5672J86825
2125B36068k01324n9425N299J77579J34135L0124K35870l53090k75395R6414J86443
2114B12698J54546m7619K7254K732R4442l52739K42064j38901Q2768K35119k37657
2103B74707O1879L3452q5932o8437p935M3326j69044N8022K03504l0416j06075
$$ plain form
2179 748817 893053 920102 878934 689820 467836 115486 128903 214587 559951 643216 623966
2168 623966 555591 474222 387030 408256 435466 168465 59623 111370 -43913 -42265 284635
2157 284635 503172 380339 547036 461607 95147 171659 463969 330903 609959 167960
2147 167960 100668 -48573 118698 168284 330680 415707 529966 454179 457150 346629 246453
2136 246453 304768 128862 -51144 86519 160893 196512 318222 245796 114915 49243 236068
2125 236068 34744 -24681 -19382 158197 292332 322456 558326 205236 -70159 26255 212698
2114 212698 367244 319625 346879 349611 444053 91314 333378 194477 277245 512364 274707
2103 274707 336586 370038 284106 215669 207734 251060 82016 140038 343542 313126 207051
2092B07051J27139J19412j89611J26334j99065r0048R972O7824J1034j70399m5935
2081b6292O8857L869q9218J77119O3072Q9300k77270n6064J82258J43572j6679
2070B62524k11835j7739K04660o9387K0782q1587J72998J00270R6377J39092L27072
2059I43227K10429R2890L54669M48351J58827k40242p6088j51159l32825k44721
2049A163358l50141q0427j34644n14164J151J02998r4024M0816l306L685J53422
2038B88724q7316n6550q1083O2665p2047j6820K0890p4994j83413K13672J37447
2027A51175j77547J06390M0819J72164r2052r5929J19890k45326J42273O2722
2017A84579k8492O9933j69073J0573Q2639k32126q3478Q3894J8990K64230j36366
$$ plain form
2092 207051 334190 453602 263991 390325 191260 101212 111184 179008 190042 19643 -26292
2081 -26292 42565 46434 -42784 134335 197407 286707 9437 -46627 135631 279203 262524
2070 262524 50689 32950 237610 168223 189005 107418 280416 380686 477063 616155 943227
2059 943227 1153656 1246546 1601215 2049566 2208393 1968151 1892063 1740904 1408079 1163358
2049 1163358 813217 732790 598146 83982 85133 188131 94107 134923 131617 135302 288724
2038 288724 201408 144858 63775 126440 54393 37573 58463 -16531 -199944 13728 151175
2027 151175 -26372 80018 120837 293001 200949 105020 224910 -20416 121857 184579
2017 184579 156087 226020 56947 67520 150159 -81967 -165445 -81551 -62561 201669 65303
2006F5303k69329N9645J22128p6703J60588p6704j50194Q1352L1562n3802r316
1995a15470l14751J52392M6935P6614J24465j77701j61012l853J51197K15409
1985e775K54171k11170k92033P0993J49620J63236K2786j53114o5839m1534l056
1974a11715R825J12258J41618M6604Q8605k27794k66876L46726r831p9865J1727
1963F1282L2260R3903N489j66875q2058j61774K60133j39831j84998J65202j29205
1952b46472J78562M1186K04198k76380J17061L11291l33475j80047m5256K20564
1942h768K1632j81038n3385Q6326K626M521K50183j46318r9856k60795m9014K97110
1930a36776r1489O680L05456J8951J47062l60572l4351L8464M19656R6002l54954
$$ plain form
2006 65303 -204026 -144381 -22253 -98956 61632 -15072 -165266 -83914 -52352 -106154 -115470
1995 -115470 -430221 -277829 -230894 -154280 -29815 -207516 -368528 -372381 -221184 -5775
1985 -5775 248396 37226 -254807 -183814 -34194 129042 151828 -1286 -67125 -108659 -111715
1974 -111715 -101890 10368 151986 198590 287195 59401 -207475 139251 129420 49555 61282
1963 61282 93542 187445 192934 26059 -55999 -217773 42360 -97471 -282469 -117267 -246472
1952 -246472 -67910 -26724 177474 -98906 18155 329446 -4029 -184076 -229332 -8768
1942 -8768 12864 -168174 -221559 -135233 -132607 -128086 122097 -24221 -124077 -384872 -433886 -136776
1930 -136776 -228265 -221585 83871 102822 249884 -110688 -145039 -106575 313081 409083 54129
1919E4129J11445j54639N8618p2144L12869p9009j85316j3222k6713q1279J73137
1908I7876l8154j33108j01989k4039r7595p6964J46809K22807l73946K20694L23893
1897A66284j98870P7182j0110j30364R0938j12596j02242n7455L29798J4389k69569
1886b02615L44193l83930N0888K48603p5762o7737M1634j04367m28047p953J42568
1875d42525L25049m63J93480j26513l1432P7508Q1117j36292k00560J75620N2152
1864c2859o7750K39006K6931m1839p753l15635J0112M19649j32231l81727J72681
1853a11415q4836J56829L4035O3996N4645J70240k2117k15624k42152Q0195M28361
1842C12157J05842m73039R280K21296O6472k44820q7571J41812O2119j10681p2232
$$ plain form
1919 54129 165574 10935 69553 -2591 310278 231269 45953 32731 6018 -75261 97876
1908 97876 59722 -73386 -175375 -199414 -297009 -373973 -227164 -4357 -378303 -157609 166284
1897 166284 -32586 44596 34486 -95878 -4940 -117536 -219778 -277233 52565 66954 -202615
1886 -202615 141578 -242352 -191464 57139 -18623 -86360 -44726 -149093 -577140 -585093 -442525
1875 -442525 -117476 -117939 75541 -50972 -82404 -4896 76221 -60071 -260631 -85011 -32859
1864 -32859 -100609 138397 165328 123489 115736 -199899 -189787 229862 97631 -284096 -111415
1853 -111415 -196251 -39422 -5387 58609 113254 283494 261377 45753 -196399 -116204 312157
1842 312157 417999 -55040 -45760 175536 242008 -2812 -90383 51429 113548 2867 -69365
1831f9365l0041k57058J56967j25749K03684L00298l4482j49106J6497j71571
1821a59926j60471L41387J00386P9757o3305p2101m8124k08869r305k3937J53499
1810g1009j36047J00602K76525K90847j91751o02926j9988j4891L04686j2914
1800g6866j22170P9253J89934n6638N9330l3033k61280J63501J22249l09384k20918
1789d66022R6609J53283N00988k9853J0227L73420l76414l8705r4575m3181j77007
1778i1230L01855J64216m82760r8427J60324P2959J24026P5413m7828j65148J13858
1767A27258L8230l56010Q337o0434j3214K39577q7142K39524k85849j5048L70314
1756B05543p3937k1106J24777j16466j76846J55507j08380j405Q2056j04148j24793
$$ plain form
1831 -69365 -99406 -356464 -199497 -325246 -121562 178736 144254 -4852 11645 -159926
1821 -159926 -320397 20990 121376 201133 137828 65727 17603 -191266 -200571 -224508 -71009
1810 -71009 -207056 -106454 170071 460918 269167 -333759 -353747 -368638 -63952 -76866
1800 -76866 -199036 -119783 70151 13513 72843 39810 -221470 -57969 64280 -245104 -466022
1789 -466022 -369413 -216130 284858 255005 265232 638652 262238 223533 128958 85777 -91230
1778 -91230 210625 374841 -107919 -206346 -46022 26937 150963 226376 178548 13400 127258
1767 127258 165488 -190522 -182185 -242619 -255833 -16256 -103398 136126 -149723 -164771 205543
1756 205543 131606 110500 235277 118811 -58035 97472 -10908 -12313 69743 -34405 -159198
1745a59198J42474l7554K17678k1957J49398j86058K14366j00437j30054L8021
1735A26679j52037j48599K5155n7001o192J85059L8889m1052J8721k24488j1740
1724b46606r2628q0779L88366L9256k28537P5615K27316j54595J0513l5937J07984
1713I968m1553k09527J07581j17519J550K05775j59005j32267j4348J55939Q6920
1702a06486Q2285j04934J59092j3863l1527l1284j94881J96470R2253l53847J35926
1691a70796M318L42114k13496j83658r4632K64791R8361m36533K23129L9859k74838
1680d01381J49866K11376j02061J17736L0631j07071m9587K34706p4405p893j62535
1669a60618K58704K17971J65065l62746r9385P8841L8911J63282k48366P7353
$$ plain form
1745 -159198 -16724 -54278 163400 141443 290841 104783 319149 218712 88658 126679
1735 126679 -25358 -173957 -148802 -205803 -211995 -26936 11953 -29099 -10378 -234866 -246606
1724 -246606 -339234 -420013 -31647 7609 -220928 -145313 82003 -72592 -62079 -98016 9968
1713 9968 -31585 -241112 -133531 -251050 -249500 -43725 -202730 -334997 -349345 -193406 -106486
1702 -106486 -24201 -129135 29957 16094 -15433 -46717 -241598 -45128 47125 -306722 -170796
1691 -170796 -166478 175636 -37860 -221518 -316150 -51359 47002 -389531 -166402 -126543 -401381
1680 -401381 -251515 -40139 -142200 -24464 6167 -100904 -150491 84215 9810 1917 -160618
1669 -160618 98086 316057 481122 118376 18991 97832 136743 300025 51659 129012
1659A29012P4120n8942K07471j39125j41561J7582J12304q4288K5247m6305q0483
1648A5032l5431J37430N5859M4323j57418l09971K9401r51L55851R8105k19901
1637A2329p6797J93753q4612j19054N4868L6219J8388O6191j04219j88076J09411
1626h1599J44229J6173k72240J33964K32115j75147n4713L0445K01070j37437
1616C6860j44118n0374J03914J69362K25939k16148j29169Q3035j31952N6310
1606C659K20623j7473j74869N5150n3877m6337L36222R6562l7206l34223K3585
1595G1816j58086l05703J43440K39381Q2706k45948j0576R5202j9182n4953R9483
1584f2420k6619k3353j96370k0227J32227n814j3306o0804P8829o9595n6529J76108
$$ plain form
1659 129012 203132 144190 351661 212536 70975 88557 200861 116573 141820 95515 15032
1648 15032 -20399 117031 172890 217213 59795 -250176 -220775 -221726 134125 232230 12329
1637 12329 -64468 129285 44673 -74381 -19513 16706 35094 101285 -2934 -191010 -81599
1626 -81599 62630 78803 -193437 -59473 172642 -2505 -57218 -26773 174297 36860
1616 36860 -107258 -157632 -53718 115644 341583 125435 -3734 79301 -52651 3659
1606 3659 224282 206809 31940 87090 33213 -13124 323098 419660 382454 48231 71816
1595 71816 -86270 -391973 -248533 -9152 73554 -172394 -182970 -87768 -106950 -161903 -62420
1584 -62420 -89039 -112392 -308762 -328989 -196762 -202576 -215882 -276686 -197857 -267452 -323981 -147873
1572a47873K06055Q9715j2046R600q6397q2902o4723j40486R8K02764J5720o3489
1560g3964j6353k5703r7062J48111O7009Q5414N869q5824k51857K02945j7298
1549e8713j56128J13312k07830n8965J35633Q4239K11233l13227m9695K09129
1539i1012R6975K39911k0166l49906J5483k52458j19802k6528J56425K11544j59862
1528b99396J89451J20283j58237J186M9960J06672J38911m24641P5956L14415
1518A14560l7464l76042O6003K49624P6167l9000o4693k51089M3345J43722j62862
1507b37729J14460J55466N3083j2956j37792m4423k93552L39044l5499J33475
1497C3577j37533j74984J46406J68056J16566k43345Q9259K82523l2425J72921
$$ plain form
1572 -147873 58182 147897 135851 145451 59054 -23848 -88571 -229057 -228959 -26195 -10475 -73964
1560 -73964 -90317 -116020 -213082 -64971 2038 87452 93321 7497 -244360 -41415 -58713
1549 -58713 -214841 -101529 -309359 -368324 -232691 -148452 62781 -250446 -300141 -91012
1539 -91012 5963 245874 225708 -124198 -108715 -361173 -480975 -507503 -351078 -139534 -299396
1528 -299396 -109945 10338 -147899 -146713 -96753 9919 148830 -275811 -199855 114560
1518 114560 77096 -298946 -232943 16681 92848 53848 -10845 -261934 -218589 -74867 -237729
1507 -237729 -123269 32197 85280 72324 -65468 -109891 -403443 -64399 -99898 33577
1497 33577 -103956 -278940 -132534 35522 152088 -91257 -1998 280525 248100 421021
1487D21021m86063k46400K98520j31804P3023J72137N2221J6372j28463j13833
1477g3269K20904l05411q6399R5736j29818k1878K8691J39498K18134k01851Q4139
1466c1524J43517k86557m6794J43956j43174J31565K82355O3201j57149k28678
1456a29282j2742J03211n4903r9265m900j5968J22913p4557j07684k89266O5379
1445d97064J85513Q9967L4960J90814j81784l27903J07640K29572j24846k8591
1435c21722K37413k3714K96764J00959M688k59906k9571J32952J6042m6575r6206
1424A1124k71905J84044K68075j96887k54949K12979Q4264j1016L1310j49889
1414i2850J63629N4227k2445k01046q5779L0993L6249n0052o3764J28165m2745
$$ plain form
1487 421021 -65042 -311442 -12922 -144726 -71703 100434 152655 169027 40564 -73269
1477 -73269 147635 -157776 -244175 -148439 -278257 -300135 -271444 -131946 86188 -115663 -31524
1466 -31524 111993 -174564 -221358 -77402 -220576 -89011 193344 256545 99396 -129282
1456 -129282 -142024 -38813 -93716 -192981 -197881 -213849 -90936 -165493 -273177 -562443 -497064
1445 -497064 -311551 -221584 -186624 4190 -177594 -505497 -397857 -168285 -293131 -321722
1435 -321722 -84309 -108023 188741 289700 294388 34482 4911 137863 153905 107330 11124
1424 11124 -260781 -76737 191338 -5549 -260498 -47519 36745 25729 57039 -92850
1414 -92850 70779 125006 102561 -98485 -184264 -153271 -117022 -167074 -230838 -102673 -145418
1403a45418k2824K93925Q7905n6081K62412n389K9811n80461p9497K60029l124
1392D1288k16198K08657K36729P9833j06062k65891n9998J83556m05957p8202
1382c82245L20027L04003l05540j85510L34768k799l6820j872J16585j3486k43505
1371i6394J54910M3405j60633o7534q3949J34133K7562J35346j83012J47499q9695
1360c8362j59470J58936M6180J45716q104j57337j06923o9178r0019k692L00947
1349A9694m9286J78158r9938r9776j36010M87842j01697k96747J52915J76808
1339B31963Q0595j43377o908J49565J9205j31413j32805j893j17776m1347j55982
1328b50173K34115J45092K6207Q528j5976j25497j66274L07040O6195j16859k06717
$$ plain form
1403 -145418 -168242 125683 213588 157507 419919 414530 444341 -136120 -215617 44412 41288
1392 41288 -174910 33747 270476 350309 244247 -21644 -81642 101914 -304043 -382245
1382 -382245 -62218 241785 -63755 -249265 85503 82704 45884 44012 160597 147111 -96394
1371 -96394 58516 101921 -58712 -126246 -210195 -76062 -48500 86846 -96166 51333 -38362
1360 -38362 -197832 -38896 7284 153000 144896 -12441 -119364 -188542 -278561 -281253 19694
1349 19694 -29592 148566 48628 -51148 -187158 300684 198987 -97760 55155 231963
1339 231963 312558 169181 162273 311838 331043 199630 66825 64932 -52844 -94191 -250173
1328 -250173 -16058 129034 155241 163769 147793 22296 -143978 163062 229257 112398 -94319
1317i4319K70997l2806K8713o518j75731k9260n289k52773p1937M7571k79356
1306f00708K35347K19870L51629j31408k35425K62982J18065k63314k30029L054
1296b69937K12847J47525K43231j02669k51712P5383M885j08526q5774J86514
1286E1767K04359Q8320k14846p2851j30003j65535J19985P9337l82388J1553L38966
1275g1336M36111J6171m8856k60941j5166J53887j88538N4974n7812m3146n4570
1264g9222J45595J24643l65399M2307J34345J632J93031o3170k03024j36659J15710
1253i0211p3581r5264K40931m969J07960K58512l48887Q6475P0582j62456J63600
1242A52692J01315j54726o6437r176m1563J8956J92479J47997k06644J61765m5099
$$ plain form
1317 -94319 176678 143872 172585 166067 -9664 -38924 -44213 -296986 -368923 -321352 -600708
1306 -600708 -365361 -145491 206138 74730 -160695 102287 220352 -42962 -272991 -269937
1296 -269937 -57090 90435 333666 230997 -20715 54668 59553 -48973 -134747 51767
1286 51767 256126 344446 129600 56749 -73254 -238789 -118804 -39467 -421855 -410302 -71336
1275 -71336 364775 380946 332090 71149 55983 209870 21332 76306 18494 -24652 -79222
1264 -79222 66373 191016 -174383 -132076 2269 3901 196932 133762 -69262 -205921 -90211
1253 -90211 -163792 -259056 -18125 -23094 84866 343378 -5509 80966 151548 -10908 152692
1242 152692 254007 99281 32844 23668 -17895 1061 193540 341537 134893 296658 251559
1231B51559n1986l174j2450Q908P7644K6074k51507j48939L2869j42602K42751
1220B9147J47980K7922k65709j16056K8234J61963J2867o5388k21902j49757J43673
1209b67026n5921m8050o6132L81670J38906O7482m8675J02114J1818j41722o1411
1198A3053M4548J85329k29741j56543J17933L21167p6918k42208j06950k3464
1188a53794q8054j08770J63201K08013l9688j34881r2627K9562J86577l8104r7900
1177a66465J14542J71196J11675k85729L3619K6748J9660J96346l69314K39539
1167I1817O6799j6072m3935k37090n2091J29016K8460j9809j75842o918N9731
1156a75934l5694n2055K40749Q889j86412j56492K68937J43283Q0188L023j91764
$$ plain form
1231 251559 199573 196399 183949 192857 270501 296575 45068 -103871 -71002 -213604 29147
1220 29147 177127 205049 -60660 -176716 -148482 13481 26348 -39040 -260942 -410699 -267026
1209 -267026 -322947 -370997 -437129 -55459 83447 150929 102254 204368 216186 74464 13053
1198 13053 57601 242930 13189 -143354 -25421 295746 218828 -23380 -130330 -153794
1188 -153794 -241848 -350618 -187417 20596 -19092 -153973 -246600 -217038 -30461 -68565 -166465
1177 -166465 -51923 119273 230948 -54781 -21162 5586 25246 221592 -147722 91817
1167 91817 158616 142544 98609 -138481 -190572 -61556 -33096 -52905 -228747 -235665 -175934
1156 -175934 -211628 -263683 -22934 -14045 -200457 -356949 -88012 55271 135459 138482 -53282
1145e3282P227O4440K50537j16380k02836m4843p3052K3685n5572M6614P5823
1134g7639J69247j65484L0397L5163j20285L2790o9057l7049m137K11241k33314
1123b28127J07009P4807M1726j1182j16033J50021m3905j0203K12131J9077N3764
1112B49085R8254l06444p5574K5381O2839K50473j25393l6543K4820j80150N3386
1101D0134J75880k17199k1382j8J62386q7637j05094j60207M3440M14449P9015
1090C23767j27837l13524j69053J95728j29476K96384J74022j20512j24379j64680
1080a59560J0945p548J49546J43036k11917J17304m114j32515M2053j09546l0768
1069a93084L58085r5409l16632R6581m941P1137K42677k20195K67149O8602k52578
$$ plain form
1145 -53282 -46055 18385 268922 152542 -50294 -95137 -168189 -144504 -200076 -153462 -77639
1134 -77639 91608 -73876 -43479 -8316 -128601 -95811 -164868 -201917 -206054 5187 -228127
1123 -228127 -121118 -46311 -4585 -15767 -131800 18221 -25684 -35887 176244 195321 249085
1112 249085 347339 40895 -34679 -9298 53541 304014 178621 142078 166898 -13252 40134
1101 40134 216014 -1185 -22567 -22585 139801 52164 -52930 -213137 -169697 244752 323767
1090 323767 195930 -117594 -286647 -90919 -220395 75989 250011 129499 5120 -159560
1080 -159560 -148615 -156163 -6617 136419 -75498 41806 37692 -94823 -52770 -162316 -193084
1069 -193084 165001 69592 -247040 -150459 -155400 -84263 158414 -61781 205368 273970 21392
1058B1392K08009k02969p7629o7592L01749o363o5692k86325j30328M7235J91208
1047f7305K74902M8162l18764M0472J302M0758L7571K02108k33232j74662M3312
1036a05376J68508J99600r1839j05985p4641J35470k0843k49417O9503K84772
1026B09752l9608l04336k31628J66754J87458J8068k96592O7279K31640L05607
1016C14394k16269j49866k3487J51363M6829J06807J2048k73678j1473J65765
1006A22433k04185J2628K99831j17694j61650n8350o4593M2279J48729k53681
996b34253L28979L46524n5448k82944J97512L1440j77979k32550J43182P3854
986A38317k78770J81298j29162K4019J03653j54690J71976L1344n1697j76889
$$ plain form
1058 21392 229401 26432 -51197 -118789 182960 176597 110905 -175420 -305748 -258513 -67305
1047 -67305 207597 255759 -63005 -22533 -21231 19527 57098 259206 25974 -148688 -105376
1036 -105376 63132 262732 170893 64908 -9733 125737 104894 -144523 -75020 209752
1026 209752 170144 -134192 -365820 -199066 -11608 6460 -290132 -222853 8787 314394
1016 314394 98125 -51741 -75228 76135 122964 229771 241819 -31859 -43332 122433
1006 122433 -81752 -69124 230707 113013 -48637 -106987 -171580 -129301 19428 -234253
996 -234253 94726 441250 385802 102858 300370 331810 153831 -78719 64463 138317
986 138317 -140453 40845 -88317 -64298 39355 -115335 56641 87985 36288 -140601
976a40601L11522P5412k6030p9024J9571j296j35138n2010K8039R9978k71978
965a71555k41948j17344M51992J06379o0543J77169p5859k13310R6844K24822
955A76647k23306L4775K84189q6877K1143l4397k51948j86039N0203J12811L4092
944f8707Q1446K37055J21531j79837m05297J39322j01192K73143J50632j99509
934D8587M9715L4866o2367J18364j66428M6219o5677l4801k47709J2337L40688
923G3794L9931m01990J42373r4578K6411L10015l3861K5514j60835Q1334l373
912D735k1843j44660J65787j70163j91533J30815K34295q2073l2593j86434K718
901b90949L04909J76976O7465J1223j26162k0085K7186j62075M2540K6638L65522
$$ plain form
976 -140601 170921 246333 220303 141279 160850 159554 24416 -27594 445 100423 -171555
965 -171555 -413503 -530847 -78855 27524 -33019 144150 68291 -145019 -48175 176647
955 176647 -46659 -11884 272305 185428 206571 172174 -79774 -265813 -215610 -102799 -68707
944 -68707 12739 249794 371325 191488 -213809 -74487 -175679 97464 248096 48587
934 48587 98302 133168 70801 189165 22737 68956 3279 -31522 -279231 -266894 73794
923 73794 113725 -288265 -145892 -240470 -214059 95956 62095 87609 -73226 8108 4735
912 4735 -17108 -161768 4019 -166144 -357677 -226862 7433 -74640 -107233 -293667 -290949
901 -290949 13960 190936 258401 269624 143462 123377 150563 -11512 31028 57666 423188
890D23188j35128l34887m9943j5369M0800j9524J13733n7596j50512J35261J38313
879H8336o6330q2039q4104R2974j07762k5890Q5719J25957L4494J939l5304j74687
867a46697K46492k6752K00893L2830l46021j89099J50990K60599l11943P7129
857e1579J44181j93415o6891L724P2110J65391j77078j07703j71991L72879j47086
846a57458j22463J00387J79311Q5779J23248K86543j67368q9491K0936k52324
836G100J18161L5149k63987J06393J7316p6380r8770J37742p4168l2039p6959
825b00442j1062K12910K60697r065j18102J12908j32446j03619K18630J08284
815C38693j54135k2401j31759k8610J16847j79130J68855l2417j49970J3785p0505
$$ plain form
890 423188 288060 -46827 -96770 -112139 -71339 -90863 22870 -34726 -185238 -49977 88336
879 88336 22006 -60033 -144137 -51163 -158925 -184815 -99096 26861 61355 63294 27990 -146697
867 -146697 99795 73043 273936 306766 -39255 -228354 -77364 183235 -128708 -51579
857 -51579 92602 -100813 -167704 -163980 -91870 73521 -103557 -211260 -383251 -10372 -157458
846 -157458 -279921 -179534 -223 85556 208804 495347 327979 238488 259424 7100
836 7100 125261 160410 -103577 2816 20132 -56248 -155018 -17276 -91444 -123483 -200442
825 -200442 -211504 1406 262103 253038 134936 247844 115398 11779 230409 338693
815 338693 184558 162157 30398 1788 118635 -60495 108360 75943 -74027 -60242 -130747
804a30747N2509k40427l62126K80080M03737J31950N4192j25034k14643q5994
794b36503J88187K176r4318k25628j34980M96336L89828m85944Q5410m528L4297
783A4333j38575J07480k16420R7992Q7642j01782J95728n0107K4321k00681J77616
772b453O8168M1583M8274J68234k63690j59756n2121K8914K01108P8991l7995
761A19257l4685Q1767p0768l64574L90889l2429r5524p9646J3052N9716K05947
750A93002j46611m4824J1026k3850o2168M5670j60133P7922j4432O1530J67431
739A04563k71131j00587q5057L00650r7945J28741j02618O34k03815O3754K04086
728e8725J16325k04570n3147R2098r2764J02708j6945k68555J39786L26470L6182
$$ plain form
804 -130747 -78238 -318665 -680791 -400711 3026 134976 189168 64134 -150509 -236503
794 -236503 -48316 -46140 -140458 -366086 -501066 -4730 385098 -100846 -15436 -19964 14333
783 14333 -124242 -16762 -233182 -135190 -47548 -149330 46398 -3709 20612 -180069 -2453
772 -2453 65715 107298 155572 323806 60116 -99640 -151761 -122847 78261 157252 119257
761 119257 84572 166339 95571 -269003 121886 89457 -6067 -85713 -72661 -12945 193002
750 193002 46391 1567 12593 -11257 -73425 -27755 -187888 -109966 -124398 -62868 104563
739 104563 -166568 -267155 -352212 -51562 -149507 -20766 -123384 -122750 -326565 -262811 -58725
728 -58725 57600 -146970 -200117 -108019 -200783 -98075 -115020 -383575 -243789 82681 118863
717A18863j65798K76754j60668m5041Q6354N9952J18701j65905r752l72769l09763
706e69072K89026K64021J50168K55889k38203J1918k81039J55409J09653j84687
696c6917k80840L64126J33710j29764j85908M8884K56673Q55k10510m2294J90052
685A08067l02317O0759Q2891L3018K18629j78696N3113j74341j98934q989K03146
674a03654M7433N1794R6819j41637n7795j91755p7506J03152M86496j83591l30502
663c00746K87683K16591j75632l9749j25797J6807K2469q342K19317K13906j05575
652B20932j49853j3779j7638q9815p4189m3691j87989N4253N4405K29466r6384
641a14282k7735J08463r3810R5824j05628P130p3239K3631j33502m2479K07621
$$ plain form
717 118863 -46935 229819 69151 24110 110464 170416 289117 123212 113460 -259309 -569072
706 -569072 -280046 -16025 134143 390032 151829 163747 -117292 38117 147770 -36917
696 -36917 -317757 46369 180079 50315 -135593 -86709 169964 170819 -39691 -81985 108067
685 108067 -194250 -133491 -50600 -17582 201047 22351 75464 -98877 -297811 -306800 -103654
674 -103654 -56221 -4427 92392 -49245 -107040 -298795 -376301 -273149 213347 29756 -300746
663 -300746 -13063 203528 27896 -11853 -137650 -120843 -98374 -106716 112601 326507 220932
652 220932 71079 57300 39662 -50153 -124342 -168033 -356022 -301769 -247364 -17898 -114282
641 -114282 -142017 -33554 -127364 -31540 -137168 -130038 -203277 -179646 -313148 -355627 -148006
630a48006J59974j39365k2037n3076L81068q2506j30422J20888J73707j29698
620A30527j9730L39494p1055k59953Q8674N0531k27771J19282J09848m745k34958
609B0144J57640q104p2548L7446j8259q8630N728j3149m0252l8715r5930k6596
597a81225K18558o3928k32499k9315n0226J27231J60745J08977J51526K81751
587D91595k06052l64572L74206J86430L790k95599j18874k6552k29414J78284
577f758J06225k22441k35666J36089K31548l1590q7599K04178n5073J33935L184
566A76032k46157k08563K95670j95066O3592J07337R9326n8452j93437J65399
556E681K2666q3778O863J39051J42217j68491j94351O3072r8864L06146K28385
$$ plain form
630 -148006 11968 -127397 -149434 -202510 178558 96052 -34370 86518 260225 130527
620 130527 110797 450291 379236 119283 207957 258488 30717 149999 259847 255102 20144
609 20144 177784 169680 97132 134578 116319 27689 33417 20268 -19984 -58699 -154629 -181225
597 -181225 37333 -26595 -259094 -288409 -338635 -211404 -50659 58318 209844 491595
587 491595 285543 -79029 295177 481607 485397 189798 70924 44372 -185042 -6758
577 -6758 99467 -122974 -358640 -222551 8997 -22593 -110192 93986 38913 172848 176032
566 176032 -70125 -278688 16982 -178084 -114492 -7155 92171 33719 -159718 5681
556 5681 28347 -55431 -48568 90483 232700 64209 -130142 -67070 -165934 140212 368597
545C68597M224k98983p6861K4136J51603l01347k47218R2940K4135K37548J54911
534A33685J13998q9300j38106l24Q3142O9952K5388j59383j24748K52687k47839
523h0848m698L0199J33088K55942l07196j42379J35094n6606M8923M524L1076
512D7119j51357j4191l952J5881M90223l6701l08661m4834j4220K952j11600Q1932
500d7409R4091J1144J77882J88604k34790l08354m35046J67209J97792Q1129J28436
489B0688n8202j0645o4586J80738j48242O768J26061m204M7643J8673o9251l1774
477A3667K4635O6891J51476k76584j25480O852l3499N2458p9379K88316j5576
466G3777k3093j11489r9889r097L39621Q2235k83158J25132K54602k55070l07034
$$ plain form
545 368597 372821 73838 -3023 21113 172716 -128631 -375849 -282909 -258774 -21226 133685
534 133685 247683 158383 20277 19953 103095 173047 198435 39052 -85696 166991 -80848
523 -80848 -85546 -55347 77741 333683 26487 -115892 19202 -37404 11519 16043 47119
512 47119 -104238 -118429 -122381 -106500 383723 347022 38361 -6473 -20693 -17741 -129341 -47409
500 -47409 46682 57826 235708 424312 189522 -118832 -553878 -386669 -188877 -107748 20688
489 20688 -37514 -48159 -112745 67993 -80249 -73481 52580 48376 96019 114692 45441 13667
477 13667 38302 105193 256669 -19915 -145395 -138543 -172042 -119584 -198963 89353 73777
466 73777 50684 -60805 -160694 -169791 169830 252065 -31093 94039 348641 93571 -213463
455b13463J12035M6648J75553o482Q5654r4021l53897K74513k36647R0651L13043
444A93587J3230j87400j26993J00542j52685M7832N2191L6891K12046P1697m13175
433a52237m1513J11823R5720O9345R8588j13774J03651K53866k06260l00030k54877
422c35698J688k4040K37980J38886M6533J27040j29936J76857k19345j3533j18707
411a12275o8772n5263N9345J95476L5725J39962j11960l4490L03070j10638k7249
400B12931K4718n8559k4348j22002k0707J69478J98031k42166k34537n6504N7677
389i5988J23304K788k6244J32090L25282k87365k78522K38265J05761K42165q4428
378C97108j7057J1674L8322l56048n5196j4209m4869l804P5842J04532K06953
$$ plain form
455 -213463 -101428 -54780 120773 114291 199945 105924 -247973 26540 -210107 -119456 193587
444 193587 206817 19417 -107576 -7034 -159719 -111887 -59696 -22805 189241 260938 -152237
433 -152237 -193750 -81927 13793 83138 181726 67952 171603 425469 219209 -80821 -335698
422 -335698 -334010 -358050 -120070 18816 65349 192389 62453 239310 19965 6432 -112275
411 -112275 -181047 -236310 -176965 18511 54236 194198 82238 47748 350818 240180 212931
400 212931 237649 179090 154742 32740 12033 181511 379542 137376 -97161 -153665 -95988
389 -95988 27316 30104 3860 135950 461232 173867 -104655 133610 239371 481536 397108
378 397108 380051 391725 430047 73999 18803 4594 -40275 -44079 31763 136295 343248
367C43248o3695J42745K3971k64442m94393P686L41231P0637j68323R5422j5838
356A8249k99058J69230O3682j3941J52928R2387j02369J05558m5661k3185j79405
345f1585l5051P1455q6108p2996k4878J63776L4539j5086J09534j83431J88911
334H9080L60634k33210m7891J43902k26353N1843K20052l86852L6030q337J63940
323A62838l161J05188r589k17459j49057j17725k4906J13083K97014j13931K5587
312F7882J08046L24392J6944k83649k00960q4763O1579K99589J28071j16601j95977
301A24553Q8043N2196j62453k4779l0340P5960j6416L9798k5812k45107K49922
290A25565K552k80142q1529K36097P7764O6823j3023j68992k398j12865O6595
$$ plain form
367 343248 279553 422298 446269 181827 -312566 -304880 36351 106988 -61335 34087 18249
356 18249 -280809 -111579 -47897 -61838 91090 183477 81108 186666 141005 117820 -61585
345 -61585 -96636 -25181 -111289 -184285 -209163 -45387 -10848 -25934 83600 -99831 89080
334 89080 449714 216504 168613 312515 86162 138005 358057 -28795 7235 -1102 162838
323 162838 159677 264865 255276 37817 -111240 -228965 -253871 -140788 156226 42295 67882
312 67882 175928 500320 517264 233615 32655 -52108 9471 309060 437131 320530 124553
301 124553 212596 264792 102339 77560 47220 123180 106764 146562 120750 -124357 125565
290 125565 128117 -152025 -233554 2543 80307 147130 134107 -34885 -37283 -150148 -83553
279h3553j66669j50464K52030J78008j41416l30210R8604L50706K44388j79215
269G2209l3609j8628K75229k02540R8914o4255k30728k06991o049J9876j34780
258d31352N0509L39262Q7065j4708K51137k7287j33033j40043J69373j13021Q8433
247A26335K2876k31921p713n6676K47861J24966j54747L5441m1895k44246j30211
236c09930N1305L08662J78538L5733k69551j57446k9698o8307N9156l0529M5041
225a87026K37088J54928r3489r7282o6567Q9501O3504K493j97614j5261q8320
214a98045p9484J88294L39349Q1914j21194j80781l2187j49244M722M4201k12261
203c14716J03230J90656k9649J64967p610K04477p6202m17936K08162L5759r8053
$$ plain form
279 -83553 -250222 -400686 -148656 29352 -112064 -442274 -343670 7036 251424 72209
269 72209 38600 19972 295201 92661 191575 127320 -103408 -310399 -316448 -296572 -431352
258 -431352 -380843 -41581 45484 30776 281913 254626 121593 -18450 150923 37902 126335
247 126335 149211 -82710 -90423 -147099 100762 225728 70981 106422 64527 -179719 -309930
236 -309930 -258625 50037 228575 264308 -5243 -162689 -192387 -260694 -201538 -232067 -187026
225 -187026 50062 204990 111501 14219 -52348 37153 100657 103150 -94464 -109725 -198045
214 -198045 -277529 -89235 250114 332028 210834 30053 -2134 -151378 -146656 -102455 -314716
203 -314716 -211486 -20830 -50479 114488 106878 311355 235153 -182783 25379 61138 -36915
192c6915O730j96816J75999J93213k94578N4056M4234o5640j4388J1885J41664
181A9444j58933J44062J01278K4593k94830L16698J33916p4896j6195J02788k19624
170G8301j47370J38447r1007j00534J64150L0437K7280j25131K06529j62681j64489
159a46068Q1388j73947J83282R0913r9786q7060K46888J26417m5035k56031q2539
148a61578l8060J07685j9352J98915j17229k41148J29788J86148o8341j59226
138a82398j42867M7150J18768J82789J11668j7989K9707o6451P5286n3489j76014
127g3840k4846J50448L3293n4271j21101n9463O7461J09649q8736n4814M360N3305
115e8555N2605m8415J21104j61650Q9697N9688n737L4558j64556k9748K8104J079
$$ plain form
192 -36915 -30185 -227001 -51002 142211 -152367 -98311 -54077 -119717 -134105 -122220 19444
181 19444 -139489 4573 105851 130444 -164386 152312 286228 211332 195137 297925 78301
170 78301 -69069 69378 -21629 -122163 41987 72424 99704 -25427 181102 18421 -146068
159 -146068 -64680 -238627 -55345 35568 -64218 -151278 95610 222027 176992 -79039 -161578
148 -161578 -199638 -91953 -111305 87610 -29619 -270767 -140979 45169 -23172 -182398
138 -182398 -325265 -278115 -159347 23442 135110 117121 146828 80377 155663 102174 -73840
127 -73840 -98686 51762 85055 30784 -90317 -149780 -82319 27330 -61406 -116220 -111860 -58555
115 -58555 -5950 -54365 66739 -94911 -5214 54474 48737 83295 -81261 -111009 -82905 -81826
103h1826J33210O1149k34365J1420J16175M6870L30337j62480k86271j07559J88838
92A5498k4791n9096j2032K23082n2753j552R6255k74287j0903J59820m2604j08155
80i1518m9118Q6505R7748M0555j64668k3610M6085M5208m9842M6343M0008o4759
68d1063K18014p899j62342p9351J83331j17763k64075Q7828O4809j24423j00537
57c43471N9981Q7581J4660m5941P4868J48368j8160o0930O7437J33908k18769
46a00468J17367j3460j12537j45825q3273K30300J18264L5347P4634l6114N038
35H9273j47964o7295o7031J72742J19965k5401J8825k84323j32324K46957R4898
24A8322k29448j01710Q1546P5582j37583J44967r4217k03528J39137R0071N4728
$$ plain form
103 -81826 51384 112533 -121832 -110412 5763 52633 382970 220490 -65781 -173340 15498
92 15498 -9293 -68389 -80421 142661 89908 88356 184611 -89676 -100579 59241 16637 -91518
80 -91518 -140636 -54131 43617 84172 -80496 -104106 -58021 -12813 -62655 -16312 23696 -41063
68 -41063 176951 169052 6710 -72641 110690 -7073 -271148 -183320 -118511 -242934 -343471
57 -343471 -283490 -195909 -181249 -227190 -152322 -3954 -22114 -83044 -15607 118301 -100468
46 -100468 16899 3439 -109098 -254923 -338196 -107896 10368 45715 120349 84235 89273
35 89273 -58691 -125986 -193017 -20275 99690 74289 93114 -191209 -323533 -76576 18322
24 18322 -211126 -312836 -231290 -155708 -293291 -148324 -242541 -446069 -306932 -216861 -162133
13a62133L3874m3289J08782o215p8450j06801P6110L3292m7173j0978P7439P584
1a17958J27466
0I508
$$ plain form
13 -162133 -128259 -171548 -62766 -68981 -147431 -254232 -178122 -144830 -192003 -202981 -125542 -117958
1 -117958 9508
0 9508
$$ Imaginary data points
##PAGE= N=2
##DATA TABLE= (X++(I..I)), XYDATA
16383i33190K43807N7833P760j907l2095P7105r1260j59574M10780J55972j65238
16372d30007M6548N973j24735K81o3020j06840M9660M5003J79968k6597Q553J95732
16360b19481o7433j07411p6877R3149p2128J25026K36664N3589j46836K2429l11209
16349d70518J02450Q0025m0116j7866q0196L20508K4912j6999j84545J58071K29321
16338A05047N8300j39077K0146p713j3794Q2847j68105p3810j01082R3435R9255
16327d4551m7066m1040K3899K19111K08394r8229m6798j37909k1757m5109J85087
16316A54032k3881r2789J84696K72852m4150j6884O5282j62655J21913L5931o9542
16305D24805j38272L18084M1640j48940k02894L4915J14314Q4697j29855L08759
$$ plain form
16383 -933190 -689383 -631550 -623790 -625697 -657792 -580687 -671947 -831521 -420741 -264769 -430007
16372 -430007 -383459 -377486 -502221 -501940 -564960 -671800 -622140 -577137 -397169 -423766 -415213 -219481
16360 -219481 -286914 -394325 -471202 -378053 -450181 -325155 -88491 -34902 -181738 -159309 -470518
16349 -470518 -368068 -288043 -328159 -346025 -426221 -105713 -80801 -97800 -282345 -124274 105047
16338 105047 163347 24270 44416 36703 22909 105756 -62349 -136159 -237241 -143806 -44551
16327 -44551 -91617 -132657 -108758 110353 318747 220518 173720 35811 14054 -31055 154032
16316 154032 130151 37362 222058 494910 450760 433876 499158 336503 458416 494347 424805
16305 424805 286533 604617 646257 497317 294423 329338 443652 528349 398494 707253
16295G07253j50179p3054J51149j51252Q3932k1629j34576Q700J28468N1447m8637
16284E51622J00361p5727j64355K74509P6617j08239K7674p7174K23559k5295
16274H03552j28932N6206j60462R775Q1094P8206J63955J1697o313J37543l25352
16263G20969j3319J50820j0082o3406o201J01521J21816j9800j23610M0070K36393
16252A135171P5329j55025Q7131j30603n7558L6568K67955j53102j6718J91796
16242A280944j86754J905J36792k5059k8501k5543j22723N252N9664j58000J37496
16231A075473R3895m9686P8470r179M6829k6134j8150n9567J74561J66903n4416
16220A418999m7924k47141p2884J60758J21329j18493j10492L80985q1386J00438
$$ plain form
16295 707253 557074 484020 635169 483917 567849 546220 411644 420344 548812 600259 551622
16284 551622 651983 576256 411901 686410 763027 654788 682462 605288 828847 803552
16274 803552 674620 730826 570364 580139 661233 739439 903394 915091 908778 1046321 720969
16263 720969 707650 858470 848388 784982 778781 880302 1002118 982318 858708 898778 1135171
16252 1135171 1210500 1055475 1142606 1012003 954445 991013 1258968 1105866 1089148 1280944
16242 1280944 1094190 1096095 1232887 1207828 1179327 1153784 1031061 1036313 1095977 937977 1075473
16231 1075473 1169368 1119682 1198152 1188973 1235802 1209668 1191518 1131951 1306512 1473415 1418999
16220 1418999 1371075 1123934 1051050 1211808 1333137 1214644 1104152 1485137 1403751 1504189
16210A504189j0238m5894L317j37854k23340J97351K7957l7893J03722k02031
16200A179286J22371j01026j08780J254K76293P4627l2195K52351k91203j02949
16190A270029P5170K19348p7903j70440k1397J38467J52646Q2392J32221k49790
16180A550743j01202J7799j38680o7947J36452K0995O1443J79226k50154j47245
16170A261430o1507M3930J91883m2603L12735j16201j54665j73850J47220j6984
16160A391388K02972K3057k73865K25358r6819J52400R461k1708J07219m078m11398
16149A303987J82347M31069k29018j58818K44557K4222l8008J5146k00015J20084
16139A695553Q0540p6328j64861p9655K9060j38643j28252N9830J03397K61489
$$ plain form
16210 1504189 1493951 1448057 1451374 1313520 1090180 1287531 1315488 1277595 1381317 1179286
16200 1179286 1301657 1200631 1091851 1093105 1369398 1444025 1411830 1664181 1372978 1270029
16190 1270029 1345199 1564547 1486644 1316204 1294807 1433274 1585920 1668312 1800533 1550743
16180 1550743 1449541 1467340 1328660 1260713 1397165 1418160 1479603 1658829 1408675 1261430
16170 1261430 1199923 1243853 1435736 1393133 1705868 1589667 1435002 1261152 1408372 1391388
16160 1391388 1594360 1617417 1343552 1568910 1472091 1624491 1633952 1612244 1719463 1715385 1303987
16149 1303987 1486334 1917403 1688385 1529567 1774124 1798346 1760338 1775484 1575469 1695553
16139 1695553 1776093 1699765 1534904 1455249 1484309 1345666 1217414 1277244 1380641 1642130
16129A642130J82581K3841R5052l59086k35253j54319K41749q672K15227J43033
16119A786283p5804l20k50391R151j02608N886O0129P7533J61259o0372K36641
16108A847387r000k57599J3118l9345k2366R6745K23818n4350J26918Q4792l09747
16097A700371r2961k11166j66893K39519j30110J27131J07842j66703L35403k601
16087A739832k60895J43640N567o979j66624K16119K10204k05795P8698J77224
16077A930991j48664p8473j02748p8674j16111m8408K80267K0052n3287J34290
16067A739235R9321R3521l50054J79653J28111k27010j7145j26661K20185K8243
16057A767399J46065O4414j02596K34271j27113j06872j23349k11456J12381m8839
$$ plain form
16129 1642130 1824711 1848552 1943604 1584518 1349265 1194946 1436695 1428023 1643250 1786283
16119 1786283 1710479 1710159 1459768 1468919 1366311 1372197 1432326 1509859 1671118 1610746 1847387
16108 1847387 1838387 1580788 1593906 1554561 1532195 1628940 1852758 1798408 1925326 2010118 1700371
16097 1700371 1607410 1396244 1229351 1468870 1338760 1465891 1573733 1407030 1742433 1739832
16087 1739832 1478937 1622577 1628144 1621165 1454541 1670660 1880864 1675069 1753767 1930991
16077 1930991 1782327 1703854 1601106 1522432 1406321 1357913 1638180 1658232 1604945 1739235
16067 1739235 1838556 1932077 1582023 1761676 1889787 1662777 1645632 1518971 1739156 1767399
16057 1767399 1913464 1977878 1875282 2109553 1982440 1875568 1752219 1540763 1653144 1604305
16047A604305q4079R8432K48862J920j61332J61618l59304k1582K79290j41717
16037A626413N1018k05740J14052J87610k39595m0336J5260j81955P3706K99508
16027A699941l1722M2989J96225P1262l43784k5006J04222k68677j20920K21561
16017A546091R7567J14176j196q786P0063j31173j10768j69807J11531L0366J95172
16006A743236M35655n1067l30906j61334k4980j97711J34191K821M6340J3665
15996A609910J34600Q1369J77496j90678k17144M6436n9296R5343o8276k2449
15986A587311L1866K84750j12574l90489o6783J66044j26129J47680j35905J60325
15976A546096K2145P4797M7645j02386L28703l5371m15895J87802O9875O0818
$$ plain form
16047 1604305 1520226 1618658 1867520 1869440 1708108 1869726 1510422 1488840 1768130 1626413
16037 1626413 1677431 1471691 1585743 1773353 1533758 1493422 1508682 1326727 1400433 1699941
16027 1699941 1668219 1711208 1907433 1978695 1634911 1609905 1714127 1445450 1324530 1546091
16017 1546091 1643658 1757834 1756638 1747852 1817915 1686742 1575974 1406167 1517698 1548064 1743236
16006 1743236 2178891 2127824 1796918 1635584 1610604 1412893 1547084 1549905 1596245 1609910
15996 1609910 1744510 1825879 2003375 1812697 1595553 1641989 1582693 1678036 1609760 1587311
15986 1587311 1619177 1903927 1791353 1400864 1334081 1500125 1373996 1521676 1385771 1546096
15976 1546096 1568241 1643038 1690683 1588297 1917000 1881629 1465734 1653536 1723411 1784229
15966A784229j74884R328k8040M6412R5737k01901N2068P8405L038j46743K11855
15955A729504m1278j79567j6232L2348P0271q674J43176J25776L22610m6501j15743
15944B015690m2671j47224q4681K57871J34482p8162k18804q8570M1918j21464
15934A668385K66682K0575o0107j51920L4163q9255N9763j64126K74957r2963
15924A766154q8780J09807N0885j1490o0807k17971k4938J0504J11081J43914
15914A788359k60923P0961J39216L2188n1741P8340j470q7565J15210J55073j52971
15903A824677J70159j15943l59296k4754J7506J20926K3922K64006L8783l39421
15893A620565o8084J49687K68862M6329j93028k17725K12233l07341K92547K6389
$$ plain form
15966 1784229 1609345 1618673 1590633 1637045 1732782 1530881 1582949 1661354 1664392 1517649 1729504
15955 1729504 1688226 1508659 1492427 1524775 1595046 1586372 1729548 1855324 2177934 2131433 2015690
15944 2015690 1973019 1825795 1741114 1998985 2133467 2055305 1836501 1747931 1789849 1668385
15934 1668385 1935067 1955642 1895535 1743615 1777778 1688523 1748286 1584160 1859117 1766154
15924 1766154 1677374 1787181 1838066 1826576 1765769 1547798 1522860 1533364 1644445 1788359
15914 1788359 1527436 1598397 1737613 1769801 1718060 1796400 1794930 1707365 1822575 1977648 1824677
15903 1824677 1994836 1878893 1519597 1494843 1512349 1633275 1657197 1921203 1959986 1620565
15893 1620565 1552481 1702168 1971030 2017359 1824331 1606606 1818839 1511498 1804045 1830434
15883A830434M7850j99195M441j48875j37222K88114R5710R9173j56915Q043j93960
15872A537598j9802O9102R166J16735k5726k34713O412M4090n2593P6869K6308
15861A553446p0532J16093j00040K94343L2673M6371k44465n9298M8917j67787
15851A449721r2305J58660K93855p2781k71951J82647J2068q3579J72519m6743
15841A702111l7616j48153R5809L57813j1985j77469p3869j83228m1172L8554
15831A520795R2083m0714K45262j74680J04126J87863p0240j60250k24395K49228
15821A729078J40278J2085j86508j986K46490J7217j72335j95380J04056J36373
15811A829368q1513m1223k4128P8792k01307M2116O4481j43024j82861L97370
$$ plain form
15883 1830434 1878284 1679089 1683530 1534655 1397433 1685547 1781257 1880430 1723515 1731558 1537598
15872 1537598 1517796 1586898 1596064 1712799 1687073 1452360 1458772 1502862 1450269 1527138 1553446
15861 1553446 1482914 1599007 1498967 1793310 1825983 1872354 1627889 1568591 1617508 1449721
15851 1449721 1357416 1516076 1809931 1737150 1465199 1647846 1659914 1576335 1748854 1702111
15841 1702111 1664495 1516342 1612151 1969964 1957979 1780510 1706641 1523413 1482241 1520795
15831 1520795 1612878 1572164 1817426 1642746 1746872 1934735 1864495 1704245 1479850 1729078
15821 1729078 1869356 1881441 1694933 1692947 1939437 1956654 1784319 1588939 1692995 1829368
15811 1829368 1747855 1706632 1682504 1761296 1559989 1602105 1666586 1523562 1340701 1738071
15801A738071K42629k28537j27147N5926l5823J25801p9483k30586L05321J36092
15791A902264l08762M4253K15744j95012k06203J93954l0523j22053J13668K69871
15781A877201N9067J60124k6337P5228j15793j42574j47308j3164L4708P5282
15771A836434J58467R3017n8443r3516j00863j06730o6710m3435l8922r1642J63267
15760A650924M1648q9786J05811J8431m4747J02531m09048k3970J40504J52245
15750A644543J64465o1330K1748J52980l25879j42313q8483J29670K12436J17281
15740A825118O4735L0150k88484K16676r102j98625L5903J72378o0853J2998J60952
15729A961846j19526q8017O0359k52765m9902L2493L15233J85879j35061j76518
$$ plain form
15801 1738071 1980700 1752163 1625016 1680942 1645119 1770920 1691437 1460851 1766172 1902264
15791 1902264 1593502 1637755 1853499 1658487 1452284 1646238 1615715 1493662 1607330 1877201
15781 1877201 1936268 2096392 2070055 2145283 2029490 1886916 1739608 1726444 1761152 1836434
15771 1836434 1994901 2087918 2029475 1935959 1835096 1728366 1661656 1618221 1579299 1487657 1650924
15760 1650924 1692572 1602786 1708597 1727028 1682281 1784812 1375764 1351794 1492298 1644543
15750 1644543 1809008 1747678 1769426 1922406 1596527 1454214 1365731 1495401 1707837 1825118
15740 1825118 1889853 1920003 1631519 1848195 1839093 1640468 1676371 1848749 1787896 1800894 1961846
15729 1961846 1842320 1754303 1814662 1561897 1511995 1544488 1859721 2045600 1910539 1734021
15719A734021J20967L46235k21347j46709p5800k59297K79193N7750j01576O052
15709A739489J18546m5223j56673j64540K5359L21895j38226j87769J09549J15897
15699A738304j9236J05577J42382l02104j76378P2170Q0414j06043J4210Q5315
15689A634611P905J92727k01502m3915N125m24957J34916L35161j30423L35789
15679A845437j83533k1060M742J19120m4966j81032J40344Q2353L08248q6914
15669A982739k8252j63797l33543l4579M0904K02523J93681j84891M25036j73696
15659A926125l56429J24994J8197J73754j80942j24908K14865Q9604k30860q8778
15649A565622Q2275P2897k06242Q3404j47999L40932k0951j09248p1421J1168
$$ plain form
15719 1734021 1854988 2201223 1979876 1833167 1757367 1498070 1777263 1835013 1733437 1739489
15709 1739489 1858035 1812812 1656139 1491599 1516958 1838853 1700627 1512858 1622407 1738304
15699 1738304 1719068 1824645 1967027 1664923 1488545 1560715 1641129 1535086 1549296 1634611
15689 1634611 1642516 1835243 1633741 1589826 1594951 1169994 1304910 1640071 1509648 1845437
15679 1845437 1661904 1640844 1645586 1764706 1719740 1538708 1679052 1761405 2069653 1982739
15669 1982739 1954487 1790690 1457147 1422568 1463472 1665995 1859676 1674785 2099821 1926125
15659 1926125 1569696 1694690 1712887 1886641 1705699 1580791 1795656 1885260 1654400 1565622
15649 1565622 1647897 1720794 1514552 1597956 1449957 1790889 1769938 1660690 1589269 1600437
15639A600437R4734J28980J45616J00508l56881J07924j94702K44173J80933j29534
15629A922188q574J239N2149J01654k14995M3420r0412j82893K35609K5566j09781
15618A775170p3880K05374q0625J95298m4140p1117J14737j37249j67415N9099
15608A775252L50111l2077k92266p2837R1427K27728j79646j91410k70366L88427
15598A794343K04028j43311r7699O3530J13283K37856j16581k35300K86760k65359
15588A841550m7613J36659k27627J55725L8513j17989q912j88981M11315q3150
$$ plain form
15639 1600437 1695171 1824151 1969767 2070275 1713394 1821318 1626616 1870789 2051722 1922188
15629 1922188 1913614 1914853 1967002 2068656 1853661 1897081 1806669 1623776 1859385 1884951 1775170
15618 1775170 1701290 1906664 1826039 2021337 1977197 1906080 2020817 1883568 1716153 1775252
15608 1775252 2125363 2093286 1801020 1728183 1819610 2047338 1867692 1676282 1405916 1794343
15598 1794343 1998371 1855060 1757361 1820891 1934174 2172030 2055449 1820149 2106909 1841550
15588 1841550 1793937 1930596 1702969 1858694 1897207 1779218 1770306 1581325 1992640 1909490
$$ [...]
##END NTUPLES=NMR SPECTRUM
##END=
