##TITLE=1H_DE-80H_X3
 200.13MHz, d2o
 8 sc
 
 19ns.26.2.2025
##JCAMPDX= 6.0         $$ Bruker NMR JCAMP-DX V2.0
##DATA TYPE= NMR SPECTRUM
##DATA CLASS= NTUPLES
##ORIGIN= UXNMR, Bruker Analytische Messtechnik GmbH
##OWNER= pz
$$ XWIN-NMR		Version 3.5
$$ Tue Oct 28 10:44:00 2025 Russian Standard Time (UT+4h)  Yarkov@DPX200
##.OBSERVE FREQUENCY= 200.1313
##.OBSERVE NUCLEUS= ^1H
##.ACQUISITION MODE= SIMULTANEOUS
##.ACQUISITION SCHEME= undefined
##.AVERAGES= 8
##.DIGITISER RES= 18
##SPECTROMETER/DATA SYSTEM= spect
##.PULSE SEQUENCE= zg30
##.SOLVENT NAME= DMSO
##.SHIFT REFERENCE= (INTERNAL, DMSO, 0, 15.5034)
##AUDIT TRAIL= $$ (NUMBER, WHEN, WHO, WHERE, WHAT)
$$ ##TITLE= Audit trail, XWIN-NMR		Version 3.5
$$ ##JCAMPDX= 5.01
$$ ##ORIGIN= Bruker BioSpin GmbH
$$ ##OWNER= Yarkov
$$ C:/Bruker/XWIN-NMR/data/yarkov2/nmr/H-C/1/pdata/1/auditp.txt
$$ ##AUDIT TRAIL=  $$ (NUMBER, WHEN, WHO, WHERE, WHAT)
(   1,<2025-10-28 10:42:39.48 +0400>,<Yarkov>,<DPX200>,
      <created by zg, POWCHK disabled, PULCHK disabled
       configuration hash MD5:
       00 E9 B6 7A A2 85 ED C7 34 08 36 98 17 FE 4E 26
       data hash MD5: 16K
       AA 7C A6 2C F5 4F 42 63 E0 76 1F F3 5A B6 C4 94>)
(   2,<2025-10-28 10:42:47.75 +0400>,<Yarkov>,<DPX200>,
      <Start of raw data processing
       efp BC_mod = 2 LB = 0.25 FT_mod = 6 PKNL = 1 PHC0 = -4584.799 PHC1 = 12.02191 SI = 16K 
       data hash MD5: 16K
       30 C4 48 B7 27 27 09 DB 99 8E FB 67 D3 58 73 E6>)
(   3,<2025-10-28 10:42:55.76 +0400>,<Yarkov>,<DPX200>,
      <abs ABSG = 5 
       data hash MD5: 16K
       2A C3 BE E2 89 7D D5 0A 7F D4 31 3E 78 82 EA 5E>)
(   4,<2025-10-28 10:43:19.70 +0400>,<Yarkov>,<DPX200>,
      <pk PHC0 = -8.097389 PHC1 = 0.4000039 
       data hash MD5: 16K
       60 A7 90 18 9D 3E CB 76 F0 E1 67 02 6F F3 1E 94>)
$$ ##END=
$$ 
$$ hash MD5
$$ 30 A7 05 36 FA 74 B6 76 61 52 6E 3C 41 F3 47 AC
##$RELAX= 
##$RELAX= 
##$RELAX= 
##$RELAX= 
##$RELAX= 
##$RELAX= 
$$ Bruker specific parameters
$$ --------------------------
##$DU= <C:/Bruker/XWIN-NMR>
##$EXPNO= 1
##$NAME= <H-C>
##$PROCNO= 1
##$TYPE= <nmr>
##$USER= <yarkov2>
##$AMP= (0..31)
100 100 100 100 100 100 100 100 100 100 100 100 100 100 100 100 100 100 
100 100 100 100 100 100 100 100 100 100 100 100 100 100 
##$AQSEQ= 0
##$AQ_mod= 1
##$AUNM= <au_zg>
##$AUTOPOS= <>
##$BF1= 200.13
##$BF2= 200.13
##$BF3= 200.13
##$BF4= 200.13
##$BF5= 200.13
##$BF6= 200.13
##$BF7= 200.13
##$BF8= 200.13
##$BYTORDA= 1
##$CFDGTYP= 0
##$CFRGTYP= 5
##$CHEMSTR= <none>
##$CNST= (0..31)
1 1 145 1 1 1 1 1 1 1 1 1 1 1 1 1 1 1 1 1 1 1 1 1 1 1 1 1 1 1 1 1 
##$CPDPRG= <>
##$CPDPRG1= <>
##$CPDPRG2= <>
##$CPDPRG3= <>
##$CPDPRG4= <mlev>
##$CPDPRG5= <mlev>
##$CPDPRG6= <mlev>
##$CPDPRG7= <mlev>
##$CPDPRG8= <mlev>
##$CPDPRGB= <>
##$CPDPRGT= <>
##$D= (0..31)
0 0.7 0 0 0 0 0 0 0 0 0 0.03 0 0 0 0 0 0 0 0 0 0 0 0 0 0 0 0 0 0 0 0 
##$DATE= 1761633758
##$DBL= (0..7)
120 120 120 120 120 120 120 120 
##$DBP= (0..7)
150 150 150 150 150 150 150 150 
##$DBP07= 0
##$DBPNAM0= <>
##$DBPNAM1= <>
$$ [...]
##$SUBNAM3= <"">
##$SUBNAM4= <"">
##$SUBNAM5= <"">
##$SUBNAM6= <"">
##$SUBNAM7= <"">
##$SUBNAM8= <"">
##$SUBNAM9= <"">
##$SW= 18.0517328524113
##$SWIBOX= (0..15)
0 0 2 0 0 0 0 0 0 0 0 0 0 0 0 0 
##$SW_h= 3612.71676300578
##$TD= 16384
##$TD0= 1
##$TE= 0
##$TE2= 300
##$TE3= 300
##$TEG= 300
##$TL= (0..7)
0 120 120 120 120 120 120 120 
##$TP= (0..7)
150 150 150 150 150 150 150 150 
##$TP07= 0
##$TPNAME0= <>
##$TPNAME1= <>
##$TPNAME2= <>
##$TPNAME3= <>
##$TPNAME4= <>
##$TPNAME5= <>
##$TPNAME6= <>
##$TPNAME7= <>
##$TPOAL= (0..7)
0.5 0.5 0.5 0.5 0.5 0.5 0.5 0.5 
##$TPOFFS= (0..7)
0 0 0 0 0 0 0 0 
##$TUNHIN= 0
##$TUNHOUT= 0
##$TUNXOUT= 0
##$USERA1= <user>
##$USERA2= <user>
##$USERA3= <user>
##$USERA4= <user>
##$USERA5= <user>
##$V9= 5
##$VALIST= <valist>
##$VCLIST= <CCCCCCCCCCCCCCC>
##$VD= 0
##$VDLIST= <DDDDDDDDDDDDDDD>
##$VPLIST= <PPPPPPPPPPPPPPP>
##$VTLIST= <TTTTTTTTTTTTTTT>
##$WBST= 1024
##$WBSW= 4
##$XGAIN= (0..3)
0 0 0 0 
##$XL= 0
##$YL= 0
##$YMAX_a= 17543
##$YMIN_a= -16367
##$ZGOPTNS= <>
##$ZL1= 120
##$ZL2= 120
##$ZL3= 120
##$ZL4= 120
##$ABSF1= 15.50341
##$ABSF2= -2.548439
##$ABSG= 5
##$ABSL= 3
##$ALPHA= 0
##$AQORDER= 0
##$ASSFAC= 0
##$ASSFACI= 0
##$ASSFACX= 0
##$ASSWID= 0
##$AUNMP= <proc_1d>
##$AZFE= 0.1
##$AZFW= 0.1
##$BCFW= 0
##$BC_mod= 2
##$BYTORDP= 0
##$COROFFS= 0
##$CY= -3
##$DATMOD= 1
##$DC= 0
##$DFILT= <>
##$DTYPP= 0
##$F1P= 0
##$F2P= 0
##$FCOR= 1
##$FTSIZE= 16384
##$FT_mod= 6
##$GAMMA= 0
##$GB= 0
##$INTBC= 1
##$INTSCL= 3.241238e-09
##$ISEN= 128
##$LB= 0.25
##$LEV0= 0
##$LPBIN= 0
##$MAXI= 10000
##$MC2= 0
##$MEAN= 0
##$ME_mod= 0
##$MI= 1.114404
##$NCOEF= 0
##$NC_proc= -11
##$NLEV= 6
##$NOISF1= 3.799351
##$NOISF2= 2.8
##$NSP= 0
##$NTH_PI= 0
##$NZP= 0
##$OFFSET= 15.50341
##$PC= 1
##$PHC0= -4592.896
##$PHC1= 12.42191
##$PH_mod= 1
##$PKNL= yes
##$PPARMOD= 0
##$PSCAL= 0
##$PSIGN= 0
##$REVERSE= no
##$SF= 200.130003660558
##$SI= 16384
##$SIGF1= 3
##$SIGF2= 2
##$SINO= 0.751879
##$SIOLD= 32768
##$SREGLST= <19F.Aceton>
##$SSB= 0
##$STSI= 16384
##$STSR= 0
##$SW_p= 3612.71676300578
##$SYMM= 0
##$S_DEV= 0
##$TDeff= 16384
##$TDoff= 0
##$TI= <>
##$TILT= no
##$TM1= 0
##$TM2= 0
##$TOPLEV= 0
##$USERP1= <user>
##$USERP2= <user>
##$USERP3= <user>
##$USERP4= <user>
##$USERP5= <user>
##$WDW= 1
##$XDIM= 16384
##$YMAX_p= 297006683
##$YMIN_p= -15287920
$$ End of Bruker specific parameters
$$ ---------------------------------
##NTUPLES= NMR SPECTRUM
##VAR_NAME=  FREQUENCY,     SPECTRUM/REAL,   SPECTRUM/IMAG
##SYMBOL=    X,             R,               I
##VAR_TYPE=  INDEPENDENT,   DEPENDENT,       DEPENDENT
##VAR_FORM=  AFFN,          ASDF,            ASDF
##VAR_DIM=   16384,         16384,           16384
##UNITS=     HZ,            ARBITRARY UNITS, ARBITRARY UNITS
##FACTOR=    0.220516191357247, 1,           1
##FIRST=     3102.69756796634, 0,            0
##LAST=      -510.019195039437, 0,           0
##MIN=       -510.019195039437, -15287920,   0
##MAX=       3102.69756796634, 297006683,    0
$$ Real data points
##PAGE= N=1
##DATA TABLE= (X++(R..R)), XYDATA
$$ [...]
6841C546051P09167J97184o92038n8544k69623J216002J94471j217977j223050
6832B401643K11478n96387Q52450J128461l94803J38256j793998J91457N20577
6823B659134O20754O97193K822j050034r68788N09924M24685J91120O3360l0498
6813C119672Q17864J35147o45214p02488J102566Q12568O6427j188413K56521
6804C774650k845j033147O8529P10543M919M01144l63383J28452n86701r66192
6794B135969o1931L83862L63200M61701J189648M05207K18832j456968n12563
6785C126957O6787M05148N73603m90075Q75906j262809J6091N34171L35924k39365
6775C942338j67452N14537J46848r23129l77852M34624Q64473K15831k37729l17229
$$ plain form
6841 3546051 4255218 4452402 3760364 3701820 3432197 4648199 4842670 3624693 2401643
6832 2401643 2613121 2016734 2869184 3997645 3602842 3741098 1947100 2138557 2659134
6823 2659134 3279888 3977081 3979903 2929869 1961081 2471005 2895690 3086810 3150170 3119672
6813 3119672 3937536 4072683 3427469 2724981 3827547 4640115 4706542 3518129 3774650
6804 3774650 3771805 2738658 2807187 3517730 3522649 3923793 3560410 3688862 3102161 2135969
6794 2135969 2074038 2457900 2821100 3282801 4472449 4877656 5096488 3639520 3126957
6785 3126957 3193744 3598892 4172495 3682420 4558326 3295517 3311608 3845779 4181703 3942338
6775 3942338 3774886 4289423 4436271 3513142 3135290 3569914 4434387 4650218 4412489 4095260
6765D095260k60997J57913J075663K3922o47684r1622j30603l67409J806655j637491
6755D023607n0091j42836m42121q1792o97528J003066K09733j09456k80498k89430
6745C142654L01928p45532J062894O26201n86327N52313J41475P72874k358621
6736B909859R7723L69459J259241N37959m9757l27731p37582j344652J029151
6727C743670Q70609j318532l49886P76069L55428j83134L18481J50794J5967r0414
6717D289052N2635Q88419J49620J06439j407078J379327O55351k11999L522m57166
6707E448122K35362o62015P28634k50855K41106m40824o21928K99477J8512o63015
6697D332576P62097L82768J08266L74901o5587Q20147l39613n78705L1239L10681
$$ plain form
6765 4095260 3834263 3992176 5067839 5091761 4444077 4352455 4221852 3854443 5661098 4023607
6755 4023607 3973516 3830680 3388559 3306767 2609239 3612305 3822038 3712582 3432084 3142654
6745 3142654 3444582 2699050 3761944 4388145 3801818 4354131 4495606 5268480 2909859
6736 2909859 3007582 3377041 4636282 5174241 5124484 4796753 4059171 2714519 3743670
6727 3743670 4614279 3295747 2945861 3721930 4077358 3894224 4212705 4363499 4379466 4289052
6717 4289052 4341687 5230106 5379726 5486165 4079087 5458414 6113765 5901766 5905288 5448122
6707 5448122 5683484 5021469 5750103 5499248 5740354 5299530 4677602 4977079 4995591 4332576
6697 4332576 5094673 5477441 5585707 5960608 5895021 6715168 6375555 5796850 5828089 6138770
6687F138770r5479J02069N53920r02426j24407K84367l97643O69301k81976j356186
6677D590310M25564R92018m73731M03807L8225N0573j64137p31422O49486J05130
6667E885823l86690J020232l88073J52377o07024j61971j7818J655894n1441j108919
6657E992390L72863N51049j9392K53218l27997o28909O24552k93743K0414K01681
6647F746126p00468O6848k25698R1084R75836O93888K96604L36921q90282o52232
6637F738627K61566j121749m01575p9206M14932J63064L73443J120786l83824
6628G086064m71135N39017j12507m69392L30422j204708M68994L33785j83379
6619F317161J26459P41154P4001K94406O58622o92253N42298K0184N14539m65792
$$ plain form
6687 6138770 6043291 6145360 6699280 5796854 5672447 5956814 5559171 6228472 5946496 4590310
6677 4590310 5015874 6007892 5534161 5937968 5976193 6026766 5862629 5131207 5780693 5885823
6667 5885823 5499133 6519365 6131292 6283669 5676645 5514674 5496856 7152750 7101309 5992390
6657 5992390 6365253 6916302 6896910 7150128 6822131 6193222 6817774 6524031 6544445 6746126
6647 6746126 6045658 6112506 5886808 5977892 6953728 7647616 7944220 8281141 7390859 6738627
6637 6738627 7000193 5878444 5476869 5397663 5812595 5975659 6349102 7469888 7086064
6628 7086064 6614929 7153946 7041439 6572047 6902469 5697761 6166755 6500540 6317161
6619 6317161 6443620 7184774 7258775 7553181 8211803 7519550 8061848 8082032 8596571 8130779
6609H130779r96846Q35114j37167P33897J277405j259550N0918j676209o49782
6600F308559Q69548N83600l62865N29041k08406P46328j47564k70416K03586m13733
6590G837678q32534j46691L98290m070o92889N80085R64808Q60602p16202M21617
6580H670694R98749j389751l94535P98895o30680R81203k05518L61781J137703
6571A0328541M23874m20590l89626P60425j73975l58074r95343M52854j03099
6562I524987N04473N41644K0268k6901k56687p9859L47948N18081O07396L38422
6552A2039772O52328n65277n85804L26589K26739P87812J04509L71953l34287
6543A3024334R66977K9476J90186O05833P7831R78363K2010J65175Q37780m3174
$$ plain form
6609 8130779 7133933 7969047 7831880 8565777 9843182 8583632 8634550 6958341 6308559
6600 6308559 7178107 7761707 7398842 7927883 7719477 8465805 8318241 8047825 8251411 7837678
6590 7837678 7005144 6858453 7256743 7252673 6559784 7139869 8104677 8965279 8249077 8670694
6580 8670694 9669443 8279692 7885157 8684052 8053372 9034575 8829057 9190838 10328541
6571 10328541 10752415 10331825 9942199 10702624 10528649 10170575 9175232 9628086 9524987
6562 9524987 10029460 10571104 10591372 10564471 10307784 10227925 10575873 11093954 11701350 12039772
6552 12039772 12692100 12126823 11541019 11867608 12094347 12882159 12986668 13358621 13024334
6543 13024334 13991311 14020787 14210973 14816806 14894637 15873000 15895010 16060185 16897965 16854791
6533A6854791o4222k62827k1531J33465L21524J91036P73871J354048O26890P89155
6523B0696200R9976J01981j078983P34855Q28718K64424M32243J62717N71395
6514B2813526P045m41955M39130q09826J134129J524412K46912J40027j54811
6505B4898589N07841K30731m5427R64277p28294J571102J639983j14435l68587
6496B8555780R93383M83292j49171J513343k99892Q03781O31834l54302o94191
6487C1483857j50818M50605L89386N5400J06023J171909Q73543O86161P7269Q6677
6477C5230012J89816j572320L73852N58690p0745N04146J142772j298797J59066
6468C5216492M03239J64274K73361M18604K69367k80646l10806m3882n82038P35532
$$ plain form
6533 16854791 16790569 16527742 16506211 16639676 16961200 17152236 17926107 19280155 19907045 20696200
6523 20696200 20796176 20898157 19819174 20554029 21382747 21647171 22079414 22242131 22813526
6514 22813526 22820571 22378616 22817746 22007920 23142049 24666461 24913373 25053400 24898589
6505 24898589 25406430 25637161 25591734 26556011 25827717 27398819 29038802 28924367 28555780
6496 28555780 29549163 30032455 29883284 31396627 31096735 31900516 32532350 32178048 31483857
6487 31483857 31333039 31783644 32173030 32228430 32334453 33506362 34379905 35066066 35143335 35230012
6477 35230012 35419828 33847508 34221360 34780050 34709305 35213451 36356223 35057426 35216492
6468 35216492 35619731 35784005 36057366 36475970 36745337 36464691 36153885 36110003 35527965 36263497
6458C6263497J404931J11886J145604j378001r25917n27177l87874o96571J165299
6449C6175677P1424r5856j779407N89170j140238r20792l74411j216598o15181
6440C0693788k92290n98285m1764p58046k74069m92637j204258M1264j03680r19484
6430B6050539o47191o37367j071238O7314L16858P83473j288397J80520M92497
6421B4247008m05976m65114k10734p00202L46756J482069p11328P52319K3137
6412B4357935j54105J177505L5402j22879K80383J224248R90812Q2423M35611
6403B8307335J34762K7425N82921J20510L98572L41945J163395L61787p21622
6394C0717030n06865J397678q52636K19322j125081L07755k94724J57463O35710
$$ plain form
6458 36263497 37668428 37780314 38925918 37547917 36622000 36094823 35706949 35010378 36175677
6449 36175677 36247101 36151245 34371838 34961008 33820770 32899978 32525567 31308969 30693788
6440 30693788 30401498 29803213 29761449 29003403 28729334 28236697 27032439 27073703 26970023 26050539
6430 26050539 25403348 24765981 23694743 23762057 24078915 24862388 23573991 23754511 24247008
6421 24247008 23841032 23375918 23165184 22464982 22811738 24293807 23582479 24334798 24357935
6412 24357935 24203830 25381335 25416737 25293858 25574241 26798489 27789301 27871724 28307335
6403 28307335 28442097 28469522 29052443 29172953 29571525 29913470 31076865 31438652 30717030
6394 30717030 30210165 31607843 30755207 30974529 29849448 30157203 29862479 30019942 30655652
6385C0655652j569442j80480K61646r98698l32387m83785j540464m23914o76631
6376B4711497j541197J7345j376954o88367Q11215p92729p32005q24564J6509
6367A9600750r53599m03616j439982L06940l76486m26862q89251n76319M23257
6358A5264832P99660j403019j388721O2945j361918l71978M57063J178033m59572
6349A2777325o47423o14641l8092m02416J91869n91519P19602O8519p60452n06739
6339A0196033J004948j130098N4573o6093O19235j18138m25109m53896j019080
6330H662375N40954r0436O57340j315268P17593M06726j146300m36928M37225
6321H433281M61004j064Q97833j038254O49637k87021q76877M69881p77921k29017
$$ plain form
6385 30655652 29086210 28905730 29167376 28168678 27836291 27352506 25812042 25388128 24711497
6376 24711497 23170300 23187645 21810691 21122324 21933539 21140810 20408805 19584241 19600750
6367 19600750 18647151 18243535 16803553 17110493 16734007 16307145 15417894 14841575 15264832
6358 15264832 16064492 14661473 13272752 13335697 11973779 11601801 12058864 13236897 12777325
6349 12777325 12129902 11515261 11477169 11074753 11266622 10675103 11394705 11463224 10702772 10196033
6339 10196033 11200981 10070883 10125456 10059363 10678598 10560460 10135351 9681455 8662375
6330 8662375 9203329 9112893 9770233 8454965 9172558 9579284 8432984 7996056 8433281
6321 8433281 8894285 8893221 9791054 8752800 9402437 9115416 8238539 8708420 7930499 7701482
6311G701482M26203j61926n32495j67830p43112p04069m11984J619405J045692
6302H071366l85198o53002N76849o60236k25312L35664K53030l13649J7284o8260
6292F948536k21801K12134o4619J95683k95925k57062O90492j007539J470023
6283G669922N72494O1482l60240P24213L32105j268572Q4714j129286o37604R19910
6273F969138j48276n01349N49962N52688j35388j14936k63098J96372O97362R79992
6263H782467j369930r93574J45297K12230k87427j65692K73788P75503L21320
6254G693982q33183K88617J176106M70399m91998r90813j169893J925446J84396
6245H253059j319929N22428J076059k85227J811488j7305j457737m91506j221706
$$ plain form
6311 7701482 8127685 7965759 7433264 7265434 6522322 5818253 5406269 7025674 8071366
6302 8071366 7686168 7033166 7610015 6949779 6724467 7060131 7313161 6999512 7016796 6948536
6292 6948536 6726735 6938869 6874250 7069933 6774008 6516946 7207438 6199899 7669922
6283 7669922 8242416 8303898 7943658 8667871 8999976 7731404 7816118 6686832 6049228 6969138
6273 6969138 6820862 6319513 6869475 7422163 7286775 7171839 6908741 7105113 7802475 8782467
6263 8782467 7412537 6418963 6564260 6776490 6489063 6323371 6597159 7372662 7693982
6254 7693982 6860799 7149416 8325522 8795921 8303923 7313110 6143217 8068663 8253059
6245 8253059 6933130 7455558 8531617 8246390 10057878 10040573 8582836 8091330 6869624
6236F869624M17445K60148M10961J176854O59692L63098l90056k52497J270903
6227A0786172N2228n71267K07437L72809K74461M78712p94698k77490J480129
6218A2008493P26182O59144j43828J197347m52210M40456J172458J336488Q72702
6209A7817232k03059Q97534L67774p53889O76591M71533Q77093J35804l27499
6200A9959114J304523Q99719O51914L73095M51625K65364K79982M07762j87013
6191B4406085K37903l32257J92212J93362N86415K016817q7153j530953R96776
6182B6679207J227285l70469n05793j289668R93365m31137N27601K81041l9022
6173B7072410N50329R98573N0400j104640p1956n94709L54457Q238l61355m43350
$$ plain form
6236 6869624 7287069 7547217 7958178 9135032 9794724 10157822 9767766 9515269 10786172
6227 10786172 10838400 10267133 10474570 10847379 11121840 11600552 10805854 10528364 12008493
6218 12008493 12734675 13393819 13249991 14447338 13995128 14435584 15608042 16944530 17817232
6209 17817232 17614173 18511707 18879481 18125592 18802183 19273716 20150809 20286613 19959114
6200 19959114 21263637 22163356 22815270 23188365 23639990 23905354 24185336 24593098 24406085
6191 24406085 24643988 24311731 24503943 24697305 25283720 27300537 27213384 25682431 26679207
6182 26679207 27906492 27536023 27030230 25740562 26733927 26302790 26830391 27111432 27072410
6173 27072410 27622739 28621312 28671712 27567072 27495116 26900407 27254864 27263102 26901747 26458397
6163B6458397m20482l27857k32926j198430J27194J017252r00836J217584o67597
6154B5072299q88901o14446L93032l84489k27892q54427K58962j84800r24022
6145B1645316P47232o04440j004881o78531M58176Q09149n35354q29310Q40624
6136B0847981J80175p62577n94219l48248L3448R0100j7256r22150J05955j14541
6126A8498668P4060L08137q63981m9107k24837k7811r35252N62716m49355P42215
6116A7635453q35711M47119J095265r26401j188365l05380k59443J559864O49466
6107A7871867p81521j19886Q28499q16196q79686k45672K78942L94091j031675
6098A5498763O18921N8573j275814l38543O21919k59566k08102Q04438j564275
$$ plain form
6163 26458397 26037915 25710058 25477132 24278702 24405896 25423148 24522312 25739896 25072299
6154 25072299 24183398 23568952 23961984 23577495 23349603 22495176 22754138 22569338 21645316
6145 21645316 22392548 21788108 20783227 20104696 20562872 21372021 20836667 20007357 20847981
6136 20847981 21028156 20265579 19671360 19323112 19356560 19446660 19429404 18507254 18613209 18498668
6126 18498668 18572728 18880865 18016884 17967777 17742940 17715129 16779877 17342593 16893238 17635453
6116 17635453 16799742 17246861 18342126 17415725 16227360 15921980 15662537 17222401 17871867
6107 17871867 17090346 16970460 17798959 16982763 16103077 15857405 16136347 16530438 15498763
6098 15498763 16117684 16176257 14900443 14561900 15183819 14924253 14716151 15520589 13956314
6089A3956314m28209R1343l79044q07165m0949K44997R71804q41196l62423n36323
6079A1869149m49790q17913l14487m68735J120885P75119j74334n47219j157296
6070I835379K4212l97400N80m29991q2216L92708M0911r82435Q60929O500n40717
6059H728460j324178J505025j54525R11097m24173O1460K74506r91258k68133
6050H318281Q01678j367793j9017J49476M70553o597j156149o17944J516772k01283
6040G887977k23263N70520n04695j076612J93130O54946k86198J03832K11113
6031G530750O00752J57467m14949L21561j55126o35530j209972P74766P78276
6022G747995k35881K64723L82893l1572o04570m20361k16949Q36431p93508J55366
$$ plain form
6089 13956314 13528105 13619448 13240404 12433239 12392290 12637287 13609091 12767895 12405472 11869149
6079 11869149 11419359 10601446 10286959 9818224 10939109 11714228 11539894 10992675 9835379
6070 9835379 9859591 9462191 9462771 9032780 8950564 9343272 9384183 8401748 9262677 9269177 8728460
6059 8728460 7404282 8909307 8754782 9665879 9241706 9303166 9577672 8586414 8318281
6050 8318281 9119959 7752166 7733149 7882625 8353178 8346581 7190432 6572488 8089260 7887977
6040 7887977 7664714 8235234 7730539 6653927 6847057 7502003 7215805 7319637 7530750
6031 7530750 8131502 8288969 7874020 8195581 8040455 7404925 6194953 6969719 7747995
6022 7747995 7512114 7776837 8159730 8128158 7523588 7103227 6886278 7722709 6929201 7084567
6012G084567m94408M32812K8884p28333R66116O05182r23222J99914o18553j282994
6002E269965K54167Q6619J069208J05225L80261J04806p52716K13143k11760j124649
5992E394269R43964O40314l57572n05026n47091J9721J22278j02157J032533J20742
5982F761975k97211M4026O35405n9225j573682P02414K62190N47146O38323m55986
5972G205375p34157M06502N83383L48592m81552K57603K85522M50387j522933
5963F798722j15087P19582J111755k81386l9596j963092j024628R56643R27511
5954G090424j20511Q58797j31235j63621L67831n23188k2132l16656k57722m86263
5944F295724q9151M99437L27272Q46693j40263q68242J010842Q16851r07839m58237
$$ plain form
6012 7084567 6590159 7022971 7051855 6323522 7289638 7894820 6971598 7171512 6552959 5269965
6002 5269965 5524132 5610751 6679959 6785184 7165445 7270251 6517535 6730678 6518918 5394269
5992 5394269 6338233 6978547 6620975 6115949 5568858 5588579 5710857 5608700 6641233 6761975
5982 6761975 6464764 6508790 7144195 7084970 5511288 6213702 6475892 7023038 7661361 7205375
5972 7205375 6471218 6877720 7461103 7809695 7328143 7585746 7871268 8321655 6798722
5963 6798722 6683635 7403217 8514972 8233586 8193990 6230898 5206270 6162913 7090424
5954 7090424 6969913 7828710 7697475 7533854 7901685 7378497 7356365 7039709 6781987 6295724
5944 6295724 6206573 6706010 7033282 7879975 7739712 6871470 7882312 8699163 7791324 7333087
5934G333087K58884N75360R17218o4078N9759o39084M53559M98857j277910N95796
5924H711448j82916j038961o09365l0837P04469M78948J05854O05922j20863p15135
5914G908564N64387k08712o0806O5883k51277N75474J152942m45383L44484M26729
5904A0072285M96999m22891j094026P66778K91229J66042Q7316l92341m03227
5895I568164m87178l77949J61899J213171M88909P35628p08157m02085L31518
5886A0523920q2289m29676O2064Q43792m75477j60842l7477N37050K11437j129184
5876I863318N00818L95240J072553j63751J11773O13815q6482J96289l60260k54185
5866A1889128l93843j161576P24178J320265k11458n11872Q81229p58319Q45530
$$ plain form
5934 7333087 7591971 8167331 9084549 9020471 9080230 8441146 8894705 9393562 8115652 8711448
5924 8711448 8528532 7489571 6880206 6849369 7553838 8032786 8138640 8744562 8623699 7908564
5914 7908564 8472951 8264239 8203433 8269316 8018039 8593513 9746455 9301072 9645556 10072285
5904 10072285 10569284 10146393 9052367 9819145 10110374 10276416 10363732 9971391 9568164
5895 9568164 9080986 8703037 8864936 10078107 10567016 11302644 10594487 10192402 10523920
5886 10523920 10441631 10011955 10074019 10917811 10442334 10281492 10244015 10781065 10992502 9863318
5876 9863318 10364136 10759376 11831929 11668178 11779951 12393766 12307284 12503573 12143313 11889128
5866 11889128 11495285 10333709 11057887 12378152 12166694 11654822 12536051 11777732 12623262
5857A2623262n9209J23378n73535J19740O45086Q57944L35623j594248M99117
5848A2977158O52247j59121O96832k85296k63215O91605J83653q44845p9592J395975
5838A4965401j17171R50170L51764L09154l61086O18102k6571n07945L80146J12431
5828A6674395K96403j36137m9253L82825J314528O99323m27718k27225O76907
5819A9204048K79542O33541L10010o47229Q29531P09340O59916J21731J99943
5810B2300373M85033M26359L86061O88151R16223J316618M2860M54356Q42485
5801B7858519M85374M58072K59739N80436N72218J358812J907217R21628K90366
5792C4692381K11706J270760K27350K042480K147678P02460o1683O24652K366919
$$ plain form
5857 12623262 12564053 12687431 12113896 12233636 12878722 13736666 14072289 12478041 12977158
5848 12977158 13629405 13470284 14167116 13881820 13618605 14310210 14493863 13649018 13569426 14965401
5838 14965401 14848230 15798400 16150164 16459318 16098232 16716334 16689763 16181818 16561964 16674395
5828 16674395 16970798 16834661 16785408 17168233 18482761 19182084 18754366 18527141 19204048
5819 19204048 19483590 20117131 20427141 19779912 20609443 21318783 21978699 22100430 22300373
5810 22300373 22785406 23211765 23597826 24285977 25202200 26518818 26561678 27016034 27858519
5801 27858519 28343893 28801965 29061704 29642140 30214358 31573170 33480387 34402015 34692381
5792 34692381 34904087 36174847 36402197 38444677 40592355 41294815 41233132 41857784 44224703
5783D4224703K353703O09209J558847R66337J968126K345081J485023J956288
5775E7467317K061154K106640R22893L028607K862048L010189K031651J950029
5767G5440528J744314K197028K727330K277273K854546L507978K059609J392917
5759I4201523J684319M735594K818884J399159J814852J435564J291680J515056
5751A10896631K794223J203890J481506J029852J96376K1026J204043K74540l4508
5742A19067579r46253K82225O7062k005517j327099j411640n92392j571457j712431
5733A09850077k309160j661138k194113k010872n79232j996244j989674k592758
5725I4516886j917030j760665k314981l406169k265165j877412j672282k543707
$$ plain form
5783 44224703 46578406 47187615 48746462 49712799 51680925 54026006 55511029 57467317
5775 57467317 59528471 61635111 62558004 65586611 68448659 71458848 73490499 75440528
5767 75440528 77184842 79381870 82109200 84386473 87241019 90748997 92808606 94201523
5759 94201523 95885842 100621436 103440320 104839479 106654331 108089895 109381575 110896631
5751 110896631 113690854 114894744 116376250 117406102 117602478 117623504 118827547 119102087 119067579
5742 119067579 118121326 118403551 118470613 116465096 115137997 113726357 113133965 111562508 109850077
5733 109850077 107540917 105879779 103685666 101674794 101095562 99099318 97109644 94516886
5725 94516886 92599856 90839191 88524210 85118041 82852876 80975464 79303182 76759475
5717G6759475o33188j761747k530921j496875j630471j7166p0377j189941r73760
5708F6455029j554237k133593q04396j306016r35745j075631r78287j687794J45717
5699E6125047J418499k441628j827852l06564j774252P18138j32838k92160p41382
5690E0745008n8593n20383k12543j030283N35856n67301q06716n22547j106898
5681D6455600J22465o60978m52139j073685q39680q36154O72365j390398l51664
5672D1645732p40124J19910j408445q48389q46617N5732P76437j205509L36221
5663C7884948K72880j91662j407762n64449k50308o18578j273786o39697m76030
5654C2735556j194720k50934o91097P2677N21160j089877r15373j424859N25735
$$ plain form
5717 76759475 76126287 74364540 71833619 70336744 68706273 68689107 68618730 67428789 66455029
5708 66455029 64900792 62767199 61962803 60656787 59721042 58645411 57667124 55979330 56125047
5699 56125047 57543546 55101918 53274066 52967502 51193250 51911388 51778550 51486390 50745008
5690 50745008 50686415 50166032 49953489 48923206 49459062 48891761 48085045 47562498 46455600
5681 46455600 46578065 45917087 45464948 44391263 43551583 42715429 43387794 41997396 41645732
5672 41645732 40905608 41025518 39617073 38768684 37922067 37977799 38754236 37548727 37884948
5663 37884948 38157828 37966166 36558404 35993955 35743647 35125069 33851283 33211586 32735556
5654 32735556 31540836 31289902 30598805 30671482 31192642 30102765 29187392 27762533 28288268
5645B8288268J265473L96815j640102l70309r03708l75373n12211Q571p23394
5636B5434030j032039m66529o85759N09117Q58725N63667j228668p01278N875
5627B3257141m4650k39469P3416Q86549n29547p48080r4719o28770j61196R9216
5617B1869891M30031j20563o05241j07102n06878J82474L75678J1145n75842n73691
5607B0379902n84811j14105K92178k55406L32919l35696K3589l99974J055795
5598B0394391O63248k8234k97581m18493K18565K42082n09579p49969L76894P69830
5588B0661154l5615N27846J39767l69068L54055O7493M77901j8708j94726n35420
5578B1074679O92571J312943r77739L29900N03825J22571j624346N66262J436046
$$ plain form
5645 28288268 29553741 29950556 28310454 27940145 27036437 26661064 26148853 26157424 25434030
5636 25434030 24401991 23935462 23249703 23758820 24617545 25181212 23952544 23251266 23257141
5627 23257141 23212491 22973022 23046438 23932987 23403440 22655360 22560641 21931871 21770675 21869891
5617 21869891 22299922 22179359 21574118 21467016 20960138 21142612 21518290 21529435 20953593 20379902
5607 20379902 19795091 19680986 19973164 19717758 20050677 19714981 19738570 19338596 20394391
5598 20394391 21057639 21029405 20731824 20313331 20531896 20773978 20264399 19514430 19891324 20661154
5588 20661154 20625539 21153385 21293152 20924084 21278139 21345632 21823533 21804825 21610099 21074679
5578 21074679 21767250 23080193 22102454 22432354 22936179 23058750 21434404 22000666 23436712
5569B3436712j52644k43960n78442J572946K59710j149066o68017M16021m7024
5560B2846236L43672o79854J5164k36252q15613J686984p34218r88919m13249
5551B1023951O2984L80432M41691r76207j161045R54092J44048r30498J229032
5542B1168480j29781L25917k19233j241397M16901Q99676J49587n00272K30907
5533B1100785j69739j057091J198792l61925M46090R24431m82797k97821p0442
5524B1230283J320333M58449l66922q08009m95531o07018O34403L57487J95806
5515B1919281n3521k55545J27651N41659j82188k01015J59781L77164m50173O72081
5505B2655175L02743J21894M60395K88999j124220N89310N82187O18883L79935
$$ plain form
5569 23436712 23284068 23040108 22461666 24034612 24294322 23145256 22477239 22893260 22846236
5560 22846236 23189908 22510054 22525218 22288966 21473353 23160337 22426119 21437200 21023951
5551 21023951 21086935 21467367 21909058 20932851 19771806 20725898 20869946 19939448 21168480
5542 21168480 21038699 21364616 21145383 19903986 20320887 21220563 21370150 20869878 21100785
5533 21100785 20931046 19873955 21072747 20710822 21156912 22081343 21598546 21300725 21230283
5524 21230283 22550616 23009065 22642143 21834134 21338603 20731585 21365988 21723475 21919281
5515 21919281 21865760 21610215 21737866 22279525 22097337 21896322 22056103 22433267 21983094 22655175
5505 22655175 22957918 23079812 23540207 23829206 22704986 23294296 23876483 24495366 24875301
5496B4875301j089947k30442k80590N21733o01179j51729J004539J189145j453905
5487B3782926o27882L87037N25232k08827M71741k94060j43241O54910j054570
5478B3493266L56663j66979M55564Q40072Q36092j68025M62048j132305p83567
5469B4192829M88115J361624M17396j187864m03165J38225M3459K57227K90215
5460B5598061l70808R76228l61997q83628M99332J26619n41267L36080N2709j1890
5450B5419439R4910o60915J307137R04723o50711p92646O63882r68065J11369
5441B5429123l67004k8763O86524q12878r4224l28444r6420o6236J054028Q13718
5431B6189424r98726K6200k88841q83337L98507O09342l97399q10098R93341l78907
$$ plain form
5496 24875301 23785354 23554912 23274322 23796055 23194876 23043147 24047686 25236831 23782926
5487 23782926 23155044 23542081 24067313 23858486 24330227 24036167 23892926 24547836 23493266
5478 23493266 23849929 23682950 24138514 24978586 25814678 25646653 26108701 24976396 24192829
5469 24192829 24680944 26042568 26459964 25272100 24868935 25007160 25050619 25307846 25598061
5460 25598061 25227253 26203481 25841484 24957856 25457188 25583807 25042540 25378620 25431329 25419439
5450 25419439 25514349 24853434 26160571 27065294 26414583 25621937 26285819 25317754 25429123
5441 25429123 25062119 25033356 25719880 24907002 24812778 24484334 24387914 24321678 25375706 26189424
5431 26189424 25190698 25216898 24928057 24044720 24443227 25052569 24655170 23845072 24838413 24459506
5421B4459506n10879L66206k14710L33589O76324M8272o56861q79336o18019O62941
5411B3667033J11900r72145r1981k77442n80344N03249Q0424j353196N99599L53007
5401B2040104j252114L5950k83198L18587Q4139m67121q90057p60286m14987P34708
5391A9145725P91205n53364j94799j27554L50185o95541l87095J131695k9591
5382A9430866r31901r0440P1363K26239j77103j64372o67866m86951n96948R04320
5372A7517207Q83396R02487j007042n76676j759711j117091N91135P36965P97258
5363A6967928O37357O4348o98623m48971j70619J96375l7665R02513R82123n59850
5353A7834916j245031R3292o31135q18104N33331Q37744N86734J62441O1091o5856
$$ plain form
5421 24459506 23948627 24314833 24100123 24433712 25110036 25158308 24501447 23622111 23004092 23667033
5411 23667033 23778933 22806788 22714807 22437365 21857021 22360270 22440694 21087498 21687097 22040104
5401 22040104 20787990 20823940 20540742 20859329 20943468 20476347 19586290 18826004 18411017 19145725
5391 19145725 19936930 19383566 19188767 19061213 19411398 18715857 18328762 19460457 19430866
5382 19430866 18498965 18408525 18479888 18706127 18529024 18364652 17696786 17209835 16612887 17517207
5372 17517207 18400603 19303090 18296048 17719372 15959661 14842570 15433705 16170670 16967928
5363 16967928 17605285 17669633 16971010 16522039 16351420 16547795 16510130 17412643 18394766 17834916
5353 17834916 16589885 16683177 16052042 15233938 15767269 16605013 17191747 17354188 17415279 17349423
5343A7349423n84195p60474j055668P73225J57828l65623j90376k78411P43009
5334A5788738M52200j43014L22509n3021j253829N36548K10013j142632k87888
5325A4429624J238517m20150O56813n00839J078483J486131p70400n38638M80923
5316A7140464m96390m32377o84284j249328O06264O4767O46002N87126M08056
5307A6590300J52650K43090N42971l27772K75983L67484l10266L89726M8859K18068
5297A8191093m01530K10991R28058k36366K46483M40391m20327M04303N14618
5288A9877714o64163K77744J526291K8533J09492J131354N36929K30802Q16048
5279B3870744k08705L79896J07195J375609n6379j073260M16827J210909R45856
$$ plain form
5343 17349423 16765228 16004754 14949086 15722311 15880139 15514516 15324140 15045729 15788738
5334 15788738 16240938 16097924 16420433 16367412 15113583 15650131 15860144 14717512 14429624
5325 14429624 15668141 15247991 15904804 15403965 16482448 17968579 17198179 16659541 17140464
5316 17140464 16644074 16211697 15527413 14278085 14884349 14949116 15595118 16182244 16590300
5307 16590300 16742950 16986040 17529011 17201239 17477222 17844706 17534440 17924166 17973025 18191093
5297 18191093 17789563 18000554 18928612 18692246 18938729 19379120 18958793 19363096 19877714
5288 19877714 19213551 19491295 21017586 21046119 21155611 22286965 22823894 23054696 23870744
5279 23870744 23662039 24041935 24149130 25524739 25468360 24395100 24811927 26022836 26968692
5270B6968692N91949J354938J543110L43413K43060k27021k53990J009610J332763
5261C2906524O33423R33361m54429J622474K84597K66341M13472L54588J213268
5252C8173619O09972p63010O21130J131921k17880K27321o91915J087987K855300
5243D3034445M83041M76865l51823P43592Q1916j66646j1035n0523k9342J194538
5233D5405028O53865j131398r11408J83913J486458l53350L73326P8442n47503
5224D5237373j396490J415478j282453n15872K5293l86364N41374m37875n19705
5215D2680759N1434p24669k50952j89577q83909p8754j310087o5665j22001J04326
5205C9210905o8820k0056K0586j024454j261922j596662M96138m8579L91495Q20581
$$ plain form
5270 26968692 27560641 28915579 30458689 30802102 31045162 30818141 30564151 31573761 32906524
5261 32906524 33539947 34473308 34018879 35641353 35925950 36192291 36605763 36960351 38173619
5252 38173619 38783591 38020581 38641711 39773632 39555752 39783073 39091158 40179145 43034445
5243 43034445 43517486 43994351 43642528 44386120 44468036 44301390 44290355 44239832 44210490 45405028
5233 45405028 46058893 44927495 44016087 44200000 45686458 45333108 45706434 45784876 45237373
5224 45237373 43840883 45256361 43973908 43458036 43483329 43096965 43638339 43200464 42680759
5215 42680759 42732193 42007524 41756572 41566995 40683086 40604332 39294245 39228580 39106579 39210905
5205 39210905 39142085 39122029 39142615 38118161 36856239 35259577 35755715 35707136 36098631 36919212
5195C6919212j708490J77255r92187m81109N04314r02281n28651o12917n41888
5186C1833258j196907O72763n34439n54004n35757l30718P31926l79921j456372
5177B8249829M47499q17891P958l84965J05563K0912N24781j278878Q5726R36387
5167B7896921K39606m46712m32004o25836k80802N90522l27180K33948L38823
5158B7187286j920403j286575P93617K29274N21510K86625K61204O47049R42241
5149B7661828m09900q84671j009460R9997j04351j18101R94307K40933k72380
5140B6198202m44345K57509L56061k4626j258598K3800J099898n42640M70159
5131B6135420j98724J24743q73927J50536K54957M1565K79034K99233L38785L63673
$$ plain form
5195 36919212 35210722 35387977 34395790 33914681 34418995 33516714 32988063 32375146 31833258
5186 31833258 30636351 31309114 30774675 30220671 29684914 29354196 30086122 29706201 28249829
5177 28249829 28697328 27879437 27887395 27502430 27607993 27628905 28153686 26874808 26960534 27896921
5167 27896921 28136527 27689815 27257811 26631975 26351173 26941695 26614515 26848463 27187286
5158 27187286 25266883 23980308 24773925 25003199 25524709 25811334 26072538 26719587 27661828
5149 27661828 27251928 26367257 25357797 25457794 25353443 25235342 26229649 26470582 26198202
5140 26198202 25753857 26011366 26367427 26342801 25084203 25108003 26207901 25665261 26135420
5131 26135420 25936696 26061439 25187512 25338048 25593005 25634570 25913604 26212837 26551622 26915295
5121B6915295j55956r49434j5019N59494L40160R6064j208810J73873M67875J60303
5111B6383845P58809N40481q00466o12233L42326r49460J06811L60010P56602
5102B6886725L42966j526093m61766M44792O39688O40901K50079n6980k9575n09263
5092B6621474r1956k16425M97077K23283q73876o75569J8446J48364R96856K64604
5082B6912278Q97350l85417l99978n92456o50316l84455O9078N58943k65936Q40825
5072B6599916J60362R0311N39391L25414L96560J59927o65544q40960k68819j17082
5062B6379476o92951L82308O87816j56292m38380o82239O52547J598420j64871
5053B7565834j92134Q35379j260234O3043M03357n52364K63443K67136K52327
$$ plain form
5121 26915295 26759339 25809905 25794886 26354380 26694540 26790604 25581794 25755667 26223542 26383845
5111 26383845 27142654 27683135 26882669 26270436 26612762 25663302 25770113 26130123 26886725
5102 26886725 27229691 25703598 25241832 25686624 26326312 26967213 27217292 27160312 27130737 26621474
5092 26621474 26529518 26313093 26810170 27033453 26159577 25484008 25502454 25650818 26647674 26912278
5082 26912278 27809628 27424211 27024233 26431777 25781461 25397006 25466084 26025027 25759091 26599916
5072 26599916 26760278 26850589 27389980 27715394 28111954 28271881 27606337 26765377 26496558 26379476
5062 26379476 25686525 26068833 26756649 26600357 26161977 25479738 26132285 27730705 27565834
5053 27565834 27373700 28209079 26948845 27011888 27415245 26862881 27126324 27393460 27645787
5044B7645787O39956N52579R52958M00664o38974J30352k70910J65608P75107
5035C0353127J008428k69385L96798j046899n29429J466587P29530J90109P26928
5026C3025794k23004R55908J054179n94393Q7N47402N07268J917013Q4483L91586
5016C7666323K094261L64091J751198J470674J211057J051470J782104J418415
5008D8809593K186889K453248K355488K072294K499199K114242K366542K830395
5000F7687890K824181K506931K391699L197002K950038L238906L507389K439766
4992I0743802K235765K935335K216281J806450J175830K018878M14862R89731
4984A04536934Q69230O98566Q00868J9229p06311l45992K51012K87634K27337
$$ plain form
5044 27645787 28285743 28838322 29791280 30191944 29552970 29683322 29412412 29578020 30353127
5035 30353127 31361555 31092170 31488968 30442069 29912640 31379227 32108757 32298866 33025794
5026 33025794 32802790 33758698 34812877 34218484 34218571 34765973 35273241 37190254 37274737 37666323
5016 37666323 39760584 40124675 41875873 43346547 44557604 45609074 47391178 48809593
5008 48809593 50996482 53449730 55805218 57877512 60376711 62490953 64857495 67687890
5000 67687890 70512071 73019002 75410701 78607703 81557741 84796647 88304036 90743802
4992 90743802 92979567 95914902 98131183 99937633 101113463 103132341 103547203 104536934
4984 104536934 105406164 106104730 106905598 106924827 106218516 105872524 106123536 106411170 106638507
4975A06638507p58316q52662K04547j449110j697651n21817j837172m31786j435631
4966I7858909m261349j995426j086145k713260k549629k014465k678396k643493
4958G7916746k874275l320792k823306l195940k037891k492356k613071k428350
4950E6130765j794161k571741l024208k373892p63161k063387j233993J6314l791045
4941C8531491j068218r2152k023955M59462j419948j320510r22644j182224L8576
4932C0999878k405573J97221Q26955o37607j679707o7349m60689n59135M38216
4923B6652210j381022n85950o71324o50384N44331m47641Q17400K82855o3808
4914B4496667n71558J61929j198438q38378J027455l25580p90381j105008l61193
$$ plain form
4975 106638507 105880191 105027529 105232076 103782966 102085315 101563498 99726326 99294540 97858909
4966 97858909 93597560 91602134 90515989 87802729 85253100 83238635 80560239 77916746
4958 77916746 75042471 71721679 68898373 65702433 63664542 61172186 58559115 56130765
4950 56130765 54336604 51764863 48740655 46366763 45603602 43540215 42306222 42322536 38531491
4941 38531491 37463273 37371121 35347166 35806628 34386680 33066170 32143526 30961302 30999878
4932 30999878 28594305 28791526 29618481 28980874 27301167 27233818 26773129 26213994 26652210
4923 26652210 25271188 24685238 24013914 23363530 23907861 23460220 24277620 24560475 24496667
4914 24496667 23925109 24087038 22888600 22050222 23077677 22752097 21961716 20856708 20495515
4905B0495515J208980l88183m62472l59540j060515P33371o6283j453542n0916
4896A8596415P63567j049423Q9133O73030j059984j040766K78921l99057Q70459
4887A7722295o50756j037339K37484q68682J25722M07636k65539J06950k50122
4878A5527649K69744n50894n84303o26961l7021o18122J96914R21023q58681N15232
4868A4154580m4582M30400j609071k09665N11971j011075M32203p26571L62177
4859A2290367Q1341R4748J65453k49625n06338r14130J35331M23629k34387n50229
4849A0736160M37639J492363r29620m67316k46559L60548n83796j031741M44022
4840A0211700j73251J00240j25435j8018K99772L62614p84139k26091N63248m71494
$$ plain form
4905 20495515 21704495 21316312 20853840 20494300 19433785 20167156 20100873 18647331 18596415
4896 18596415 19359982 18310559 18399692 19072722 18012738 16971972 17250893 16851836 17722295
4887 17722295 17071539 16034200 16271684 15403002 15528724 15936360 15670821 15777771 15527649
4878 15527649 15797393 15246499 14662196 14035235 13998214 13380092 13577006 14498029 13639348 14154580
4868 14154580 14109998 14540398 12931327 12721662 13233633 12222558 12654761 11928190 12290367
4859 12290367 12371708 12466456 12631909 12382284 11875946 10961816 11097147 11520776 11286389 10736160
4849 10736160 11173799 12666162 11736542 11269226 11022667 11383215 10799419 9767678 10211700
4840 10211700 10038449 10138689 10013254 9995236 10295008 10657622 9873483 9647392 10210640 9739146
4830I739146K54620r6277o37151K49611P88831Q1724j539311j79889l98203l18702
4820G944399R72026l16642j85920J79210K09232n99397j01394L55180N27549Q55981
4810I840224J37876j209476K72953o44731j57360J176570o3513r03877p92163
4801G656503m33280K83454L41989r27748J053066L16975p46325j95298L2068J10224
4791G491628L37692k02458L25039j5736l90207L70730M45468O62091j569857l88224
4781G066166R5511M63708n26728l39008K50078L56647M00647k63665r27359l78958
4771F197039L61926Q07709m19199n19711J272597L5440l90874o13212Q24539l03539
4761G252715O5851o07071p0036L14498p36405j63431q614K41428N72713j41215
$$ plain form
4830 9739146 9993766 9897489 9260338 9509949 10298780 10380504 8841193 8661304 8263101 7944399
4820 7944399 8916425 8599783 8413863 8593073 8802305 8202908 8101514 8456694 8984243 9840224
4810 9840224 9978100 8768624 9041577 8396846 8239486 9416056 9352543 8448666 7656503
4801 7656503 7223223 7506677 7848666 6920918 7973984 8290959 7544634 7349336 7381404 7491628
4791 7491628 7829320 7626862 7951901 7936165 7545958 7916688 8362156 9024247 7454390 7066166
4781 7066166 7161677 7625385 7098657 6759649 7009727 7366374 7767021 7503356 6575997 6197039
4771 6197039 6558965 7366674 6947475 6427764 7700361 7735801 7344927 6731715 7556254 7252715
4761 7252715 7318566 6711495 6641459 6955957 6219552 6056121 6047507 6288935 6861648 6720433
4751F720433o09050p50195r7260k56946k50582K047398K33457n17077J13412q9972
4741F543618N87605J51812p8505K20644l1356q78089n01282J022211P45045q33079
4731F948624k74412Q5608J32121p76728M26046q26003q5292K18596j64693o81338
4721E002529J083890o33755o75768L28952O09258L48237o18411j21094o7477o86132
4711D570229P82856Q07771J66984N85766K70212r7197L27798j115071m24193J103411
4701F978566l84038o40674Q56473R4913o90608R50899o85375l94235j51792L37756
4691F271885Q34777p24973L44996K97557J02458j34533k12422L47849l48223L38033
4681G117404K85000L01019P18259K2168n13434o34575L5939J029446J51666N21337
$$ plain form
4751 6720433 6111383 5361188 5263928 5006982 4756400 6803798 7037255 6520178 6633590 6543618
4741 6543618 7131223 7283035 7204530 7425174 7393818 6515729 6014447 7036658 7781703 6948624
4731 6948624 6674212 6759820 6891941 6115213 6541259 5715256 5629964 5848560 5683867 5002529
4721 5002529 6086419 5452664 4776896 5105848 5715106 6063343 5444932 5323838 5256361 4570229
4711 4570229 5353085 6160856 6327840 6913606 7183818 7086621 7414419 6299348 5875155 6978566
4701 6978566 6594528 5953854 6810327 6905240 6214632 7165531 6480156 6085921 5934129 6271885
4691 6271885 7106662 6381689 6726685 7024242 7126700 6992167 6779745 7127594 6779371 7117404
4681 7117404 7402404 7703423 8421682 8443850 7930416 7295841 7331780 8361226 8512892 9034229
4671I034229l59872M7152m83289M46971n58450O79047K1848m19753Q1324J003683
4661I492890n95892Q59356q73409j22633J210693n74990j06122J46825m53997
4652H982721j44524J249390j31987Q18535j176156k71495J186121O95723p26092
4643A0482236J3597N36098R62667P92965L48224j34564n24204M46090P39874J313853
4633A4976836M91450m15781K41200Q84888J364107J411257Q08581K720001J726959
4624B4209498J272991J907414K062492J659701K789700K225663K351692L045339
4616D1524490L224923M783781N277496L653494M565438O883945M338316O297075
4608H0548958P325337O694524P700961P062210P871124Q362840P749121O620539
$$ plain form
4671 9034229 8674357 8721509 8238220 8685191 8126741 8805788 8827636 8407883 8489207 9492890
4661 9492890 8896998 9756354 8882945 8760312 9971005 9396015 9289893 9436718 8982721
4652 8982721 8838197 10087587 9955600 10774135 9597979 9326484 10512605 11208328 10482236
4643 10482236 10495833 11031931 11994598 12787563 13135787 13001223 12477019 12923109 13662983 14976836
4633 14976836 15468286 15052505 15293705 16178593 17542700 18953957 19762538 22482539 24209498
4624 24209498 25482489 27389903 29452395 31112096 33901796 36127459 38479151 41524490
4616 41524490 44749413 49533194 54810690 58464184 63029622 69913567 74251883 80548958
4608 80548958 87874295 94568819 102269780 109331990 117203114 125565954 133315075 139935614
4600A39935614P872525O435352O344420O713091O359474N982915P772274N164861
4592A92580526L603387L937023K916879P71947J009539P01385Q49168M3684j690520
4583B04723018k099936n337590o216554o147226o002958n297069m411282n364968
4575A63845435o131472o966376q823654r568619q010913o556090o474636o670573
4567A04643102n404281p286736p115182o207636n816179m827608m484742m781122
4559E8719616l651154l454877k398422l510673k608217k025398k887544j681496
4551C6501835j961216k831823j206577p41899m65953j750000K61852j603708k11887
4542B5990624m39050k01755k14335p53894r81469m09518r88906p06724j012098
$$ plain form
4600 139935614 147808139 154243491 160587911 167301002 173660476 179643391 187415665 192580526
4592 192580526 196183913 200120936 203037815 203809762 204819301 205520686 206369854 206413538 204723018
4583 204723018 202623082 197285492 191068938 184921712 178918754 173621685 169210403 163845435
4575 163845435 157713963 150747587 141923933 132355314 124344401 117788311 111313675 104643102
4567 104643102 99238821 91952085 84836903 78629267 72813088 67985480 63500738 58719616
4559 58719616 55068462 51613585 49215163 45704490 43096273 41070875 38183331 36501835
4551 36501835 34540619 31708796 30502219 29760320 29294367 27544367 27806219 26202511 25990624
4542 25990624 25551574 25349819 25135484 24381590 23400121 22990603 22001697 21294973 20282875
4533B0282875m53789k20700j14868J046624n71168r20276N20574n40625K20981
4524A9249628p12016n73855j33856m69587j56447m26108J7415j110497m7109K26359
4514A5863927Q93042p8066j99105k4308m9229k99706j209449o59283k75088o04414
4504A3358321R64140Q11822M32269n64207n23760m13844L50373N94756j731001
4495A3278869l9018l23546o34067J727144j718329J47453K97487m53921N58742
4486A2840814r53849o89401J088569k55805o42759k86717P24206j241333R89256
4477A1572981N35799J74216q18083j475499r94719R34587j54796o83249j83405
4468H907832k26217J074108N1134n45357k39044Q8351K37620J90170r98392p51313
$$ plain form
4533 20282875 19829086 19608386 19493518 20540142 19968974 19048698 19569272 19028647 19249628
4524 19249628 18537612 17963757 17829901 17360314 17203867 16777759 16795174 15684677 15637568 15863927
4514 15863927 16756969 16678903 16479798 16455490 16406261 16106555 14897106 14237823 13962735 13358321
4504 13358321 14322461 15134283 15566552 15002345 14478585 14064741 14415114 15009870 13278869
4495 13278869 13239851 12916305 12282238 14009382 12291053 12438506 12735993 12282072 12840814
4486 12840814 11886965 11197564 12286133 12030328 11387569 11100852 11825058 10583725 11572981
4477 11572981 12108780 12282996 11464913 9989414 8994695 9929282 9774486 9091237 8907832
4468 8907832 8681615 9755723 9806857 9261500 9022456 9110807 9348427 9538597 8540205 7788892
4458G788892O78078K65860M21434q4133P59845k97433m30612J74581L81770o33593
4448I024689j063256L75052l5213j2891M0419Q36073o14096j266228Q37190N71530
4438H693269m89228o83164j8336J051276J49637j311402M08076J76657r76879
4429F999906J369561l25335j005453j41058R43189j178472R42657O99981n33574
4420G771402q1513j069316M92971m70435L20172J423206p90206P1456O7820k24545
4410G511012p0731Q28675M93789j120367n52803L94548k0413Q46741K73167l56551
4400H227067r37732j476108K3042R05069J721898q70787q30345J44840j52761
4391F754183N69284m35933r10894l96759J133240O21257r7440N62401R33844q60826
$$ plain form
4458 7788892 8466970 8732830 9154264 9070131 9829976 9532543 9101931 9276512 9658282 9024689
4448 9024689 7961433 8336485 8301272 8288381 8328800 9164873 8550777 7284549 8121739 8693269
4438 8693269 8204041 7520877 7502541 8553817 8703454 7392052 7800128 7976785 6999906
4429 6999906 8369467 8044132 7038679 6897621 7840810 6662338 7604995 8304976 7771402
4420 7771402 7689889 6620573 7113544 6643109 6963281 8386487 7596281 7667737 7735557 7511012
4410 7511012 7440281 8268956 8762745 7642378 7089575 7484123 7463710 8310451 8583618 8227067
4400 8227067 7289335 5813227 5836269 6741338 8463236 7592449 6762104 6906944 6754183
4391 6754183 7323467 6887534 5976640 5579881 6713121 7334378 7236938 7799339 8733183 7872357
4381G872357m95103O58621J59862L88391o69343j82114J030825j544226r43066
4372F276204O1751R18437j060415M19612R21476N0581o94984N36353J88406J62662
4362G780083L00322j067201j38604M22187m330O86898j051854m00325P70301O48817
4352G946294P46319O59967k42045l91856k21005K95449P01183j59037k72670p76098
4342H286501O37748m26457k63829J95234L40961k34628L01024O27802L47744N86961
4332A0399061K01748j226352n55065J73678K45912n56571J486880M94065o5201
4323A0598155j83172O80111K72516o95375l24208p32104N99760L7630o34498Q27760
4313A0446575l79304P22848o66031j49253K79087K52329Q5297R22170J91472m66225
$$ plain form
4381 7872357 7377254 8035875 8195737 8584128 7914785 7732671 8763496 7219270 6276204
4372 6276204 6337955 7256392 6195977 6615589 7537065 7587646 6892662 7429015 7617421 7780083
4362 7780083 8080405 7013204 6874600 7296787 7292457 7979355 6927501 6527176 7297477 7946294
4352 7946294 8692613 9352580 9110535 8718679 8497674 8793123 9494306 9335269 9062599 8286501
4342 8286501 8924249 8497792 8233963 8429197 8770158 8535530 8836554 9464356 9812100 10399061
4332 10399061 10600809 9374457 8819392 8993070 9238982 8682411 10169291 10663356 10598155
4323 10598155 10414983 11095094 11367610 10672235 10348027 9615923 10215683 10253313 9618815 10446575
4313 10446575 10067271 10790119 10124088 9974835 10253922 10506251 10591548 11513718 11705190 11238965
4303A1238965j54564m37037P74158R29145k67176Q43414J017444r27272k22182
4294A2794895k52101l46911J32813J91950J210570J128818J01730j4497J00496
4285A5047763j0950O64339L27924O27802k84045J96983J346084N08883l3583r2114
4275A8299086P71608J75986N0852Q06964J54288k0187N74490J499123o09122O89924
4265B2393012O76099R48269N59045l40776N58490O59977J328787R32911J547855
4256B9263669J863177M47544J017536J494619P35907J794876K365315K146372
4248D1129015J315804Q82836Q97714K888961J221314K774662K495190J773703
4240E5379199Q35449J885564L139222L346105K190929L496773K334099K820800
$$ plain form
4303 11238965 11084401 10647364 11421522 12350667 12083491 12926905 13944349 13017077 12794895
4294 12794895 12542794 12195883 12328696 12520646 13731216 14860034 14961764 14947267 15047763
4285 15047763 15036813 15701152 16029076 16656878 16372833 16569816 17915900 18424783 18391200 18299086
4275 18299086 19070694 19246680 19297532 20104496 20258784 20238597 20813087 22312210 21703088 22393012
4265 22393012 23069111 24017380 24576425 24235649 24794139 25454116 26782903 27715814 29263669
4256 29263669 31126846 31574390 32591926 34086545 34822452 36617328 38982643 41129015
4248 41129015 42444819 43327655 44225369 47114330 48335644 51110306 53605496 55379199
4240 55379199 56214648 58100212 61239434 64585539 66776468 70273241 72607340 75428140
4232G5428140K144824M620430O440059O294216N619840O878221O264200Q789431
4224A22479361R019279P434087Q246327P934822P437535Q475152Q637837P915961
4216A87580361R529840J0229443R203221P748573Q208100R013667R492241P517354
4208B58522800P749221P797671P443040R214671O279280k905429j4968559k0495757
4200B58636938k0607334j8314347j5214783j2478056r577833j0217001r802550
4193A62425034p735647p823631q041404q622074p557636o087473n616837o203682
4185A04736650n364237m204199m870143l637130l877925l714499k622274k538748
4177G3907495j969779k356009j968875j797429j904245j423593k080094q68270
$$ plain form
4232 75428140 77572964 82193394 88633453 94927669 100547509 107425730 113689930 122479361
4224 122479361 131498640 138932727 147179054 155113876 162551411 171026563 179664400 187580361
4216 187580361 197110201 207339644 216542865 224291438 232499538 241513205 251005446 258522800
4208 258522800 266272021 274069692 281512732 290727403 297006683 294101254 279132695 258636938
4200 258636938 238029604 219715257 204500474 192022418 182444585 172227584 162425034
4193 162425034 154689387 146865756 138824352 130202278 122644642 116557169 110940332 104736650
4185 104736650 99372413 95168214 90298071 86660941 82783016 79068517 76446243 73907495
4177 73907495 71937716 69581707 67612832 65815403 63911158 62487565 60407471 59539201
4169E9539201j860148j120004k769097o02911j589828j416661p07854p08790r24144
4160D7839764M88878j655862j289688p72575j002951p90803j965956j657734R63899
4151D0156972n99184p3680m29236r58079p43456l93066K63640o61559n17666n07981
4141C5536705n33967o89279L88091o2355j14586j17445N95593q0589o82083n27452
4131C3712633M35295K2688l68972m0210J6861Q14677M96002r23326j333819Q3676
4121C2915505L63824L21284M83618M96862J72499L8950O59083J267489N87438
4112C7306552k9703M29504L42761O03505L52342J072409J147504J171037P84686
4103D3180597J30463P92183O52414K74970O17002J928042L008865J708150J058931
$$ plain form
4169 59539201 57679053 56559049 53789952 53187041 51597213 50180552 49472698 48763908 47839764
4160 47839764 48328642 46672780 45383092 44610517 43607566 42816763 40850807 39193073 40156972
4151 40156972 39557788 39484108 39054872 38096793 37353337 36960271 37223911 36562352 36044686 35536705
4141 35536705 35002738 34313459 34701550 34639195 34524609 34407164 35002757 34922168 34240085 33712633
4131 33712633 34147928 34170616 33801644 33761434 33778295 34592972 35088974 34165648 32831829 32915505
4121 32915505 33279329 33600613 34084231 34581093 34753592 34792542 35451625 36719114 37306552
4112 37306552 37276849 37706353 38049114 38652619 39004961 40077370 41224874 42395911 43180597
4103 43180597 43311060 44103243 44755657 45030627 45647629 47575671 50584536 52292686 53351617
4094E3351617J473919K204522K600782K159109M024483L110136J397500K901039
4086G3223107K526349K573100M037115L257343K266446K722067L072649L352796
4078I7030972L328592L467514M268008M653458J625197L163648K399104K310192
4070A22246685L172380L350071K176999J735305O16742Q00920M80817J32820j582461
4061A33130278O59863m03549j833175r11105j896255p87183k799771k491477l653315
4052A19014311k186064l022757l319863l808036l844257m036061k666253l127763
4044I3003257m310997k464007m301250k178620l137425l586937k844412k254895
4036F7924714l066333j904263k657130l179987j468924k577972j555217q77739
$$ plain form
4094 53351617 54825536 57030058 59630840 61789949 65814432 68924568 70322068 73223107
4086 73223107 75749456 78322556 82359671 85617014 87883460 90605527 93678176 97030972
4078 97030972 100359564 103827078 108095086 112748544 114373741 117537389 119936493 122246685
4070 122246685 125419065 128769136 130946135 132681440 133298182 134099102 134579919 134712739 133130278
4061 133130278 133790141 133386592 131553417 130642312 128746057 127958874 125159103 122667626 119014311
4052 119014311 116828247 113805490 110485627 106677591 102833334 98797273 96131020 93003257
4044 93003257 88692260 86228253 81927003 79748383 76610958 73024021 70179609 67924714
4036 67924714 64858381 62954118 60296988 57117001 55648077 53070105 51514888 50637149
4028E0637149j564538j185068j222558o66003j348915j724270j502205p54649
4020D0668943n11264r26098j486872q56538j62015m30443n09447m13024N81801
4011C5955043j316813J52948N5304n92547m90334r73078o60807o46004J22971
4002C1606683R98297l29981j642956o08968l72402j202933n25299J53020k69231
3993B7806230p76638n76257P58460P15996l19822r35564K42512N38761M65545
3984B7919223m80921j38772j105262j165252M04470L54828N9454N16382R0520
3975B6454670J769Q26303N95278m42903j221708J222881R68162R83715Q4524K31266
3965B9703957J631270J645242K291600R16860L83557K273189J442805J647136
$$ plain form
4028 50637149 49072611 47887543 46664985 45998982 44650067 42925797 41423592 40668943
4020 40668943 40157679 39231581 37744709 36888171 36726156 36295713 35786266 35373242 35955043
4011 35955043 34638230 34791178 34846482 34253935 33763601 32790523 32129716 31483712 31606683
4002 31606683 32604980 32274999 30632043 30023075 29650673 28447740 27922441 28075461 27806230
3993 27806230 27029592 26453335 27211795 27927791 27607969 26672405 26914917 27453678 27919223
3984 27919223 27438302 27299530 26194268 25029016 25433486 25788314 25847768 26364150 26454670
3975 26454670 26456439 27282742 27878020 27435117 26213409 27436290 28404452 29388167 29472691 29703957
3965 29703957 31335227 32980469 35272069 36188929 36572486 38845675 40288480 41935616
3957D1935616J651558K593008K067265J422973R51028J372692N46162J300090
3949E3840392J072903J595140K660477J107447J110865J235648j196057K76204
3941F1703019K062126j016291j298948l78245o89977k1383j421518r94819j371229
3932E6572735q42718r38560j857759j953199k30836j827429k733480k123145k334259
3923D1731350k151936j962065r74330j227136j200490q78992r14730j050692j049255
3914C0321724j828120j700141j254443K96377l44029k05513q06290o96923j121144
3905B2661498j186866l02212N65999o85210o42931m2255o7337p80794O03403O42962
3895B0766257m56400K87378j37142l82501j251712J177072J4937O7375j30100
$$ plain form
3957 41935616 43587174 46180182 48247447 49670420 50621448 51994140 52540302 53840392
3949 53840392 54913295 56508435 59168912 60276359 61387224 62622872 61426815 61703019
3941 61703019 63765145 62748854 61449906 61071661 60381684 60360301 58938783 57943964 56572735
3932 56572735 55730017 54791457 52933698 50980499 50749663 48922234 46188754 44065609 41731350
3923 41731350 39579414 37617349 36643019 35415883 34215393 33336401 32421671 31370979 30321724
3914 30321724 28493604 26793463 25539020 25835397 25491368 25285855 24479565 23782642 22661498
3905 22661498 21474632 21172420 21738419 21053209 20410278 20368023 20300686 19519892 20123295 20766257
3895 20766257 20309857 20597235 20460093 20077592 18825880 20002952 20017889 20085264 19955164
3886A9955164l09945M22864K38501m1933j004340j37864l28794N074n26995J249860
3876A9521592K40767J400145N66521j298074R40366R85045k29719N16973N82102
3867B3225718R0597j026366J561169J736853J036112P8622k46015M49210J3197
3858B6919097Q83657J103734R40303p5902N1171J454647J83489O5160O97898J290011
3848C3513265j06411o69346O60114J047968M67241K58017o32375j052856J511835
3839C4997452J049763l21888k9323M04672J50275j29055J02874M96028k83615
3830C6437183l12462J41298O02337n00245R16490J705930p53108n61349J403777
3821C9079851R19381R0872J355457K018648K25694J12970J197006K032328J682596
$$ plain form
3886 19955164 19645219 20068083 20306584 20264651 19260311 19122447 18793653 18798727 18271732 19521592
3876 19521592 19762359 21162504 21729025 20430951 21371317 22356362 22126643 22643616 23225718
3867 23225718 23316315 22289949 23851118 25587971 26624083 26702705 26456690 26905900 26919097
3858 26919097 27802754 28906488 29846791 29770889 29822060 31276707 31460196 31525356 32223254 33513265
3848 33513265 33406854 32737508 33397622 34445590 34912831 35170848 34538473 33485617 34997452
3839 34997452 36047215 35725327 35696004 36100676 36250951 36121896 36224770 36720798 36437183
3830 36437183 36124721 36266019 36868356 36368111 37284601 38990531 38237423 37676074 39079851
3821 39079851 39999232 40090104 41445561 43464209 43689903 43802873 44999879 47032207 48714803
3812D8714803Q96634J716458J570621K233644J779353J419521K509203J423698
3804F2263935K896151J884380J608963J934137L395120L346755K563535L001226
3796H2894202J334346K206925J650212J936371J631677Q61763J621692K679948
3788I6817136K087567K269287J243043J414909k68308J353138K317440J292470
3780A08526682j74212q32070L30133M4766m0744K81223J037313R22253n94395
3771A09500949k48477J113832N7231L32197m33326n47291k38992N14522j054170
3762A08996475k63764j41282o80823j8579k42543k413229j228728J4782j013690
3753A03008619l68765j166264j293081k193161j726980r29715j894194j097136
$$ plain form
3812 48714803 49611437 51327895 52898516 55132160 56911513 58331034 60840237 62263935
3804 62263935 65160086 67044466 68653429 70587566 73982686 77329441 79892976 82894202
3796 82894202 84228548 86435473 88085685 90022056 91653733 92515496 94137188 96817136
3788 96817136 98904703 101173990 102417033 103831942 103563634 104916772 107234212 108526682
3780 108526682 108352470 107520400 107850533 107895299 107854555 108135778 109173091 110095344 109500949
3771 109500949 109252472 110366304 110423535 110755732 110322406 109775115 109536123 110050645 108996475
3762 108996475 108732711 108591429 107910606 107892027 107649484 105236255 104007527 104022309 103008619
3753 103008619 102639854 101473590 100180509 97987348 96260368 95330653 93436459 92339323
3745I2339323j687019j543212k481680j589824j777394l425085j160856j857950
3737G6816303k489097j630089k825266k735498k346980r86517j593201k108785
3729F0100870j658618j576054k355153j825914j729738j465125p59953j319787
3721D7410528j191266n62297j171332p44644j059466q91595r6351j103720r8412
3712D0491445m05745m24186l65328r02794Q96804r8684j018956r34132N45826
3703C7784250m3101m13743j181500m84854N33844O44324M20741r46847l15173
3694C5997941r18878r15347j836782J8808N11941o72052n12307l51874r38568
3685C0382882r14531j396922r80249p660O35944j573279j88755l50636r80444
$$ plain form
3745 92339323 90652304 89109092 86627412 85037588 83260194 79835109 78674253 76816303
3737 76816303 74327206 72697117 69871851 67136353 64789373 63802856 62209655 60100870
3729 60100870 58442252 56866198 54511045 52685131 50955393 49490268 48730315 47410528
3721 47410528 46219262 45656965 44485633 43740989 42681523 41789928 41693577 40589857 40491445
3712 40491445 40085700 39661514 39296186 38393392 39290196 39191512 38172556 37238424 37784250
3703 37784250 37741149 37327406 36145906 35661052 36194896 36839220 37259961 36313114 35997941
3694 35997941 35079063 34163716 32326934 32345742 32857683 32185631 31673324 31321450 30382882
3685 30382882 29468351 28071429 27091180 27083520 27719464 26146185 25957430 25606794 24626350
3676B4626350j259010n8659K57935k092678q19614n24558m19640K98558p20892
3667A9287792p77039l6527l51331j295673q3621J73778m81321o03542r53503k56997
3657A4622016m42834M02844k8301n82278J90559n31597l37450n23589M2666k87105
3647A2524931o23046p33527l20454m27745K72546K00076p1944L84244j030967
3638A0174114l20165M92080N41398k16876r4847J81910n48302J13467m07336j498913
3628H416530n61880O72035M45008n80977K36285j82817k54838p94070k77579J53087
3618G270784O27964Q47205M0240j3711n20511J73018J59157M61606p02582o28871
3608G714299m21243o73803K71739j75549o72474N10582N32592P505j05559k22444
$$ plain form
3676 24626350 23367340 23308681 23566616 21473938 20654324 20129766 19710126 20008684 19287792
3667 19287792 18510753 18474226 18122895 16827222 16743601 16917379 16436058 15832516 14879013 14622016
3657 14622016 14179182 14582026 14553725 13971447 14162006 13630409 13292959 12769370 12812036 12524931
3647 12524931 11901885 11168358 10847904 10420159 10692705 10892781 10820837 11205081 10174114
3638 10174114 9853949 10346029 10887427 10670551 10575704 10757614 10209312 10322779 9915443 8416530
3628 8416530 7854650 8526685 8971693 8390716 8627001 8444184 8189346 7395276 7117697 7270784
3618 7270784 7898748 8745953 8786193 8772482 8251971 8424989 8584146 9045752 8343170 7714299
3608 7714299 7293056 6619253 6890992 6715443 6042969 6553551 7086143 7093648 6988089 6765645
3598F765645L45147k53169O162J07711p18955O2473L84512n16183M26076k31456
3588F377963j007984K69487P64348o78166Q75373l553j767751L15399P65113p0806
3578E839423m86108o32777p096l1096l51006J570760m04459k057266O40720r4099
3568C986996j57194k78471L0512J232867l91148o20225O306j39104n75088K32377
3558C327828K23907n54904O81925n25638N52398J81878R33557J3612r23370m49424
3548C461769j030954J142189k07235j53392k74209j84031l98633k35080O49953
3539B770377j20484l91439J29369k7296o31974r4185R54028n04616k16946K5420
3529A892254N22567N14232l32279Q72655R81293j477026j85811N52186K01341
$$ plain form
3598 6765645 7110792 6857623 6863785 6971496 6252541 6315014 6699526 6183343 6609419 6377963
3588 6377963 5369979 5639466 6403814 5725648 6601021 6597468 4829717 5145116 5910229 5839423
3578 5839423 5353315 4720538 4713442 4682346 4331340 5902100 5497641 3440375 4081095 3986996
3568 3986996 3829802 3551331 3581843 4814710 4423562 3803337 3809643 3670539 3095451 3327828
3558 3327828 3551735 2996831 3678756 3153118 3705516 3887394 4820951 4834563 3911193 3461769
3548 3461769 2430815 3573004 3365769 3212377 2938168 2754137 2355504 2120424 2770377
3539 2770377 2649893 2258454 2387823 2360527 1728553 1634368 2588396 2083780 1866834 1892254
3529 1892254 2414821 2929053 2596774 3469429 4450722 2973696 2787885 3340071 3541412
3520C541412K47674p3017J04193K99527P22267j8514M05933j350612L25916K47249
3510D452028M59176m81140r99511m05881Q29313N519n41703J000963j85755j13840
3500D019169o62144L9201j1398M65940m46622J35530n40592L93267L70586o24137
3490C138800Q36030P57405o67926r98308L10703P59261j29848Q1979J74004p57259
3480C504841O53125n23966n1733j27795Q19658P25676j155878J09426Q52711r31153
3470C874912m4233P88491j04477m81732m99800J956j51946J76298N47157J18472
3460D225098J219799l12325p20069K91790J93433L8104q32263Q69254P51583L80104
3450F104508j462750p2796P87151L49892n7895m6666M57853o26549K87617J99236
$$ plain form
3520 3541412 3789086 3716069 3820262 4119789 4842056 4823542 5229475 3878863 4204779 4452028
3510 4452028 4911204 4430064 3430553 3024672 3853985 3859504 3317801 4318764 4133009 4019169
3500 4019169 3357025 3396226 3384828 3850768 3404146 3539676 2999084 3392351 3762937 3138800
3490 3138800 3974830 4732235 4064309 3066001 3376704 4135965 4006117 4088096 4262100 3504841
3480 3504841 4157966 3634000 3582267 3454472 4274130 4999806 3843928 3953354 4806065 3874912
3470 3874912 3830679 4619170 4514693 4032961 3533161 3535117 3383171 3559469 4106626 4225098
3460 4225098 5444897 5132572 4412503 4704293 4897726 4935830 4103567 4972821 5724404 6104508
3450 6104508 4641758 4568962 5356113 5706005 5648110 5601444 6059297 5432748 5720365 5919601
3440E919601P04043K72606k43260Q21059k58560L07596k50619L27302J05780j082632
3430F622916j090620J122013J11502q74109j66781j79641J467813l52582k41837
3421F418674K08458K184q73597q25981M18161Q30404r12552k49080J183608n78621
3411E621658n98876J14195K14147L2069O62708l18608p70688K43554k08305q82226
3401D109628K08977J006912K5063Q688J1257q01598P51874K82877m12166k0993
3391E170519n07038J040113k767N73269j32511r82741N24533q16395j246046J217062
3381D837998O76257P03438l43919L40060j40171P91246o14651q51921N6375m95527
3371D959185K29176K04906k6280m1702K41484o0323O21008J77460o43019K94706
$$ plain form
3440 5919601 6623644 6896250 6652990 7474049 7215489 7523085 7272466 7599768 7705548 6622916
3430 6622916 5532296 6654309 6765811 5891702 5724921 5545280 7013093 6660511 6418674
3421 6418674 6627132 6629316 5755719 4929738 5347899 6178303 5265751 5016671 6200279 5621658
3411 5621658 5022782 5136977 5351124 5383193 6045901 5727293 4956605 5200159 4991854 4109628
3401 4109628 4318605 5325517 5350580 5359268 5370525 4568927 5320801 5603678 5191512 5170519
3391 5170519 4663481 5703594 5700827 6274096 6141585 5158844 5683377 4866982 3620936 4837998
3381 4837998 5514255 6217693 5873774 6213834 6073663 6864909 6250258 5398337 5454712 4959185
3371 4959185 5188361 5393267 5366987 5325285 5566769 5506446 6127454 6304914 5661895 5956601
3361E956601l62900j150122L49143O59315R18912n23934P1522O88495O25435l69239
3351F863228j726936j10715Q03813m55850q41655K45784M22929k18566j38806
3342D843226j603889q10408N32534J206286L13918o88814L94897N43306j234566
3333C496490j122088J81196N70114j058941Q68976O72312q62087o86741J531879
3324C591110l89537L12446o41580n7577J56250p01402j263095k67813J546775
3315B285577q08686q85281p59478P52052J125321j49541q85903p9332l33287J323421
3305A584863J472595k75311q5398j084550m10582n3384N03127L34086p15623l15701
3295I54122j18329r17149J600049P37734j541644N81038N74341m32444j62998
$$ plain form
3361 5956601 5593701 4443579 4792722 5452037 6370949 5847015 5918537 6607032 7232467 6863228
3351 6863228 5136292 5025577 5829390 5373540 4531885 4777669 5200598 4982032 4843226
3342 4843226 3239337 2428929 2961463 4167749 4481667 3792853 4187750 4731056 3496490
3333 3496490 2374402 2555598 3125712 2066771 2935747 3608059 2745972 2059231 3591110
3324 3591110 3201573 3514019 2872439 2814862 2971112 2269710 1006615 738802 2285577
3315 2285577 1476891 591610 -167868 584184 1709505 1559964 674061 594729 261442 1584863
3305 1584863 3057458 2782147 2696749 1612199 1201617 1148233 1651360 1985446 1269823 954122
3295 954122 835793 -81356 1518693 2256427 714783 1295821 1870162 1437718 1274720
3286A274720K90728L71505J38046n02363R95869k61375j12288r03493p29165k71460
3276B90724l1898M47803r65444N4659Q52942J27299J237475l23056Q5756L52390
3266B128650k70162k49111O09423j53249O29634J57441k56778N95380j008771
3257B182457j020516J046867M3033j054606Q4089P43895j67730O12358L06727
3248B776574o93393Q99696N5052o0224o97970n2030m49156m45181J193576O34104
3238C161048J115675J4931j68822L42589M83502n35880K00815o84577O29602L87983
3228D946866J42433R07628K071652L38414o93254J379665Q75178M14664J270339
3219A1653585m89751l22064J092867J450858R24603J116029R83789j58063n86623
$$ plain form
3286 1274720 1565448 1936953 2074999 1572636 2568505 2307130 2194842 1291349 562184 290724
3276 290724 258826 706629 -258815 -204156 648786 776085 2013560 1690504 1776260 2128650
3266 2128650 1858488 1609377 2218800 2065551 2695185 2852626 2595848 3191228 2182457
3257 2182457 1161941 2208808 2251841 1197235 1281324 2025219 1857489 2469847 2776574
3248 2776574 2083181 2982877 3037929 2977705 2279735 2227705 1778549 1333368 2526944 3161048
3238 3161048 4276723 4291654 4122832 4465421 4948923 4413043 4613858 3929281 4558883 4946866
3228 4946866 5089299 5996927 8068579 8406993 7713739 9093404 9968582 10383246 11653585
3219 11653585 11163834 10841770 11934637 13385495 14310098 15426127 16409916 16251853 15665230
3210A5665230O64678L53006Q54901K52493r14177L33043j10249J67597K14648
3201A7481170Q7523J51500N30680k29188J048668J672167k78471N0577J338398
3192B1853024k97923J084519J067939J205657Q39266J160906j83554O68465r54678
3183B6443621j99139j123688j261551m24083n58106j155840j37312q10750j277463
3174A9495689L33133n34862r68380j76037k30838l08190l40344P04030J460700
3165A9434901q97262q25498O94035m74726j37899n89970N80205o5123o82015q89348
3155A6147300k648728l74965k37038o74392k43564m45076m63894j248002m24818
3146I386823K1117o51045j795291j19862J141727l07681M50088n11987j257716
$$ plain form
3210 15665230 16329908 16682914 17537815 17790308 16876131 17209174 17098925 17266522 17481170
3201 17481170 17568693 17720193 18250873 18021685 19070353 20742520 20464049 20514626 21853024
3192 21853024 21555101 22639620 23707559 24913216 25752482 26913388 26729834 27398299 26443621
3183 26443621 26244482 25120794 23859243 23435160 22877054 21721214 21583902 20773152 19495689
3174 19495689 19828822 19293960 18325580 18149543 17918705 17610515 17270171 17974201 19434901
3165 19434901 18537639 17712141 18406176 17931450 17793551 17203581 17783786 17718663 17036648 16147300
3155 16147300 13498572 13123607 12886569 12212177 11968613 11523537 11059643 9811641 9386823
3146 9386823 9407940 8756895 6961604 6841742 7983469 7675788 8125876 7613889 6356173
3137F356173l37131Q4743o22253O40665K55692k93913r00780O3939o4410q37835
3127D344890Q81589j114190N81106J097709p21631k06734K98701l89480j246379
3118C525581R72282k25815j42141k41573m96886p23361Q45923P41485k24846K77675
3108D308324j240960R53729q05606L35704J52643j117092J603811K57287l40312
3099D107528q57681l47152P17798k90066L67001j81642L13936K69658K55889m59071
3089C896198l63697N94232l56730o1268k16507R16123p23719j51367K52973K19812
3079D006050k2604j104937L06204M50233l86229m46985p71275R50846R56004p13590
3069C223717k40570P29521J019069n94129k155335P18153J240511o150n91099
$$ plain form
3137 6356173 6019042 6103785 5481532 6122197 6377889 6083976 5183196 5247135 5182725 4344890
3127 4344890 5226479 4112289 4693395 5791104 5069473 4862739 5161440 4771960 3525581
3118 3525581 4497863 4272048 4129907 3888334 3391448 2668087 3514010 4255495 4030649 4308324
3108 4308324 3067364 4021093 3215487 3551191 3703834 2586742 4190553 4447840 4107528
3099 4107528 3249847 2902695 3620493 3330427 3697428 3515786 3829722 4099380 4355269 3896198
3089 3896198 3532501 4126733 3770003 3708735 3492228 4408351 3684632 3533265 3786238 4006050
3079 4006050 3983446 2878509 3184713 3634946 3248717 2801732 2030457 2981303 3937307 3223717
3069 3223717 2983147 3712668 4731737 4137608 1982273 2700426 3940937 3934787 3343688
3060C343688K17136K79821m29745j442679P75695J439652l02042j725276R10989
3051C067239J08555n33113Q7361L84130l62750o83434K59355L19207p17523M41438
3041B370465k00987p28944K17533J245017O6851q60332m83194K18598O05806j14434
3031B336379J411931o90249m74182o60671J025488o43393o70871Q47504M47203
3022B929139R86387j30506j208789p75908m70692J772382k30219j590711Q5342
3013A366425L88143l98372l18291M87175M74405J22358M09401n29438N48985J10323
3003B661114j223646L41710o49241o09179J279507j97090j77764J99082Q3907
2994A708400o18214j150312N9832Q11408J465990m93413j228132P4053k8114K57124
$$ plain form
3060 3343688 3560824 3840645 3410900 1968221 2743916 4183568 3881526 2156250 3067239
3051 3067239 3175794 2642681 2730042 3114172 2751422 2067988 2327343 2646550 1929027 2370465
3041 2370465 2169478 1440534 1658067 2903084 2969935 2109603 1626409 1845007 2450813 2336379
3031 2336379 3748310 3058061 2583879 1923208 2948696 2305303 1634432 2481936 2929139
3022 2929139 3915526 3785020 2576231 1800323 1329631 3102013 2871794 1281083 1366425
3013 1366425 1754568 1356196 1037905 1525080 1999485 2121843 2531244 2001806 2550791 2661114
3003 2661114 1437468 1779178 1129937 520758 1800265 1603175 1425411 1624493 1708400
2994 1708400 1090186 -60126 -294 811114 2277104 1783691 555559 629612 601498 858622
2984H58622k82984m64948J044770M2482M14571j011771N88725r88020q39420L81509
2974b56464J90898R93363m66065k12262m77716k48097k43135R93643O95942O62806
2964A632913o67478m11082O46100N69105q79710n33617k07438j40690O10959n77144
2954D1918Q4000L65204n6158J01504o9685n10680j632974j71345J279028J46753
2944d22435p26657N01538K14039j49392n06717L75436N47017L34076m63499j317947
2934a614541J31541J46083k84986N26327L99010Q805K21547r18041j449807J25016
2924b709046J002357M12404n4242M95264l76877n41871J202530r8753o69041M55120
2914h82155n39930P4722N58816m92630K28617l08592L25732O55647n45444j369038
$$ plain form
2984 858622 575638 110690 1155460 1197942 1612513 600742 1189467 201447 -637973 -256464
2974 -256464 -65566 927797 461732 249470 -228246 -476343 -719478 274165 970107 1632913
2964 1632913 965435 554353 1200453 1769558 889848 356231 148793 8103 619062 41918
2954 41918 125918 491122 434964 536468 466783 -43897 -1676871 -1848216 -569188 -422435
2944 -422435 -1149092 -647554 -433515 -582907 -1089624 -714188 -167171 166905 -296594 -1614541
2934 -1614541 -1483000 -1336917 -1621903 -1095576 -696566 -687761 -466214 -1384255 -2834062 -2709046
2924 -2709046 -1706689 -1294285 -1348527 -853263 -1230140 -1772011 -569481 -668234 -1337275 -882155
2914 -882155 -1422085 -1347363 -788547 -1281177 -1052560 -1361152 -1035420 -379773 -925217 -2294255
2904b294255J367787J756859j038621j498250q81592J058408M11350k85934r18480
2895b322728R89618N01866q49149L0601O03339m2118J05038L63867p87671o73792
2885b081129J0815m13498J291895O16947o58055J85956n19153J36489L64174o3174
2875a128733j029655m97704K01869P59827n52932O74322J29758k88553j01756
2866a833557J135080k09261r13897J481294l13815N03082Q35428n23536j281851
2857a121033J042514K89197r72650j046481m52660O09855j259091q97371L52203
2848c455517J065658J436381n36711n53011J029249p41890l68542m89686O42850
2839a971219M1546R72860m59344J021652Q84503j553406r18735K06043K93547
$$ plain form
2904 -2294255 -926468 830391 -208230 -1706480 -2588072 -1529664 -1118314 -1404248 -2322728
2895 -2322728 -1333110 -831244 -1680393 -1649792 -1046453 -1088571 -983533 -619666 -1407337 -2081129
2885 -2081129 -2070314 -2483812 -1191917 -574970 -1233025 -1047069 -1566222 -1429733 -1065559 -1128733
2875 -1128733 -2158388 -2656092 -2454223 -1694396 -2247328 -1573006 -1443248 -1731801 -1833557
2866 -1833557 -698477 -907738 -1821635 -340341 -654156 -151074 684354 160818 -1121033
2857 -1121033 -78519 210678 -761972 -1808453 -2261113 -1651258 -2910349 -3807720 -3455517
2848 -3455517 -2389859 -953478 -1490189 -2043200 -1013951 -1755841 -2124383 -2614069 -1971219
2839 -1971219 -1929673 -956813 -1416157 -394505 489998 -1063408 -1982143 -1776100 -1482553
2830a482553J67529j5528j59690L57867O4426m9697q74870J9647K91750P04696
2820i76423N5368q46677N0563J17426K43353K55749K96565p08143q11767O39623
2810a684363J59386p9426m00815p31906J047545M81429J83223P6158K10842r91098
2800a729025Q9887R01268p4873j567450r55830L49799Q19463P84777j26396k31354
2790a739734O2450k25506l30524n327k94526K04576Q71201L95647L0388k35352
2780a266707j657406M29523Q34822M72039o51373j091651N52399L73087n89374
2771b594641j2515n39065L11971K23962J564690M86323m25094O0318o35523k22731
2761a782305q99911k83132R20434n45282R54752L43632M27815j70950n17736m05272
$$ plain form
2830 -1482553 -1315024 -1330552 -1490242 -1132375 -1067949 -1117646 -1992516 -1972869 -1681119 -976423
2820 -976423 -921055 -1767732 -1717169 -1599743 -1356390 -1100641 -804076 -1512219 -2323986 -1684363
2810 -1684363 -1524977 -1604403 -2005218 -2737124 -1689579 -1208150 -1024927 -948769 -737927 -1729025
2800 -1729025 -1639138 -737870 -812743 -2380193 -3336023 -2986224 -2166761 -1381984 -1508380 -1739734
2790 -1739734 -1677284 -1902790 -2233314 -2238641 -2533167 -2328591 -1457390 -1061743 -1031355 -1266707
2780 -1266707 -2924113 -2494590 -1659768 -1187729 -1839102 -2930753 -2378354 -2005267 -2594641
2771 -2594641 -2607156 -3146221 -2834250 -2610288 -1045598 -559275 -984369 -924051 -1559574 -1782305
2761 -1782305 -2682216 -2965348 -2044914 -2590196 -1635444 -1291812 -863997 -1034947 -1552683 -1957955
2751a957955o97313N9389R87100Q73841l47604j024271j39596M3085J66719N49708
2741a486897P97026k92017j041041L18476N31262P67237P81854r77695n58551
2732a160346K6874n69999j444900m02920Q20315K3651P28657j079127L7344P81012
2722b239439o53572J43869M01673m74539P11131J39262n87518N37686O18232n37622
2712a940837r67787K21219J001223l73935l29445p2556j31883L0332k63877J17344
2702b710202n58908M68201K13415k94699q06741J145877N80119M70155L01523
2693a191260J26580j500983J11190K87145j60304R68709m94949P2916K9902q17571
2683b568625k38871K14890J055577o65630q99674J458873k63925R03560K6542
$$ plain form
2751 -1957955 -2655268 -2595879 -1608779 -734938 -1082542 -2106813 -2246409 -2203324 -2036605 -1486897
2741 -1486897 -689871 -981888 -2022929 -1704453 -1173191 -405954 375900 -601795 -1160346
2732 -1160346 -1133472 -1703471 -3148371 -3551291 -2730976 -2707325 -1978668 -3057795 -3020451 -2239439
2722 -2239439 -2893011 -2749142 -2347469 -2822008 -2110877 -1971615 -2559133 -2021447 -1403215 -1940837
2712 -1940837 -2908624 -2687405 -1686182 -2060117 -2389562 -2462118 -2594001 -2563669 -2827546 -2710202
2702 -2710202 -3269110 -2800909 -2587494 -2882193 -3688934 -2543057 -1962938 -1492783 -1191260
2693 -1191260 -1064680 -2565663 -2454473 -2167328 -2327632 -1358923 -1853872 -1780956 -1751054 -2568625
2683 -2568625 -2807496 -2592606 -1537029 -2202659 -3102333 -1643460 -1907385 -1003825 -977283
2674i77283m96423o56633r93048o16113j49270J84572Q85761Q90158n53218l68530
2664b850027L62061K97655p220j283348j08837L24373K228835j584232j375983
2655c996723M70620O37388J142464n03818l09228P22857M79665j08047o95750
2646b160572O22090j97998j72240n37844l0055P70931j10717O16935j503666j03490
2636b806626M69958j56097K10396o761O13778l96536j02801l15488p72781J193384
2626b069574M91254j50418j13634O28171l55633O58804j85214j297932Q51209
2617a542967k72967j173456M245Q75783p46227l70783J250680K83338l34749o01927
2607b629030K49473J42774n11341M86334R51654J74793N7399r60294o17510P24481
$$ plain form
2674 -977283 -1473706 -2130339 -3123387 -3739500 -3888770 -3704198 -2818437 -1928279 -2481497 -2850027
2664 -2850027 -2487966 -2190311 -2197531 -3480879 -3589716 -3265343 -1036508 -2620740 -3996723
2655 -3996723 -3526103 -2888715 -1746251 -2250069 -2559297 -1836440 -1356775 -1464822 -2160572
2646 -2160572 -1538482 -1736480 -1908720 -2446564 -2476619 -1705688 -1816405 -1199470 -2703136 -2806626
2636 -2806626 -2336668 -2492765 -2282369 -2289130 -1675352 -2071888 -2174689 -2490177 -3262958 -2069574
2626 -2069574 -1578320 -1728738 -1842372 -1214201 -1569834 -911030 -1096244 -2394176 -1542967
2617 -1542967 -1815934 -2989390 -2985145 -2109362 -2855589 -3226372 -1975692 -1692354 -2027103 -2629030
2607 -2629030 -2379557 -2236783 -2748124 -2261790 -1310136 -1135343 -1077944 -2038238 -2655748 -1931267
2597a931267Q697O06411j649427J232841N02692j152045J05451J009488p72990
2588b040149p6298r38233k23883N96022j35198P77657o06767K83958n30064J069730
2578a823225L01049q80562p90031N69950O58305N05105m38554N05229j200336
2569b593070o76361J90347R88332L22501j17056Q58464j972650j27362P81360
2560b345495P58301l00690o16240o73160J069696P93740q78208L25090L78503
2551a488463J53456O157j01065k16359p09263p0362N03309q9828K62800m37716
2541b187334l452r04779n66025k01945O79611L35947L43207j73594n96029P46590
2531b527803L27105K5518M48388L01832N19076j380931l2607j44167o42367P84863
$$ plain form
2597 -1931267 -1922570 -1316159 -2965586 -1732745 -1230053 -2382098 -2276647 -1267159 -2040149
2588 -2040149 -2116447 -3054680 -3278563 -2682541 -2817739 -2040082 -2646849 -2362891 -2892955 -1823225
2578 -1823225 -1522176 -2402738 -3192769 -2622819 -1964514 -1459409 -1897963 -1392734 -2593070
2569 -2593070 -3269431 -3079084 -2090752 -1768251 -1885307 -1026843 -2999493 -3126855 -2345495
2560 -2345495 -1587194 -1887884 -2504124 -3177284 -2107588 -1313848 -2192056 -1866966 -1488463
2551 -1488463 -1335007 -1328850 -1429915 -1646274 -2355537 -2425899 -1922590 -2012418 -1749618 -2187334
2541 -2187334 -2190786 -3095565 -3661590 -3863535 -3183924 -2847977 -2504770 -2678364 -3274393 -2527803
2531 -2527803 -2200698 -2175180 -1726792 -1424960 -905884 -2286815 -2319422 -2463589 -3105956 -2321093
2521b321093l02429J306984J59494n98746j25706n02621K84112L73247q65587
2512b592345J12574N32138k38997l4841L35388J164623r4382j58742Q2276o07331
2502a499639q40842k57914K23682q5014j78824J35686R54347M2694o0757j0047
2492a576628R9015M42777q94814l55966j80462m32848N25074k15186j8319J168403
2482a438954p52624m68533M16225P85181k18402R9299q58674r7278O00527j68479
2472b101712j18836L6542R91399p88622o91357J372941N98524j111963q69255
2463b682339O33147K35430P32156l05708n5997K1310j37765m21237P6670k32339
2453b136672j085370J105840J416505j424971j044791Q61430L93624m57144j25887
$$ plain form
2521 -2321093 -2623522 -1316538 -1157044 -1755790 -1881496 -2384117 -2100005 -1726758 -2592345
2512 -2592345 -2479771 -1947633 -2186630 -2221471 -1886083 -721460 -815842 -974584 -892308 -1499639
2502 -1499639 -2340481 -2598395 -2374713 -2459727 -2638551 -2502865 -1548518 -1505824 -1566581 -1576628
2492 -1576628 -1477613 -1034836 -1929650 -2285616 -2466078 -2898926 -2373852 -2589038 -2607357 -1438954
2482 -1438954 -2191578 -2660111 -2243886 -1458705 -1677107 -1577808 -2436482 -2533760 -1933233 -2101712
2472 -2101712 -2220548 -2184006 -1192607 -1981229 -2672586 -1299645 -701121 -1813084 -2682339
2463 -2682339 -2049192 -1813762 -1081606 -1387314 -1443311 -1422001 -1559766 -1981003 -1904333 -2136672
2453 -2136672 -3222042 -2116202 -699697 -2124668 -3169459 -2308029 -1914405 -2371549 -2497436
2444b497436j52285m94617O5200P93353L36810o76821J289399k01756l98328K17478
2434a719003J42296l93837Q39383k95854N63896m51072o35105R6956J49933N60706
2424a141701l14627j509380K1487P15537n41586P2108J293913J83926N44135j05494
2414g81682j701386Q06321k68195j666786R02408Q3492M43048j267924r3274N08056
2404c035922O6943Q40267P25112m01949p95052j99623M2764k57865N20782K02870
2394b291673N41662m03235o89194R55743O53361j4142o99838o77650N05134m03500
2384b523332J262281L40142L4602q49276p29783k00236j9123j31977J04209R50335
2374a762158j107749J71865j28443O64713M11174K34679j573170k71399K15449
$$ plain form
2444 -2497436 -2649721 -3144338 -3079138 -2285785 -1948975 -2625796 -1336397 -1538153 -1936481 -1719003
2434 -1719003 -1576707 -1970544 -1131161 -1427015 -863119 -1314191 -1949296 -1852340 -1702407 -1141701
2424 -1141701 -1456328 -2965708 -2944221 -2228684 -2770270 -2698162 -1404249 -1220323 -676188 -781682
2414 -781682 -2483068 -1676747 -1944942 -3611728 -2709320 -2625828 -2182780 -3450704 -3543978 -3035922
2404 -3035922 -2968979 -2128712 -1403600 -1805549 -2600601 -2800224 -2757460 -3015325 -2494543 -2291673
2394 -2291673 -1750011 -2153246 -2842440 -1886697 -1233336 -1247478 -1947316 -2624966 -2119832 -2523332
2384 -2523332 -1261051 -920909 -886307 -1735583 -2465366 -2665602 -2684725 -2816702 -2712493 -1762158
2374 -1762158 -2869907 -2698042 -2826485 -2161772 -1750598 -1515919 -3089089 -3360488 -3145039
2365c145039J318364J41102j78281N9576l39577Q967J65972k05952q31645L45349
2355b661164L09507j03815O83707p64406l93044m10118N68226r0916R15477L31252
2345a615294M99753l98841r26699j80684M64929O44444k26110m5283j5037N26461
2335a272361r84917k89519o14327Q11987o6952l15653l8496N12175N82809L86852
2325a288402m10666n3738m85112k94099J807827q25456q05510N08876L28137m43128
2315a961271k23737M73581K42409L20311P38517r70024J99519n39826m93433O24345
2305a589609k5821m28803P85500m64564k10583L42566j86850q37217M01966R72650
2295a240765M26849k63517l51751O66380j002923r95120J526368P85087M4253
$$ plain form
2365 -3145039 -1826675 -1685573 -1863854 -1804278 -2143855 -2134888 -1968916 -2174868 -3006513 -2661164
2355 -2661164 -2351657 -2455472 -1771765 -2536171 -2929215 -3339333 -2771107 -2862023 -1946546 -1615294
2345 -1615294 -1115541 -1514382 -2441081 -2621765 -2156836 -1512392 -1738502 -1783785 -1798822 -1272361
2335 -1272361 -2257278 -2546797 -3161124 -2349137 -2416089 -2731742 -2770238 -2258063 -1675254 -1288402
2325 -1288402 -1699068 -1752806 -2237918 -2532017 -724190 -1549646 -2355156 -1846280 -1518143 -1961271
2315 -1961271 -2185008 -1711427 -1469018 -1148707 -410190 -1380214 -1180695 -1720521 -2213954 -1589609
2305 -1589609 -1615430 -2044233 -1258733 -1723297 -1933880 -1591314 -1778164 -2615381 -2213415 -1240765
2295 -1240765 -813916 -1077433 -1429184 -762804 -1765727 -2760847 -1234479 -449392 -405139
2286d05139j155295k50237l98894j06434M85687m648K42816k68105k07764N88273
2276a479740O81447p72342j014149J047M68882J03444O71696K19260p3493j98657
2266a392605q38528N61963l34433j451030O62201J59348N77902J008604O35313
2257d11265j391956j350187J012175J74352M68096J9213j629404l69429J722331
2248a756074q60627j36726J365889r87477L36380K01594Q42368p27183q53510
2239b575366R48072k3146j34232L86673p58898L08088m24868j85811j50091j97531
2229b807110j33995J290454J45285n95795J84048L23962k60438J78391j94038
2220a869236K96769N95012j22868j056435k73459Q7170K80544L78727n16370J36482
$$ plain form
2286 -405139 -1560434 -1810671 -2209565 -2315999 -1830312 -1834960 -1592144 -1860249 -2068013 -1479740
2276 -1479740 -798293 -1570635 -2584784 -2583737 -2114855 -2011411 -1339715 -1120455 -1193948 -1392605
2266 -1392605 -2231133 -1669170 -2003603 -3454633 -2792432 -2633084 -2055182 -1046578 -411265
2257 -411265 -1803221 -3153408 -2141233 -1966881 -1498785 -1479572 -3108976 -3478405 -1756074
2248 -1756074 -2616701 -2753427 -1387538 -2375015 -2038635 -1837041 -994673 -1721856 -2575366
2239 -2575366 -1627294 -1650440 -1784672 -1397999 -2156897 -1848809 -2273677 -2459488 -2609579 -2807110
2229 -2807110 -2941105 -1650651 -1505366 -2101161 -1917113 -1593151 -1853589 -1675198 -1869236
2220 -1869236 -1572467 -977455 -1100323 -2156758 -2430217 -2343047 -2062503 -1683776 -2200146 -2063664
2210b063664k50777K22848j18521n66720L16926o16554M60858K16188K93059k82110
2200b388467p22838P70981K270917j120410l83177m46074N09350p79344K37191
2191b051871N41258M58738O33276j413327N47274m55438j72539l18148k02195
2182b432972n79346J123226N19186m77535k96268Q80711L6693o78521k51953J20721
2172b036058M05676K63199j59437n79058P53563K01942O431J40248j774744O1323
2162b716915J90476L28303q07878N06334N21656M66806m40172M30400M93270j361053
2152b388773o54686L30828J252047J67633q0607J92031p670p16980N0526M02271
2142a453380J16253n02889k15924k32832l05486N82390l08951K80151L07799m56012
$$ plain form
2210 -2063664 -2314441 -2091593 -2210114 -2776834 -2459908 -3076462 -2615604 -2399416 -2106357 -2388467
2200 -2388467 -3111305 -2340324 -69407 -1189817 -1572994 -2019068 -1509718 -2289062 -2051871
2191 -2051871 -1510613 -1051875 -418599 -1831926 -1284652 -1740090 -1912629 -2230777 -2432972
2182 -2432972 -3012318 -1889092 -1369906 -1847441 -2143709 -1262998 -1226305 -1904826 -2156779 -2036058
2172 -2036058 -1630382 -1367183 -1526620 -2105678 -1352115 -1150173 -1143742 -1003494 -2778238 -2716915
2162 -2716915 -2526439 -2198136 -3006014 -2499680 -1978024 -1511218 -1951390 -1520990 -1027720 -2388773
2152 -2388773 -3043459 -2712631 -1460584 -1292951 -1373558 -1181527 -1189197 -1906177 -1855651 -1453380
2142 -1453380 -1337127 -1840016 -2055940 -2288772 -2594258 -2011868 -2320819 -2040668 -1732869 -2188881
2132b188881J19604O20003N5242l67034J09376O31813p74664N32735n40661l17904
2122b120371j72988p2772O1106M33003l9134O35675r59418p61624P26043j09330
2112b379810k63667q16303O6851P41958k35377Q07437L97750n71698J150801L72439
2102g29619q11066P7137l53567k62889k0104m78195N6886J73760R55692o13457
2092b005422L35561P66343j322232J60738J060046o43072L06978j104016p63189
2083c208265P35458L4321J131655l76988j558779P10844l38813j84218J123075
2074a931710L44660l06997l15278J167217k28164q86315M5177M78923o12709L14513
2064a930683l03799n03392O26975J47696J639915j725982P2276P15072p25269
$$ plain form
2132 -2188881 -2069277 -1449274 -1394032 -1761066 -1651690 -1019877 -1794541 -1261806 -1802467 -2120371
2122 -2120371 -2293359 -2366131 -2305025 -1872022 -1911156 -1275481 -2234899 -2996523 -2270480 -2379810
2112 -2379810 -2643477 -3459780 -3392929 -2650971 -2886348 -2078911 -1681161 -2252859 -1102058 -729619
2102 -729619 -1540685 -1463548 -1817115 -2080004 -2100108 -2578303 -2521417 -2347657 -1391965 -2005422
2092 -2005422 -1669861 -903518 -2225750 -2065012 -1004966 -1648038 -1341060 -2445076 -3208265
2083 -3208265 -2472807 -2438486 -1306831 -1683819 -3242598 -2531754 -2870567 -3054785 -1931710
2074 -1931710 -1587050 -1894047 -2209325 -1042108 -1270272 -2156587 -2111410 -1632487 -2245196 -1930683
2064 -1930683 -2234482 -2737874 -2110899 -1963203 -323288 -2049270 -1976994 -1261922 -1987191
2055a987191p5785M98975M3124o88282m69527l0226K98193k24461J042119p94520
2045b387581j27938o48058J55104K011725j076742p00257M38052M03299R0164
2036a842232J42923L21743N71108r93774l22880L06989M81641j5106q70503P91332
2026a428759O47258J64771l73160k69853K00724o69708k35027Q2177J116k18717
2016b099178O17679k83963q29976m25781l2919N43654R69714q31665L46554L20108
2006a705773q6935L68985j23869N58536o30396j63177K8184k0135m14258n5982
1996b244820J105104m44081J18235n20622O15553q61038n00712O14349K83504
1987a834528K29605k96217k49039l99911k97320K65055o5544M6614O24759p29241
$$ plain form
2055 -1987191 -2062976 -1564001 -1520877 -2209159 -2678686 -2708912 -2410719 -2635180 -1593061 -2387581
2045 -2387581 -2515519 -3163577 -3008473 -996748 -2073490 -2773747 -2335695 -1932396 -1842232
2036 -1842232 -1699309 -1377566 -806458 -1800232 -2123112 -1816123 -1334482 -1349588 -2220091 -1428759
2026 -1428759 -781501 -616730 -989890 -1259743 -1059019 -1728727 -1963754 -1881577 -1880461 -2099178
2016 -2099178 -1481499 -1765462 -2595438 -3021219 -3054138 -2510484 -1540770 -2372435 -2025881 -1705773
2006 -1705773 -1792708 -1423723 -1547592 -989056 -1619452 -1782629 -1754445 -1774580 -2188838 -2244820
1996 -2244820 -1139716 -1583797 -1465562 -1986184 -1370631 -2231669 -2732381 -2118032 -1834528
1987 -1834528 -1604923 -1901140 -2150179 -2550090 -2847410 -2582355 -2647899 -2601285 -1976526 -2705767
1977b705767N97387N30773k15998q48676n89438O14012J125733o15127j410580
1968c517681M59455R30560p08626R19421r44682p3795M25797m1254M00228n41565
1958b692142J169595K65573p88785m04259j51355m24187o9233L86672L78291k41299
1948b571129m61302J41415n35670R99644Q50890J468n56821m69018j77340R21115
1938a856748O68251n07784q9183j84849L88183M2018M57791j09598j209386j99867
1928b601172L04286P72395k55219p74814J67259N04909l96534r61088M99403K60722
1918b479853L06541n5371R97353J18420M54520L557p99561O00256J11561o75117
1908a417694j004919j10832N80454K01824k69592L90180n86405O1784k4600L36950
$$ plain form
1977 -2705767 -2108380 -1577607 -1793605 -2642281 -3231719 -2617707 -1491974 -2107101 -3517681
1968 -3517681 -3058226 -2127666 -2836292 -1916871 -2861553 -2935348 -2509551 -2550805 -2150577 -2692142
1958 -2692142 -1522547 -1256974 -2045759 -2450018 -2601373 -3025560 -3094793 -2708121 -2329830 -2571129
1948 -2571129 -3032431 -2891016 -3426686 -2427042 -1576152 -1574684 -2131505 -2600523 -2777863 -1856748
1938 -1856748 -1188497 -1696281 -1785464 -1970313 -1582130 -1540112 -1082321 -1191919 -2401305 -2601172
1928 -2601172 -2296886 -1524491 -1779710 -2554524 -2387265 -1882356 -2278890 -3239978 -2740575 -2479853
1918 -2479853 -2173312 -2228683 -1231330 -1112910 -658390 -654833 -1454394 -854138 -742577 -1417694
1908 -1417694 -2422613 -2533445 -1952991 -1751167 -2020759 -1630579 -2216984 -2155200 -2179800 -1842850
1898a842850k42145L55076l93165l00112J35689N49001J7317o78574O89796P7650
1888a632317m9347M27671o01454o15495K36538K51282L31391J208345N3006K39893
1878a50487j263195m0104n28888K98031L84571j005527k80579Q06896n01653J28563
1868b152372N56089O20408r67917j543424J855165M1253j15526l88909j40792
1859b236025J26273J61660J18177O18126n11558j76666L0194q05262k83486O08167
1849b350400l91501O66715L32243o01305p44417J739326R43797n2723O25429p90212
1839f23048m97437p37867n82182R93738r63153N51483L05026j87450M63598m63176
1829a740468r03245K69080n95239m74596P83226J088739J20981K72911J29691
$$ plain form
1898 -1842850 -2084995 -1729919 -2123084 -2423196 -2287507 -1738506 -1721189 -2399763 -1709967 -1632317
1888 -1632317 -1681664 -1253993 -1855447 -2470942 -2234404 -1983122 -1651731 -443386 -390380 -150487
1878 -150487 -1413682 -1453786 -1982674 -1684643 -1300072 -2305599 -2586178 -1779282 -2280935 -2152372
1868 -2152372 -1596283 -975875 -1943792 -3487216 -1632051 -1590798 -1706324 -2095233 -2236025
1859 -2236025 -2109752 -1948092 -1829915 -1211789 -1723347 -1900013 -1869819 -2675081 -2958567 -2350400
1849 -2350400 -2741901 -2075186 -1742943 -2344248 -3088665 -1349339 -405542 -458265 167164 -623048
1839 -623048 -1120485 -1858352 -2440534 -1446796 -2409949 -1858466 -1553440 -1740890 -1277292 -1740468
1829 -1740468 -2643713 -2374633 -2969872 -3444468 -2661242 -1572503 -1451522 -1178611 -1048920
1820a048920K01433k11649q23671J017053L05812p08417j027151j18802r3168
1811b507480L73704L83967p79152l50948k11208K96479o2135n35022J055307p64415
1801c100903L86734m82160M13962J67617K02333R25898j146268o6886q7692R3019
1791b694346L93414j025957R8310J399798K47071M27340m74058M95894J26755
1782a005779o83415p16397N06154j18365m18000M07327P91601q95980k90863k25271
1772b648988P11649P01236j152971J179958N25401o19048m4415L53149q44508
1763a838537k27528l25216R8727R42404R37711j89189j200752N47498o40789l8005
1753a933676J4486O35604K76980j270921k37413L48713M60221J83917K25368m86139
$$ plain form
1820 -1048920 -847487 -1059136 -1882807 -865754 -559942 -1268359 -2295510 -2414312 -2507480
1811 -2507480 -2133776 -1749809 -2528961 -2879909 -3091117 -2794638 -2856773 -3391795 -2336488 -3100903
1801 -3100903 -2714169 -3196329 -2782367 -2614750 -2412417 -1486519 -2632787 -2699673 -2787365 -2694346
1791 -2694346 -2300932 -3326889 -3228579 -1828781 -1581710 -1154370 -1628428 -1132534 -1005779
1782 -1005779 -1689194 -2405591 -1899437 -2017802 -2435802 -2028475 -1236874 -2132854 -2423717 -2648988
1772 -2648988 -1937339 -1236103 -2389074 -1209116 -683715 -1302763 -1347178 -994029 -1838537
1763 -1838537 -2066065 -2391281 -2292554 -1350150 -412439 -601628 -1802380 -1254882 -1895671 -1933676
1753 -1933676 -1919190 -1283586 -1006606 -2277527 -2514940 -2166227 -1706006 -1522089 -1296721 -1782860
1743a782860J54942p63408m89944Q45563M13692r22262Q82649J44203q67539J8560
1733b366404M8979K99451j25525p64104L21050L54682J325649m44460l60424l23193
1723b034299j078027O08727J24418K51813l62322o21591o47844O79326J288324
1714a791475O3896o86490o77602Q01303k17862L26714K84846j83641j58077Q49887
1704a388501K45685j902585J26959L7457R1489J045960O28113m27772q13672N0919
1694b305948M56059P72787j94843j070507L41007k0523m51554J062599q65738
1685b276661j89852P83862n43164K72639k31257J131852O99104o67336N01671
1676e19142k39901M394j147153o40832L32183P15761K66303m19231o06875L96218
$$ plain form
1743 -1782860 -1627918 -2391326 -2881270 -2035707 -1622015 -2544277 -1661628 -1517425 -2384964 -2366404
1733 -2366404 -2317425 -2017974 -2143499 -2907603 -2586553 -2231871 -906222 -1350682 -1711106 -2034299
1723 -2034299 -3112326 -2503599 -2379181 -2127368 -2489690 -3111281 -3759125 -3079799 -1791475
1714 -1791475 -1727579 -2414069 -3091671 -2290368 -2508230 -2181516 -1896670 -2080311 -2238388 -1388501
1704 -1388501 -1142816 -3045401 -2918442 -2880985 -2789496 -1743536 -1115423 -1543195 -2356867 -2305948
1694 -2305948 -1849889 -1077102 -1271945 -2342452 -2001445 -2021968 -2473522 -1410923 -2276661
1685 -2276661 -2466513 -1682651 -2225815 -1953176 -2184433 -1052581 -353477 -1020813 -519142
1676 -519142 -759043 -754649 -1901802 -2542634 -2210451 -1494690 -1228387 -1647618 -2254493 -1858275
1666a858275O3307m73436J104859p79534J031309M0870k13020O17112l58718j084122
1656a909648J47019J099326r78645m75627l15891o90451r8369k28464O74758J163493
1646a612499j065338K19532J59572J339858o19215j404735O60527N00235J130618
1637f91445l26664p53219k50455M57300L68508N17583j415052r64902M68115N07729
1627b082502j38988o29383J032022J27041m04184O68066q93616r9699P27614k72170
1617a965799q73689Q30382k26080j78007K72527M09592j107319J158627R4890
1608a584876o86697l92701j71391r1611m37542P92956J467906j2680n51823R26618
1598g41841q94818p20336q4328q715O46742J361271n67548K07478r4408q96351
$$ plain form
1666 -1858275 -1794968 -2268404 -1163545 -1943079 -911770 -870900 -1083920 -466808 -825526 -1909648
1656 -1909648 -1762629 -663303 -1641948 -2117575 -2433466 -3123917 -3222286 -3450750 -2775992 -1612499
1646 -1612499 -2677837 -2458305 -2298733 -958875 -1578090 -2982825 -2322298 -1822063 -691445
1637 -691445 -1018109 -1771328 -2021783 -1564483 -1195975 -678392 -2093444 -3058346 -2590231 -2082502
1627 -2082502 -2221490 -2850873 -1818851 -1691810 -2095994 -1427928 -2321544 -2421243 -1693629 -1965799
1617 -1965799 -2839488 -2009106 -2235186 -2413193 -2140666 -1731074 -2838393 -1679766 -1584876
1608 -1584876 -2271573 -2664274 -2835665 -2927276 -3364818 -2571862 -1103956 -1116636 -1668459 -741841
1598 -741841 -1636659 -2356995 -2441323 -2450038 -1803296 -442025 -1009573 -802095 -896503 -1792854
1588a792854q6273N01647l08335J204360k29659p20905O0924N25450o35620j208767
1578b690032k93400M83822m19999O91764k21778j65114J306082m60838l655k6726
1568a799874j89176L07791j8428l0036K8020r26750J270021O56525o84441j211788
1558b598136k49437J455111l94140j253473m84208K98678J053118R34447j53657
1549a391697o88687J32572Q80745j2577j295760q59273J335316M90464j160494
1540b569391j031412L68812J779832m30767N01342J1748n68086J91990Q365m32469
1530b170036J49349L05394J167324l93315k228780K06610O6898L6272J137752
1521a722532M16855n09512p32038J42567P43618K55983p06602p6575L65596J241325
$$ plain form
1588 -1792854 -1879127 -1377480 -1685815 -481455 -711114 -1432019 -1371095 -845645 -1481265 -2690032
1578 -2690032 -2983432 -2499610 -2919609 -2227845 -2449623 -2614737 -1308655 -1769493 -1773148 -1799874
1568 -1799874 -1989050 -1681259 -1699687 -1729723 -1701703 -2628453 -1358432 -701907 -1386348 -2598136
1558 -2598136 -2847573 -1392462 -1786602 -3040075 -3524283 -3225605 -2172487 -1238040 -1391697
1549 -1391697 -2080384 -1947812 -1067067 -1079644 -2375404 -3234677 -1899361 -1408897 -2569391
1540 -2569391 -3600803 -3231991 -1452159 -1882926 -1381584 -1369836 -1937922 -1745932 -1737567 -2170036
1530 -2170036 -2020687 -1715293 -547969 -941284 -3170064 -2963454 -2896556 -2860284 -1722532
1521 -1722532 -1305677 -1815189 -2547227 -2404660 -1661042 -1405059 -2111661 -2188236 -1822640 -581315
1511e81315P111j435921M00928J8335j324120J03513M09974J002397O93771q27101
$$ plain form
1511 -581315 -574204 -2010125 -1609197 -1590862 -2914982 -2811469 -2401495 -1399098 -705327 -1532428
$$ [...]
##END NTUPLES=NMR SPECTRUM
##END=
