##TITLE=1H_DE-80H_X3
 200.13MHz, d2o
 8 sc
 
 19ns.26.2.2025
##JCAMPDX= 6.0         $$ Bruker NMR JCAMP-DX V2.0
##DATA TYPE= NMR SPECTRUM
##DATA CLASS= NTUPLES
##ORIGIN= UXNMR, Bruker Analytische Messtechnik GmbH
##OWNER= pz
$$ XWIN-NMR		Version 3.5
$$ Tue Oct 28 10:18:29 2025 Russian Standard Time (UT+4h)  Yarkov@DPX200
##.OBSERVE FREQUENCY= 200.1313
##.OBSERVE NUCLEUS= ^1H
##.ACQUISITION MODE= SIMULTANEOUS
##.ACQUISITION SCHEME= undefined
##.AVERAGES= 8
##.DIGITISER RES= 18
##SPECTROMETER/DATA SYSTEM= spect
##.PULSE SEQUENCE= zg30
##.SOLVENT NAME= DMSO
##.SHIFT REFERENCE= (INTERNAL, DMSO, 0, 15.5034)
##AUDIT TRAIL= $$ (NUMBER, WHEN, WHO, WHERE, WHAT)
$$ ##TITLE= Audit trail, XWIN-NMR		Version 3.5
$$ ##JCAMPDX= 5.01
$$ ##ORIGIN= Bruker BioSpin GmbH
$$ ##OWNER= Yarkov
$$ C:/Bruker/XWIN-NMR/data/yarkov2/nmr/H-C/1/pdata/1/auditp.txt
$$ ##AUDIT TRAIL=  $$ (NUMBER, WHEN, WHO, WHERE, WHAT)
(   1,<2025-10-28 10:17:00.59 +0400>,<Yarkov>,<DPX200>,
      <created by zg, POWCHK disabled, PULCHK disabled
       configuration hash MD5:
       00 E9 B6 7A A2 85 ED C7 34 08 36 98 17 FE 4E 26
       data hash MD5: 16K
       92 BF D7 16 6C C3 3C 02 2F 9D C2 BD 27 0D 63 31>)
(   2,<2025-10-28 10:17:08.67 +0400>,<Yarkov>,<DPX200>,
      <Start of raw data processing
       efp BC_mod = 2 LB = 0.25 FT_mod = 6 PKNL = 1 PHC0 = -4567.199 PHC1 = 12.02191 SI = 16K 
       data hash MD5: 16K
       90 0F 66 46 0A AA 69 CF 58 89 50 D2 80 BD 47 1B>)
(   3,<2025-10-28 10:17:26.70 +0400>,<Yarkov>,<DPX200>,
      <pk PHC0 = -17.6 PHC1 = 0 
       data hash MD5: 16K
       D7 99 2D 4F 36 70 B5 F1 57 2C 3D 36 D8 75 A4 C9>)
(   4,<2025-10-28 10:17:29.79 +0400>,<Yarkov>,<DPX200>,
      <abs ABSG = 5 
       data hash MD5: 16K
       3D EE A5 BC FC 06 9E 5C 13 C9 A3 70 2F 97 70 08>)
$$ ##END=
$$ 
$$ hash MD5
$$ 8A 43 C9 D2 A1 5B A5 F4 3F E9 80 BA AF 0A D4 3B
##$RELAX= 
##$RELAX= 
##$RELAX= 
##$RELAX= 
##$RELAX= 
##$RELAX= 
$$ Bruker specific parameters
$$ --------------------------
##$DU= <C:/Bruker/XWIN-NMR>
##$EXPNO= 1
##$NAME= <H-C>
##$PROCNO= 1
##$TYPE= <nmr>
##$USER= <yarkov2>
##$AMP= (0..31)
100 100 100 100 100 100 100 100 100 100 100 100 100 100 100 100 100 100 
100 100 100 100 100 100 100 100 100 100 100 100 100 100 
##$AQSEQ= 0
##$AQ_mod= 1
##$AUNM= <au_zg>
##$AUTOPOS= <>
##$BF1= 200.13
##$BF2= 200.13
##$BF3= 200.13
##$BF4= 200.13
##$BF5= 200.13
##$BF6= 200.13
##$BF7= 200.13
##$BF8= 200.13
##$BYTORDA= 1
##$CFDGTYP= 0
##$CFRGTYP= 5
##$CHEMSTR= <none>
##$CNST= (0..31)
1 1 145 1 1 1 1 1 1 1 1 1 1 1 1 1 1 1 1 1 1 1 1 1 1 1 1 1 1 1 1 1 
##$CPDPRG= <>
##$CPDPRG1= <>
##$CPDPRG2= <>
##$CPDPRG3= <>
##$CPDPRG4= <mlev>
##$CPDPRG5= <mlev>
##$CPDPRG6= <mlev>
##$CPDPRG7= <mlev>
##$CPDPRG8= <mlev>
##$CPDPRGB= <>
##$CPDPRGT= <>
##$D= (0..31)
0 0.7 0 0 0 0 0 0 0 0 0 0.03 0 0 0 0 0 0 0 0 0 0 0 0 0 0 0 0 0 0 0 0 
##$DATE= 1761632220
##$DBL= (0..7)
120 120 120 120 120 120 120 120 
##$DBP= (0..7)
150 150 150 150 150 150 150 150 
##$DBP07= 0
##$DBPNAM0= <>
##$DBPNAM1= <>
##$DBPNAM2= <>
$$ [...]
##$SUBNAM3= <"">
##$SUBNAM4= <"">
##$SUBNAM5= <"">
##$SUBNAM6= <"">
##$SUBNAM7= <"">
##$SUBNAM8= <"">
##$SUBNAM9= <"">
##$SW= 18.0517328524113
##$SWIBOX= (0..15)
0 0 2 0 0 0 0 0 0 0 0 0 0 0 0 0 
##$SW_h= 3612.71676300578
##$TD= 16384
##$TD0= 1
##$TE= 0
##$TE2= 300
##$TE3= 300
##$TEG= 300
##$TL= (0..7)
0 120 120 120 120 120 120 120 
##$TP= (0..7)
150 150 150 150 150 150 150 150 
##$TP07= 0
##$TPNAME0= <>
##$TPNAME1= <>
##$TPNAME2= <>
##$TPNAME3= <>
##$TPNAME4= <>
##$TPNAME5= <>
##$TPNAME6= <>
##$TPNAME7= <>
##$TPOAL= (0..7)
0.5 0.5 0.5 0.5 0.5 0.5 0.5 0.5 
##$TPOFFS= (0..7)
0 0 0 0 0 0 0 0 
##$TUNHIN= 0
##$TUNHOUT= 0
##$TUNXOUT= 0
##$USERA1= <user>
##$USERA2= <user>
##$USERA3= <user>
##$USERA4= <user>
##$USERA5= <user>
##$V9= 5
##$VALIST= <valist>
##$VCLIST= <CCCCCCCCCCCCCCC>
##$VD= 0
##$VDLIST= <DDDDDDDDDDDDDDD>
##$VPLIST= <PPPPPPPPPPPPPPP>
##$VTLIST= <TTTTTTTTTTTTTTT>
##$WBST= 1024
##$WBSW= 4
##$XGAIN= (0..3)
0 0 0 0 
##$XL= 0
##$YL= 0
##$YMAX_a= 59788
##$YMIN_a= -38310
##$ZGOPTNS= <>
##$ZL1= 120
##$ZL2= 120
##$ZL3= 120
##$ZL4= 120
##$ABSF1= 15.48356
##$ABSF2= -2.56829
##$ABSG= 5
##$ABSL= 3
##$ALPHA= 0
##$AQORDER= 0
##$ASSFAC= 0
##$ASSFACI= 0
##$ASSFACX= 0
##$ASSWID= 0
##$AUNMP= <proc_1d>
##$AZFE= 0.1
##$AZFW= 0.1
##$BCFW= 0
##$BC_mod= 2
##$BYTORDP= 0
##$COROFFS= 0
##$CY= -3
##$DATMOD= 1
##$DC= 0
##$DFILT= <>
##$DTYPP= 0
##$F1P= 0
##$F2P= 0
##$FCOR= 1
##$FTSIZE= 16384
##$FT_mod= 6
##$GAMMA= 0
##$GB= 0
##$INTBC= 1
##$INTSCL= 3.241238e-09
##$ISEN= 128
##$LB= 0.25
##$LEV0= 0
##$LPBIN= 0
##$MAXI= 10000
##$MC2= 0
##$MEAN= 0
##$ME_mod= 0
##$MI= 1.114404
##$NCOEF= 0
##$NC_proc= -9
##$NLEV= 6
##$NOISF1= 3.799351
##$NOISF2= 2.8
##$NSP= 0
##$NTH_PI= 0
##$NZP= 0
##$OFFSET= 15.50341
##$PC= 1
##$PHC0= -4584.799
##$PHC1= 12.02191
##$PH_mod= 1
##$PKNL= yes
##$PPARMOD= 0
##$PSCAL= 0
##$PSIGN= 0
##$REVERSE= no
##$SF= 200.130003660646
##$SI= 16384
##$SIGF1= 3
##$SIGF2= 2
##$SINO= 0.751879
##$SIOLD= 32768
##$SREGLST= <19F.Aceton>
##$SSB= 0
##$STSI= 16384
##$STSR= 0
##$SW_p= 3612.71676300578
##$SYMM= 0
##$S_DEV= 0
##$TDeff= 16384
##$TDoff= 0
##$TI= <>
##$TILT= no
##$TM1= 0
##$TM2= 0
##$TOPLEV= 0
##$USERP1= <user>
##$USERP2= <user>
##$USERP3= <user>
##$USERP4= <user>
##$USERP5= <user>
##$WDW= 1
##$XDIM= 16384
##$YMAX_p= 538067748
##$YMIN_p= -1736370
$$ End of Bruker specific parameters
$$ ---------------------------------
##NTUPLES= NMR SPECTRUM
##VAR_NAME=  FREQUENCY,     SPECTRUM/REAL,   SPECTRUM/IMAG
##SYMBOL=    X,             R,               I
##VAR_TYPE=  INDEPENDENT,   DEPENDENT,       DEPENDENT
##VAR_FORM=  AFFN,          ASDF,            ASDF
##VAR_DIM=   16384,         16384,           16384
##UNITS=     HZ,            ARBITRARY UNITS, ARBITRARY UNITS
##FACTOR=    0.220516191357247, 1,           1
##FIRST=     3102.69756796771, 0,            0
##LAST=      -510.019195038073, 0,           0
##MIN=       -510.019195038073, -1736370,    0
##MAX=       3102.69756796771, 538067748,    0
$$ Real data points
##PAGE= N=1
##DATA TABLE= (X++(R..R)), XYDATA
$$ [...]
9426A359086L12403L3437j26891J50760M4941K40937j7430J09408Q5314j72876
9416B019089q1500K21379Q8353J2288j40466L486K07133j20042N0486J88653J54368
9405B603227L4280L41444K20516j57221m2337k23272o5210Q880o6954L85989J30714
9394C170056l49481m1679O6608L78269J16301l8267J33592J43857K19364K08254
9384D006874J80390K70540N54123P8499L06146O38848N19570N46386N85747N59943
9374H247066O35241R08689J131438J119837Q05069J066806J106813R26524J080005
9365A7027488R36780O90666M75748J15877l34147m07396k91865o49481n07554
9356A7056116l54444j76040k94655l0573K46502N27445N62570N92982R56114P43441
$$ y = [1359086, 1671489, 1704926, 1578035, 1728795, 1773736, 2014673, 1997243, 2106651, 2191965, 2019089, 1937589, 2158968, 2247321, 2259609, 2119143, 2122629, 2329762, 2209720, 2260206, 2448859, 2603227, 2637507, 2978951, 3199467, 3042246, 2999909, 2776637, 2711427, 2720307, 2653353, 3039342, 3170056, 2820575, 2778896, 2845504, 3223773, 3340074, 3301807, 3435399, 3579256, 3798620, 4006874, 4187264, 4457804, 5011927, 5090426, 5396572, 6035420, 6554990, 7101376, 7687123, 8247066, 8882307, 9790996, 10922434, 12042271, 12847340, 13914146, 15020959, 15947483, 17027488, 17964268, 18654934, 19130682, 19246559, 18912412, 18505016, 18213151, 17563670, 17056116, 16701672, 16525632, 16230977, 16200404, 16446906, 16974351, 17536921, 18129903, 19086017, 19829458]
9346A9829458O79537N87499K74770j37750j76889o23178m60024o34481r33578
9337A8405364o78101m42887k31764l47466n500J97481L97548P42796O65083O51590
9327A9354144O91694M23352R71995P94137O50898q375k22726n82490n71593q15182
9317B0685854q82246n36362p87940l91920l70633j28750M00602K89825M60005
9308A8738435M57805M70013M67907K22025L32880j05391n08048p99692r26837
9299A8349097j198907j180553j280929j304187j509653j125162j046189r04725
9291H798792p76251p83756n47914l43627k89563p48288m53720j44943k72049N3151
9281D491832m11967l55332k40514l82230k14365j9407j01231n542l14340j00597
$$ y = [19829458, 20508995, 21096494, 21371264, 21233514, 21056625, 20433447, 19973423, 19338942, 18405364, 17727263, 17284376, 17052612, 16705146, 16699646, 16897127, 17294675, 18037471, 18702554, 19354144, 20045838, 20469190, 21441185, 22235322, 22886220, 22877845, 22655119, 22072629, 21501036, 20685854, 19803608, 19267246, 18479306, 18087386, 17716753, 17588003, 17988605, 18278430, 18738435, 19196240, 19666253, 20134160, 20356185, 20689065, 20583674, 20075626, 19275934, 18349097, 17150190, 15969637, 14688708, 13384521, 11874868, 10749706, 9703517, 8798792, 8022541, 7238785, 6690871, 6347244, 6057681, 5309393, 4855673, 4710730, 4438681, 4491832, 4079865, 3724533, 3484019, 3101789, 2887424, 2868017, 2766786, 2761244, 2446904, 2346307]
9271B346307M5543l72305j38373j1553m02647J35637J63687K0180k67041K25262
9261A744697q9680m04343J01462J44965p7368j05106n3379Q3114P3508Q4842l02322
9250A200390O4325j21702q0981K99027J57912P8651k68211l7810j14890K75971
9240A452682j71642k74297o1266L19969q7626J7570k40417p5678K33680J66441
9230A279416j54902J25319o5099l74425n8180M3139N2354j20551J2181j73835
9220E65417K46714R5526j0078P5214L13444k26217k382J05129j95031Q7415j07479
9209I47672n7786l00147R3353K22198Q2361m02282J05697J65161K23336Q0081
9199A159644n5877k7312n4632J77879j17431Q5240k3351J57435M3852j35221l1061
$$ y = [2346307, 2391850, 2019545, 1881172, 1869619, 1466972, 1602609, 1766296, 1786476, 1519435, 1744697, 1655017, 1250674, 1352136, 1497101, 1419733, 1314627, 1261248, 1344362, 1417870, 1502712, 1200390, 1264715, 1143013, 1062032, 1361059, 1518971, 1597622, 1329411, 1291601, 1176711, 1452682, 1281040, 1006743, 945477, 1265446, 1177820, 1195390, 954973, 879295, 1112975, 1279416, 1124514, 1249833, 1184734, 810309, 752129, 795268, 847622, 727071, 739252, 565417, 812131, 907657, 897579, 972793, 1286237, 1060020, 1057638, 1162767, 967736, 1055151, 947672, 889886, 589739, 683092, 905290, 987651, 585369, 691066, 856227, 1079563, 1159644, 1103767, 1076455, 1021823, 1199702, 1082271, 1167511, 1144160, 1301595, 1345447, 1210226, 1179165]
9188A179165j43062k07346p9268K76016R0297r9310L54133m2675m02809P2264
9178I97405j23480J76422K53004j47159j29842O8104m9017q5296j57065M5564
9168H48640N5611p7810P8049J39792j99279l4965j14087k8772M8896j35625K97802
9157H78252J60893O3021j10834j19826q5365R5277J3281J61650K40672j25295
9147A171726k76337J92556k8596j41665j76597J46916K5179j20335K30919j75630
9137H48136K60496K9882k04211j62388P4829J53069J56187O6125K3961k13796
9127A032290P491J20371p0848k47353K99686r8962n0132n4337J39368R3319j21929
9116A048964J65182K518M9580J27983l10311n8321R6285k01817j7433K47417j36945
$$ y = [1179165, 1036103, 828757, 749489, 1025505, 1115802, 1016492, 1370625, 1327950, 925141, 997405, 873925, 1050347, 1303351, 1156192, 1026350, 1094454, 1045437, 960141, 803076, 848640, 904251, 826441, 904490, 1044282, 845003, 810038, 695951, 667179, 716075, 580450, 878252, 1039145, 1102166, 991332, 871506, 786141, 881418, 894699, 1056349, 1297021, 1171726, 895389, 1087945, 1059349, 917684, 741087, 888003, 913182, 792847, 1023766, 848136, 1108632, 1138514, 934303, 771915, 846744, 999813, 1156000, 1222125, 1246086, 1032290, 1039781, 1160152, 1089304, 841951, 1141637, 1042675, 992543, 938206, 1077574, 1170893, 1048964, 1214146, 1216664, 1266244, 1394227, 1083916, 1025595, 1121880, 920063, 902630, 1150047, 1013102]
9105A013102j69059M2255K7304K27180m606J24129m5069K79431J616J44222j23391
9094A517114n4844n20272j66904J91422J95107j33198K9918R5410l6712O666j7127
9083A106580J59255J90229J30881k18082p3351L15139j8799k395q7109Q7417o0519
9072A529246j44271N9998L11109M3540r5099k6663j36788M3396j43457r4562N2
9061A346501J86687J43440j06939r9779P2377j00731o4185K81082p92k57939j3748
9050A385974J63054K01971J40544j35908j23156l51886m6430J61312J06276J04998
9040A606749K65476p5656k2091m700N987l7171r9242J83370J35708M0901K8963
9029B028294J16492O2220N0306j2343K64384j42593k9859P0944j04110j09320
$$ y = [1013102, 844043, 886298, 913602, 1140782, 1136176, 1260305, 1215236, 1494667, 1496283, 1640505, 1517114, 1462270, 941998, 775094, 966516, 1161623, 1028425, 1058343, 1153753, 1117041, 1123707, 1106580, 1265835, 1456064, 1586945, 1368863, 1295512, 1610651, 1591852, 1589457, 1502348, 1589765, 1529246, 1384975, 1444973, 1756082, 1799622, 1704523, 1677860, 1541072, 1584468, 1441011, 1346449, 1346501, 1533188, 1676628, 1569689, 1469910, 1542287, 1441556, 1377371, 1658453, 1657661, 1399722, 1385974, 1549028, 1750999, 1891543, 1755635, 1632479, 1280593, 1234163, 1395475, 1501751, 1606749, 1872225, 1796569, 1774478, 1769778, 1775765, 1738594, 1639352, 1822722, 1958430, 1999331, 2028294, 2144786, 2207006, 2257312, 2244969, 2509353, 2366760, 2336901, 2407845, 2303735, 2194415]
9019B194415J54917N5930k0139j94718J78188k1538j6801J16441o5012m4292J87777
9008B525168J70241J27000j64100L429p095p9494Q3761K13308L1190J87927J4950
8997C106285J11387J11193Q7995K76678J28268j0216K12428Q5588K43456Q1561
8987D434623J24695M39638M49791K91999L29346L75100M54722R68899O15231P86742
8977I270786N78197O39283J183024J401973J187350J534079J714818J642824J593125
8968B0745459J526235J405221J172931Q58402P49209k3778k69310R1615o0380
8959B6195604j8386J19165K9632J08555r4142n92287r97730j033666j409948j804006
8949B0502791j561283j610997j449168j277384j086669p43071o59522o76945n45027
$$ y = [2194415, 2349332, 2405262, 2385123, 2190405, 2368593, 2347055, 2330254, 2446695, 2381683, 2337391, 2525168, 2695409, 2822409, 2658309, 2661738, 2654643, 2575149, 2658910, 2872218, 2903408, 3091335, 3106285, 3217672, 3328865, 3416860, 3693538, 3821806, 3811590, 4024018, 4109606, 4353062, 4434623, 4559318, 4998956, 5448747, 5740746, 6070092, 6445192, 6899914, 7868813, 8484044, 9270786, 9848983, 10488266, 11671290, 13073263, 14260613, 15794692, 17509510, 19152334, 20745459, 22271694, 23676915, 24849846, 25708248, 26457457, 26433679, 26164369, 26255984, 26195604, 26177218, 26296383, 26326015, 26434570, 26340428, 25748141, 24750411, 23716745, 22306797, 20502791, 18941508, 17330511, 15881343, 14603959, 13517290, 12774219, 12114697, 11437752, 10892725]
8940A0892725o3082K22247k33997k05394M75997M02074N38816L90543N41937P42968
8930A3704834J211752J057553J119465J542395J576970J727222J551227J539071
8922B5030489J146846M40803k00021k65108M026k56069m17889J65273j75807n44056
8912B4928487q2890o7287o07277q81576j362095j748877j828921j611649j664567
8903A5073348j686927j276242j117131j271884r58349p71621p78530o13573n92991
8894F006100m37569j43002l56866l34280m33987o4057j16078l11111l85933j41552
8884C281665m97255o4852O1347j90220j29303k15552J08260j49327k23869J24491
8874B105385j5422M7093J12885j64066j31524k45283J04358j81704J56323n3545
$$ y = [10892725, 10829643, 11051890, 10817893, 10612499, 11088496, 11490570, 12029386, 12419929, 12961866, 13704834, 14916586, 15974139, 17093604, 18635999, 20212969, 21940191, 23491418, 25030489, 26177335, 26618138, 26418117, 26153009, 26157035, 25900966, 25483077, 25648350, 25472543, 24928487, 24845597, 24778310, 24171033, 23289457, 21927362, 20178485, 18349564, 16737915, 15073348, 13386421, 12110179, 10993048, 9721164, 8762815, 7991194, 7212664, 6599091, 6006100, 5568531, 5425529, 5068663, 4734383, 4300396, 4236339, 4120261, 3809150, 3423217, 3281665, 2784410, 2719558, 2780905, 2590685, 2461382, 2245830, 2354090, 2204763, 1980894, 2105385, 2089963, 2137056, 2249941, 2085875, 1954351, 1709068, 1813426, 1631722, 1788045, 1734500]
8864A734500J26553p8109K85608k19580J22917n2001l33689P8994P8677K52109
8854A995979j79351J10965J69112j32468l86727k1613J98744O8707n0154N3959
8844A827153o2546Q0863J19853l0809j97943j05639N8883J5829J55512l9431k03039
8833A618686M4071J3884k9362j99505J8331K43126j47352P035j43670J33326j6697
8822A541873J60498J04640O5147q7283J43534J84201j60118J73745n9154N1796
8812B118879k47668K54421o8887j32766J42017p7917J56468Q0350j05986O347
8802B125258j08789N9865j3535R8361K33827k28746J93744K46219O1444j1692
8792B655956l2702k39483n9714K04667M12455l7850j12512K3396m950K32514J0292
$$ y = [1734500, 1861053, 1782944, 2068552, 1848972, 1971889, 1919888, 1586199, 1665193, 1743870, 1995979, 1816628, 1927593, 2096705, 1964237, 1577510, 1555897, 1754641, 1823348, 1773194, 1827153, 1764607, 1845470, 1965323, 1934514, 1736571, 1630932, 1689815, 1705644, 1861156, 1821725, 1618686, 1662757, 1676641, 1647279, 1447774, 1466105, 1709231, 1561879, 1568914, 1425244, 1558570, 1541873, 1702371, 1807011, 1872158, 1784875, 1928409, 2112610, 1952492, 2126237, 2067083, 2118879, 1871211, 2125632, 2056745, 1923979, 2065996, 1988079, 2144547, 2224897, 2118911, 2125258, 2016469, 2076334, 2062799, 2161160, 2394987, 2166241, 2359985, 2606204, 2667648, 2655956, 2623254, 2383771, 2324057, 2528724, 2941179, 2903329, 2790817, 2814213, 2809263, 3041777, 3052069]
8781C052069J46986J05654K53591K22340M65347L45106L54455O5975M32445M12310
8771E856278M59077M76969N81039N43886M88552Q25088R40215N97301J069116
8762A1837521R94546P50504N31742L47135N35479M439r4769k61612n8809M7518
8752A4633694n624o0466j07328l33920r7235j28832l96883n85232n12715n69515
8742A1835944m20838p75025o44414l49028l20028k61586p5362L19142j19137J68431
8732I358099L56710N42058N18808P71072Q17759P23563R99025J078966J335209
8723A6501269J493695J310051J148893J684264J228706R45135P72275N63269L39335
8714B5986892k11414m38831l29993j43238l89588m55138j17770n26058p02217
$$ y = [3052069, 3199055, 3304709, 3558300, 3780640, 4245987, 4591093, 4945548, 5011523, 5443968, 5856278, 6315355, 6792324, 7373363, 7917249, 8405801, 9230889, 10171104, 10768405, 11837521, 12832067, 13582571, 14114313, 14461448, 14996927, 15001366, 14906597, 14644985, 14586176, 14633694, 14628070, 14567604, 14460276, 14126356, 14029121, 13900289, 13503406, 12918174, 12405459, 11835944, 11415106, 10640081, 9995667, 9646639, 9326611, 9065025, 8989663, 9308805, 9189668, 9358099, 9714809, 10256867, 10775675, 11546747, 12364506, 13088069, 14087094, 15166060, 16501269, 17994964, 19305015, 20453908, 22138172, 23366878, 24312013, 25084288, 25647557, 25986892, 25775478, 25336647, 25006654, 24863416, 24473828, 24018690, 23900920, 23374862, 22672645]
8705B2672645n76187o21856j081083j290897j350174j403163j219765j304231
8697A3825289j248151r21460q41687o80969q33708o44320k41068j73460J61279
8688H401745K55752J16577P7319K37219K29778K04794M61793M46147P97534Q59970
8678A2088628M17902N05405L29103L29297m9368m34468k26122m63477j28023j96226
8668A2172651k46703j07668k4566m08120r8716m35884r76533n16202p46154p98200
8658G813905m36973n34908r87676l49296m53516o96426l43883l12585l30568k80975
8648C087099q4093j12511l30089p4446r6943j16909q0578k24001l05523J44080
8638A806086J35802k86424j53778j32667k20460O8287K24987j2751j84463j41548
$$ y = [22672645, 22096458, 21474602, 20393519, 19102622, 17752448, 16349285, 15129520, 13825289, 12577138, 11655678, 10813991, 10133022, 9299314, 8654994, 8413926, 8240466, 8401745, 8657497, 8774074, 8851393, 9088612, 9318390, 9523184, 9984977, 10431124, 11228658, 12088628, 12506530, 13011935, 13341038, 13670335, 13620967, 13186499, 12960377, 12496900, 12368877, 12172651, 11925948, 11818280, 11793714, 11385594, 11286878, 10850994, 9874461, 9358259, 8612105, 7813905, 7376932, 6842024, 5854348, 5505052, 5051536, 4355110, 4011227, 3698642, 3368074, 3087099, 3003006, 2890495, 2560406, 2485960, 2389017, 2272108, 2191530, 1967529, 1662006, 1806086, 1941888, 1655464, 1501686, 1369019, 1148559, 1216846, 1441833, 1429082, 1244619, 1103071]
8628A103071R6829R4904k80537j82526L34087n146m26087q4569P4472J3080k68485
8617D69093J27173J24112j63462j2497L7889n9239J78313k86447J18886K15355
8607G49176j00944K08627k13192j37253K42650j08919K7337k8699q9228J81528
8597G31083k3003Q3682k3520o0250N3917o3052j8123J39623j15794q8394j96179
8586D19990J37480K49570j99079K18156j76192j53284L77568k41884q2248j8274
8576E31803j38067l1388N0618J82623j10296J4201K80128K8322p4324k26647n5477
8565D51496K716n1012k7804k22325K04061p5372R7591J12071r1943k33690J54265
8554C20054n7039K5336K34127L52291j69433J7356l6044p5880j0967R3489j49673
$$ y = [1103071, 1199900, 1294804, 1014267, 831741, 1165828, 1160682, 734595, 650026, 724498, 737578, 469093, 596266, 720378, 556916, 544419, 582308, 523069, 701382, 414935, 533821, 749176, 648232, 856859, 643667, 506414, 749064, 640145, 667482, 638783, 549555, 731083, 708080, 791762, 768242, 707992, 761909, 698857, 680734, 820357, 704563, 616169, 419990, 557470, 807040, 607961, 826117, 649925, 496641, 874209, 632325, 550077, 531803, 393736, 362348, 412966, 595589, 485293, 499494, 779622, 807944, 733620, 506973, 451496, 454212, 403200, 375396, 153071, 357132, 281760, 379351, 491422, 399479, 165789, 320054, 263015, 288351, 522478, 874769, 705336, 722692, 686648, 610768, 599801, 693290, 543617]
8543E43617k23781o7550j00035K21026j22815M9692m43864K30719K5064J72487
8533B84560n6013k4806j15626J82877R7575J42812M402j05539k56715p8171L6934
8522A12290K05035k2737R8995R1364n2505m10313M8884J34783n5923k47031O8466
8511b8692J56371n4553J11358K2111o5761n8291n4446P2610k15879q0483M08271
8500B12616j66325K49435m562l7227k80783R8687l3267n4493P7759K46793j02999
8489B05634J10766J53880j23666j61618j49924n4541N9042m2906J17191K00299
8479C14157j45973j65128k0225L05865o3026k28246Q5798N6438O6215J29958k05460
8468A30373j85818J61675n1751j36760J55412k64586j09693L63831j03724j6529
$$ y = [543617, 319836, 252286, 152251, 373277, 250462, 300154, -143710, 87009, 112073, 284560, 228547, 203741, 88115, 270992, 368567, 511379, 515781, 410242, 153527, 75356, 112290, 317325, 294588, 393583, 484947, 432442, 22129, 71013, 205796, 149873, -97158, -28692, 127679, 73126, 184484, 206595, 140834, 82543, 28097, 100707, -115172, -195655, 212616, 46291, 295726, 291164, 253937, -26846, 71841, 38574, -15919, 61840, 308633, 205634, 316400, 470280, 346614, 184996, 35072, -19469, 39573, -3333, 113858, 314157, 168184, 3056, -17169, 288696, 225670, -2576, 83222, 139660, 205875, 335833, 130373, -55445, 106230, 54479, -82281, 73131, -191455, -301148, 62683, -41041, -57570]
8458e7570j85298r230Q8540L4428j12112J4635K17909l6065j0230O5343L21919
8447C32269n7426m529M3313l75250j46389J05321Q3689P0313o956k9094j38497
8436a23236K07052J04327l9009J21891j24063n1929k44404O4641J59454O5681
8426A40405p7838J66551j54335l60223K55442P073q7400K92518k6352j79408l21668
8415c45235K24555O7409k2589J908R9474K1936l99682J04731R0841k4610J87458
8404F196J52643k96410R7200N9524j39639l1149L40508p3369k00150J21396M8938
8393H5688J19327O5625k02106k33948L64757j90147q0544L86883p5764k09189
8383C0582n1891J47494q8666j00802K53863l3150J8939K43795l49311l03650O976
$$ y = [-57570, -242868, -252098, -163558, -129130, -241242, -226607, -8698, -44763, -54993, 10350, 332269, 274843, 270314, 313627, -61623, -208012, -102691, -19002, 51311, 44355, 15261, -123236, 83816, 188143, 149134, 271025, 146962, 95033, -149371, -84730, 74724, 140405, 62567, 229118, 74783, -285440, -29998, -22925, -110325, 182193, 155841, -23567, -345235, -120680, -53271, -75860, -73952, 25522, 47458, -352224, -247493, -156652, -181262, 6196, 158839, -137571, -40371, 19153, -120486, -151635, 188873, 115504, -84646, 36750, 85688, 205015, 270640, 68534, -165414, 199343, 9196, -71348, 315535, 239771, 30582, -21309, 126185, 37519, -63283, 190580, 157430, 176369, 420164, 70853, -232797, -225821]
8372b25821m3884M52216K44317k74676k59894j51196N6476m81856M5373K70449
8362c68496K22022K62769l97820J96907K2278l7711J12396k16103q4910q5947
8352c74615K05607n474r7542L6984L3276Q3905R8714k85686k8954N6064J96788
8341h0933J2996l9739J59778l23559O5921n5298Q6031m8412j27617K29369J3160
8330a08303K448k664o3260n5768J18101m7021K41503k8035k48356O4437L70534
8319B43616J2376l79037j41259K55857j14155L9268N509k12726j60122k9500J99487
8308b80686l8102J1725J42709M6761J89607k0832l71711j56J52855m6474j29081
8297c43385n0406K70569l9432K88928l47027j07605P8900r1273R1171P0612R0769
$$ y = [-225821, -269705, 182511, 426828, 152152, -107742, -258938, -202462, -684318, -638945, -368496, -146474, 116295, -281525, -84618, -62340, -100051, 12345, -203758, -288668, -374615, -169008, -174482, -272024, -235040, -201764, -117859, -19145, -304831, -333785, -277721, -80933, -67937, -107676, 52102, -271457, -205536, -260834, -174803, -223215, -350832, -121463, -108303, -105855, -108519, -171779, -227547, -109446, -156467, 85036, 57001, -191355, -126918, 243616, 255992, -123045, -264304, -8447, -122602, -83334, -77825, -290551, -450673, -480173, -280686, -318788, -307063, -164354, -117593, 72014, 51182, -320529, -320685, -167830, -214304, -343385, -393791, -123222, -162654, 126274, -220753, -328358, -249458, -340731, -249560, -178948, -88179]
8286h8179m35333M3142J67811m4873p0668n6163M7675n095K29822J95019m03594
8275d20436j43224J52194j405K7626J16108r0389K00028j76377j12687J65427
8265b83135J04245k52340J58775j00198J42595j05584j68123J6439J47086l6839
8255c77079o9377p9849J37819L2344L896J82205j18695J86009k1261O9175J76047
8244A21234o2000j92281j37625P3042J40252k0842m7043k4316n2957J79276R3837
8233G0577l9898P5553j71466M6522q4288N0689J95475k60989k96164J62571j2566
8222b63984m2917J3982l1380J70965K07603l22090j30523Q262j44429M9514M02820
8211h2177K69333k51464J98640l74785k01951P601K46349J26120j3968O081K0947
$$ y = [-88179, -523512, -480370, -312559, -357432, -428100, -484263, -436588, -441683, -211861, -16842, -420436, -563660, -411466, -412871, -385245, -269137, -359526, -159498, -335875, -448562, -283135, -178890, -431230, -272455, -372653, -230058, -335642, -503765, -487326, -340240, -377079, -446456, -526305, -388486, -356142, -352246, -170041, -288736, -102727, -123988, -54813, 121234, 59234, -133047, -270672, -197630, -57378, -78220, -125263, -149579, -202536, -23260, 70577, 30679, 106232, -65234, -18712, -103000, -52311, 143164, -117825, -413989, -251418, -263984, -306901, -292919, -324299, -153334, 54269, -267821, -398344, -390082, -534511, -484997, -82177, 187156, -64308, 134332, -240453, -442404, -434803, -188454, -62334, -76302, -70221, -49274]
8200d9274R9850k64830Q5543M2865j85509N685j43207n55327J818712J83366j007449
8189C0425J51960o1926j2386k81134r7163P2795L87764J67325l19345J27098n5049
8178A10364k17217j2247k38711L26364r9421j61627j44625j9900O3788K23991
8168a69241J12195K68801M672m48101j28823J24513K19914j64054j28914j03114
8158d12152q2908J29985J66929K23989q5704j78597k96962J07480J17838j91287
8148e01389K41130k30640q7321J78612o5460K83805q7460j07802k27089n2460
8138f56074L05527J54790J6372j30858J63707J0905l50687o5848K21990K0776
8128c09400o5311P5948j37028m9419n7895K3034R9853K15397N2157R5489q118
$$ y = [-49274, 50576, -214254, -128711, -85846, -271355, -265670, -408877, -964204, 854508, 1037874, 30425, 182385, 120459, 108073, -173061, -270224, -197429, 190335, 357660, 38315, 165413, 110364, -106853, -119100, -357811, -31447, -130868, -292495, -437120, -457020, -393232, -169241, -57046, 211755, 216427, -231674, -360497, -235984, -16070, -180124, -309038, -412152, -495060, -365075, -198146, 25843, -59861, -238458, -535420, -427940, -310102, -501389, -260259, -490899, -578220, -399608, -465068, -181263, -268723, -376525, -603614, -656074, -350547, -195757, -179385, -310243, -146536, -135631, -486318, -552166, -330176, -309400, -374711, -298763, -435791, -485210, -543105, -520071, -420218, -204821, -152664, -57175, -65293]
8117f5293n21995P2049J74073K17919k70515R0647R774k63224K50201Q5255j34287
8106c55396J36547j91170J20649L9146J19693p2808K8461n4459j70865J01297
8096b98905P1576j68030j82169L94453k7771j84252J34912J5714N4124O3229m3740
8085a70859j60236n2201O0640q9511k20778o3614K81213l4974M307K1959R0750
8074c33304r1803j12408J08677m7504m2572J29427J46706Q965p7481j40329j87858
8063f39484k6009j38464J7067J89300k44570j11376L9689M36974J25560K6797
8053c24516J21599j62666J17132N1252p081K13369k20179j56277N5175O9325p7461
8042c20328j25406J46913K03384j7210k74116K84835K8893k52025j80040J84710
$$ y = [-65293, -587288, -515239, -341166, -123247, -393762, -303115, -293341, -556565, -306364, -221109, -355396, -218849, -410019, -289370, -250224, -130531, -203339, -174878, -229337, -400202, -298905, -227329, -395359, -577528, -183075, -210846, -395098, -260186, -244472, -190348, -127119, -170859, -331095, -383296, -322656, -412167, -632945, -696559, -415346, -450320, -446013, -424054, -333304, -425107, -537515, -428838, -476342, -518914, -389487, -242781, -233816, -311297, -451626, -639484, -665493, -803957, -786890, -597590, -842160, -953536, -913847, -476873, -351313, -324516, -202917, -365583, -248451, -197199, -204280, 9089, -211090, -367367, -312192, -242867, -320328, -445734, -298821, -95437, -112647, -386763, -101928, -73035, -325060, -505100, -320390]
8032c20390K02145L51838l21210J119p3647J76788K14099l95196l4221p5493j96190
8021d70358j48071K55190L38601K49958j31886l23191J3137p8181J83401K4160
8011h7240m56146K090Q8676m9350K09444p5971m2672j62547J50202K74630k59256
8000d08140j46573N4883J30266K43355K0979j59535m2541k64804K1820J65874
7990c84416J71367J31472k77239m5146q150j48735J29797N901O0688L3822J43204
7979a87435j15831j43908J19527P9201P0503j23510k97146j38167L83223R9754
7969b53789K6102R3520j50516j06940j4465Q9440k3959k02756r0589K95626k36860
7958e75186J55826j00679q4868L41784Q8852L08890r4822j79374j63052n7793
$$ y = [-320390, -118245, 233593, -87617, -86498, -160145, 16643, 230742, -164454, -198675, -274168, -470358, -618429, -363239, -24638, 225320, 93434, -229757, -216620, -294801, -111400, -87240, -543386, -541296, -452620, -501970, -292526, -368497, -411169, -573716, -423514, -148884, -408140, -554713, -499830, -369564, -126209, -105230, -264765, -307306, -572110, -550290, -384416, -213049, -81577, -358816, -403962, -412112, -560847, -431050, -425149, -364461, -330639, -187435, -303266, -447174, -327647, -248446, -177943, -301453, -598599, -736766, -353543, -253789, -227687, -134167, -284683, -391623, -406088, -316648, -340607, -543363, -633952, -338326, -575186, -419360, -520039, -604907, -263123, -174271, 134619, 39797, -139577, -302629, -360422]
7948c60422M074J20976k7605k04754J15288P3099N4490q4164m0645O3465O242
7937b79956j5601j14552j9885J31024q2601J15849J06658k86148K20257J27096
7927i7859k15286p6961J4205j8745L3219O631M2753K41277j65995R3832q1205
7916b24134l6195j26811j37143K0807L33618m9934J54799q4664k09610P9952N5713
7905b23602l8315j11708o1226O696m8095j16792K43515j02018M024j8628j03219
7894e69368L8873K48886j30643J95640l26220n1149L66780K20799j98962k18878
7884d24242j11659Q9509J55004L15554m13501r5115J94535k07429J44308J14037
7874b38999J2004k4195L920p8606R1568J15611p6143j81619L6184j74980n7312
$$ y = [-360422, -356348, -235372, -262977, -467731, -352443, -279344, -224854, -309018, -349663, -286198, -279956, -295557, -410109, -429994, -298970, -381571, -265722, -159064, -445212, -224955, -97859, -313145, -390106, -375901, -394646, -361427, -354796, -312043, -70766, -236761, -142929, -224134, -260329, -387140, -524283, -503476, -169858, -219792, -64993, -149657, -359267, -279315, -223602, -261917, -373625, -434851, -428155, -476250, -593042, -349527, -451545, -447521, -466149, -569368, -530495, -281609, -412252, -216612, -542832, -593981, -227201, -6402, -205364, -424242, -535901, -446392, -291388, 24166, -389335, -484450, -289915, -497344, -353036, -238999, -226995, -251190, -247270, -325876, -234308, -118697, -194840, -376459, -340275, -515255, -572567]
7863e72567j46535N637J76102J58463N41j7409k16196L72906n2323j14298k6525
7852d32204j24855K051J76569L07687k16965r8771j03565K83700J11455n5795
7842a50693k41830j7696J89515k03805m9593k7260Q3124K20333j32777j71990
7832e02672J5615J10469J02752j22207q0756m6009K88074N2429N9934J72080O1274
7821A10983l32135l71318p6739J82078P632K42606j97493P6068j19356l62386
7811h40060q96310J25372J214533J1293L79099k33690k17595J25435J84537k16619
7801c64005r924k84549J60720j38049K04165K50092l17067J82574J86627k75499
7791d04915j9006M91218n992l94397m2765M7579N0477l68826O3304K6544r3767
$$ y = [-572567, -719102, -713465, -537363, -378900, -378359, -395768, -611964, -239058, -291381, -405679, -432204, -557059, -555008, -378439, -70752, -287717, -386488, -490053, -206353, -94898, -150693, -392523, -410219, -220704, -424509, -474102, -501362, -418238, -197905, -330682, -502672, -487057, -376588, -273836, -396043, -476799, -522808, -234734, -182305, -122371, 49709, 110983, -221152, -592470, -669209, -487131, -479499, -236893, -434386, -358318, -477674, -840060, -1736370, -1610998, -396465, -385172, -6073, -239763, -457358, -331923, -147386, -364005, -373929, -658478, -497758, -635807, -431642, -181550, -498617, -316043, -129416, -404915, -423921, 67297, 61305, -333092, -375857, -328278, -277801, -646627, -583323, -556779, -650546]
7780f50546J00683j78265J18563J01208L6750j8369J23581j7024L1977j13053
7770d64495J09813l85653J50736O7170J15226K67598Q1234l3962l01177J36014
7760b57496r3761j31351M7710J66882k23887q1513K09652j62443o6125K75758
7750c16574P2714r3022o686J93545M7580J23853K5418j14869j53069k66186K00400
7739b86896L1303J44658J6555j54977k49087J96971j29411k40934n4903K91854
7729d34867L08161j65994j96902l9282m0572J48263K70214k6056j72821K15539
7719a34317j27130j76740K89108k79192j14364J41022K94571j57476L8997J0395
7709b15126N5796j74586K0982P4537j10367j40607O2479O4450n781K39072q7539
$$ y = [-650546, -549863, -728128, -609565, -508357, -471607, -489976, -366395, -383419, -351442, -464495, -354682, -740335, -589599, -522429, -407203, -139605, -58371, -92333, -393510, -257496, -351257, -482608, -434898, -268016, -491903, -573416, -363764, -526207, -592332, -316574, -243860, -336882, -343568, -150023, -102443, 21410, 46828, -68041, -221110, -487296, -286896, -255593, -110935, -94380, -249357, -498444, -301473, -430884, -671818, -726721, -434867, -126706, -292700, -489602, -528884, -569456, -421193, -150979, -177035, -349856, -134317, -261447, -438187, -149079, -428271, -542635, -401613, -107042, -264518, -225521, -215126, -159330, -333916, -312934, -238397, -348764, -489371, -426892, -362442, -368223, -129151, -216690]
7698b16690O7513P5021j18887k77900J7096Q7853M2064J37208l3723j39802J24480
7687b35767M1166L5648p2940k17293J90160j31220J37191J39164r827K5630o4908
7676a62996q747k6366J69305K75433j44864N1137p1342m77384O7590J14581O9212
7665a44441M1758P6728j23799j85705P5255r0345p1995q1822J95533l6220J7951
7654c27102M562j52805r0771R1316J44087J25485L815k70554M8784j25430j29828
7643f78441K98350j3959J41839K08472q2945J0025J43540j5822j06990j54816
7633b50747J09279M07230j39867J157j34617r5301k4283j63827J27454R1410K8894
7622d3218J26906k5968k68900j74715K1208K8905M63134j38819j19790P9075m0332
$$ y = [-216690, -149177, -74156, -193043, -470943, -453847, -365994, -323930, -186722, -220445, -360247, -235767, -194601, -158953, -231893, -449186, -259026, -390246, -253055, -113891, -123718, -98088, -162996, -171743, -198109, -28804, 246629, 101765, 152902, 81560, -395824, -328234, -213653, -144441, -102683, -25955, -149754, -335459, -260204, -350549, -422544, -504366, -308833, -345053, -327102, -322540, -475345, -566116, -474800, -330713, -205228, -201413, -471967, -423183, -548613, -678441, -380091, -394050, -252211, -43739, -126684, -116659, 26881, 11059, -95931, -250747, -141468, 265762, 125895, 127052, -7565, -102866, -127149, -290976, -163522, -72112, -43218, 83688, 57720, -211180, -385895, -364687, -335782, 127352, -11467, -131257, -52182, -92514]
7611i2514O6920j05168k4154O8517k77113J29863j5378J39659N6379M5811l04529
7600c11707J76011J88843k03835J87834q4313k18255j54157J63562R5374j5343
7590a75986J33855K728k51141R9739k6599r2421R2292Q6324L9246L49259l0990
7579B26306k75156j44924j61874o3205N00940J26078j64132K2890q880j01486
7569d3443j81163o0638K8744j2354j46686J01600j0402J25539K53770P6670O363
7558A38000j63855k19286R0720J6090L3113J53810j20646j06501J48879q1557
7548a11233J01234K26482k26830l37209o295M16612K7754Q3663k05612K52034
7538B20600K50892l66340l5679L3811J01684n9273j33810k39709J46574K17961
$$ y = [-92514, -25594, -130762, -154916, -86399, -363512, -233649, -249027, -109368, -52989, -7178, -311707, -135696, 53147, -150688, 37146, -47167, -265422, -419579, -256017, -160643, -175986, -42131, -39403, -290544, -190805, -217404, -309825, -217533, -131209, -91963, 257296, 226306, -48850, -193774, -355648, -418853, 82087, 208165, 44033, 66923, 58043, -43443, -224606, -285244, -256500, -268854, -415540, -313940, -324342, -198803, 54967, 131637, 138000, -25855, -245141, -154421, -138331, -105218, 48592, -72054, -178555, -29676, -111233, -9999, 216483, -10347, -347556, -353851, 62761, 90515, 174178, -31434, 220600, 471492, 105152, 69473, 103284, 204968, 145695, 11885, -227824, -81250, 136711]
7528A36711r7034L0763n9634J63801J29035J48932l99922k88624J83660n3786
7518a06098M2754N6512L8396o343N1681K19903k80305j39884R5099m7188k25107
7507c00580K66721m5356L7337Q7312j5816J19093j04268n2357J2535K55044k00467
7496E9198J3574J87612l4283J47326j72734j48656L7989j4011l6571J7388P6074
7485A32906J16313j09427k06333r5016L81497P7993j64332k60761R4302J54785
7475A21927J42785j66959k2519M4870Q4352J01573l31203Q7529k48422J95966
7465I899p7613J99444j46647J66918k29000J12590J8532o94k6646l7142M30472
7454D20113p8351j57802r7540O7653k22921P6150O3181J18209M8329J0088M1276
$$ y = [136711, 39677, 70440, 10806, 174607, 303642, 452574, 52652, -235972, -52312, -106098, -63344, -6832, 31564, 25221, 76902, 296805, 16500, -123384, -28285, -75473, -300580, -33859, -79215, -41878, 45434, 29618, 148711, 44443, -7914, 4621, 259665, 59198, 72772, 260384, 226101, 373427, 200693, 52037, 90026, 76015, 39444, 56832, 132906, 249219, 139792, -66541, -161557, 219940, 297933, 133601, -127160, -32858, 121927, 264712, 97753, 75234, 120104, 204456, 306029, -25174, 62355, -186067, 9899, -67714, 131730, -14917, 152001, -76999, 35591, 54123, 53429, 26783, -10359, 420113, 341762, 183960, 86420, 154073, -68848, 7302, 70483, 188692, 237021, 247109, 288385]
7443B88385k16529j32288q6431P9844J27252M4912j17305R646K29564j36114k50231
7432a59295R6049J31028J72029J1081j63856k00182j49024J6444L58220j30719
7422a8225Q474r4813J43249N31204q7391k15031j33453J23657K04192j94519j67191
7411A00153J22798L74534J7369j61115j5653k19026P1890J0852J71205j65532
7401C07475r155K83970J66701m14890k76871r8714J6365J74829N9960J13439J12613
7390D35722p5151J80108j05417p8227J3328R8487j73648p8782J87083q9360J68297
7379D82440n1510k6950R7204R5095j58178j14263j3040J16898P0387k00040J7815
7368C15858r0861O250J88385j4008q6643L3809l6274k65892K15712J80977K21949
$$ y = [288385, 71856, -60432, -146863, -67019, 60233, 105145, -12160, -2514, 227050, 90936, -159295, -63246, 67782, 239811, 250892, 87036, -113146, -262170, -245726, 112494, -18225, -9751, -104564, 38685, 569889, 482498, 267467, 134014, 257671, 461863, 267344, 100153, 222951, 597485, 614854, 453739, 438086, 219060, 290950, 301802, 473007, 307475, 298320, 582290, 748991, 334101, 57230, -41484, -25119, 149710, 209670, 323109, 435722, 360571, 540679, 435262, 357035, 370363, 468850, 295202, 216420, 403503, 314143, 482440, 430930, 403980, 501184, 596279, 438101, 323838, 310798, 427696, 498083, 298043, 315858, 224997, 231247, 419632, 405624, 318981, 352790, 316516, 50624, 266336, 447313, 669262]
7357F69262j2866k50479p5932j22354K1566n6765K5578K29214M844r6615J90354
7346E25807r7403N5391J20127O887K5829J42308j23685j85502R7125n2289K56213
7335G70808n6772j64112k58817J16979L3450L9183J28448J5566j55135p0361L27663
7324G26900j43241p1577J31556j68093j23515J86150l7046K07322J5959k62792
7314D61623j16902k40439J3582P1006J80241p3569j00804J78409r1382q851J23092
7303C96006p8378J99362j9393O0352J70859j38887p3049J02935m5088k97010P4520
7292C52229J78425R1806J58269L4450L6460j57419P69j27706k12743L11111O1217
7281G26868k01178k90373J92612k347N1026k7576p7899j6726J5963m2112J93344
$$ y = [669262, 656396, 405917, 329985, 207631, 229197, 172432, 198010, 427224, 432068, 335453, 525807, 428404, 483795, 603922, 610809, 636638, 778946, 655261, 469759, 566884, 514595, 770808, 714036, 549924, 291107, 408086, 441536, 480719, 609167, 624733, 469598, 399237, 726900, 583659, 512082, 643638, 475545, 352030, 538180, 501134, 708456, 724415, 461623, 344721, 104282, 117864, 188870, 369111, 295542, 194738, 373147, 281765, 272914, 396006, 317628, 516990, 497597, 557949, 728808, 589921, 516872, 619807, 574719, 277709, 352229, 530654, 622460, 780729, 815179, 851639, 694220, 694989, 567283, 354540, 665651, 726868, 525690, 235317, 427929, 425582, 476608, 449032, 371133, 354407, 370370, 328258, 521602]
7270E21602p7904j67759L14134O8805O4912j91147R5177M2581k30648k0798R1277
7259E10232M1554K08590k20704k20322J60641j55919L58000P7579k01730n0431
7249E07490L89432n936j11810k38555j12889Q3646P0772m2204N0981L4504K4908
7238F50339K00772l02745Q2306j34787j3254m6858r722J45290K09825j55818k52023
7227C73325K8983L7341P385k8173L87639j06369k70970p8736J16636K19461R0283
7216G76805j95284J41236K07144k92342Q3147q4537J86641j76256k49613o3225
7206C33716L74012K5548O4475n5049m7724K25322j45071l9195P8202m5401k00677
7195E68158J80711J2265N3618r8185o7613K2051M3607l9083J14300K6597j30548
$$ y = [521602, 443698, 275939, 590073, 658878, 723790, 532643, 627820, 670401, 439753, 418955, 510232, 551786, 760376, 539672, 319350, 479991, 324072, 682072, 759651, 557921, 507490, 896922, 890986, 779176, 540621, 427732, 511378, 582150, 539946, 590927, 625431, 650339, 851111, 548366, 630672, 495885, 482631, 435773, 426051, 571341, 781166, 625348, 373325, 402308, 439649, 447034, 418861, 806500, 700131, 429161, 350425, 467061, 686522, 776805, 581521, 722757, 929901, 637559, 720706, 636169, 822810, 646554, 396941, 333716, 707728, 733276, 797751, 742702, 694978, 920300, 775229, 736034, 814236, 768835, 568158, 748869, 761134, 814752, 716567, 648954, 671005, 714612, 675529, 789829, 816426, 685878]
7184F85878O0688P5906J83764j03841k16243N1877K71259M8239l23868n7434K10988
7173H87213r558q2236l9452K29380r4079o6129J36297j66254J34012m4733K51482
7162A135943P6723j80447O6704k4265K12099j12676o7336n7271q5919q5557m7487
7151H30511K45848k59915k44426M60656M68689k37069j43388q3865j1045K55757
7141A281753j17048m3323r6820j7149J99018j28895j05037N773O408M34036Q142
7130A426858k67857k59897p5591K50922K78064l955k24590k21264r1653M48574
7120A259611L0856j28261j07106J89688J9886j35553J18866o5269K79586J50583
7110A612887k19761j67897j43282J429J45265J82689J78230k62804M83j76168
$$ y = [685878, 746566, 822472, 1006236, 902395, 686152, 738029, 1009288, 1057527, 733659, 676225, 887213, 877655, 795419, 755967, 985347, 891268, 825139, 961436, 795182, 929194, 884461, 1135943, 1212666, 1032219, 1098923, 1074658, 1286757, 1174081, 1106745, 1049474, 963555, 877998, 830511, 1076359, 816444, 572018, 1032674, 1501363, 1264294, 1120906, 1037041, 1025996, 1281753, 1164705, 1121382, 1024562, 1007413, 1206431, 1077536, 972499, 978272, 984680, 1418716, 1426858, 1159001, 899104, 823513, 1074435, 1352499, 1348544, 1123954, 902690, 811037, 1259611, 1290467, 1162206, 1055100, 1244788, 1264674, 1129121, 1247987, 1182718, 1462304, 1612887, 1393126, 1225229, 1081947, 1083376, 1228641, 1411330, 1589560, 1326756, 1327239, 1151071]
7100A151071j40669j16277Q0487j1734K64361L2492J0389J15710l6216j53244
7090A196370J5228K04027k26168m1127p0152J79551l796j29075o7190j78799m7006
7079H31863L44807o8299J813K49284J76275M8724J11792j86608K5828j1166k6021
7068A498292p2153P1752k6495l37096o746K12628N1286j5278J54934q3899l01857
7057A145368j0713J52256j1313J17995L9754N4566q0489P4464O9247q3870j25326
7046A341939r3431J32728J27888J10472l07000j30193j1369N5557J44473K19908
7036A590972K3561q0409m3984J1685J68431k3805r0815k8892j20546L44240q6928
7025A663510k68529J3897N9501O6074K28194M2730L0744j21502j12766K34280
$$ y = [1151071, 1010402, 894125, 974612, 962878, 1227239, 1259731, 1270120, 1385830, 1349614, 1196370, 1211598, 1415625, 1189457, 1148330, 1078178, 1257729, 1253933, 1124858, 1057668, 878869, 831863, 1176670, 1108371, 1110184, 1359468, 1535743, 1584467, 1696259, 1509651, 1535479, 1524313, 1498292, 1426139, 1497891, 1471396, 1134300, 1127554, 1340182, 1391468, 1376190, 1531124, 1447225, 1145368, 1134655, 1286911, 1275598, 1393593, 1433347, 1487913, 1407424, 1481888, 1551135, 1467265, 1341939, 1248508, 1381236, 1509124, 1619596, 1312596, 1182403, 1171034, 1226591, 1371064, 1590972, 1614533, 1534124, 1490140, 1501825, 1670256, 1646451, 1555636, 1526744, 1406198, 1750438, 1663510, 1394981, 1408878, 1468379, 1534453, 1762647, 1805377, 1836121, 1714619, 1601853, 1836133]
7015A836133k04233J9464L03808Q0968p9761k44137k83520J8270J94866N7117
7005A698975j82233K639J16559O3118K2630k3164m712J9742j38832J95284l9646
6994A730360j04271J35996L09223R9763Q7562m51430k15689M82349K0422l17315
6984A776970K41584k70794k64937R3533J31634K44303K0119L9018k76618j4998
6974A719814J82888R8811J2142O4345n7213j12046K3369J15524L2475p5445k80168
6963A724496K8186N4231o652L37372P3776r4957m4211k30034k23140J85456O3813
6952A868336l1051J72063J92566n1257o2537K56552k25471j47461n6804j9989
6942A894947J49591m8852J42360J18221n8902J35606J37520j08195m5214K75336
$$ y = [1836133, 1631900, 1651364, 1955172, 2036140, 1956379, 1712242, 1428722, 1446992, 1641858, 1698975, 1516742, 1519381, 1635940, 1699058, 1721688, 1698524, 1693812, 1713554, 1574722, 1770006, 1730360, 1626089, 1762085, 2071308, 2171071, 2258633, 1807203, 1591514, 2073863, 2094285, 1776970, 2018554, 1747760, 1482823, 1576356, 1707990, 1952293, 1972412, 2011430, 1734812, 1719814, 1902702, 2001513, 2013655, 2078000, 2020787, 1908741, 1932110, 2047634, 2080109, 2004664, 1724496, 1752682, 1806913, 1800261, 2137633, 2211409, 2116452, 2072241, 1842207, 1619067, 1804523, 1868336, 1837285, 2009348, 2201914, 2150657, 2088120, 2344672, 2119201, 1971740, 1914936, 1894947, 2044538, 1995686, 2138046, 2256267, 2197365, 2332971, 2470491, 2362296, 2317082, 2592418]
6932B592418j29039k21272R6914K534L1986k75732j08877N8828L03029r5641M7122
6921B302270o5913J63589r3797Q4061M8401j79451Q7108M4285j96498K11229K47062
6910B652346j91814K804J02519j61021j25017p8919K27290R5498l7473J60964
6900B647177j94228J86629n6335n7712N9159J8840j1281j76310J29753J18577
6890B664269J28923Q3206j84989O1684k21988l3677j10812l143J14317L80678
6880B878468j77096j43058M3601j12961L1835J57357L4610J5643J6896L1846q3146
6869B693995O687J6259Q388j12218O2727K23470K59433p5943Q2818j27941r5269
6858B942406J1257j72605J67386K55375l6275j62503J18480K63171L9728j03564
$$ y = [2592418, 2463379, 2242107, 2339021, 2341555, 2373541, 2097809, 1988932, 2047760, 2350789, 2255148, 2302270, 2236357, 2399946, 2306149, 2390210, 2438611, 2259160, 2346268, 2390553, 2194055, 2405284, 2652346, 2460532, 2463336, 2565855, 2404834, 2279817, 2200898, 2428188, 2523686, 2486213, 2647177, 2452949, 2639578, 2583243, 2525531, 2584690, 2603530, 2592249, 2415939, 2545692, 2664269, 2793192, 2876398, 2691409, 2753093, 2531105, 2497428, 2386616, 2383473, 2497790, 2878468, 2701372, 2558314, 2601915, 2488954, 2520789, 2678146, 2712756, 2728399, 2745295, 2777141, 2693995, 2700682, 2716941, 2725329, 2613111, 2675838, 2899308, 3158741, 3082798, 3165616, 3037675, 2942406, 2953663, 2781058, 2948444, 3203819, 3167544, 3005041, 3123521, 3386692, 3426420, 3322856]
6848C322856O7762l95540O6484O3651R3418k17273J09585O8886P32R0312J51307
6837C422180J92071l23819m505j02155J41329J81237j94962j77499j44773m9370
6827B939734M72960K11957j76131K8791N7790q7390J0347p6761J31955J02127
6817C615379n8975p9281J02446K70551K9375j76786K48902K18149j04428n7432
6807D007900k26475L1603m8867J71343J44613J80774j81209k1467L6497j88277
6797C906435k8848o6091K85829L5799k34717N576M1119J96649m6287K10970N46
6786D306980l48630K14415J90103J59025j03936J98611O7987k7656J2186N9274
6776D728359j6733j77376Q7705J70215j20398m1566K87539K4866M5586j84930
$$ y = [3322856, 3390618, 2995078, 3061562, 3125213, 3218631, 3001358, 3110943, 3179829, 3180561, 3270873, 3422180, 3614251, 3290432, 3285927, 3183772, 3325101, 3506338, 3311376, 3133877, 2989104, 2939734, 3412694, 3624651, 3448520, 3477311, 3535101, 3447711, 3458058, 3381297, 3513252, 3615379, 3556404, 3477123, 3579569, 3850120, 3879495, 3702709, 3951611, 4169760, 4065332, 4007900, 3781425, 3813028, 3764161, 3935504, 4080117, 4260891, 4079682, 4058215, 4094712, 3906435, 3877587, 3811496, 4097325, 4133124, 3898407, 3903983, 3945102, 4141751, 4095464, 4306434, 4306980, 3958350, 4172765, 4362868, 4521893, 4417957, 4616568, 4684555, 4656899, 4669085, 4728359, 4711626, 4534250, 4621955, 4792170, 4671772, 4630206, 4917745, 4942611, 4988197, 4803267]
6766D803267J65980j47550o3444j7561L769J88285O9045l8885p7043O7715l545
6755D950033J92790p7362k77337O0131j40528Q2084L30113j62575r3871n293J18588
6744D976773J50326K15173p2390j13775N9697L3784J36911L81076j36892j60961
6734E469722P6922p3236R0102P6170J19388M5359J9142M3365k05094j11898J36529
6723E686471k7508K04613J01023J0904O4730Q1189l81161J06541j29233R9206
6713E816775R6401k71533L26318J06749J40575J38469j05271j28429J9381J92738
6703F332173Q9774k91130r1772J38875M69671n883l42095J45898J46640K77810
6693F869961R0881j54892r6390l2684j14534J26600K28680L42481J56159l43780
$$ y = [4803267, 4969247, 4821697, 4758253, 4740692, 4744461, 4932746, 5001791, 4962906, 4885863, 4953578, 4950033, 5142823, 5065461, 4788124, 4848255, 4707727, 4789811, 5119924, 4957349, 4863478, 4858185, 4976773, 5127099, 5342272, 5269882, 5156107, 5215804, 5249588, 5386499, 5767575, 5630683, 5469722, 5546644, 5473408, 5563510, 5639680, 5759068, 5804427, 5823569, 5866934, 5661840, 5549942, 5686471, 5658963, 5863576, 5964599, 5975503, 6040233, 6121422, 5740261, 5846802, 5717569, 5816775, 5913176, 5641643, 5967961, 6074710, 6215285, 6353754, 6248483, 6120054, 6139435, 6332173, 6421947, 6130817, 6039045, 6177920, 6647591, 6641708, 6299613, 6445511, 6592151, 6869961, 6960842, 6805950, 6709560, 6676876, 6562342, 6688942, 6917622, 7260103, 7416262, 7072482]
6683G072482k23921K26865J65880k46463M0815Q6034k935J05194P5770Q8745J77240
6672G565706j78872J5006K53529j74575J53879L59924j66936k23765P602N03588
6662H115086J08020Q6574R5815O4895L34742J26987N2432J75499k0994K44589
6652I383645N0271J97905K47171L3318K0603o0929O9388L0338O5870K58725K49418
6641A0545723k02838K50154R6353j63341k1465J68475n100L31910L28678j64553
6631A1163996J00410M13950j01374j28537L31090J71830R0187L0178P4588J24058
6621A2270376L9198K73336K31634p3515K80750K42905Q5105J66567J07687K98482
6611A3922525K46285K61966K18853L3594K41537J05040K03636K12606J16933j225
$$ y = [7072482, 6848561, 7075426, 7241306, 6994843, 7035658, 7121692, 7118757, 7223951, 7299721, 7388466, 7565706, 7386834, 7401840, 7655369, 7480794, 7634673, 7994597, 7827661, 7603896, 7611498, 8115086, 8223106, 8309680, 8405495, 8470390, 8805132, 8932119, 8984551, 9160050, 9139056, 9383645, 9433916, 9631821, 9878992, 9912310, 9932913, 9871984, 9941372, 9971710, 10037580, 10296305, 10545723, 10342885, 10593039, 10689392, 10526051, 10504586, 10673061, 10667961, 10999871, 11328549, 11163996, 11264406, 11678356, 11576982, 11448445, 11779535, 11951365, 12041552, 12071730, 12146318, 12270376, 12309574, 12582910, 12814544, 12741029, 13021779, 13264684, 13349789, 13516356, 13624043, 13922525, 14168810, 14430776, 14649629, 14683223, 14924760, 15029800, 15233436, 15446042, 15562975, 15561750]
6601A5561750L29634J58229K21971L33308J54681L54074L04451l11927J26186
6592A7232357M28098J41675K032L18467K99834K40628K28108K68304J70709K88815
6582A9619027M49164K60271K59057K40317L64605L64589J21193K50630L44917
6573B2273770K95727K29888L78826Q44932J74111M90348M84002M39720N49177
6564B6160501M47883K24678M11844M50185O54290O29659M78331N16272P76371
6555C0750014N19012N42093N63105Q56763O05509N59372O56339Q63650P27926
6546C6643783N64129J060486Q95931J140508P71825Q97756J086205R96456J372843
6537D5429922J293158J449980J569096J982966J542998J624865J724016J797404
$$ y = [15561750, 15891384, 16049613, 16271584, 16604892, 16759573, 17113647, 17418098, 17106171, 17232357, 17660455, 17802130, 17804162, 18122629, 18422463, 18663091, 18891199, 19159503, 19330212, 19619027, 20068191, 20328462, 20587519, 20827836, 21192441, 21557030, 21678223, 21928853, 22273770, 22569497, 22799385, 23178211, 24023143, 24197254, 24687602, 25171604, 25611324, 26160501, 26608384, 26833062, 27244906, 27695091, 28349381, 28979040, 29457371, 29973643, 30750014, 31269026, 31811119, 32374224, 33230987, 33836496, 34395868, 35052207, 35915857, 36643783, 37207912, 38268398, 39164329, 40304837, 41076662, 41974418, 43060623, 44057079, 45429922, 46723080, 48173060, 49742156, 51725122, 53268120, 54892985, 56617001, 58414405]
6529E8414405K202837K143180K099737K001475K414377K427589K307395K623812
6521G6634807K579786K519802L287626L530540L889698M242262M936804N784703
6513A07406028O586798Q064652R497773J0335908J2209509J3667902J5573305
6506A83341875J7271210J8952957K0472190K2270205K4558812K6319272K7793498
6499C40980019K9626709L0790348L1303288L0458340K7739118K3115957J6248464
6492E30262243P805505k733493j2778378k0995340k7396028l1914930l3849829
6485D08399750l3674886l2322761k9355378k6634826k3787396k1122318j8480735
6478B23021450j6443578j4668653j2948331j1934968j1065298j0051237r341411
$$ y = [58414405, 60617242, 62760422, 64860159, 66861634, 69276011, 71703600, 74010995, 76634807, 79214593, 81734395, 85022021, 88552561, 92442259, 96684521, 101621325, 107406028, 113992826, 122057478, 131555251, 141891159, 154100668, 167768570, 183341875, 200613085, 219566042, 240038232, 262308437, 286867249, 313186521, 340980019, 370606728, 401397076, 432700364, 463158704, 490897822, 514013779, 530262243, 538067748, 535334255, 522555877, 501560537, 474164509, 442249579, 408399750, 374724864, 342402103, 313046725, 286411899, 262624503, 241502185, 223021450, 206577872, 191909219, 178960888, 167025920, 155960622, 145909385, 136567974]
6471A36567974q742753p781808p406655o545013n697696n324953m190291l761032
6463H7117773l265523k768991k850234k302748j886836j677588j642076j434569
6455F9289208j372473j408874j116731j012582j220694j066946j528373j271587
6447E9290948j248180j454122j302802j220026j460847j458173j494420j166174
6439D8486204j133199j744972j399989j464872j425492j345154j688030j263881
6431C7020615j372893j333335j242318j066783j173444j229350n27700p32004
6423B8342788r19761r12973o66912o52567o14831m79240m90932n74887l19170
6414B2711515p6082l04955l88j88541q3852k50812j13595p7717j32548P0432K36330
$$ y = [136567974, 127825221, 120043413, 112636758, 106091745, 100394049, 95069096, 90878805, 87117773, 83852250, 81083259, 78233025, 75930277, 74043441, 72365853, 70723777, 69289208, 67916735, 66507861, 65391130, 64378548, 63157854, 62090908, 60562535, 59290948, 58042768, 56588646, 55285844, 54065818, 52604971, 51146798, 49652378, 48486204, 47353005, 45608033, 44208044, 42743172, 41317680, 39972526, 38284496, 37020615, 35647722, 34314387, 33072069, 32005286, 30831842, 29602492, 29074792, 28342788, 27423027, 26510054, 25843142, 25190575, 24575744, 24096504, 23605572, 23030685, 22711515, 22635433, 22330478, 22330090, 22141549, 22057697, 21806885, 21693290, 21615573, 21483025, 21553457, 21789787]
6403B1789787k6899M47426N96923M90368M63385N31140M45265N61147P94550M59937
6393B6553029N72298P75172M42474O04956N67085O4797K82841M54705l1899j06645
6383C0178813j29095l1745L1829j70082m81436m12617l01654n84565m04296l65387
6373B7329765m64760q07618r52364q87488o15790p05485o45937q83302q39858
6364B0527163n98986r25918j045254p87056o50547m59704o74096p49750r72653
6355A3663199o06578k17261k72513k00809o88297o83898K6116l34581o14059m90662
6345I580657p7605k02531j59258k80368j21132j82712j61274j1524j44145m95477
6335G744631J3315r67l18498j32012j78110K0348J23660m44691j5244L6040L27293
$$ y = [21789787, 21762888, 22210314, 22807237, 23297605, 23760990, 24292130, 24737395, 25298542, 26093092, 26553029, 27125327, 27900499, 28342973, 28947929, 29515014, 29579811, 29862652, 30317357, 30285458, 30178813, 30049718, 30017973, 30049802, 29879720, 29398284, 28985667, 28684013, 28099448, 27695152, 27329765, 26865005, 26057387, 25105023, 24217535, 23601745, 22896260, 22250323, 21367021, 20527163, 19928177, 19002259, 17957005, 17169949, 16519402, 16059698, 15385602, 14635852, 13663199, 13056621, 12839360, 12566847, 12366038, 11677741, 10993843, 11019959, 10685378, 10071319, 9580657, 9503052, 9300521, 9141263, 8860895, 8739763, 8557051, 8395777, 8384253, 8240108, 7744631, 7757946, 7756979, 7438481, 7306469, 7128359, 7148707, 7272367, 6827676, 6812432, 6848472, 7175765]
6324G175765o6045M3612k38060q6219J04492m5189r4603Q8244j54444j0103L02443
6313G019893k75903j11159l0648j9571k29866J31831r9762j73147J79052L7903
6303F428623j61411J38945n0839k01488R567l31003j88327N9951k59273K12002
6293E656747p275j51134k5205R9359j89437L6901j27668j4505N9495l7335K18205
6282E518148j98704j20594K3960p3972k04467p4395K7984K8079M8911j61606K98115
6271E111459j63647K61110Q428R9586R0370j29731m22119J90294j15060J53867
6261E084557J37202j42913n4071K25594j27311p4203J89932O332j59445l30433
6251D755241L01598P4495m8012n9919N6501J12457j45190j88502M7046J52450
$$ y = [7175765, 7109720, 7153332, 6915272, 6829053, 6933545, 6888356, 6793753, 6881997, 6727553, 6717450, 7019893, 6743990, 6632831, 6602183, 6582612, 6352746, 6484577, 6384815, 6211668, 6390720, 6428623, 6267212, 6406157, 6355318, 6153830, 6163397, 5832394, 5644067, 5704018, 5444745, 5656747, 5649472, 5498338, 5473133, 5572492, 5383055, 5419956, 5292288, 5277783, 5337278, 5299943, 5518148, 5319444, 5198850, 5222810, 5148838, 4944371, 4869976, 4897960, 4926039, 4974950, 4813344, 5111459, 4947812, 5208922, 5217350, 5316936, 5407306, 5277575, 4855456, 5045750, 4930690, 5084557, 5221759, 5078846, 5024775, 5250369, 5123058, 5048855, 5238787, 5245119, 5085674, 4755241, 5056839, 5131334, 5083322, 5023403, 5079904, 5192361, 5047171, 4858669, 4905715, 5058165]
6241E058165r354L27352J86508m61377O0520K26973K85319o5228r0031K69123
6231E787970P5644M87323J52520q4906j97724R5928L64300K89405J10590j05108
6221F975942J83812M25762K49364Q6406L09326N66929L67497K84577M84666M05419
6211A0339700L89413K76591N51450N97093N58543N78123N62758L63768P56053
6202A4973492P83930N63703J97999K49262K10229N16261J43469P1099J66797J38761
6192A8015002m4600l49199j25814k71848k88460K52749r7965n25424m89152k3957
6182A6051332M0870k0194o6486J39185J16231l4862j01754M75099K72891K92249
6172A7164561J82935K9398K8970K54612r4175o8119J79292k00469r3510K12543
$$ y = [5058165, 5048811, 5376163, 5562671, 5101294, 5161814, 5388787, 5674106, 5608878, 5518847, 5787970, 5863614, 6350937, 6503457, 6418551, 6220827, 6316755, 6681055, 6970460, 7081050, 6975942, 7159754, 7585516, 7834880, 7921286, 8230612, 8797541, 9165038, 9449615, 9934281, 10339700, 10729113, 11005704, 11557154, 12154247, 12712790, 13290913, 13853671, 14217439, 14973492, 15757422, 16321125, 16519124, 16768386, 16978615, 17494876, 17638345, 17709444, 17876241, 18015002, 17970402, 17621203, 17495389, 17223541, 16935081, 17187830, 17089865, 16564441, 16075289, 16051332, 16092202, 16072008, 16005522, 16144707, 16260938, 16226076, 16124322, 16599421, 16872312, 17164561, 17347496, 17376894, 17405864, 17660476, 17566301, 17498182, 17677474, 17477005, 17383495, 17596038]
6162A7596038m38661k31313p6385n09779k08168m18249n20023m16752o03728m67704
6152A3705276q9126l24170j14998n20642k30914K03640k13551j46480j63082L3349
6142A2139302J80346j13219R6741J31175p1805K13053j3664M18563J58287J23962
6132A3262741K79410l86260J41603j32227p8014O5030k18502j21560l59535l84446
6122A2068240N9329m19801m47235l2809N6206p1928q0783k80314K14958q891m2131
6111A1014841N8028J84161j3426J52940J59212K84440l0259J3388J30808j46551
6101A1807582M2802J98411J37375m26346l92762K67980l29405n12954k77921l22927
6091A0191835m53079j55586l15299m59741m9124n89877n58352m54867m12709M1720
$$ y = [17596038, 17157377, 16926064, 16849679, 16339900, 16131732, 15713483, 15193460, 14776708, 14172980, 13705276, 13616150, 13291980, 13176982, 12656340, 12425426, 12629066, 12415515, 12269035, 12105953, 12139302, 12319648, 12206429, 12303170, 12434345, 12362540, 12575593, 12561929, 12980492, 13138779, 13262741, 13542151, 13155891, 13297494, 13165267, 13087253, 13152283, 12933781, 12812221, 12452686, 12068240, 12127569, 11707768, 11260533, 11227724, 11283930, 11212002, 11131219, 10850905, 11065863, 11056972, 11014841, 11072869, 11257030, 11243604, 11396544, 11555756, 11840196, 11809937, 11823325, 11954133, 11807582, 11850384, 12048795, 12186170, 11759824, 11367062, 11635042, 11305637, 10792683, 10514762, 10191835, 9738756, 9583170, 9267871, 8808130, 8759006, 8169129, 7610777, 7155910, 6743201, 6784921]
6081F784921m27059o38305j09356k35814q0100j52712j93066k51558l77412q1864
6071D237675K88382j32013k21943n3415j86409j34617k1528j52618l4821l7862
6061C550831M4903q1322J74081k08527k73423l8301p6614K48959Q2081j2355k72066
6050C138247l7788q4312m6095J07j91962P4756J80485J37928j08691k61642j55021
6039B646012L41680J62431J10502j05935l72835j4105j9723O023j45154j7313
6029B591583M29317m8027l3701l34801r7239l598j57748k8895M90779J34872p9430
6018B863112j50140k44797p579R9931j53352j44833J92744j31963J50747K7099
6008B500969j64593k17796J44793K31759j59505N1658r5480j90810J25173N233
$$ y = [6784921, 6357862, 5719557, 5610201, 5374387, 5294287, 5141575, 4948509, 4696951, 4319539, 4237675, 4526057, 4394044, 4172101, 4118686, 3932277, 3797660, 3776132, 3623514, 3588693, 3550831, 3595734, 3514412, 3688493, 3479966, 3206543, 3168242, 3091628, 3340587, 3422668, 3410313, 3138247, 3100459, 3016147, 2970052, 2970159, 2778197, 2852953, 3033438, 3171366, 3062675, 2801033, 2646012, 2987692, 3150123, 3260625, 3154690, 2781855, 2767750, 2748027, 2754050, 2608896, 2591583, 3020900, 2972873, 2939172, 2604371, 2507132, 2503534, 2345786, 2316891, 2807670, 2942542, 2863112, 2712972, 2468175, 2460596, 2560527, 2407175, 2262342, 2455086, 2323123, 2473870, 2500969, 2336376, 2118580, 2263373, 2495132, 2335627, 2387285, 2291805, 2100995, 2226168, 2231401]
5998B231401O7139k7552J57139n4894m1827j2655J87613J39995k24334m0957J73640
5987B554708r9371K9389m10240R5707M5524m0494J22031K1928O4950J8939Q7648
5976B490719R206l67134n5068K6553J04983P0651j98299J34488q6640J86880K35165
5965B551504p0958k607o9776j39818Q8570m4060m13906q4476K50840L06133j02721
5954B268725M1669M4815J84721l79950j92526J05183k1131j8640j49713L42460
5944B225613j77168k8152j21653L90003N6790j12051j54319N2811J38584p8444
5934B192014k34094N2936J42512j01277q5746J82687M05756k14957j02616K97601
5924B534816J3491j13526P9245J0495p7214K39664R1893n8722k93653j24826J37314
$$ y = [2231401, 2298540, 2270988, 2428127, 2373233, 2331406, 2318751, 2506364, 2646359, 2422025, 2381068, 2554708, 2455337, 2484726, 2074486, 2170193, 2215717, 2175223, 2297254, 2319182, 2384132, 2403071, 2490719, 2499925, 2132791, 2077723, 2104276, 2209259, 2279910, 2081611, 2216099, 2129459, 2316339, 2551504, 2480546, 2477939, 2408163, 2268345, 2356915, 2312855, 1898949, 1814473, 2065313, 2371446, 2268725, 2310394, 2355209, 2539930, 2159980, 1967454, 2072637, 2051506, 2032866, 1883153, 2225613, 2048445, 2020293, 1898640, 2288643, 2345433, 2233382, 2079063, 2131874, 2270458, 2192014, 1957920, 2010856, 2153368, 2052091, 1966345, 2149032, 2554788, 2339831, 2237215, 2534816, 2548307, 2434781, 2514026, 2524521, 2447307, 2686971, 2778864, 2720142, 2426489, 2301663, 2438977]
5913B438977P6346k01601N0769o7233n4275q747n2640O3603j35555K08593r0890
5902B227347J47106k17707J30326R1864k03936q3459j6764J45463L1571L31221
5892B583032j2643N3470k64970M7157J49341J29298j72624K805k3983L849J31958
5881B626690P6017k28106r6357q941M2961K45145n7368j28321j57846k09213J89481
5870B294142L7824j74534M10841K44242l06107l33533N0505K33594L30648j4929
5860B772693j10514q0460R0203l4147j35752p8693K97300p840k9809N1331j39866
5849B594446j5584K5153M27799N4521j52303j52315j35828R4215n4878J31329
5839B816555m9059j83789O9144K08673o1418p019j80268M6735r2580O752J12428
$$ y = [2438977, 2515323, 2313722, 2364491, 2297258, 2242983, 2234236, 2181596, 2245199, 2109644, 2318237, 2227347, 2374453, 2156746, 2287072, 2378936, 2175000, 2091541, 2074777, 2220240, 2251811, 2583032, 2570389, 2623859, 2358889, 2406046, 2555387, 2684685, 2512061, 2514866, 2490883, 2494732, 2626690, 2702707, 2474601, 2378244, 2369303, 2412264, 2657409, 2600041, 2471720, 2313874, 2104661, 2294142, 2331966, 2157432, 2568273, 2812515, 2506408, 2172875, 2223380, 2456974, 2787622, 2772693, 2662179, 2581719, 2671922, 2637775, 2502023, 2423330, 2720630, 2712790, 2682981, 2734312, 2594446, 2578862, 2604015, 3031814, 3086335, 2934032, 2781717, 2645889, 2740104, 2685226, 2816555, 2767496, 2583707, 2652851, 2861524, 2800106, 2793087, 2612819, 2659554, 2566974, 2573726, 2686154]
5828B686154K64048j41929J66927L45563l44011J80074j54784j85333J87345J28298
5818C132352J12238p9397J03602O3306k37770k47j8967N4077j804R6561L71870
5807C595821p7440l03870J24098m350J55767J15514j99878J54880K72947N4128
5797C887617l59571n8663m2356J46585J21919J39709J46539K01147j42921L4643
5787D074648k5662J3662J93625l4774j84973K05555L09167J54067J38399J18934
5777D962648J32606p6221k44699J84556J37943j45581K52154Q3723K28638K62512
5767E778279R5209l1116M52573K41808J21796K63947n3688R6934L34764L48171
5757G648677L20713P8295K10705L58841J25337K02854K45229J69097K03707L30251
$$ y = [2686154, 2950202, 2808273, 2975200, 3320763, 2976752, 3156826, 3002042, 2816709, 3004054, 3132352, 3244590, 3165193, 3268795, 3332101, 3094331, 3094084, 3075117, 3129194, 3127390, 3223951, 3595821, 3518381, 3214511, 3338609, 3334259, 3490026, 3605540, 3405662, 3560542, 3833489, 3887617, 3528046, 3469383, 3427027, 3573612, 3695531, 3835240, 3981779, 4182926, 4040005, 4074648, 4048986, 4062648, 4256273, 4221499, 4036526, 4242081, 4551248, 4705315, 4843714, 4962648, 5095254, 5019033, 4774334, 4958890, 5096833, 4951252, 5203406, 5287129, 5515767, 5778279, 5873488, 5842372, 6294945, 6536753, 6658549, 6922496, 6868808, 6965742, 7300506, 7648677, 7969390, 8047685, 8258390, 8617231, 8742568, 8945422, 9190651, 9359748, 9563455, 9893706]
5747I893706K69229J90254N9592M8231J88886J32812K86911L58991O01656J92526
5737A2222794J06997K54382M33147L40924J10120M33689J91238Q8356J69449J52642
5727A4503738j33358l12197K48525m3285K8598j56621j46206J30977M4617j5836
5717A4148952J32651J66770j79710L1288k8495n9319j26527O5664L16475J10372
5707A4578121Q8847J6268K85223n3124K88572M03472K55090K0465l15365J21789
5697A5689358J64928K57307J29590J01583l374J84044r422p3174L54715L09917
5687A7105472L84075J003L39898J88732l1988J99504L98328N3360J38958L22041
5677A9099383K40939L31076k0451k91475p885m436j01639L187m53334j21702m21597
$$ y = [9893706, 10162935, 10353189, 10412781, 10461012, 10649898, 10782710, 11069621, 11428612, 12030268, 12222794, 12329791, 12584173, 13017320, 13358244, 13468364, 13902053, 14093291, 14181647, 14351096, 14503738, 14370380, 14058183, 14306708, 14263423, 14292021, 14135400, 13989194, 14120171, 14164788, 14148952, 14281603, 14448373, 14268663, 14299951, 14271456, 14212137, 14085610, 14151274, 14467749, 14578121, 14666968, 14683236, 14968459, 14915335, 15203907, 15607379, 15862469, 15882934, 15567569, 15689358, 15854286, 16111593, 16241183, 16342766, 16339392, 16523436, 16514014, 16440840, 16795555, 17105472, 17489547, 17490550, 17830448, 18019180, 17987192, 18186696, 18585024, 18638384, 18777342, 19099383, 19340322, 19671398, 19650947, 19359472, 19351587, 19347151, 19245512, 19248699, 18795365, 18673663, 18252066]
5666A8252066o00311m85142m15311j47804j90236k87094n23715k86669m1363l87495
5656A4886926m21492j34658j28219m42548l26003p02909l97100k13962m94982
5647A1625053k64005l36309k12712l61889l78803m42215j2745m34359j71813j83721
5637H826482m31018j44874l06995m03831k28901K7936k12910m08857j24700j16746
5627F475586l21723p5369o9342k84602k66424N0424q4163j42317k1552j28753
5617E131765J926J36545m5987p8727j75757L13P5156p896l877k5228j40058J1516
5605D879691j26335m6125P5328J70136l8989O1494L6168j13959q4528N537j13252
5594D705166J71436L6118j26891k8476o7505k3401j21957o1272K75044j40296
$$ y = [18252066, 17651755, 17166613, 16751302, 16603498, 16413262, 16126168, 15602453, 15315784, 15274421, 14886926, 14465434, 14330776, 14202557, 13760009, 13434006, 12731097, 12333997, 12120035, 11625053, 11361048, 11024739, 10812027, 10450138, 10071335, 9629120, 9616375, 9182016, 9010203, 8826482, 8395464, 8250590, 7943595, 7539764, 7310863, 7338799, 7125889, 6717032, 6592332, 6475586, 6153863, 6078494, 6009152, 5724550, 5458126, 5508550, 5424387, 5282070, 5260518, 5131765, 5133691, 5270236, 5224249, 5145522, 4969765, 4970078, 5045234, 5037338, 5033461, 5008233, 4868175, 4879691, 4753356, 4707231, 4782559, 4952695, 4913706, 4975200, 5011368, 4897409, 4812881, 4818418, 4705166, 4876602, 4912720, 4785829, 4757353, 4689848, 4666447, 4544490, 4483218, 4758262, 4617966]
5584D617966j25663k5223J59343K8019m8034Q348J65672J16275P98p7757R0281
5573D910025L4592J03540n825P8006K50384J25260n0362j37513P6314J76146K7294
5562E587861K26331K9084K92889j21829K2448K92657J43672K05820O5366K23803
5552F968102J55453J44816l8462J11932J22338J67812k89967J55722J38480L85922
5542H022148J01381o6819R098J45577J96257l8447J9080K70044J19042K96518
5532I073879j03106M4488K01588K03854L13844M74957L12111L25091K82590J50488
5522A1279784K92631L30334M1173M49389J24856K07379N42185J74114J18098K42354
5512A3802297J89888J93043n0379J2370Q2310L292R1862J91988l21902k85398
$$ y = [4617966, 4492303, 4467080, 4626423, 4654442, 4606408, 4614756, 4780428, 4896703, 4897501, 4819744, 4910025, 4944617, 5048157, 5042332, 5120338, 5370722, 5495982, 5445620, 5308107, 5384421, 5560567, 5587861, 5814192, 5843276, 6136165, 6014336, 6036784, 6329441, 6473113, 6678933, 6744299, 6968102, 7123555, 7268371, 7229909, 7341841, 7464179, 7631991, 7342024, 7497746, 7636226, 8022148, 8123529, 8056710, 8065808, 8211385, 8407642, 8369195, 8388275, 8658319, 8777361, 9073879, 8970773, 9015261, 9216849, 9420703, 9734547, 10209504, 10521615, 10846706, 11129296, 11279784, 11572415, 11902749, 11943922, 12393311, 12518167, 12725546, 13267731, 13441845, 13559943, 13802297, 13992185, 14185228, 14134849, 14147219, 14229529, 14232821, 14324683, 14516671, 14194769, 13909371]
5502A3909371L41425K8653j3384Q0479J70027l13353j72079K55259K88973J30317
5492A4705688L17020K10142K29770K80618J98395O5273Q0439K05515J65200L17085
5482A6775145L89744o9721m09019L40399O5166K02562j22772m19832j1806j40982
5472A6598884K18756j8467k82855j91057j1685m61555j21770K0540L4698J6543
5462A5802032k19104j35779O5460K53906J63660j65724j6615j03958k29966j22787
5452A5291125J07528k03351j52372O7851j05686j72689j39035P8279L7511k95317
5442A4513844j66427k10973n30144N14n2220J1791Q2251m8593k66774O2871q5174
5431A3310966k88076M2851K35045M1289k46552P2795J11273j00853j7817j02344
$$ y = [13909371, 14250796, 14279449, 14266065, 14346544, 14516571, 14203218, 14031139, 14286398, 14575371, 14705688, 15022708, 15232850, 15462620, 15743238, 15941633, 16006906, 16087345, 16292860, 16458060, 16775145, 17164889, 17095168, 16686149, 17026548, 17091714, 17294276, 17171504, 16751672, 16739866, 16598884, 16817640, 16799173, 16516318, 16325261, 16313576, 15852021, 15730251, 15750791, 15785489, 15802032, 15582928, 15447149, 15512609, 15766515, 15930175, 15764451, 15747836, 15643878, 15413912, 15291125, 15398653, 15195302, 15042930, 15110781, 15005095, 14832406, 14693371, 14771650, 14809161, 14513844, 14347417, 14136444, 13606300, 13606814, 13554594, 13566385, 13648636, 13600043, 13333269, 13396140, 13310966, 13022890, 13065741, 13300786, 13342075, 13095523, 13168318, 13279591, 13178738, 13160921, 13058577]
5421A3058577o28995m9453L3440l7774k73238k84245p2103l09294n07599k10593
5411A0718723N0192k60499m29517l65273l27476k58j5945k66040j695K11000K67002
5400I580214k5174p4246j82282q0890j81557p1764j00251k6014K68104M4996j18320
5389I032816K7102j81424j99501Q5307j69243l53185j20596K02863j77312j48497
5379G998330r8707j91751k3846j24949m7238j50843J21105J90032j76949j19223
5369G375961j88523q653l2012N9041q8049l1055j41008j82129k3054R4026L77220
5358G211765N1697k45132K5852J74271N3473J69615o9115j05817n6947N2138L27109
5347G588909q5318K1745J83817j69656j0126j19535j09734K51586N06833K32935
$$ y = [13058577, 12429582, 12380129, 12413569, 12375795, 12102557, 11818312, 11746209, 11436915, 10929316, 10718723, 10768915, 10508416, 10078899, 9713626, 9386150, 9385892, 9369947, 9103907, 9102212, 9313212, 9580214, 9555040, 9480794, 9298512, 9217622, 9036065, 8964301, 8864050, 8838036, 9106140, 9151136, 9032816, 9059918, 8878494, 8678993, 8764300, 8595057, 8241872, 8121276, 8324139, 8146827, 7998330, 7899623, 7707872, 7684026, 7559077, 7511839, 7360996, 7482101, 7672133, 7495184, 7375961, 7187438, 7178785, 7146773, 7205814, 7117765, 7086710, 6945702, 6763573, 6740519, 6834545, 7211765, 7263462, 7018330, 7044182, 7218453, 7271926, 7441541, 7372426, 7266609, 7209662, 7261800, 7588909, 7503591, 7525336, 7709153, 7539497, 7529371, 7409836, 7300102, 7551688, 8058521, 8291456]
5337H291456j77426j73012K89589j94641J55955N039m0935L09457j2129J27407
5327H580760j6240r4157j44269J28011J37624J7578j9120J8476L11201K2846r7313
5316H845397J88205O1189L30212J10935j8055j38009J83701M3203J65592Q1164
5306I853534L1640Q7091j05595j5268L87935L78459j92385J58562L39260M0869
5296A0964102J90433L75503J9883k16786L57178K66343k0322K39178K32605L73950
5286A2782067J82456N42523L85594L27629K74190K55351K79418N20824N16118
5277A6066170K67064L51372N70963O15471O55990N71874N81663P15656P98424
5268B1194647Q31828Q54536N92087R14869J186412P75046O42774R02352J182957
$$ y = [8291456, 8114030, 7941018, 8230607, 8035966, 8191921, 8196960, 8156025, 8465482, 8453353, 8580760, 8564520, 8470363, 8326094, 8454105, 8591729, 8609307, 8590187, 8608663, 8919864, 8942710, 8845397, 9033602, 9094791, 9425003, 9535938, 9517883, 9379874, 9563575, 9606778, 9772370, 9853534, 9885174, 9972265, 9866670, 9851402, 10239337, 10617796, 10425411, 10583973, 10923233, 10964102, 11154535, 11530038, 11549921, 11333135, 11690313, 11956656, 11936334, 12175512, 12408117, 12782067, 12964523, 13507046, 13892640, 14220269, 14494459, 14749810, 15029228, 15550052, 16066170, 16333234, 16684606, 17255569, 17871040, 18527030, 19098904, 19680567, 20396223, 21194647, 22026475, 22881011, 23473098, 24387967, 25574379, 26349425, 26992199, 27894551, 29077508]
5259B9077508J093991P35264P96243Q85189R92181Q40705N49335Q96044P30436
5250C6596896O00557L09204M17454P53145R42506O56506N37542J25104P13862
5241D1652776Q76500M72129P14114N08458O65957N26100M49140K51070O27818
5232D6744062N39604L14931K27804J39806K9523K9911J0736k19361k00521l61724
5222D7254771k60577k79576n87970m40968n36768r70601n66239n62836o69992
5213D2379244o57474p19078l84194l12952p32982p62000r50643o33197j28671
5204C7098053l68813m28527m32167o02101p18663n21981m41340n44169q31081
5195C2209211n50693m47130m81162m61779n51761n44108o22255p09821l02211
$$ y = [29077508, 30171499, 30906763, 31703006, 32588195, 33580376, 34421081, 34970416, 35866460, 36596896, 37197453, 37506657, 37924111, 38677256, 39619762, 40276268, 40813810, 40938914, 41652776, 42529276, 43001405, 43715519, 44223977, 44889934, 45416034, 45865174, 46116244, 46744062, 47283666, 47598597, 47826401, 47966207, 47995730, 48025641, 48036377, 47817016, 47616495, 47254771, 46994194, 46714618, 46126648, 45685680, 45148912, 44178311, 43612072, 43049236, 42379244, 41721770, 41002692, 40618498, 40305546, 39572564, 38810564, 37859921, 37226724, 37098053, 36729240, 36300713, 35868546, 35266445, 34547782, 34025801, 33584461, 33040292, 32209211, 31658518, 31211388, 30730226, 30268447, 29716686, 29172578, 28550323, 27840502, 27538291]
5186B7538291o25032o29841m16147o93012l21074r8303l97314o70349k59317j22351
5176B3305551n75534l14949p0512l75104j44663p7201k39158j91480n0647o1425
5166B1204878j8020n9058L07793N3767m01523k23445N4834J58755j08052k22226
5156B0747703K10335J0273l280Q0244m2606L89155o969l79918K36463K88936J97594
5145B1727930k36016j38169P4465K50121j5347M4481N3508P2565R5247k56230
5135B1672555J01446p1085n8920j7978N6154k6051N3440J22582J44002J60103
5125B2136248k9246r2745k20113k49515J44205J93151K03899J22228r3473l68382
5115B1746257O3098L37444k05753Q00O2424K5836Q2297j3603M7480J53134P2637
$$ y = [27538291, 26913259, 26283418, 25867271, 25174259, 24853185, 24754882, 24357568, 23687219, 23427902, 23305551, 22730017, 22415068, 22344556, 21969452, 21824789, 21747588, 21508430, 21316950, 21266303, 21204878, 21186858, 21127800, 21435593, 21489360, 21087837, 20864392, 20919226, 21077981, 20969929, 20747703, 20958038, 20968311, 20965031, 21045275, 21002669, 21391824, 21384855, 21004937, 21241400, 21530336, 21727930, 21491914, 21353745, 21428210, 21678331, 21662984, 21707465, 21760973, 21833538, 21928785, 21672555, 21774001, 21702916, 21643996, 21626018, 21682172, 21656121, 21709561, 21832143, 21976145, 22136248, 22107002, 22014257, 21794144, 21544629, 21688834, 21881985, 22085884, 22208112, 22114639, 21746257, 21809355, 22146799, 21941046, 21941846, 22004270, 22030106, 22112403, 22098800, 22146280, 22299414, 22372051]
5104B2372051O146J21530k19035j01037J56213K48945K97334k05980k01438L62034
5094B2836763O7284k90696l14485j7700L04899O7643J20410J6969j73235K4535
5084B2642387l02950J73931J46367Q2119q3861J12227K29637k42199j71808R8245
5074B2684095J14920M6421L24628M2848J67860j26793J36220q8001R810K14059
5064B3526067K2362K44605j81078j3954L02657J5826K18251K0620K8306K84135
5054B4467797n1185j61343K06485J1009J33753J32828n5354J43390J52710k2766
5044B4957324j4416J20475K8658K8455L7813O416N9380M9685R2163M46756O8846
5033B5881555K07170K4557J28482J60363J95007K71173J26003R5439O9030O40675
$$ y = [22372051, 22378197, 22499727, 22280692, 22179655, 22335868, 22584813, 22882147, 22676167, 22474729, 22836763, 22904047, 22613351, 22298866, 22281166, 22586065, 22653708, 22774118, 22791087, 22617852, 22642387, 22339437, 22513368, 22659735, 22741854, 22657993, 22770220, 22999857, 22757658, 22585850, 22684095, 22799015, 22845436, 23170064, 23212912, 23380772, 23253979, 23390199, 23302198, 23312008, 23526067, 23548429, 23793034, 23611956, 23598002, 23900659, 23916485, 24134736, 24155356, 24183662, 24467797, 24416612, 24255269, 24461754, 24472763, 24606516, 24739344, 24683990, 24827380, 24980090, 24957324, 24942908, 25063383, 25092041, 25120496, 25158309, 25164725, 25224105, 25273790, 25365953, 25812709, 25881555, 26088725, 26113282, 26241764, 26402127, 26597134, 26868307, 26994310, 27089749, 27158779, 27799454]
5023B7799454L67966O888N5239L89305N44567M81910L50834N71016M85005N84413
5013C1636597K90576N79284Q15849O15374O70244M25963J105703J172440J276403
5004C8588433J476132J814866J847464J952827K501023K610754K632630L113701
4996E6537830L376043L124612L338440L846359M056153M056351M033048L896038
4988H6264874L661204L297745K693464K382611J689787J057488K61291j58713
4980A01149751l84472m89794o31378r80173r18048j64284k93960n16457K11665
4971I6982850L41471J18366O97137K96087J7238K02834p45807j301871j638910
4962I4969395k170878k977520l478094m212606m606084m621128m467841m362358
$$ y = [27799454, 28167420, 28174308, 28229547, 28618852, 29163419, 29645329, 29996163, 30567179, 31052184, 31636597, 31927173, 32506457, 33322306, 33937680, 34607924, 35033887, 36139590, 37312030, 38588433, 40064565, 41879431, 43726895, 45679722, 48180745, 50791499, 53424129, 56537830, 59913873, 63038485, 66376925, 70223284, 74279437, 78335788, 82368836, 86264874, 89926078, 93223823, 95917287, 98299898, 99989685, 101047173, 101308464, 101149751, 100765279, 100275485, 99644107, 98663934, 97745886, 97581602, 97287642, 96771185, 96982850, 97324321, 97442687, 98139824, 98435911, 98453149, 98655983, 97910176, 96608305, 94969395, 92798517, 89820997, 86342903, 82130297, 77524213, 72903085, 68435244, 64072886]
4954F4072886l939314m159510l766944l367227l187145k677652k980106k481067
4946C7513921k350992j672258k016913k050458j731841j438935j227562j542255
4938B3482707q96228j266892q08166o53639p22170r17632r81713p05974m79652
4929A6050641m91485l65897m82271o64197m15011j80259n14428m07408k37392
4920A2292293j09759k75810k65561l99759m39290r3527j32964K7272m0058k21642
4910A0341195k94902K5852k15427m56651J67306j61558n12002j11319L4867K8440
4900H845801J01727J04601l86180j27770l30576J71923K54774l6672l75535p2676
4890H149417l1864j29678J7039k75687K5304k19219J7536N7782k85674j11704
$$ y = [64072886, 60133572, 55974062, 52207118, 48839891, 45652746, 42975094, 39994988, 37513921, 35162929, 33490671, 31473758, 29423300, 27691459, 26252524, 25024962, 23482707, 22586479, 21319587, 20511421, 19857782, 19135612, 18217980, 17236267, 16530293, 16050641, 15559156, 15193259, 14710988, 14046791, 13631780, 13451521, 12937093, 12529685, 12292293, 12182534, 11906724, 11641163, 11241404, 10802114, 10708587, 10575623, 10602895, 10562837, 10341195, 10046293, 10072145, 9856718, 9400067, 9567373, 9405815, 8893813, 8782494, 8817361, 8845801, 8947528, 9052129, 8665949, 8538179, 8207603, 8379526, 8634300, 8597628, 8222093, 8149417, 8117553, 7987875, 8004914, 7729227, 7754531, 7535312, 7552848, 7610630, 7324956, 7213252]
4880G213252R6578k62029J2509j21661l7288O8268l31159R7709m0274j92991r1598
4869F411316K32776Q7827l0632m14224n2273J24940r4449P8694o1540j25200j57195
4858F000040J50997m508m7554m395j80880n9424k09494l3872O4172n035o7262
4847E602785J8147k4489M7880J45819m76667R9673J81399P8566k88656N1029j95128
4836E240358j1745K66550J13849J75234o5286j92348l34832O6544J00661j79224
4826E179761K92294j50656N0572l9164l4396J50537k6459M9112n3414l40000j17436
4815D960751L27022N0476J12183q9864k34056k5628j0538j5154q6374P8803m5924
4804E021697N5358J94036k28591O485j35810J55003K24976J2407j44770K29301
$$ y = [7213252, 7309830, 7047801, 7060310, 6938649, 6901361, 6969629, 6638470, 6736179, 6695905, 6502914, 6411316, 6644092, 6731919, 6701287, 6287063, 6234790, 6359730, 6265281, 6343975, 6282435, 6157235, 6000040, 6151037, 6146529, 6098975, 6094580, 5913700, 5854276, 5644782, 5610910, 5675082, 5670047, 5602785, 5620932, 5596443, 5644323, 5790142, 5313475, 5413148, 5594547, 5673113, 5384457, 5435486, 5240358, 5228613, 5495163, 5609012, 5784246, 5718960, 5526612, 5191780, 5258324, 5358985, 5179761, 5472055, 5321399, 5371971, 5332807, 5298411, 5448948, 5422489, 5471601, 5418187, 5078187, 4960751, 5287773, 5338249, 5450432, 5360568, 5126512, 5100884, 5090346, 5075192, 4988818, 5067621, 5021697, 5077055, 5271091, 5042500, 5048985, 4913175, 5068178, 5293154, 5305561, 5160791, 5390092]
4794E390092J9393L22562k76660k56275j48195k16571j05722K12725L04659J37016
4784E383024k84143K00631j5867j17235M1564J38845J70527j03312p5751j16324
4774E221959J73306J04036N032K05993r9596m1763j66552j84013J93368j69671
4764E242099K21705J05110j1012l20912l97022K14945K43803j2781k09177l6990
4754E039768L9622K08889L6749q1844o1812J90636K80084k74858Q5029Q9173J49000
4743E700436J85467j88872j56949M2216m7561J96036k11913P4583M7160j12654
4733E527949J11892j01468M8141j87616K1516J22627J45589j6158P3243K12583
4723E958298j74106K40289r5765j96736J28192K30674L6675K46036j21578J10566
$$ y = [5390092, 5409485, 5732047, 5455387, 5199112, 5050917, 4834346, 4728624, 4941349, 5246008, 5383024, 5098881, 5299512, 5283645, 5166410, 5207974, 5346819, 5517346, 5414034, 5338283, 5221959, 5395265, 5499301, 5504333, 5710326, 5610730, 5568967, 5402415, 5218402, 5411770, 5242099, 5463804, 5568914, 5557902, 5236990, 4839968, 5054913, 5298716, 5285935, 5076758, 5039768, 5079390, 5288279, 5325028, 5243184, 5181372, 5372008, 5652092, 5377234, 5462263, 5551436, 5700436, 5885903, 5697031, 5540082, 5582298, 5534737, 5730773, 5518860, 5593443, 5640603, 5527949, 5639841, 5538373, 5586514, 5398898, 5420414, 5543041, 5688630, 5672472, 5745715, 5958298, 5784192, 6024481, 5928716, 5731980, 5860172, 6090846, 6127521, 6373557, 6251979, 6362545]
4713F362545l5158M3274J68916p0980k61178k45119k6051K36822P3089J80185
4703F426345j82662J35740J38960N1756J27603J18928p9787J2004J62648K19666
4693G131201J35227j23880j22685k21665L32086j43864M5653O6937J71419l1971
4683G238458m7903K985J17630Q611J08797M6899N0844m9385O7372O1110K85939
4672G891357J34641j34727M31804O656k90773K55933J91738J66313p303o3682
4662H581957K22656K11957o5296p7188M34712Q866K6763o8895L657K25365j0148
4651I494406J81683J51601K129L92654J96587j00634K39594O1047o2147J884M17133
4640A0975937J88327N1617N0636J99185j22119j42172J53796K37646J88181L74471
$$ y = [6362545, 6327387, 6370661, 6539577, 6468597, 6207419, 5962300, 5936249, 6173071, 6246160, 6426345, 6243683, 6379423, 6518383, 6570139, 6697742, 6816670, 6736883, 6748887, 6911535, 7131201, 7266428, 7142548, 7019863, 6798198, 7130284, 6986420, 7032073, 7099010, 7270429, 7238458, 7190555, 7193540, 7311170, 7319781, 7428578, 7475477, 7526321, 7476936, 7544308, 7605418, 7891357, 8025998, 7891271, 8323075, 8329731, 8038958, 8294891, 8486629, 8652942, 8645639, 8581957, 8804613, 9016570, 8951274, 8874086, 9308798, 9317664, 9344427, 9275532, 9279189, 9504554, 9494406, 9676089, 9827690, 9829819, 10222473, 10419060, 10318426, 10558020, 10619067, 10556920, 10558804, 10975937, 11164264, 11215881, 11266517, 11465702, 11343583, 11201411, 11355207, 11592853, 11781034, 12155505]
4630A2155505R1273K75549J0297J92259q8960K33793M75359L22294M96806M07017
4620A4571192M59620M41941Q78274N91866Q60981Q31167J135534J315209J466130
4611B2551914J592197K012632K403056K645598L124299L668339M148395M371635
4603D6518065M797108N323880N870622N486723N856170N550554N327943N846024
4595I0577089N835717O415170O328181N912822N721710M952762L912714L663897
4587A33320062K978256K928241K825895K550932J388056K05375j235402k631488
4579A42329927l531323l734882m095003m117620m343428m662316n267066n834743
4571A06743546o372309o166640o076949o065445n619026n584453n534668n329846
$$ y = [12155505, 12246778, 12522327, 12532624, 12724883, 12635923, 12869716, 13345075, 13667369, 14164175, 14571192, 15030812, 15472753, 16351027, 16942893, 17803874, 18635041, 19770575, 21085784, 22551914, 24144111, 26156743, 28559799, 31205397, 34329696, 37998035, 42146430, 46518065, 51315173, 56639053, 62509675, 67996398, 73852568, 79403122, 84731065, 90577089, 96412806, 102827976, 109156157, 115068979, 120790689, 125743451, 129656165, 133320062, 136298318, 139226559, 142052454, 144603386, 145991442, 146196817, 144961415, 142329927, 138798604, 135063722, 130968719, 126851099, 122507671, 117845355, 112578289, 106743546, 100371237, 94204597, 88127648, 82062203, 76443177, 70858724, 65324056, 59994210]
4563E9994210n259193n239872n169786m446816l824999l461972k763841k777297
4555B7050434k445164k139894j768120j322327j277015j218253j134851j045001
4547A4699809q15563o36065n91216n96458l45441q17675n56898m81620j78251
4538I680622q8188j66724k60486m11120k11351k64905k14717l4024K39058k74100
4528G994065j43877K7484j3268p4341k35670J6586k30820j75635o0964l7540q4800
4517F981220R2994l6933J9002R488j5338k32799l9886N7441k22182Q2827M1894
4506F737728J67261L9896l11229Q0666j17142m1079J60401L47437J04332k50335
4496F917936m5629k08634J19387J88514j92413o7218l1202L8303R6445j68399
$$ y = [59994210, 54735017, 49495145, 44325359, 39878543, 36053544, 32591572, 29827731, 27050434, 24605270, 22465376, 20697256, 19374929, 18097914, 16879661, 15744810, 14699809, 13884246, 13248181, 12656965, 12060507, 11715066, 10897391, 10340493, 9858873, 9680622, 9592434, 9425710, 9165224, 8754104, 8542753, 8277848, 8063131, 8029107, 8268165, 7994065, 7850188, 7877672, 7864404, 7790063, 7554393, 7570979, 7340159, 7164524, 7103560, 7066020, 6981220, 7074214, 7037281, 7056283, 7065771, 7050433, 6817634, 6777748, 6835189, 6613007, 6695834, 6737728, 6904989, 6944885, 6633656, 6714322, 6597180, 6556101, 6716502, 7063939, 7168271, 6917936, 6872307, 6663673, 6783060, 6971574, 6779161, 6711943, 6680741, 6719044, 6815489, 6647090]
4486F647090l18380J75183K77622j52516k12768k91019k97373q2504J82815o0859
4476E867291J92840J92798j25453j79j40077l35047J66509K13967o2692n0259
4466E919698j17287K40039R7075j04509j25300p4665R7716Q9230j59103k4571
4456E838323j38455K09834n1051q5607K49434k258l27M6875j96390N1197J43198
4445F064773j21471P5099L485J40471k178j83940j32235O5333N6052M5454J28301
4434F139144j40098L19872K38478l03221j30502l03835j05855J28673J36262L8623
4424F017541M0451J79751M9182J50788O5934o8000l2225l7575j54071P887L37248
4413F556911j9571K2064l8948L36510r1361j70037j83454O6800J54219R9605q7897
$$ y = [6647090, 6328710, 6503893, 6781515, 6628999, 6416231, 6125212, 5827839, 5745335, 5928150, 5867291, 6060131, 6252929, 6127476, 6127297, 5987220, 5652173, 5818682, 6032649, 5969957, 5919698, 5802411, 6042450, 6139525, 6035016, 5909716, 5835051, 5932767, 6021997, 5862894, 5838323, 5699868, 5909702, 5858651, 5773044, 6022478, 6020220, 6019893, 6066768, 5870378, 5921575, 6064773, 5943302, 6018401, 6021886, 6162357, 6160179, 5976239, 5844004, 5909337, 5965389, 6010843, 6139144, 5999046, 6318918, 6557396, 6254175, 6123673, 5819838, 5713983, 5842656, 5978918, 6017541, 6057992, 6237743, 6286925, 6437713, 6503647, 6435647, 6403422, 6365847, 6211776, 6219663, 6556911, 6537340, 6559404, 6520456, 6856966, 6765605, 6595568, 6412114, 6478914, 6633133, 6732738, 6644841]
4402F644841j45387j43344M3102M09412j9742j14290J8429J09463l272K07793
4392G007005j98578J2645m8048n4238J27294j7406q1344j65217K19384q5008j9461
4381F697028R6616j00029N0054L35567J18384K90850k70756j1797o8508p5355
4371G062054K78088m6191k70302J80138J69415l8663K49723K47673j52281P5794
4361G755448K08852l52114K6515Q0695M8451J59232J55982O923k34967j18000
4351G737017N45143K12470J0667m3044j33339J07800J55880O7547m7714j92148
4341H420279K13911K91727o437k49373L34787n8079J31389n9787l33617K21689
4331H906489K15237L2962P7895P006J57065p408j86681J75199q184N2439m18515
$$ y = [6644841, 6499454, 6356110, 6399212, 6808624, 6788882, 6674592, 6693021, 6802484, 6799212, 7007005, 6808427, 6821072, 6773024, 6718786, 6846080, 6828674, 6747330, 6582113, 6801497, 6716489, 6697028, 6793644, 6693615, 6743669, 7079236, 7197620, 7488470, 7217714, 7205917, 7137409, 7062054, 7340142, 7293951, 7023649, 7203787, 7373202, 7334539, 7584262, 7831935, 7679654, 7755448, 7964300, 7612186, 7638701, 7719396, 7767847, 7927079, 8083061, 8089984, 7855017, 7737017, 8282160, 8494630, 8505297, 8462253, 8328914, 8436714, 8592594, 8660141, 8612427, 8420279, 8634190, 8925917, 8919480, 8670107, 9004894, 8946815, 9078204, 9018417, 8684800, 8906489, 9121726, 9154688, 9232583, 9239589, 9396654, 9389246, 9202565, 9377764, 9369580, 9422019, 9003504]
4320I003504J70425M44012J97181j10585j44673O078K21270O3062k461J31486
4310I979299J0674L74955J53224j72605J37579L37967k42604R6834j32788L23231
4300A0865766L30124m1471M6151j3067R876j02282K79822L30993K83955J29688
4290A2119555q9533K01631J97970J30599J90127J01028K03233r5244J64569K03775
4280A3327710J11241J43958J87657R8137N16616M67081j8732J16600L0546M24018
4270A5404832J26025J41957M04996K1207J66944L97469L09056K88315M53840J24849
4260A7839490K15662J38151L85594O01942K79475N00128L20421L96524P49514
4251B1426901M55517M34538R74848P60309P18741Q42763Q86936J172928J177540
$$ y = [9003504, 9173929, 9617941, 9815122, 9704537, 9559864, 9565942, 9787212, 9850274, 9847813, 9979299, 9989973, 10364928, 10518152, 10345547, 10483126, 10821093, 10578489, 10675323, 10542535, 10865766, 11195890, 11154419, 11200570, 11187503, 11197379, 11095097, 11374919, 11705912, 11989867, 12119555, 12030022, 12231653, 12429623, 12560222, 12750349, 12851377, 13054610, 12959366, 13123935, 13327710, 13438951, 13582909, 13770566, 13868703, 14385319, 14852400, 14833668, 14950268, 14980814, 15404832, 15530857, 15672814, 16077810, 16099017, 16265961, 16663430, 16972486, 17260801, 17714641, 17839490, 18055152, 18193303, 18578897, 19180839, 19460314, 19960442, 20280863, 20677387, 21426901, 21882418, 22316956, 23291804, 24052113, 24770854, 25613617, 26500553, 27673481, 28851021]
4242B8851021Q83573J036762J505998J475326R21733J503977J678161J898534
4234C9755085J653627J840402K044488J796595K078247K123331K213498K563460
4226E6068733K313044K089949K260789K647761K589900K122800K176662K518689
4218G4788327L070342L127396L067510L391487L674578L983529L817373L795796
4210A02716338L680526M188082M853002M913961M567115M771202N879988P182073
4202A42752287P493484O779278N356560L511509K847847l322798q464052r027537
4194A47926578q636209r478573r424659q568109p091908n803128m617627l956842
4186I0349523l783508l755529l330697k963427l116189l009528k982342k983633
$$ y = [28851021, 29734594, 30771356, 32277354, 33752680, 34674413, 36178390, 37856551, 39755085, 41408712, 43249114, 45293602, 47090197, 49168444, 51291775, 53505273, 56068733, 58381777, 60471726, 62732515, 65380276, 67970176, 70092976, 72269638, 74788327, 77858669, 80986065, 84053575, 87445062, 91119640, 95103169, 98920542, 102716338, 106396864, 110584946, 115437948, 120351909, 124919024, 129690226, 135570214, 142752287, 150245771, 157025049, 162381609, 165893118, 168740965, 165418167, 156954115, 147926578, 139290369, 129811796, 120387137, 111819028, 104727120, 98923992, 94306365, 90349523, 86566015, 82810486, 79479789, 76516362, 73400173, 70390645, 67408303, 64424670]
4178F4424670l072988k687328k796853k944244k332012j883599k203945k175926
4170D4327775j806884j402078j572370j528570j605187j475242j037103r56877
4162C2943464r25253j099022q84794j141587n32489o76612p84691n84542n90797
4153B5723677m94726n44167o98843l25653p2244l71025k40937l04118k46567k19470
4143B2205927K46185k19743N8156R4950Q2235k00692J22348J51859q9639N63819
4133B3015405R8731J84400L46659N8599K73036K65602N7321Q3611J52312L94748
4123B4930424M30889K89516K95246K41595O94978L73592M51148L26591J36640
4114B8170619K89899L85007N69961N27665N53606K77416M36945O39191O02075
$$ y = [64424670, 61351682, 58664354, 55867501, 52923257, 50591245, 48707646, 46503701, 44327775, 42520891, 41118813, 39546443, 38017873, 36412686, 34937444, 33900341, 32943464, 32018211, 30919189, 30034395, 28892808, 28360319, 27683707, 26899016, 26314474, 25723677, 25228951, 24684784, 23985941, 23660288, 23588044, 23217019, 22976082, 22671964, 22425397, 22205927, 22452112, 22232369, 22290525, 22385475, 22467710, 22267018, 22389366, 22541225, 22451586, 23015405, 23114136, 23298536, 23645195, 23703794, 23976830, 24242432, 24299753, 24383364, 24535676, 24930424, 25361313, 25650829, 25946075, 26187670, 26882648, 27256240, 27707388, 28033979, 28170619, 28460518, 28845525, 29415486, 29943151, 30496757, 30774173, 31211118, 31850309, 32452384]
4105C2452384Q45034N93030Q32783J000450Q34597Q65056J061055J046855J113568
4096D0644812J397708J684874J655338J856188J269682J979715K120716K272544
4088E4881577L028013K743993L372952L424776L368822M095193M629933M386751
4080H3932010M916477N392142N093092N855337O277767O276203O695972O701978
4072A31140978O889611O308757O364791O118774N847775N756141M934786M480654
4064A77842267L788301L054670K111676J568414Q63242M06879m44411r77744j994456
4055A86218838k557600k849209l518638l870335m355608n128778n252749n374484
4047A53311437n868884n923588o329272o497746o100771o155075o277937n774732
$$ y = [32452384, 33297418, 33890448, 34723231, 35723681, 36558278, 37423334, 38484389, 39531244, 40644812, 42042520, 43727394, 45382732, 47238920, 48508602, 50488317, 52609033, 54881577, 57909590, 60653583, 64026535, 67451311, 70820133, 74915326, 79545259, 83932010, 88848487, 94240629, 99333721, 105189058, 111466825, 117743028, 124439000, 131140978, 138030589, 144339346, 150704137, 156822911, 162670686, 168426827, 173361613, 177842267, 181630568, 184685238, 186796914, 188365328, 189228570, 189635449, 189191038, 188213294, 186218838, 183661238, 180812029, 177293391, 173423056, 169067448, 163938670, 158685921, 153311437, 147442553, 141518965, 135189693, 128691947, 122591176, 116436101, 110158164, 104383432]
4039A04383432n968126n696567n201939m849837m609601m366096l936587l734324
4031F6020355l754128l333862l033444k620298k627867k699825k399575j905065
4023D3646291j627622j812964j626132j606493j250610j285996j176938q85572
4015C2373964j454443r23064p16205q98509o82654n84695o10763n93326q58224
4006B5052081l90029n06866q02763n91596l18044o28380m97361l69514m24758
3997B0522770p99648k1116k74212o94684k93625m45776k74741k96402q5532k00599
3987A7136435l07024k09358j46517l02143m61920m5824m00588k71670l02371j14249
3977A4574771j83382m08417j10957k52721j84292k44387J0576n0925k05629k14751
$$ y = [104383432, 98415306, 92718739, 87516800, 82666963, 78057362, 73691266, 69754679, 66020355, 62266227, 58932365, 55898921, 53278623, 50650756, 47950931, 45551356, 43646291, 42018669, 40205705, 38579573, 36973080, 35722470, 34436474, 33259536, 32373964, 30919521, 29996457, 29280252, 28381743, 27699089, 27114394, 26503631, 25910305, 25052081, 24662052, 24155186, 23352423, 22760827, 22442783, 21814403, 21317042, 20947528, 20522770, 19723122, 19702006, 19427794, 18733110, 18439485, 17993709, 17718968, 17422566, 17337034, 17136435, 16829411, 16620053, 16473536, 16171393, 15709473, 15663649, 15263061, 14991391, 14689020, 14574771, 14391389, 13982972, 13872015, 13619294, 13435002, 13190615, 13201191, 13150266, 12944637, 12729886]
3967A2729886l1140l00104q8675r1566j18237m0066n5341l11632M6617j32513
3957A1607229P0020p2806J61259k43225l65693J6037n7732q4390m1557o0377J18872
3946A1047637J29945l03223L16577j12356o8624k387n6857j08680j04183J14504
3936A0852353j61639K8540p0524M34861J26390k50904k40971j65122P4297k2231
3926A0605050q6018K77870R7553k79596L94419K08984m10521R5402K18450j05462
3916A1016131K52600j66908J69623O3621k16863J03235Q9642P1212J92575j15858
3906A1459010k9581m3188j16976K09797N20895l23017k36037L26321o4860L9673
3896A1742037o0279n10K44648J65921o8208Q0415J98339l8808J41150J35473K46780
$$ y = [12729886, 12698746, 12398642, 12309967, 12218401, 12100164, 12060098, 12004757, 11693125, 11739742, 11607229, 11677249, 11604443, 11765702, 11522477, 11156784, 11172821, 11115089, 11030699, 10989142, 10928765, 11047637, 11177582, 10874359, 11190936, 11078580, 11009956, 11007569, 10950712, 10842032, 10737849, 10852353, 10690714, 10719254, 10648730, 11083591, 11209981, 10959077, 10718106, 10552984, 10627281, 10605050, 10519032, 10796902, 10894455, 10614859, 11009278, 11218262, 10807741, 10903143, 11121593, 11016131, 11268731, 11101823, 11271446, 11335067, 11118204, 11221439, 11311081, 11382293, 11574868, 11459010, 11429429, 11386241, 11269265, 11479062, 11999957, 11676940, 11440903, 11767224, 11702364, 11742037, 11681758, 11681248, 11925896, 12091817, 12023609, 12104024, 12302363, 12263555, 12404705, 12540178, 12786958]
3885A2786958O9413j36705k10660Q5946J82096J28498K12729j82716M0340J31716
3875A3107615L81499K47110J46545M927J37083K69895L91402M90454K08370K590
3865A5387490j71059K64384O99509L89069K48118M31262N05205L05494L92219
3856A8451691M49667L62524O20100P39630P55321Q05100L41817N78976Q35170
3847B3939996P41329M61174P76571L72578L23887J097106P13989M90969P72455
3838B9690054O01455L70185Q14189M08725K54073N49027L45643K62916Q3765J46659
3828C3526691K67762L68707L3346J26723l10552k29039m4093L03722j78272k48714
3818C3616281J9795k58753L1794J60227N6739J70308K81002L7285N84314M62469
$$ y = [12786958, 12856371, 12719666, 12509006, 12594952, 12777048, 12905546, 13118275, 12935559, 12975899, 13107615, 13489114, 13736224, 13882769, 13887696, 14024779, 14294674, 14686076, 15176530, 15384900, 15387490, 15216431, 15480815, 16180324, 16569393, 16817511, 17248773, 17753978, 18059472, 18451691, 18901358, 19263882, 19883982, 20623612, 21378933, 22184033, 22525850, 23104826, 23939996, 24681325, 25142499, 25919070, 26291648, 26615535, 27712641, 28426630, 28917599, 29690054, 30291509, 30661694, 31475883, 31884608, 32138681, 32687708, 33033351, 33296267, 33380032, 33526691, 33794453, 34163160, 34196506, 34323229, 34012677, 33783638, 33739545, 34043267, 33864995, 33616281, 33636076, 33377323, 33409117, 33569344, 33626083, 33796391, 34077393, 34114678, 34698992, 35161461]
3808C5161461O59188O33365P58755R63340Q42182J039589J365248J178853J437023
3799D4039004J595494J847744K042872K275514K379676K103070K603635K674099
3791F1561108K556628K454530K670965K848900K531221K542078K588750K675491
3783H2429671K504970K341965K317806K301539J944616J687019J619770J981830
3775I9129186J514594J189087J263451P33944O39899R68944P10664N28158M73051
3766A07150978L43716K6177K67639Q1800J58494O9019o6252m64357l70358j61077
3756A07035779k65778l34046l85890m58201k52196l04102o80244n50191q02688
3747A03002443q46790r61338q42865j135272j171399j510370j733390j629413
$$ y = [35161461, 35820649, 36454014, 37212769, 38176109, 39018291, 40057880, 41423128, 42601981, 44039004, 45634498, 47482242, 49525114, 51800628, 54180304, 56283374, 58887009, 61561108, 64117736, 66572266, 69243231, 72092131, 74623352, 77165430, 79754180, 82429671, 84934641, 87276606, 89594412, 91895951, 93840567, 95527586, 97147356, 99129186, 100643780, 101832867, 103096318, 103830262, 104470161, 105439105, 106149769, 106677927, 107150978, 107494694, 107520871, 107788510, 107870310, 108028804, 108097823, 108031571, 107567214, 107196856, 107035779, 106770001, 106435955, 106050065, 105591864, 105339668, 105035566, 104355322, 103805131, 103002443, 102155653, 101194315, 100351450, 99216178, 98044779, 96534409, 94801019, 93171606]
3739I3171606k077727k066271j798310k453141k169096k351984k321683k374327
3731G5559067k358613k520441k694494k628095k509287k431434k515611k381728
3723E5519364k096282k429730k180187k108290k244181j815098j706876j477882
$$ y = [93171606, 91093879, 89027608, 87229298, 84776157, 82607061, 80255077, 77933394, 75559067, 73200454, 70680013, 67985519, 65357424, 62848137, 60416703, 57901092, 55519364, 53423082, 50993352, 48813165, 46704875, 44460694, 42645596, 40938720, 39460838]
$$ [...]
##END NTUPLES=NMR SPECTRUM
##END=
