##TITLE=1H_DE-80H_X3
 200.13MHz, d2o
 8 sc
 
 19ns.26.2.2025
##JCAMPDX= 6.0         $$ Bruker NMR JCAMP-DX V2.0
##DATA TYPE= NMR SPECTRUM
##DATA CLASS= NTUPLES
##ORIGIN= UXNMR, Bruker Analytische Messtechnik GmbH
##OWNER= pz
$$ XWIN-NMR		Version 3.5
$$ Mon Oct 20 12:11:38 2025 Russian Standard Time (UT+4h)  Yarkov@DPX200
##.OBSERVE FREQUENCY= 200.1313
##.OBSERVE NUCLEUS= ^1H
##.ACQUISITION MODE= SIMULTANEOUS
##.ACQUISITION SCHEME= undefined
##.AVERAGES= 8
##.DIGITISER RES= 18
##SPECTROMETER/DATA SYSTEM= spect
##.PULSE SEQUENCE= zg30
##.SOLVENT NAME= CDCl3
##.SHIFT REFERENCE= (INTERNAL, CDCl3, 0, 15.4968)
##AUDIT TRAIL= $$ (NUMBER, WHEN, WHO, WHERE, WHAT)
$$ ##TITLE= Audit trail, XWIN-NMR		Version 3.5
$$ ##JCAMPDX= 5.01
$$ ##ORIGIN= Bruker BioSpin GmbH
$$ ##OWNER= Yarkov
$$ C:/Bruker/XWIN-NMR/data/yarkov2/nmr/H-C/1/pdata/1/auditp.txt
$$ ##AUDIT TRAIL=  $$ (NUMBER, WHEN, WHO, WHERE, WHAT)
(   1,<2025-10-20 12:10:46.04 +0400>,<Yarkov>,<DPX200>,
      <created by zg, POWCHK disabled, PULCHK disabled
       configuration hash MD5:
       00 E9 B6 7A A2 85 ED C7 34 08 36 98 17 FE 4E 26
       data hash MD5: 16K
       22 AC 9B 39 1C E1 BA 7C 1A 70 D3 04 78 AE 17 51>)
(   2,<2025-10-20 12:10:50.03 +0400>,<Yarkov>,<DPX200>,
      <Start of raw data processing
       efp BC_mod = 2 LB = 0.25 FT_mod = 6 PKNL = 1 PHC0 = -4079.816 PHC1 = 14.22191 SI = 16K 
       data hash MD5: 16K
       10 F0 AA 8C 9B F7 7B 35 1F AB 01 E9 16 3E 34 85>)
(   3,<2025-10-20 12:11:00.59 +0400>,<Yarkov>,<DPX200>,
      <abs ABSG = 5 
       data hash MD5: 16K
       2C 68 FA 78 C3 BD 62 69 D5 6A 98 30 8C 06 B4 A4>)
$$ ##END=
$$ 
$$ hash MD5
$$ F7 3D D2 8A 7C 08 59 02 C9 AA 77 74 2D 37 B2 52
##$RELAX= 
##$RELAX= 
##$RELAX= 
##$RELAX= 
##$RELAX= 
##$RELAX= 
$$ Bruker specific parameters
$$ --------------------------
##$DU= <C:/Bruker/XWIN-NMR>
##$EXPNO= 1
##$NAME= <H-C>
##$PROCNO= 1
##$TYPE= <nmr>
##$USER= <yarkov2>
##$AMP= (0..31)
100 100 100 100 100 100 100 100 100 100 100 100 100 100 100 100 100 100 
100 100 100 100 100 100 100 100 100 100 100 100 100 100 
##$AQSEQ= 0
##$AQ_mod= 1
##$AUNM= <au_zg>
##$AUTOPOS= <>
##$BF1= 200.13
##$BF2= 200.13
##$BF3= 200.13
##$BF4= 200.13
##$BF5= 200.13
##$BF6= 200.13
##$BF7= 200.13
##$BF8= 200.13
##$BYTORDA= 1
##$CFDGTYP= 0
##$CFRGTYP= 5
##$CHEMSTR= <none>
##$CNST= (0..31)
1 1 145 1 1 1 1 1 1 1 1 1 1 1 1 1 1 1 1 1 1 1 1 1 1 1 1 1 1 1 1 1 
##$CPDPRG= <>
##$CPDPRG1= <>
##$CPDPRG2= <>
##$CPDPRG3= <>
##$CPDPRG4= <mlev>
##$CPDPRG5= <mlev>
##$CPDPRG6= <mlev>
##$CPDPRG7= <mlev>
##$CPDPRG8= <mlev>
##$CPDPRGB= <>
##$CPDPRGT= <>
##$D= (0..31)
0 0.7 0 0 0 0 0 0 0 0 0 0.03 0 0 0 0 0 0 0 0 0 0 0 0 0 0 0 0 0 0 0 0 
##$DATE= 1760947845
##$DBL= (0..7)
120 120 120 120 120 120 120 120 
##$DBP= (0..7)
150 150 150 150 150 150 150 150 
##$DBP07= 0
##$DBPNAM0= <>
##$DBPNAM1= <>
##$DBPNAM2= <>
##$DBPNAM3= <>
##$DBPNAM4= <>
##$DBPNAM5= <>
##$DBPNAM6= <>
##$DBPNAM7= <>
##$DBPOAL= (0..7)
0.5 0.5 0.5 0.5 0.5 0.5 0.5 0.5 
##$DBPOFFS= (0..7)
0 0 0 0 0 0 0 0 
##$DE= 6
$$ [...]
##$SUBNAM3= <"">
##$SUBNAM4= <"">
##$SUBNAM5= <"">
##$SUBNAM6= <"">
##$SUBNAM7= <"">
##$SUBNAM8= <"">
##$SUBNAM9= <"">
##$SW= 18.0517328524113
##$SWIBOX= (0..15)
0 0 2 0 0 0 0 0 0 0 0 0 0 0 0 0 
##$SW_h= 3612.71676300578
##$TD= 16384
##$TD0= 1
##$TE= 0
##$TE2= 300
##$TE3= 300
##$TEG= 300
##$TL= (0..7)
0 120 120 120 120 120 120 120 
##$TP= (0..7)
150 150 150 150 150 150 150 150 
##$TP07= 0
##$TPNAME0= <>
##$TPNAME1= <>
##$TPNAME2= <>
##$TPNAME3= <>
##$TPNAME4= <>
##$TPNAME5= <>
##$TPNAME6= <>
##$TPNAME7= <>
##$TPOAL= (0..7)
0.5 0.5 0.5 0.5 0.5 0.5 0.5 0.5 
##$TPOFFS= (0..7)
0 0 0 0 0 0 0 0 
##$TUNHIN= 0
##$TUNHOUT= 0
##$TUNXOUT= 0
##$USERA1= <user>
##$USERA2= <user>
##$USERA3= <user>
##$USERA4= <user>
##$USERA5= <user>
##$V9= 5
##$VALIST= <valist>
##$VCLIST= <CCCCCCCCCCCCCCC>
##$VD= 0
##$VDLIST= <DDDDDDDDDDDDDDD>
##$VPLIST= <PPPPPPPPPPPPPPP>
##$VTLIST= <TTTTTTTTTTTTTTT>
##$WBST= 1024
##$WBSW= 4
##$XGAIN= (0..3)
0 0 0 0 
##$XL= 0
##$YL= 0
##$YMAX_a= 1079436
##$YMIN_a= -1183376
##$ZGOPTNS= <>
##$ZL1= 120
##$ZL2= 120
##$ZL3= 120
##$ZL4= 120
##$ABSF1= 15.47831
##$ABSF2= -2.57354
##$ABSG= 5
##$ABSL= 3
##$ALPHA= 0
##$AQORDER= 0
##$ASSFAC= 0
##$ASSFACI= 0
##$ASSFACX= 0
##$ASSWID= 0
##$AUNMP= <proc_1d>
##$AZFE= 0.1
##$AZFW= 0.1
##$BCFW= 0
##$BC_mod= 2
##$BYTORDP= 0
##$COROFFS= 0
##$CY= -3
##$DATMOD= 1
##$DC= 0
##$DFILT= <>
##$DTYPP= 0
##$F1P= 0
##$F2P= 0
##$FCOR= 1
##$FTSIZE= 16384
##$FT_mod= 6
##$GAMMA= 0
##$GB= 0
##$INTBC= 1
##$INTSCL= 3.241238e-09
##$ISEN= 128
##$LB= 0.25
##$LEV0= 0
##$LPBIN= 0
##$MAXI= 10000
##$MC2= 0
##$MEAN= 0
##$ME_mod= 0
##$MI= 1.114404
##$NCOEF= 0
##$NC_proc= -5
##$NLEV= 6
##$NOISF1= 3.799351
##$NOISF2= 2.8
##$NSP= 0
##$NTH_PI= 0
##$NZP= 0
##$OFFSET= 15.49678
##$PC= 1
##$PHC0= -4079.816
##$PHC1= 14.22191
##$PH_mod= 1
##$PKNL= yes
##$PPARMOD= 0
##$PSCAL= 0
##$PSIGN= 0
##$REVERSE= no
##$SF= 200.130004988032
##$SI= 16384
##$SIGF1= 3
##$SIGF2= 2
##$SINO= 0.751879
##$SIOLD= 32768
##$SREGLST= <19F.Aceton>
##$SSB= 0
##$STSI= 16384
##$STSR= 0
##$SW_p= 3612.71676300578
##$SYMM= 0
##$S_DEV= 0
##$TDeff= 16384
##$TDoff= 0
##$TI= <>
##$TILT= no
##$TM1= 0
##$TM2= 0
##$TOPLEV= 0
##$USERP1= <user>
##$USERP2= <user>
##$USERP3= <user>
##$USERP4= <user>
##$USERP5= <user>
##$WDW= 1
##$XDIM= 16384
##$YMAX_p= 276342159
##$YMIN_p= -1156250
$$ End of Bruker specific parameters
$$ ---------------------------------
##NTUPLES= NMR SPECTRUM
##VAR_NAME=  FREQUENCY,     SPECTRUM/REAL,   SPECTRUM/IMAG
##SYMBOL=    X,             R,               I
##VAR_TYPE=  INDEPENDENT,   DEPENDENT,       DEPENDENT
##VAR_FORM=  AFFN,          ASDF,            ASDF
##VAR_DIM=   16384,         16384,           16384
##UNITS=     HZ,            ARBITRARY UNITS, ARBITRARY UNITS
##FACTOR=    0.220516191357247, 1,           1
##FIRST=     3101.37073785142, 0,            0
##LAST=      -511.346025154365, 0,           0
##MIN=       -511.346025154365, -1156250,    0
##MAX=       3101.37073785142, 276342159,    0
$$ Real data points
##PAGE= N=1
##DATA TABLE= (X++(R..R)), XYDATA
$$ [...]
6536D84339M6592J05178Q8547K8364Q9466Q4879O9488R3452J00137J13651J51733
$$ 484339 530931 636109 724656 753020 842486 927365 996853 1090305 1190442 1304093 1455826
6525A455826J24270J79261J67711J92848K39965J92519K63138L67511M02200L57422
$$ 1455826 1580096 1759357 1927068 2119916 2359881 2552400 2815538 3183049 3585249 3942671
6515C942671L97470M60181M89417M00693L44187L46386K09209R4800l3019j43577
$$ 3942671 4340141 4800322 5289739 5690432 6034619 6381005 6590214 6685014 6651995 6508418
6505F508418k56844l28864k82489k07875k33274k25227j61277k24457p8291n2999
$$ 6508418 6251574 5922710 5640221 5432346 5199072 4973845 4812568 4588111 4509820 4456821
6495D456821q0508j6620m5222N605Q145M7677J18837N5608M7717P0126O9742Q7357
$$ 4456821 4376313 4359693 4314471 4320076 4328221 4375898 4494735 4550343 4598060 4668186 4737928 4825285
6483D825285n591j3311j36550j39516j48433k18600k18994j76786j77649j58611
$$ 4825285 4819694 4806383 4669833 4530317 4381884 4163284 3944290 3767504 3589855 3431244
6473C431244j74554j48490j55218j53551j47942j33905j21722o4095o3610j0949
$$ 3431244 3256690 3108200 2952982 2799431 2651489 2517584 2395862 2331767 2268157 2257208
6463B257208q2415l4927k5141j240K9246J1655L2066l6531R618L1547M1989M0791
$$ 2257208 2174793 2139866 2114725 2113485 2142731 2154386 2186452 2149921 2159539 2191086 2233075 2273866
6451B273866J912l2492P53k8584q8082o4012o0260j3915o0677q104p6952j16561
$$ 2273866 2275778 2243286 2244039 2215455 2127373 2063361 2003101 1989186 1928509 1920405 1843453 1726892
6439A726892j3977n8114j06283j15115o6881p2468r4607n8646o2979p8249q0148
$$ 1726892 1712915 1654801 1548518 1433403 1366522 1294054 1199447 1140801 1077822 999573 919425
6428I19425q3462O08p7685p3023o0092k1269R059o2717m3461J2726R557k6852
$$ 919425 835963 836571 758886 685863 625771 604502 613561 550844 507383 520109 529666 502814
6416E02814m0592l4609K5056j2915k5798m5079m3954J1324L519l7354p7854K34
$$ 502814 462222 427613 452669 439754 413956 368877 324923 336247 339766 302412 224558 224792
6404B24792k3820j4261n9048j310j6516m2586l2201j4203r97L2822j2606j3984
$$ 224792 200972 186711 127663 126353 109837 67251 35050 20847 19850 52672 40066 26082
6392B6082n6190j816L5153l7096l417l521J2082L7360m7304p5362k8173J2887
$$ 26082 -30108 -31924 3229 -33867 -37284 -40805 -28723 8637 -38667 -114029 -142202 -129315
6380a29315O464O70K2526L754k1273K4983K021n021j8829L6985J9824o597N603
$$ -129315 -122851 -122181 -99655 -95901 -117174 -92191 -90170 -95191 -114020 -77035 -57211 -63808 -58205
6367e8205m4507r42J6171N433j1977j7659m5059k9333L0112J3703O68k1331N3652
$$ -58205 -102712 -103654 -87483 -82050 -94027 -111686 -156745 -186078 -155966 -142263 -141595 -162926 -109274
6354a09274J0432p5884O208J5643k003M5880j1200M1192J9515k5322K1672O1168
$$ -109274 -98842 -174726 -168518 -152875 -154878 -108998 -120198 -79006 -59491 -84813 -63141 -1973
6342a973l207j0019L3475j1434l2719J1914n352r696M2446j5559q24j2892k3015
$$ -1973 -5180 -15199 18276 6842 -25877 -13963 -19315 -29011 13435 -2124 -2948 -15840 -38855
6329c8855J8329j9723K5914K4469j6769j9929N9904l5655k2632J8223L9013O1880
$$ -38855 -20526 -40249 -14335 10134 -6635 -26564 33340 -2315 -24947 -6724 32289 94169
6317I4169k3835k7631n0358J0868L6326N4390m4258M5273M041o261k6270M9970
$$ 94169 70334 42703 -7655 3213 39539 93929 49671 94944 98985 92724 66454 116424
6305A16424j5782j8406o03J3181m7245M223J6557J4569l5138k1561L0499l8667
$$ 116424 100642 82236 81633 94814 47569 51792 68349 82918 47780 26219 56718 18051
6293A8051j2085L8244l171k3552L600P5902K5877p779j9989m1890L5028K2387
$$ 18051 5966 44210 41039 17487 21087 96989 122866 115087 95098 53208 88236 110623
6281A10623o6378L9980J02212j700M84Q66K1923j991n931j3999j9588J3298o799
$$ 110623 44245 84225 186437 184737 185221 186087 208010 206019 200088 186089 166501 179799 173000
6268A73000L2121l4073K5156L8735m588l2080l7482J7260P3982Q0109J6572J7732
$$ 173000 205121 171048 196204 234939 230351 198271 160789 178049 252031 332140 348712 366444
6256C66444J4408j8035j1506O0668j9549K2762J2717L9233L242L609p702L0691
$$ 366444 380852 362817 351311 411979 392430 415192 427909 467142 470384 473993 466291 496982
6244D96982M4112n2197K3936Q960M7574J9895j9475M6004J5819M1104M6191K9255
$$ 496982 541094 488897 512833 521793 569367 589262 569787 615791 631610 672714 718905 748160
6232G48160m083Q585L6547M1900N1300J10311J11206O3698L9744O4427N6179O1374
$$ 748160 744077 752662 789209 831109 882409 992720 1103926 1167624 1207368 1271795 1327974 1389348
6220A389348J48524P5229M6815N0137K5846K7137r187j3597m4697M217l6652n648
$$ 1389348 1537872 1613101 1659916 1710053 1735899 1763036 1753849 1740252 1695555 1699772 1663120 1657472
6208A657472k7688O524R791r869j3616K6552O5615K7932P1669M4172Q2653O4135
$$ 1657472 1629784 1636308 1646099 1636230 1622614 1649166 1714781 1742713 1814382 1858554 1941207 2005342
6196B005342M6552J17921J73814J08961J71409J44972J41548K29905K02464J25617
$$ 2005342 2051894 2169815 2343629 2452590 2623999 2768971 2910519 3140424 3342888 3468505
6186C468505J38157J39350J1672l9815o7168p7204j29737o1358q9021o2703l4093
$$ 3468505 3606662 3746012 3757684 3717869 3650701 3573497 3443760 3382402 3293381 3230678 3196585
6175C196585m0415n4842j6319K1881M5071M3686L1321N3970R0865R7402Q1352
$$ 3196585 3156170 3101328 3085009 3106890 3151961 3195647 3226968 3280938 3371803 3469205 3550557
6164C550557P7852J18218J92012K41712J72505K09844K26409J98227K32566K05107
$$ 3550557 3628409 3746627 3938639 4180351 4352856 4562700 4789109 4987336 5219902 5425009
6154E425009J09529Q1878L8883M7479R696N498L302o0392J7062M5139o6296L2046
$$ 5425009 5534538 5616416 5655299 5702778 5712474 5717972 5721274 5660882 5677944 5723083 5656787 5688833
6142E688833K2860M24n253o4824n7094n730J5597Q289L0668K4907O1632L2525
$$ 5688833 5711693 5712117 5706864 5642040 5584946 5579216 5594813 5603102 5633770 5658677 5720309 5752834
6130E752834M9192N9048O4586P764K8254K4323L5435M8619R2464L2462m565J1581
$$ 5752834 5802026 5861074 5925660 5933424 5961678 5986001 6021436 6070055 6162519 6194981 6190416 6201997
6118F201997P154M1321N3742M512q345N785n29o7942j8805n5558m3228j24360
$$ 6201997 6209151 6250472 6304214 6308726 6300381 6306166 6305637 6237695 6218890 6163332 6120104 5995744
6106E995744j04911n5662j01980n7716k9019J5425m8387m7215P426M0609K8248
$$ 5995744 5890833 5835171 5733191 5675475 5646456 5661881 5613494 5566279 5573705 5614314 5642562
6095E642562K3019J36932J23898J55606J72625K20961K48651K69263K58021K43760
$$ 5642562 5665581 5802513 5926411 6082017 6254642 6475603 6724254 6993517 7251538 7495298
6085G495298K41517K65305L09140K32303J18633L8522L4775j9944n0096j8915
$$ 7495298 7736815 8002120 8311260 8543563 8662196 8700718 8735493 8715549 8665453 8646538
6075H646538J4437L5979Q8025Q1611R1046J13631J95401K49508K73938L27539
$$ 8646538 8660975 8696954 8784979 8866590 8957636 9071267 9266668 9516176 9790114 10117653
6065A0117653L40228M63152M75971M73380N82983O60776O79596P26159O79448
$$ 10117653 10457881 10921033 11397004 11870384 12453367 13114143 13793739 14519898 15199346
6056A5199346O49845N23789M95614L98778J73145L1237q538J607M5276J46601
$$ 15199346 15849191 16372980 16868594 17267372 17440517 17471754 17463216 17464823 17510099 17656700
6046A7656700K24869L30622L54999L89227N76753O72692O69188Q93824J052938
$$ 17656700 17881569 18212191 18567190 18956417 19533170 20205862 20875050 21768874 22821812
6037B2821812J094786J243433J463515J583587J645933J666431J593921J431022
$$ 22821812 23916598 25160031 26623546 28207133 29853066 31519497 33113418 34544440
6029C4544440J072942P61467M41551m3568m21453p41601q52014q66947p87408
$$ 34544440 35617382 36378849 36820400 36776832 36355379 35613778 34761764 33894817 33107409
6020C3107409p48676n75880m11186l76377k00967j39359O1502K24866L75959N44834
$$ 33107409 32358733 31782853 31371667 30995290 30794323 30654964 30716466 30941332 31317291 31862125
6010C1862125O86609Q95066J063238J307344J510200J755583J988153K227014
$$ 31862125 32548734 33443800 34507038 35814382 37324582 39080165 41068318 43295332
6002D3295332K414731K527836K481781K248261J763783J235031N15999k56373
$$ 43295332 45710063 48237899 50719680 52967941 54731724 55966755 56482754 56226381
5994E6226381j006906j589586k080221k264233k214516k162863k008970j842880
$$ 56226381 55219475 53629889 51549668 49285435 47070919 44908056 42899086 41056206
5986D1056206j663153j572499j328627j238846j087411q62594q05209o81011n04419
$$ 41056206 39393053 37820554 36491927 35253081 34165670 33303076 32497867 31816856 31312437
5977C1312437k72347j02626O4865K52066L62893N31662P11542P64440Q20597Q16079
$$ 31312437 31040090 30937464 31002329 31254395 31617288 32148950 32860492 33624932 34445529 35261608
5967C5261608O48515M41108J78705j46130n40175q83220j194985j403799j458672
$$ 35261608 35910123 36351231 36529936 36383806 35843631 34960411 33765426 32361627 30902955
5958C0902955j402876j317039j343160j239731j090449j044268r27020q46308
$$ 30902955 29500079 28183040 26839880 25600149 24509700 23465432 22538412 21692104
5950B1692104p20046o81144o08637m91184l73219l48198k74915j55455j58257
$$ 21692104 20972058 20290914 19682277 19191093 18817874 18469676 18194761 18039306 17881049
5941A7881049j65589k17149j70887k02151k35765l37214l54213m75719m69132
$$ 17881049 17715460 17498311 17327424 17125273 16889508 16552294 16198081 15722362 15253230
5932A5253230m55864m46834m21483l15955k16107k59356k24031k07176j23679
$$ 15253230 14797366 14350532 13929049 13613094 13396987 13137631 12913600 12706424 12582745
5923A2582745j16331r0290m0335k2985n8739l9968r2184j38540j42062k25239
$$ 12582745 12466414 12376124 12335789 12312804 12254065 12214097 12121913 11983373 11841311 11616072
5913A1616072k97239l09591k52901k09360k30252j83974j97734j66488j40530
$$ 11616072 11318833 11009242 10756341 10546981 10316729 10132755 9935021 9768533 9628003
5904I628003j45917j09463q0368q7263o7865K2037k7645L7783L5342M9690J66676
$$ 9628003 9482086 9372623 9292255 9204992 9137127 9159164 9131519 9169302 9204644 9254334 9421010
5893I421010J45777J48530J45394L6976j7424m013r6623j54962k68048k31395
$$ 9421010 9566787 9715317 9860711 9897687 9880263 9876250 9779627 9624665 9356617 9125222
5883I125222j98534j71589q0749j35466j29777p3575m2096r3393q1861j7528o3548
$$ 9125222 8926688 8755099 8674350 8538884 8409107 8335532 8293436 8200043 8118182 8100654 8037106
5872H037106n8696L202L0950M559N5837N9718R9685J71474J01273M9169J4316
$$ 8037106 7978410 7981612 8012562 8017121 8072958 8132676 8232361 8403835 8505108 8554277 8568593
5861H568593m0647m1092j51740j99862j54118j96987j94858j08109o8583r2972
$$ 8568593 8527946 8486854 8335114 8135252 7981134 7784147 7589289 7481180 7412597 7319625
5851G319625p7137p5390l9417o8775q2671m2622r5068q0177m7959o3407l025j6085
$$ 7319625 7242488 7167098 7127681 7058906 6976235 6933613 6838545 6758368 6710409 6647002 6643977 6627892
5839F627892q7369m9311J0936l749o1523n3428l8002j01802j46978j58922j59119
$$ 6627892 6540523 6491212 6502148 6498399 6436876 6383448 6345446 6243644 6096666 5937744 5778625
5828E778625j14351j00573j29240j28308j24025j06450n1368o1709p5753n6109
$$ 5778625 5664274 5563701 5434461 5306153 5182128 5075678 5024310 4962601 4886848 4830739
5818D830739o7139l3978n3532n9862l3981r2173j01674r1954m8309o7980o7197
$$ 4830739 4763600 4729622 4676090 4616228 4582247 4490074 4388400 4296446 4248137 4180157 4112960
5807D112960M379q2689o1788j9281n0509l9553j15301o8624l6578k2657k4715
$$ 4112960 4117339 4034650 3972862 3953581 3903072 3863519 3748218 3679594 3643016 3620359 3595644
5796C595644k8222N89n6940n6557l2354m8831P6251n8441l9843k4270n5198J8998
$$ 3595644 3567422 3568011 3511071 3454514 3422160 3373329 3449580 3391139 3351296 3327026 3271828 3290826
5784C290826K3906L96o11m3807m8939j2954n4653j9870j4525o662m5489o5498
$$ 3290826 3314732 3315128 3314517 3270710 3221771 3208817 3154164 3134294 3119769 3113107 3067618 3002120
5772C002120q248j6294n9729p0551p5945n6757q3084k4157J6785J3064n1797m7226
$$ 3002120 2993872 2977578 2917849 2847298 2771353 2714596 2631512 2607355 2624140 2637204 2585407 2538181
5760B538181J1097l2102l6238J1411L3093k9770l5309L1659j9515J8261m6586
$$ 2538181 2549278 2517176 2480938 2492349 2525442 2495672 2460363 2492022 2472507 2490768 2444182
5749B444182q730R833m4841J2512k7969p826Q892r431L3506J7552K2798m0055
$$ 2444182 2435452 2445285 2400444 2412956 2384987 2377161 2386053 2376622 2410128 2427680 2450478 2410423
5737B410423O541K6601L5710k0322K6482R1946Q7017q580L6197L0160J6049L267
$$ 2410423 2416964 2443565 2479275 2458953 2485435 2577381 2664398 2655818 2692015 2722175 2738224 2741491
5725B741491L6973J4335K795K0452O494O8311K4928K272J1601J6426L1844P3909
$$ 2741491 2778464 2792799 2795594 2816046 2822540 2890851 2915779 2918051 2929652 2946078 2977922 3051831
5713C051831J5574r056K4733k061M0663P5275L0913L5503L5971O8449Q3202N6336
$$ 3051831 3067405 3058349 3083082 3081021 3121684 3196959 3227872 3263375 3299346 3367795 3450997 3507333
5701C507333j7952n0403J0025Q4599O3258j6184M7372K618n3621k4036K7650N1191
$$ 3507333 3489381 3438978 3449003 3533602 3596860 3580676 3628048 3630666 3577045 3553009 3580659 3631850
5689C631850M6632N4035P5298Q2142J6842P1255O9906J39869K9397L3040J21169
$$ 3631850 3678482 3732517 3807815 3889957 3906799 3978054 4047960 4187829 4217226 4250266 4371435
5678D371435J06356J27127J84148J73876J26222J24339R8016M6109Q6858M207
$$ 4371435 4477791 4604918 4789066 4962942 5089164 5213503 5311519 5357628 5444486 5448693
5668E448693N9346L9499l765L658k0442l4733J3987R2534Q4453O9286M6746K2708
$$ 5448693 5508039 5547538 5543773 5547431 5526989 5492256 5506243 5598777 5683230 5752516 5799262 5821970
5656E821970J05880J86591J53872R6254J34386J98265K20994K17033K17617K12564
$$ 5821970 5927850 6114441 6268313 6364567 6498953 6697218 6918212 7135245 7352862 7565426
5646G565426L03551L85154L87813L82170L61129M63690M02949L89919L82241M16180
$$ 7565426 7868977 8254131 8641944 9024114 9385243 9848933 10251882 10641801 11024042 11440222
5636A1440222M28070M27059L63210L36553L42637L23802K69269Q4668L1372P4765
$$ 11440222 11868292 12295351 12658561 12995114 13337751 13661553 13930822 14015490 14046862 14121627
5626A4121627J44946K55364L92886M10226M52725M66481O11896O58534O50933
$$ 14121627 14266573 14521937 14914823 15325049 15777774 16244255 16856151 17514685 18165618
5617A8165618P89455Q30715R72530J089709J089740J121562J182682J425501J533974
$$ 18165618 18955073 19785788 20758318 21848027 22937767 24059329 25242011 26667512 28201486
5608B8201486J703839J821779J984019K190824K357725K584315K531775K509762
$$ 28201486 29905325 31727104 33711123 35901947 38259672 40843987 43375762 45885524
5600D5885524K491231K520376K527991K403230K489891K835111L403166M043891
$$ 45885524 48376755 50897131 53425122 55828352 58318243 61153354 64556520 68600411
5592F8600411M501118M838589N016960N173816N158237M990702M652442M116596
$$ 68600411 73101529 77940118 82957078 88130894 93289131 98279833 102932275 107048871
5584A07048871L406807K588837J639978O75109l39411j311628k144402k675611
$$ 107048871 110455678 113044515 114684493 115359602 115020191 113708563 111564161 108888550
5576A08888550k992464l310087l601175l616769l601438l534804l548123l532349
$$ 108888550 105896086 102585999 98984824 95368055 91766617 88231813 84683690 81151341
5568H1151341l443232l257045l460790l735261l769572l601809l171692k735672
$$ 81151341 77708109 74451064 70990274 67255013 63485441 59883632 56711940 53976268
5560E3976268k459527k311570k083911j920416j818380j697850j510589j372285
$$ 53976268 51516741 49205171 47121260 45200844 43382464 41684614 40174025 38801740
5552C8801740j246633j183691j140330j110252j080870j074814j035269j044972
$$ 38801740 37555107 36371416 35231086 34120834 33039964 31965150 30929881 29884909
5544B9884909j033222r87258q30577p93403o52790o86014p10831p05682p26510
$$ 29884909 28851687 27864429 27033852 26240449 25587659 24901645 24190814 23485132 22758622
5535B2758622p57710q05518r53748r25450r66508q11209o69212o55051o35434
$$ 22758622 22000912 21195394 20241646 19316196 18349688 17538479 16869267 16214216 15578782
5526A5578782o02774n28828m68996m77940m68224l74785l73375l65167l41631
$$ 15578782 14976008 14447180 13978184 13500244 13032020 12657235 12283860 11918693 11577062
5517A1577062k79826k92644k69980k13708j64046j59539j57339j88889j42600
$$ 11577062 11297236 11004592 10734612 10520904 10356858 10197319 10039980 9851091 9708491
5508I708491j42305j52888j14805j83545j81301j52351j56684j08527j88565k04101
$$ 9708491 9566186 9413298 9298493 9114948 8933647 8781296 8624612 8516085 8327520 8123419
5498H123419j40326j30407k10378j71229j55537j16990k24314j15124r3719j49276
$$ 8123419 7983093 7852686 7642308 7471079 7315542 7198552 6974238 6859114 6765395 6616119
5488F616119r7250j42488j49113o8944j45255j16343m2484r9984n8368n0231n4124
$$ 6616119 6518869 6376381 6227268 6158324 6013069 5896726 5854242 5754258 5695890 5645659 5591535
5477E591535q5459o1102l9066j08615j47839j24833j31298q9598j15355r1055
$$ 5591535 5506076 5444974 5405908 5297293 5149454 5024621 4893323 4803725 4688370 4597315
5467D597315m0759l8303n0215r1510p4037J8262K2121n4534K8253O1835P2165
$$ 4597315 4556556 4518253 4468038 4376528 4302491 4320753 4342874 4288340 4316593 4378428 4450593
5456D450593r525R014J56988J34616J10134R4864Q0850N8330k8080j8724j21403
$$ 4450593 4441068 4450082 4607070 4741686 4851820 4946684 5027534 5085864 5057784 5039060 4917657
5445D917657j36180j51140j61305j02315j19322q3448j04371q3991j05867r9188
$$ 4917657 4781477 4630337 4469032 4366717 4247395 4163947 4059576 3975585 3869718 3770530
5435C770530j5382L0807N4817K4187q028O2375J16352Q5544N0330J39597J71010
$$ 3770530 3755148 3785955 3840772 3864959 3856931 3919306 4035658 4121202 4171532 4311129 4482139
5424D482139J82261J76603J20736P9550J2918p1342j91279j52809j84817j93108
$$ 4482139 4664400 4841003 4961739 5041289 5054207 4982865 4791586 4638777 4453960 4260852
5414D260852j32383j14423j80805j24524r2280k3130p9204j21724m0944m6059
$$ 4260852 4128469 4014046 3833241 3708717 3616437 3593307 3514103 3392379 3351435 3305376
5404C305376Q8275M5418J1946O601P0153N9738R8083P9872J05918J28409L4132
$$ 3305376 3393651 3439069 3451015 3457616 3527769 3587507 3685590 3765462 3871380 3999789 4033921
5393D033921J0931K9741l1085j53488k00615j64732j66230j29331n6742j04752
$$ 4033921 4044852 4074593 4043508 3890020 3689405 3524673 3358443 3229112 3172370 3067618
5383C067618p8122m5368o2892q5521o8161o5174k0307l1776k2159j29p706O5688
$$ 3067618 2989496 2944128 2881236 2795715 2727554 2662380 2642073 2610297 2588138 2588009 2580303 2645991
5371B645991l5380J6428N7781J1565j5124Q404l6839R354l3568o2486n3476p8994
$$ 2645991 2610611 2627039 2684820 2696385 2681261 2689665 2652826 2662180 2628612 2566126 2512650 2433656
5359B433656n7009J3562o416m53P426N1402L5559L0488Q9982J11211J38461J33665
$$ 2433656 2376647 2390209 2383793 2383340 2390766 2442168 2477727 2508215 2598197 2709408 2847869 2981534
5347B981534p496J8645N7796q9934j06502j60995j36612j40240p5165n5299j37077
$$ 2981534 2974038 2992683 3050479 2960545 2854043 2693048 2556436 2416196 2341031 2285732 2148655
5336B148655m0678n2457n8672j20344q3098k7308n2433k9282n0089l4684j0705
$$ 2148655 2107977 2055520 1996848 1876504 1793406 1766098 1713665 1684383 1634294 1599610 1588905
5325A588905m6932l1294m4588J3483K965p0709P3185m1404K6852M1489N758k0038
$$ 1588905 1541973 1510679 1466091 1479574 1482539 1411830 1485015 1443611 1470463 1511952 1517710 1497672
5313A497672m9377m2093N6806K2417l0873j360j8532K485l2202J215L0229l4592
$$ 1497672 1448295 1406202 1463008 1485425 1454552 1453192 1434660 1437145 1404943 1406158 1436387 1401795
5301A401795j1864j1803j9364j646L8545M7229K9163K5367j1426L9170J5514O9245
$$ 1401795 1389931 1378128 1358764 1357118 1395663 1442892 1472055 1497422 1485996 1525166 1540680 1609925
5289A609925P5567M7687N314m3528K4562O2041K5507N1582N7715l9165L5339j5893
$$ 1609925 1685492 1733179 1738493 1694965 1719527 1781568 1807075 1858657 1916372 1877207 1912546 1896653
5277A896653m3123L0051J1368k0852L1801r5811l139L1075L9681l8006k2591L946
$$ 1896653 1853530 1883581 1894949 1874097 1905898 1810087 1806948 1838023 1877704 1839698 1817107 1821053
5265A821053M2321J0995n996o6936l2474N7104K4438M4140k3527K3600l0805L8983
$$ 1821053 1863374 1874369 1868373 1801437 1768963 1826067 1850505 1894645 1871118 1894718 1863913 1902896
5253A902896M9178J6577K8214k4993J9597j3083j1777k1348j7465l5349J8843
$$ 1902896 1952074 1968651 1996865 1971872 1991469 1978386 1966609 1945261 1927796 1892447 1911290
5242A911290J1769j4646n513O3552L5514p6901n973K350j9899j8952O4028L387
$$ 1911290 1923059 1908413 1902900 1966452 2001966 1925065 1919092 1921442 1901543 1882591 1946619 1950006
5230A950006L4386j1707L5062P2813R088k4902L1363Q974j3302N5983O9087j7542
$$ 1950006 1984392 1972685 2007747 2080560 2089648 2064746 2096109 2105083 2091781 2147764 2216851 2199309
5218B199309j001J3472P0272j6073Q99J0048n923L4245n81J6028M1307L665O6098
$$ 2199309 2198308 2211780 2282052 2265979 2266878 2276926 2271003 2305248 2304667 2320695 2362002 2365667 2431765
5205B431765R3407J2273N0711K6142O1593P7244O3288N1812N6382K5347J3584
$$ 2431765 2525172 2537445 2588156 2614298 2675891 2753135 2816423 2868235 2924617 2949964 2963548
5194B963548J9662n4239k6024j6474o9953n6817M051M750M4433o7084L689O280
$$ 2963548 2983210 2928971 2902947 2886473 2816520 2759703 2763754 2768504 2812937 2745853 2749542 2755822
5182B755822o4853l3153J5816p925M9254P332m9763P5594n5236m1170J4840K7293
$$ 2755822 2690969 2657816 2673632 2665707 2714961 2722293 2672530 2748124 2692888 2651718 2666558 2693851
5170B693851K239j4909K2163m6419K8899P4988J8862m592J5520P5270K8657M1113
$$ 2693851 2696090 2681181 2703344 2656925 2685824 2760812 2779674 2775082 2790602 2865872 2894529 2935642
5158B935642N0205R7036O8720Q3132R0932O6991O3534N0989P9371O4060K7625
$$ 2935642 2985847 3082883 3151603 3234735 3325667 3392658 3456192 3507181 3586552 3650612 3678237
5147C678237j4360o4001j8450N6257P763l4894K5425K9247j6245l0901N6893J9906
$$ 3678237 3663877 3599876 3581426 3637683 3645446 3610552 3635977 3665224 3648979 3618078 3674971 3694877
5135C694877P3914N6501N6220P6901K440P4418M4791J11877J07142j9534J53877
$$ 3694877 3768791 3825292 3881512 3958413 3960853 4035271 4080062 4191939 4299081 4279547 4433424
5124D433424R6158R3982J29195J56672J66699J23567J82598J47196J50382O5290
$$ 4433424 4529582 4623564 4752759 4909431 5076130 5199697 5382295 5529491 5679873 5745163
5114E745163J56885J19600J32319J24670J46809J69603J38405K2659M5379O7338
$$ 5745163 5902048 6021648 6153967 6278637 6425446 6595049 6733454 6756113 6801492 6868830
5104F868830P382O4866R48K3272O7619P2814J32067J04538J31609J22956R2012
$$ 6868830 6876212 6941078 6942026 6965298 7032917 7105731 7237798 7342336 7473945 7596901 7688913
5093G688913Q3883O8080R2214J6185O1567K6403j984N3811P4268M6120M0082O4636
$$ 7688913 7772796 7840876 7933090 7949275 8010842 8037245 8035261 8089072 8163340 8209460 8249542 8314178
5081H314178J14283J03363J10081J43878J55577K03681J46402J67054K14946K08256
$$ 8314178 8428461 8531824 8641905 8785783 8941360 9145041 9291443 9458497 9673443 9881699
5071I881699K31174L10358L75812M16959N02578O63091P04821M21932L34819K72790
$$ 9881699 10112873 10423231 10799043 11216002 11718580 12381671 13086492 13508424 13843243 14116033
5061A4116033K19676j33336n57915o87486p61732m41688k21119k37032k46280
$$ 14116033 14335709 14202373 13644458 12956972 12195240 11753552 11532433 11295401 11049121
5052A1049121k03078j36866j63920j96816j67233j53805o1495j19706j35511q4626
$$ 11049121 10846043 10709177 10545257 10348441 10181208 10027403 9965908 9846202 9710691 9626065
5042I626065j21412j10344j49519j10900r6713j30315j06463j15763o0436q8411
$$ 9626065 9504653 9394309 9244790 9133890 9037177 8906862 8800399 8684636 8624200 8535789
5032H535789j02136k2564m1780l3846m9577j7166M4923J4361j3043P4321N5744
$$ 8535789 8433653 8411089 8369309 8335463 8285886 8268720 8313643 8328004 8314961 8389282 8445026
5021H445026J2223N7068P4639R804R1586J05353N8664N8455O9171P7983J29546
$$ 8445026 8457249 8514317 8588956 8598760 8690346 8795699 8854363 8912818 8981989 9059972 9189518
5010I189518J06094J25296J19680R6812R5309J84045K09243J45872J70009K56123
$$ 9189518 9295612 9420908 9540588 9637400 9732709 9916754 10125997 10271869 10441878 10698001
5000A0698001K13422K28037K07081K57467K75121L07710K52088K50509L43510
$$ 10698001 10911423 11139460 11346541 11604008 11879129 12186839 12438927 12689436 13032946
4991A3032946L47611L30768M03029L59762L97549M52002M60857M97957M90957
$$ 13032946 13380557 13711325 14114354 14474116 14871665 15323667 15784524 16282481 16773438
4982A6773438N06402N00832O35425O34236N87414O74686P36764P29637Q22561
$$ 16773438 17279840 17780672 18416097 19050333 19637747 20312433 21049197 21778834 22601395
4973B2601395Q90677J082200J081313J262350J296051J355042J462577J542189
$$ 22601395 23492072 24574272 25655585 26917935 28213986 29569028 31031605 32573794
4965C2573794J567669J597768J576361J630762J702486J848886J952163K167609
$$ 32573794 34141463 35739231 37315592 38946354 40648840 42497726 44449889 46617498
4957D6617498K277023K286189K324716K196452J968946J716446J327668J043450
$$ 46617498 48894521 51180710 53505426 55701878 57670824 59387270 60714938 61758388
4949F1758388O57214L29814K20044O9277J29426K37093L67833N01465O81488Q03510
$$ 61758388 62415602 62745416 62965460 63034737 63164163 63401256 63769089 64270554 64952042 65755552
4939F5755552J002632J254778J525829J837477K068506K265899K547519K822451
$$ 65755552 66758184 68012962 69538791 71376268 73444774 75710673 78258192 81080643
4931H1080643L093756L414170L590158L848876M070558M233178M272573M173322
$$ 81080643 84174399 87588569 91178727 95027603 99098161 103331339 107603912 111777234
4923A11777234L989549L588529K971916K284249J533779P30436J61444l60558
$$ 111777234 115766783 119355312 122327228 124611477 126145256 126875692 127037136 126676578
4915A26676578o36637o75330m98243l30947k54518O800J41026K04937K63909K32902
$$ 126676578 126039941 125364611 124866368 124535421 124280903 124287703 124428729 124633666 124897575 125130477
4905A25130477J65268R6325L6500P4301J75431K79685M39676P58048J034635J241748
$$ 125130477 125295745 125392070 125428570 125502871 125678302 125957987 126397663 127155711 128190346 129432094
4895A29432094J444514J556652J517450J303916R18711L41328l38431j087314
$$ 129432094 130876608 132433260 133950710 135254626 136173337 136514665 136176234 135088920
4887A35088920j789710k466538k988666l232278l341837l261186k814996k432317
$$ 135088920 133299210 130832672 127844006 124611728 121269891 118008705 115193709 112761392
4879A12761392j980834j585139j225366j045061j065172j256658j536493j925716
$$ 112761392 110780558 109195419 107970053 106924992 105859820 104603162 103066669 101140953
4871A01140953k404831k889276l234111l494332l511046l359328l178801k914366
$$ 101140953 98736122 95846846 92612735 89118403 85607357 82248029 79069228 76154862
4863G6154862k706440k491600k296031k093381j788657j599001j478916j208505
$$ 76154862 73448422 70956822 68660791 66567410 64778753 63179752 61700836 60492331
4855F0492331j067841j014631r16494q51909q38690q65633q94206r62285r87333
$$ 60492331 59424490 58409859 57493365 56641456 55802766 54937133 54042927 53080642 52093309
4846E2093309r76159j055056j012184r71875r39344q29463p65179o86847p23400
$$ 52093309 51117150 50062094 49049910 48078035 47138691 46309228 45544049 44857202 44133802
4837D4133802o44792o20292o07201o04743o20765n81614o39203o49713p18511
$$ 44133802 43489010 42868718 42261517 41656774 41036009 40454395 39815192 39165479 38446968
4828C8446968o55435o44783o63213o25766o09410o38278o29133n95029n39655
$$ 38446968 37791533 37146750 36483537 35857771 35248361 34610083 33980950 33385921 32846266
4819C2846266n62178o19945n46906m69327m81440n00518m78187m94761m41673
$$ 32846266 32284088 31664143 31117237 30647910 30166470 29665952 29187765 28693004 28251331
4810B8251331l70290m49614m58651l90809m23414l76580l51534l68477l62843
$$ 28251331 27881041 27431427 26972776 26581967 26158553 25781973 25430439 25061962 24699119
4801B4699119l45607l58923l13530k81012l49862k04904k52137k24272j44798
$$ 24699119 24353512 23994589 23681059 23400047 23050185 22845281 22593144 22368872 22224074
4792B2224074j64381j24822j53061n8355p0688n5422j14453j32038j94096j55456
$$ 22224074 22059693 21934871 21781810 21723455 21652767 21597345 21482892 21350854 21156758 21001302
4782B1001302k53914k88210k24708k47111k12952k01874k32022k17189j78110
$$ 21001302 20747388 20459178 20234470 19987359 19774407 19572533 19340511 19123322 18945212
4773A8945212k20853j70610j49966k05434j74848j24554q6820j1310q2501m3656
$$ 18945212 18724359 18553749 18403783 18198349 18023501 17898947 17812127 17800817 17718316 17674660
4763A7674660o829m7601M3813L6313O6205N8396J25271O8238J6458J00991N1998
$$ 17674660 17667831 17620230 17664043 17700356 17766561 17824957 17950228 18018466 18034924 18135915 18187913
4752A8187913Q7400N3566K5635P14O6553N9051L4355j396K4689N4537O6949L6558
$$ 18187913 18275313 18328879 18354514 18355228 18421781 18480832 18515187 18513791 18538480 18593017 18659966 18696524
4740A8696524M9132M0833L4326P255Q254M9258M6232p2215L8088N5965Q386O615
$$ 18696524 18745656 18786489 18820815 18828070 18836324 18885582 18931814 18859599 18897687 18953652 18962038 18968653
4728A8968653o925M6041J302L3799R0028P0332J9422N6532O567m292J06200P2893
$$ 18968653 18961728 19007769 19009071 19042870 19132898 19203230 19222652 19279184 19285751 19281459 19387659 19460552
4716A9460552O4065N2816K0525N5104K7335n114O438k9778n372j5613k1796o2938
$$ 19460552 19524617 19577433 19597958 19653062 19680397 19675283 19681721 19651943 19646571 19630958 19609162 19546224
4704A9546224j05210m4912r2885j19918j4679l8636m0405j9815m445O1940N1610
$$ 19546224 19441014 19396102 19303217 19183299 19168620 19129984 19089579 19069764 19065319 19127259 19178869
4693A9178869M5146P9986Q1439J15576R4421J33674R7046J30601J82924J81392
$$ 19178869 19224015 19304001 19385440 19501016 19595437 19729111 19826157 19956758 20139682 20321074
4683B0321074J98651K18991K51356K17950K85600K92046L22836L15958K94854
$$ 20321074 20519725 20738716 20990072 21208022 21493622 21785668 22108504 22424462 22719316
4674B2719316K97931L56246L59723L59661M00377M09648M26462M28023N30110
$$ 22719316 23017247 23373493 23733216 24092877 24493254 24902902 25329364 25757387 26287497
4665B6287497N41600N84240N38323O12931P29796O93707Q96381R93868R71448
$$ 26287497 26829097 27413337 27951660 28564591 29294387 29988094 30884475 31878343 32849791
4656C2849791R83976J035174R28212Q28089Q32550Q89296R56615J055472J127891
$$ 32849791 33833767 34868941 35797153 36625242 37457792 38347088 39303703 40359175 41487066
4647D1487066J296974J524813J656819J841152K083250K307614K725071L083194
$$ 41487066 42784040 44308853 45965672 47806824 49890074 52197688 54922759 58005953
4639E8005953L430512L892696M458646M924637N658321O480407P218820Q230052
$$ 58005953 61436465 65329161 69787807 74712444 80370765 86851172 94069992 102300044
4631A02300044R391565J0685309J1941197J2926197J3344340J2579340J0808944
$$ 102300044 111691609 122376918 134318115 147244312 160588652 173167992 183976936
4624A83976936Q523699N899144K455918j695857n598736q049435q781130q539792
$$ 183976936 192500635 198399779 200855697 199159840 193561104 185511669 176730539 168190747
4616A68190747q337208q373802q322945q094070p678681p273669o871383o603813
$$ 168190747 159853539 151479737 143156792 135062722 127384041 120110372 113238989 106635176
4608A06635176o282987n784182n318820m713372m235940l798974l325840k906911
$$ 106635176 100352189 94568007 89249187 84535815 80299875 76500901 73175061 70268150
4600G0268150k511302k181363j799657j490561j268146j225049j273091j289991
$$ 70268150 67756848 65575485 63775828 62285267 61017121 59792072 58518981 57228990
4592E7228990j368461j541003j814996k013894k015423j895758j788907j680871
$$ 57228990 55860529 54319526 52504530 50490636 48475213 46579455 44790548 43109677
4584D3109677j578042j483185j409453j330309j270004j249770j177442j145650
$$ 43109677 41531635 40048450 38638997 37308688 36038684 34788914 33611472 32465822
4576C2465822j068146r48469q82954q26151p59563p43748o65476n64510m61928
$$ 32465822 31397676 30449207 29566253 28740102 27980539 27236791 26571315 26006805 25544877
4567B5544877m48019m17169l88659k99355k84399l08280l25692k76405k71744
$$ 25544877 25096858 24679689 24291030 23991675 23707276 23398996 23073304 22796899 22525155
4558B2525155l11491k99377k84613k55397j97285j76804k83152k47871k47194
$$ 22525155 22213664 21914287 21629674 21374277 21176992 21000188 20717036 20469165 20221971
4549B0221971k37562l34835l70937l13196l53847k97141l53547k85325k24708
$$ 20221971 19984409 19649574 19278637 18965441 18611594 18314453 17960906 17675581 17450873
4540A7450873k31504k49479j98635j66729j51196j28743j73017j15339o1998l8220
$$ 17450873 17219369 16969890 16771255 16604526 16453330 16324587 16151570 16036231 15974233 15936013
4530A5936013J9061Q235N3076L8614J57685J70039K31555K89958L49171L62478
$$ 15936013 15955074 15963309 16016385 16054999 16212684 16382723 16614278 16904236 17253407 17615885
4520A7615885L83865M52290N35753N74972N47794M56089L98746K72381J57095
$$ 17615885 17999750 18452040 18987793 19562765 20110559 20566648 20965394 21237775 21394870
4511B1394870M1602j14674k76992k95675k59571k25927r8166m2265l2095l0700
$$ 21394870 21436472 21321798 21044806 20749131 20489560 20263633 20165467 20123202 20091107 20060407
4501B0060407J5399J15359J56767K19583L40258M13938L51836L16204J90378K9529
$$ 20060407 20075806 20191165 20347932 20567515 20907773 21321711 21673547 21989751 22180129 22209658
4491B2209658j06953l17229m66594o12934n71140n64222n25255m68749m10850
$$ 22209658 22102705 21785476 21318882 20705948 20134808 19570586 19045331 18576582 18165732
4482A8165732l42756k89357k41301k61627k15720j52416j16540p6815n5303L025
$$ 18165732 17822976 17533619 17292318 17030691 16814971 16662555 16546015 16469200 16413897 16416922
4472A6416922p6349k674L4099M2495O6441Q6447O5694K8123N8242O1709K8608
$$ 16416922 16340573 16337899 16371998 16414493 16480934 16567381 16633075 16661198 16719440 16781149 16809757
4461A6809757J1328q3403j64611j54846j42609j67064j46474r9454j32080j51101
$$ 16809757 16821085 16737682 16573071 16418225 16275616 16108552 15962078 15862624 15730544 15579443
4451A5579443j69699k51258l06214l64862l08938m02358l35822l88758l54948
$$ 15579443 15409744 15158486 14852272 14487410 14178472 13776114 13440292 13051534 12696586
4442A2696586l38568k51375k45046k18016j65030k06677j78565j96379j55520
$$ 12696586 12358018 12106643 11861597 11643581 11478551 11271874 11093309 10896930 10741410
4433A0741410q2910n2199j22215o0862J4030k6370k5933J4793n0104Q336J3345
$$ 10741410 10658500 10606301 10484086 10423224 10437254 10410884 10384951 10399744 10349640 10357976 10371321
4422A0371321M780L195r3545j68874j20916j71363j39064j50610j91468j04408
$$ 10371321 10376101 10379296 10285751 10116877 9995961 9824598 9685534 9534924 9343456 9239048
4412I239048j29062j61369j42179r0897j68040j16521r8046j10318q1095q3869
$$ 9239048 9109986 8948617 8806438 8715541 8547501 8430980 8332934 8222616 8141521 8057652
4402H057652o802j04429j09870o1178r7173o6941p4811o3920l3479k2437p0854
$$ 8057652 8050850 7946421 7836551 7775373 7678200 7611259 7536448 7472528 7439049 7416612 7345758
4391G345758m6623l9570n3779m9927K1017K5275m5560k1363l5646j0464N3110
$$ 7345758 7299135 7259565 7205786 7155859 7176876 7202151 7156591 7135228 7099582 7089118 7142228
4380G142228L6656L3929N0125M9040R080q064l644J4436L4612o3917K1054n0454
$$ 7142228 7178884 7212813 7262938 7311978 7321058 7312994 7309350 7323786 7358398 7294481 7315535 7265081
4368G265081r3575J8626O4709j1557j251n2156j7225L5663N6465P7220J1326K7552
$$ 7265081 7171506 7190132 7254841 7243284 7242033 7189877 7172652 7208315 7264780 7342000 7353326 7380878
4356G380878K1327K9366N7826N5937N0702L7746l2557Q861M1098J06754P6708
$$ 7380878 7402205 7431571 7489397 7545334 7596036 7633782 7601225 7610086 7651184 7757938 7834646
4345G834646j7306L3630K2168j9313j3901K3576n4492q5875n6024j4860n6713
$$ 7834646 7817340 7850970 7873138 7853825 7839924 7863500 7809008 7723133 7667109 7652249 7595536
4334G595536o6061Q110m1659m0521N2828j0900N11R243r498P5269J06261J7980
$$ 7595536 7529475 7537585 7495926 7455405 7508233 7497333 7497844 7507087 7497589 7572858 7679119 7697099
4322G697099P8369J6440M7497L0873P4297L1044l2356j3522j2482J9055j3808
$$ 7697099 7775468 7791908 7839405 7870278 7944575 7975619 7943263 7929741 7917259 7936314 7922506
4311G922506Q271o0722o6725K9768O6647K8530P018k832n7193j7645M7524R0289
$$ 7922506 7930777 7870055 7803330 7833098 7899745 7928275 7935293 7932461 7875268 7857623 7905147 7995436
4299G995436j2436k3751k1569n46O847L2552J377J4012P2495M773M0899j1695
$$ 7995436 7983000 7959249 7937680 7937134 7943981 7976533 7977910 7991922 8064417 8069190 8110089 8098394
4287H098394M7690L5590N4539k2853L0501k1425P7318N9422j3897j1630Q790L9026
$$ 8098394 8146084 8181674 8236213 8213360 8243861 8222436 8299754 8359176 8345279 8333649 8342439 8381465
4275H381465O2929P654N2750J8623K9498J15435k2608O1484N0041P7934Q9801
$$ 8381465 8444394 8452048 8504798 8523421 8552919 8668354 8645746 8707230 8757271 8835205 8925006
4264H925006K5298J14795O9721L3570Q3036J08021J01340J06295J11419Q4759
$$ 8925006 8950304 9065099 9134820 9168390 9251426 9359447 9460787 9567082 9678501 9763260
4254I763260M1484J26662R2676O3548Q8801L0627N9825J03948J08078J05283N3839
$$ 9763260 9804744 9931406 10024082 10087630 10176431 10207058 10266883 10370831 10478909 10584192 10638031
4243A0638031J49609J49832J05222Q3513Q5726J84572J09756R8562J49344J21362
$$ 10638031 10787640 10937472 11042694 11126207 11211933 11396505 11506261 11604823 11754167 11875529
4233A1875529J77053J77048J63842J91881K12489J48132J36402K54183K34602
$$ 11875529 12052582 12229630 12393472 12585353 12797842 12945974 13082376 13336559 13571161
4224A3571161K19308J81286K92065K50152K25469L00680K64902K74643L12164
$$ 13571161 13790469 13971755 14263820 14513972 14739441 15040121 15305023 15579666 15891830
4215A5891830L43790L30453L66693M12251L61346M76061M77097M36646M99959
$$ 15891830 16235620 16566073 16932766 17345017 17706363 18182424 18659521 19096167 19596126
4206A9596126M21107N57221O38719N98562O38637P49710Q14435Q07208Q89612
$$ 19596126 20017233 20574454 21213173 21811735 22450372 23200082 24014517 24821725 25711337
4197B5711337R03910R68989R76446J058830J172335J166416J248998J281894J299047
$$ 25711337 26615247 27584236 28560682 29619512 30791847 31958263 33207261 34489155 35788202
4188C5788202J436745J546765J606361J658589J691609J876019J899696J917327
$$ 35788202 37224947 38771712 40378073 42036662 43728271 45604290 47503986 49421313
4180D9421313J972744J999278K063023K097728K180728K167333K191153K284028
$$ 49421313 51394057 53393335 55456358 57554086 59734814 61902147 64093300 66377328
4172F6377328K265902K265560K307348K286918K278067K341858K245332K141626
$$ 66377328 68643230 70908790 73216138 75503056 77781123 80122981 82368313 84509939
4164H4509939K130012K021667J930885J784044J660589J622643J476360J352539
$$ 84509939 86639951 88661618 90592503 92376547 94037136 95659779 97136139 98488678
4156I8488678J302562J178088J041759R11413P28771N53793M56794K24232J1566
$$ 98488678 99791240 100969328 102011087 102922500 103651271 104205064 104661858 104886090 104897656
4147A04897656k23978m10423o34589p45718r34264j077616j151239j315451j404823
$$ 104897656 104673678 104263255 103628666 102882948 101948684 100871068 99719829 98404378 96999555
4138I6999555j500227j631095j793953j927527k013055k100108k214295k268260
$$ 96999555 95499328 93868233 92074280 90146753 88133698 86033590 83819295 81551035
4130H1551035k276140k407396k371010k321275k426640k341967k308289k310351
$$ 81551035 79274895 76867499 74496489 72175214 69748574 67406607 65098318 62787967
4122F2787967k213617k227760k147481k086673k060751k017050j968336j816922
$$ 62787967 60574350 58346590 56199109 54112436 52051685 50034635 48066299 46249377
4114D6249377j778340j688778j604303j515754j528166j402801j289141j301667
$$ 46249377 44471037 42782259 41177956 39662202 38134036 36731235 35442094 34140427
4106C4140427j221472j163004j107910j086364j040556j037455r48804q85889
$$ 34140427 32918955 31755951 30648041 29561677 28521121 27483666 26534862 25648973
4098B5648973p86233p62818p50631o82148o74868o07438o22130n45676n04551
$$ 25648973 24862740 24099922 23349291 22667143 21992275 21384837 20762707 20217031 19712480
4089A9712480m94941m99798m92923m35911l70351l98226l82150k98633l45555
$$ 19712480 19217539 18717741 18224818 17788907 17418556 17020330 16638180 16339547 15993992
4080A5993992k91185k53643j36083j68721k32016j95397k11319j67475j44658
$$ 15993992 15702807 15449164 15313081 15144360 14912344 14716947 14505628 14338153 14193495
4071A4193495o7158j54023j14037o8503r0617j5347j27324j24669q8990j45586
$$ 14193495 14126337 13972314 13858277 13789774 13699157 13683810 13556486 13431817 13342827 13197241
4061A3197241p8787k9103j52965j92668r4578j22127o7054q0254j55201j33788
$$ 13197241 13118454 13089351 12936386 12743718 12649140 12527013 12459959 12379705 12224504 12090716
4051A2090716p0200r9618j39348j52834j34195q5774j27594r3465o5608j61187
$$ 12090716 12020516 11920898 11781550 11628716 11494521 11408747 11281153 11187688 11122080 10960893
4041A0960893j55199m3944p8427p8987n1365j17943n8598r963m605J4258L403
$$ 10960893 10805694 10761750 10683323 10604336 10552971 10435028 10376430 10366467 10361862 10376120 10379523
4030A0379523k9969j5474m421O447M2185P8496J6194l6023N977o6206n931P5087
$$ 10379523 10349554 10334080 10329659 10336106 10378291 10456787 10472981 10436958 10442935 10376729 10370798 10445885
4018A0445885L0855J4261m7935N695L6337R897l5240j0548K8710L5582L1699O3309
$$ 10445885 10476740 10491001 10443066 10448761 10485098 10494995 10459755 10449207 10477917 10513499 10545198 10608507
4006A0608507J7918P4320O0667l6642N8882K8856M3430P4843j5262M4207R4017
$$ 10608507 10626425 10700745 10761412 10724770 10783652 10812508 10855938 10930781 10915519 10959726 11053743
3995A1053743K9899P836L7144K6811J4006J4550m5826n6906J8975J5424K6756
$$ 11053743 11083642 11091478 11128622 11155433 11169439 11183989 11138163 11081257 11100232 11115656 11142412
3984A1142412N0636J7404l0835N359q528p0142k7687k9982Q615m8071q0476p5478
$$ 11142412 11193048 11210452 11179617 11184976 11176448 11106306 11078619 11048637 11057252 11009181 10928705 10853227
3972A0853227p2219L3977J8352m79J43K2878J5798J9933J9279k9096M3268m83
$$ 10853227 10781008 10814985 10833337 10832858 10833001 10855879 10871677 10891610 10910889 10881793 10925061 10924578
3960A0924578O0988J05293N6821K6308P7083Q2269R7490Q8689J07406Q4800R9747
$$ 10924578 10985566 11090859 11147680 11173988 11251071 11333340 11430830 11519519 11626925 11711725 11811472
3949A1811472J06783J61543J88469J69601K03837J67665L03741K48816K05778
$$ 11811472 11918255 12079798 12268267 12437868 12641705 12809370 13113111 13361927 13567705
3940A3567705K90825K70917J91325J68123K13274J09228J69617J19287J50537
$$ 13567705 13858530 14129447 14320772 14488895 14702169 14811397 14981014 15100301 15250838
3931A5250838J33941J23020J50813J62602J03387J37057J81144J48662K08553
$$ 15250838 15384779 15507799 15658612 15821214 15924601 16061658 16242802 16391464 16600017
3922A6600017J06620Q2890N9372M6029K3044K0892K5098J7374L7675R2567J10227
$$ 16600017 16706637 16789527 16848899 16894928 16917972 16938864 16963962 16981336 17019011 17111578 17221805
3911A7221805M7171J1337J33560P9450J36664J17420R8080J46438J31298J43197
$$ 17221805 17268976 17280313 17413873 17493323 17629987 17747407 17845487 17991925 18123223 18266420
3901A8266420O0714J13701R7435P1771P5527J29419R7583Q1684J90230J32997
$$ 18266420 18327134 18440835 18538270 18610041 18685568 18814987 18912570 18994254 19184484 19317481
3891A9317481J44943J08165J85536J80584J05178J36561K45045J69828J38570
$$ 19317481 19462424 19570589 19756125 19936709 20041887 20178448 20423493 20593321 20731891
3882B0731891K15137K27169K22622J67362K29596J85431J93886J99912K05355
$$ 20731891 20947028 21174197 21396819 21564181 21793777 21979208 22173094 22373006 22578361
3873B2578361K19563K23943L20397K98205K75681L44829L39022L20901L87612
$$ 22578361 22797924 23021867 23342264 23640469 23916150 24260979 24600001 24920902 25308514
3864B5308514M25905M15599M81425N09563N43722N49990O59599O61125O70087
$$ 25308514 25734419 26150018 26631443 27141006 27684728 28234718 28894317 29555442 30225529
3855C0225529P62779Q05486Q55014Q64089R25998J045221J009200J059690J066458
$$ 30225529 30988308 31793794 32648808 33512897 34438895 35484116 36493316 37553006 38619464
3846C8619464J125988J139689J060837J084924J126989J106204J031894J016540
$$ 38619464 39745452 40885141 41945978 43030902 44157891 45264095 46295989 47312529
3838D7312529J069661R20350R06836Q77217Q45151Q06850P64936O92593O06573
$$ 47312529 48382190 49302540 50209376 51086593 51931744 52738594 53503530 54196123 54802696
3829E4802696N74098M49406M47749L37636K24512J75199J59257J41106J14149
$$ 54802696 55376794 55826200 56273949 56611585 56836097 57011296 57170553 57311659 57425808
3820E7425808R5047J75332J26599J63145J57704K60423K87040L32956L00266M23257
$$ 57425808 57520855 57696187 57822786 57985931 58143635 58404058 58691098 59024054 59324320 59747577
3810E9747577N37076O32660O92984Q96300J105262J218779J375517J511946J697181
$$ 59747577 60284653 60917313 61610297 62506597 63611859 64830638 66206155 67718101 69415282
3801F9415282J767745J992925K136174K366180K480535K653409K890327L010780
$$ 69415282 71183027 73175952 75312126 77678306 80158841 82812250 85702577 88713357
3793H8713357L203335L320557L496857L536288L629432L689380L692103L646716
$$ 88713357 91916692 95237249 98734106 102270394 105899826 109589206 113281309 116928025
3785A16928025L607062L585566L501660L432804L319037L220715L087193K957318
$$ 116928025 120535087 124120653 127622313 131055117 134374154 137594869 140682062 143639380
3777A43639380K760213K534303K324501K026042J728726J406045J172322Q98025
$$ 143639380 146399593 148933896 151258397 153284439 155013165 156419210 157591532 158489557
3769A58489557O98108N34123M20752L15211K56110J91556J30345J58958J81061
$$ 158489557 159187665 159721788 160142540 160457751 160713861 160905417 161035762 161194720 161375781
3760A61375781J61583K08044K98818L76678M88047O68779Q27486R79610J218208
$$ 161375781 161537364 161745408 162044226 162420904 162908951 163577730 164405216 165384826 166603034
3751A66603034J454719J708481J974488K351120K784435L157140L463707L816337
$$ 166603034 168057753 169766234 171740722 174091842 176876277 180033417 183497124 187313461
3743A87313461M002742M120587M144951L990800L665649L254398K716564K225243
$$ 187313461 191316203 195436790 199581741 203572541 207238190 210492588 213209152 215434395
3735B15434395J762681J325250J072027R07861R14811J012824J141318J225967
$$ 215434395 217197076 218522326 219594353 220502214 221417025 222429849 223571167 224797134
3727B24797134J352854J542518J564395J662334J700353J822922K041064K454970
$$ 224797134 226149988 227692506 229256901 230919235 232619588 234442510 236483574 238938544
3719B38938544K759320L195865L783311M140777M337623M427717M212334L741901
$$ 238938544 241697864 244893729 248677040 252817817 257155440 261583157 265795491 269537392
3711B69537392L036877K146904J194798M26188k01861p07080j030334j108761
$$ 269537392 272574269 274721173 275915971 276342159 276140298 275433218 274402884 273294123
3703B73294123j304509j434563j680517k185505k854587l663979m722305n926375
$$ 273294123 271989614 270555051 268874534 266689029 263834442 260170463 255448158 249521783
3695B49521783p044113p998518q866976r478600r711085r720554r551532r117375
$$ 249521783 242477670 234479152 225612176 216133576 206422491 196701937 187150405 178033030
3687A78033030q623384q118634p569028p086706o633631o215890n846313n478983
$$ 178033030 169409646 161291012 153721984 146635278 140001647 133785757 127939444 122460461
3679A22460461n130909m814176m525168m262777m007228l793118l496735l374654
$$ 122460461 117329552 112515376 107990208 103727431 99720203 95927085 92430350 89055696
3671H9055696l211488l037397k800247k729017k683082k506835k468700k413877
$$ 89055696 85844208 82806811 80006564 77277547 74594465 72087630 69618930 67205053
3663F7205053k277918k222403k142155k063428j977779j867745j813523j762329
$$ 67205053 64927135 62704732 60562577 58499149 56521370 54653625 52840102 51077773
3655E1077773j618302j609099j556792j444514j308964j204622j218477j200349
$$ 51077773 49459471 47850372 46293580 44849066 43540102 42335480 41117003 39916654
3647C9916654j121389j017580r59049q44136p83066p70760o77388p03810o77460
$$ 39916654 38795265 37777685 36818636 35974500 35191434 34420674 33743286 33039476 32362016
3638C2362016o51136n80287n69763n63575n97934n03049n54842n36996m35170
$$ 32362016 31710880 31130593 30560830 29997255 29399321 28896272 28341430 27804434 27369264
3629B7369264m48423n00179m56755m17285l96571m47959m03679m08029l80383
$$ 27369264 26920841 26420662 25963907 25546622 25150051 24702092 24298413 23890384 23510001
3620B3510001m24393m55518l84469m07959l81748l86266m20838l48065l45969
$$ 23510001 23085608 22630090 22245621 21837662 21455914 21069648 20648810 20300745 19954776
3611A9954776l29243k97817k85697k72419l11038l01376k30560k15782k14683
$$ 19954776 19625533 19327716 19042019 18769600 18458562 18157186 17926626 17710844 17496161
3602A7496161k46329k67694j78972j97210j96534j78003j63051j70122j46855
$$ 17496161 17249832 16982138 16803166 16605956 16409422 16231419 16068368 15898246 15751391
3593A5751391j84387j58807j07219j59430j40087j43902j04037r0581p3417p7156
$$ 15751391 15567004 15408197 15300978 15141548 15001461 14857559 14753522 14662941 14589524 14512368
3583A4512368j45279j18223j57453j36361j16581j31846j53961j10649j33964
$$ 14512368 14367089 14248866 14091413 13955052 13838471 13706625 13552664 13442015 13308051
3574A3308051j13168j11172n0139j28018j48668m9397n2463j28584j23120m8656
$$ 13308051 13194883 13083711 13033572 12905554 12756886 12707489 12655026 12526442 12403322 12354666
3564A2354666l2258o3118n2726m9739l4746m5621o3769m1645l4716p6158k9927
$$ 12354666 12322408 12259290 12206564 12156825 12122079 12076458 12012689 11971044 11936328 11860170 11830243
3553A1830243o1852j6814m4451j24574k6936o5391j37091q4226j24454j13810
$$ 11830243 11768391 11751577 11707126 11582552 11555616 11490225 11353134 11268908 11144454 11030644
3543A1030644r1861r2541p9606q4541o2533k5452o3100p1535m7892j6014l8148
$$ 11030644 10938783 10846242 10766636 10682095 10619562 10594110 10531010 10459475 10411583 10395569 10357421
3532A0357421j4976p102o2336k8660j8300j0286l7080j7240P0619L7283M144K6070
$$ 10357421 10342445 10335343 10273007 10244347 10226047 10215761 10178681 10161441 10232060 10269343 10273487 10299557
3520A0299557o214K971p1350m2450J851o575K7221N194l8823J6233P9442N9635
$$ 10299557 10293343 10296314 10224964 10182514 10184365 10177790 10205011 10210205 10171382 10187615 10267057 10326692
3508A0326692Q1474P4776P5626M6511K9968R2363P2052M1827J5866O6448O0704
$$ 10326692 10408166 10482942 10558568 10605079 10635047 10727410 10799462 10841289 10857155 10923603 10984307
3497A0984307N6678J60334M6360P1696J44331R9371O6602J14287J88599J04065
$$ 10984307 11040985 11201319 11247679 11319375 11463706 11563077 11629679 11743966 11932565 12036630
3487A2036630J24636J61953J27218J75416K14014J61445K11381K51131L13446
$$ 12036630 12161266 12323219 12450437 12625853 12839867 13001312 13212693 13463824 13777270
3478A3777270K94853L16684L25871L77105N07111M68039M46170M47702M39167
$$ 13777270 14072123 14388807 14714678 15091783 15598894 16066933 16513103 16960805 17399972
3469A7399972M62812M38006M43489M84105L85090M36098L76036L13384K95511
$$ 17399972 17862784 18300790 18744279 19228384 19613474 20049572 20425608 20738992 21034503
3460B1034503J81479J11062K3840j08587j21533j68675j41711r7790j49268j56588
$$ 21034503 21215982 21327044 21350884 21242297 21120764 20952089 20810378 20712588 20563320 20406732
3450B0406732j06509k1502n5444K542O9931J37569J86006L28557L20525K07181
$$ 20406732 20300223 20278721 20223277 20225819 20295750 20433319 20619325 20947882 21268407 21475588
3440B1475588K22775K50700J84076R0658K6439O0791N1153m891n9239k2255p3780
$$ 21475588 21698363 21949063 22133139 22223797 22250236 22311027 22362180 22357289 22298050 22275795 22202015
3429B2202015k19192l58243l27276l09987k42731j58556j50262j10797J7603Q3834
$$ 22202015 21982823 21624580 21297304 20987317 20744586 20586030 20435768 20324971 20342574 20426408
3419B0426408J05363K48214K87828L84042N22875O02197N82301O80190P69744
$$ 20426408 20531771 20779985 21067813 21451855 21974730 22576927 23159228 23839418 24609162
3410B4609162Q82770R89180R63185Q36594O19497N43977K78420j98589q03141
$$ 24609162 25491932 26481112 27444297 28280891 28900388 29444365 29722785 29524196 28721055
3401B8721055j201694j315293j101644p88545o04331n38236m60925m48095l69733
$$ 28721055 27519361 26204068 25102424 24313879 23709548 23171312 22710387 22262292 21892559
3392B1892559k61887j54842n702L4956J94933L65151N42357O63983Q06581R79325
$$ 21892559 21630672 21475830 21470128 21505084 21700017 22065168 22607525 23271508 24078089 25057414
3382B5057414J179696J393384J667184K130426K510414L064544L389580L325092
$$ 25057414 26237110 27630494 29297678 31428104 33938518 37003062 40392642 43717734
3374D3717734L408658L082459K007793O15102n80532j461427k520613l347814
$$ 43717734 47126392 50208851 52216644 52831746 52251214 50789787 48269174 44921360
3366D4921360l516868l219476k328575j668206j475477j429584j225099j093524
$$ 44921360 41404492 38185016 35856441 34188235 32712758 31283174 30058075 28964551
3358B8964551r88856q07115n35053l27119j09364P9340L61153O47760Q36713J117888
$$ 28964551 27975695 27168580 26633527 26306408 26197044 26276384 26637537 27285297 28122010 29239898
3348B9239898J721127K215005K740204K858846K071714J295737R44185L97531
$$ 29239898 30961025 33176030 35916234 38775080 40846794 42142531 43086716 43484247
3340D3484247j143983k754474l644372l448080k506418j842271j604332j534063
$$ 43484247 42340264 39585790 35941418 32493338 29986920 28144649 26540317 25006254
3332B5006254j310038j254180j278772j229649j134007j035328r81083q15518
$$ 25006254 23696216 22442036 21163264 19933615 18799608 17764280 16783197 15967679
3324A5967679o37894n53938n32780m71649m39338l72861k94688k31292k21243
$$ 15967679 15329785 14775847 14243067 13771418 13332080 12959219 12664531 12433239 12211996
3315A2211996j77980j11730j30503j12928j0551Q440m8708q3562p3085p6252n6464
$$ 12211996 12034016 11922286 11791783 11678855 11668304 11676744 11628036 11544474 11471389 11395137 11338673
3304A1338673l3414k6177K388N7836m894O373P1289J13573J83103J59169K25165
$$ 11338673 11305259 11279082 11281470 11339306 11334412 11340785 11412074 11525647 11708750 11867919 12093084
3293A2093084K97760L15817M83652N50824O34695P27071Q35896R55225J157516
$$ 12093084 12390844 12706661 13190313 13741137 14375832 15102903 15938799 16894024 18051540
3284A8051540J401692J738900K094566K410001K435111J761936J260560R73640
$$ 18051540 19453232 21192132 23286698 25696699 28131810 29893746 31154306 32127946
3276C2127946N57662m14443j618925k279712k214145j736679j087313q92956q21248
$$ 32127946 32685608 32271165 30652240 28372528 26158383 24421704 23334391 22441435 21620187
3267B1620187o79447o05892n10632m89529l87501j85006k765J99274M04778N45229
$$ 21620187 20940740 20334848 19824216 19334687 18947186 18762180 18759415 18958689 19363467 19908696
3257A9908696Q15278J056787J416920J789434K119890J917376J416144R58352
$$ 19908696 20723974 21780761 23197681 24987115 27107005 29024381 30440525 31398877
3249C1398877N73703K6864j053025k097290k544459k255337j701644j329188j171060
$$ 31398877 31972580 31999444 30946419 28849129 26304670 24049333 22347689 21018501 19847441
3240A9847441j065999j064086r67703q55975q92801q39519p37349o31223n36299
$$ 19847441 18781442 17717356 16749653 15893678 15000877 14161358 13424009 12792786 12256487
3231A2256487m19487l74731l42654l40543k20911k11274k20743k48284j39259
$$ 12256487 11837000 11462269 11119615 10779072 10558161 10346887 10126144 9877860 9738601
3222I738601j65169j80871j51256k07867j49127k32730k42741j49944k15562j78654
$$ 9738601 9573432 9392561 9241305 9033438 8884311 8651581 8408840 8258896 8043334 7864680
3212G864680r4080j31603j17182j11806k0052j04392r4257n3439r7399l8081p1579
$$ 7864680 7770600 7638997 7521815 7410009 7389957 7285565 7191308 7137869 7040470 7002389 6930810
3201F930810l4057j3848n8518o3560L478k0638q2877l7156j5588l3496n7604j29354
$$ 6930810 6896753 6882905 6824387 6760827 6764305 6743667 6660790 6623634 6608046 6574550 6516946 6387592
3189F387592o5907j22778l8526q0116q0815l1967m1760p3234m5604l443m8481
$$ 6387592 6321685 6198907 6160381 6080265 5999450 5967483 5925723 5852489 5806885 5803442 5754961
3178E754961n2784p5675K7029j6026k1354l0986k1796p2215j1811J3448J5122
$$ 5754961 5702177 5626502 5653531 5637505 5616151 5585165 5563369 5491154 5479343 5492791 5507913
3167E507913k7190N387l191k2212p073J7231l6483J474j2167o410K5945j7164
$$ 5507913 5480723 5486110 5482919 5460707 5453634 5470865 5434382 5435856 5423689 5417279 5443224 5426060
3155E426060M6168M3603M6948q680K1223N3149J8829K7371k5168O8359P9038m5765
$$ 5426060 5472228 5515831 5562779 5554099 5575322 5628471 5647300 5674671 5649503 5717862 5796900 5751135
3143E751135k0984M1797K9779N108K4754M7813K8882N4933j2697L5685O0591J04641
$$ 5751135 5730151 5771948 5801727 5806835 5831589 5879402 5908284 5963217 5950520 5986205 6046796 6151437
3131F151437N3775Q5457R9421N8515Q2614Q4290O6189Q6149J01822Q8189R6942
$$ 6151437 6205212 6290669 6390090 6448605 6531219 6615509 6681698 6767847 6869669 6957858 7054800
3120G054800J3419M3484R3906Q4763K5831k9041j3362l1366j00088o2804q0817
$$ 7054800 7068219 7111703 7205609 7290372 7316203 7287162 7273800 7242434 7142346 7079542 6998725
3109F998725o8926M588P335N323L5569K6561J5668k2436J8011O1796O1173K9874
$$ 6998725 6929799 6934387 6941722 6947045 6982614 7009175 7024843 7002407 7020418 7082214 7143387 7173261
3097G173261L4009M3204L8982k5664j177j8574m0290l2397m3076j0368L685n3568
$$ 7173261 7207270 7250474 7289456 7263792 7262615 7244041 7203751 7171354 7128278 7117910 7121595 7068027
3085G068027r8049j58647j54588j10287j23552q1773o7597q2925o5635o0402m5066
$$ 7068027 6969978 6811331 6656743 6546456 6422904 6341131 6273534 6190609 6124974 6064572 6019506
3074F019506n8737l2698p0368m2088n7677q4642l5129n4257p0972j07221q8125
$$ 6019506 5960769 5928071 5857703 5815615 5757938 5673296 5638167 5583910 5512938 5405717 5317592
3063E317592n9006j40675j13510p1615p1208j13465q2286r4878q9590r7339j14863
$$ 5317592 5258586 5117911 5004401 4932786 4861578 4748113 4665827 4570949 4481359 4384020 4269157
3052D269157j02356p5943q7160j06196q3453p4036l8494o6572m6850p2425k4450
$$ 4269157 4166801 4090858 4003698 3897502 3814049 3740013 3701519 3634947 3588097 3515672 3491222
3041C491222m0356o9294p9665n193m4636o2661n3595n7461j0599k4497k8099j44445
$$ 3491222 3450866 3381572 3301907 3296714 3252078 3189417 3135822 3078361 3067762 3043265 3015166 2870721
3029B870721n6023o85k5058n5896J7574p671n4580l3755p5364l0857j0471O0735
$$ 2870721 2814698 2814013 2788955 2733059 2750633 2742962 2688382 2654627 2579263 2548406 2537935 2598670
3017B598670j00616q9852N5116J6454n5443j067K791o9853p7950l1555K3979k0001
$$ 2598670 2498054 2408202 2463318 2479772 2424329 2423262 2426053 2356200 2278250 2246695 2270674 2250673
3005B250673k6007P079n7391K7939n046m5817k5418J4991k6208k1374j7406J2952
$$ 2250673 2224666 2231745 2174354 2202293 2197247 2151430 2126012 2141003 2114795 2093421 2076015 2088967
2993B088967p743J657K164m3214l2981m1436L5608p1974o0516j955Q952j199l9886
$$ 2088967 2081224 2082881 2085045 2041831 2008850 1967414 2003022 1931048 1870532 1868577 1877529 1876330 1836444
2980A836444r300K9335j6799k3481j3853l6535n654J1268j4700p7664K6095M8862
$$ 1836444 1827144 1856479 1839680 1816199 1802346 1765811 1760157 1771425 1756725 1679061 1705156 1754018
2968A754018o5373J3140L6409k9088J2857j2128m884J3543q165p0358o5062M257
$$ 1754018 1688645 1701785 1738194 1709106 1721963 1709835 1704951 1718494 1710329 1639971 1574909 1579166
2956A579166J3753l4506l0449N978n1464l1797p581K471n3903R656J3066j4852
$$ 1579166 1592919 1558413 1527964 1533942 1482478 1450681 1443100 1445571 1391668 1401324 1414390 1399538
2944A399538o322m2468M2178j9240k7020Q649m3071o544k1169K2445n2804J2463
$$ 1399538 1393216 1350748 1392926 1373686 1346666 1355315 1312244 1305700 1284531 1306976 1254172 1266635
2932A266635Q938L75r705J479J2833o6994k3274K4880l8637l1679K14k1505L7344
$$ 1266635 1275573 1275948 1266243 1267722 1280555 1213561 1190287 1215167 1176530 1144851 1145065 1123560 1160904
2919A160904l3581N893K204l340j5934k5108l5410j2048J4866K4465J3010j4700
$$ 1160904 1127323 1133216 1135420 1132080 1116146 1091038 1055628 1043580 1058446 1082911 1095921 1081221
2907A081221K800l0744K0518m894q282r969j2883n3301k1288L1682k6024P243
$$ 1081221 1084021 1053277 1073795 1068901 1060619 1050650 1037767 984466 963178 994860 968836 976079
2895I76079O1502o9244J543J9852o9705n325L1307J0181l749l5869l8900O029
$$ 976079 1037581 968337 969880 989732 920027 914702 946009 956190 952441 916572 877672 883701
2883H83701L5142j4397p0117N466K6460j9872o787P2746m165k8258L5586l4217
$$ 883701 918843 904446 834329 839795 866255 846383 839596 912342 908177 879919 915505 881288
2871H81288r1753j4105j427L6702j2314M6538j1139M174M3746m5364J8653l1999
$$ 881288 789535 775430 774003 810705 798391 844929 833790 837964 881710 836346 854999 823000
2859H23000n9822K2133K684K0391k1617j5325L903J9091K2783j0628l1354m7836
$$ 823000 763178 785311 787995 808386 786769 771444 775347 794438 817221 806593 775239 727403
2847G27403L5208m3059l4834J4253n110j059L2048o1805J3869r719k5088j3329
$$ 727403 762611 719552 684718 698971 693861 692802 724850 663045 676914 667195 642107 628778
2835F28778N1400O3701o6024L6986k8279n7046k3876M308N5106j9907m185N6431
$$ 628778 680178 743879 677855 714841 686562 629516 605640 609948 665054 645147 640962 697393
2823F97393p719M205m8713k6327L8200j9338m235j2268j1994J3466k7090N8696
$$ 697393 689674 693879 645166 618839 657039 637701 633466 621198 609204 622670 595580 654276
2811F54276M5203l4503k0159l0972r474j7549k1529n2788J0165L5495j1839K5313
$$ 654276 699479 664976 644817 613845 604371 586822 565293 512505 522670 558165 546326 571639
2799E71639q647l4698J7493J1029l8274m376L6445k9338K1759L279l5899M9j8295
$$ 571639 562992 528294 545787 556816 518542 514166 550611 521273 543032 546311 510412 510461 492166
2786D92166N3645J9054l1869l7527k6922j8663k7390J7016K7643N8235m6172j2267
$$ 492166 545811 564865 532996 495469 468547 449884 422494 439510 467153 525388 479216 466949
2774D66949O2972m8968j0177L1366J1593l1769p923O2386j4450m4256l1108K450
$$ 466949 529921 480953 470776 502142 513735 481966 474043 536429 521979 477723 446615 449065
2762D49065J2583k3867m945L04m170j7446J0986J4569k5099n1809L2821J2583
$$ 449065 461648 437781 432836 433140 428970 411524 422510 437079 411980 360171 392992 405575
2750D05575L506j6712o476k4803M813K4455l1795l1293K4302M9315L9526q0866
$$ 405575 409081 392369 385893 361090 365903 390358 358563 327270 351572 400887 440413 359547
2738C59547n3514Q513K075Q487j0058l5130m937r278L9282K2399l4665M7337J9283
$$ 359547 306033 314546 316621 325108 315050 279920 274983 265705 304987 327386 292721 340058 359341
2725C59341j836K738l7517j4423m4790O904J9980k2891q102J143L5233k476j6343
$$ 359341 357505 360243 322726 308303 263513 270417 290397 267506 259404 260547 295780 293304 276961
2712B76961l3226k07m0321O3291k5538K166L1527L8252l0191o5707m1381M43P3396
$$ 276961 243735 243528 203207 266498 240960 243126 274653 312905 282714 217007 175626 176069 249465
2699B49465O466m5404j6805J1218K7037j0203O649N3585l0737k1453m2750K6934
$$ 249465 255931 210527 193722 204940 231977 221774 228423 282008 251271 229818 187068 214002
2687B14002Q493l7990R60m3129R416j6491K1414R950K8996j9693m3339K2635o463
$$ 214002 222495 184505 185465 142336 151752 135261 156675 166625 195621 175928 132589 155224 148761
2674A48761K5476R605m2765R123P710k3084M367M5464O230m1351k573j603O906
$$ 148761 174237 183842 141077 150200 157910 134826 139193 184657 190887 149536 146963 145360 152266
2661A52266J6333j4858J3229k55P01l0198j7932k2036K9210j8895k076K3142p581
$$ 152266 168599 153741 166970 166715 167416 137218 119286 97250 126460 107565 105489 128631 121050
2648A21050q717K4772m715J581L9321m0531j3235P853J8157q071k4661k4083J3958
$$ 121050 112333 137105 132390 133971 173292 132761 119526 127379 145536 137465 112804 88721 102679
2635A02679j4771k8831K5801M6852j975J1229K0044K085r8655p441L6321l269
$$ 102679 87908 59077 84878 131730 129755 140984 161028 163113 64458 57017 93338 90069
2623I0069Q42O0017k8138k4095j0934N3899l7213n4551N758J8353N526j4841K749
$$ 90069 90911 150928 122790 98695 87761 141660 104447 49896 55654 74007 79533 64692 67441
2610F7441k548M4603n123m473J2757l2839J5671j0369L2241m0329q988J1088J9
$$ 67441 64893 109496 104373 99900 112657 79818 95489 85120 117361 77032 68044 79132 79151
2597G9151q572M0745K4026j6876m2175l7419Q6256j7951j1994J9585k3372j5471
$$ 79151 70579 111324 135350 118474 76299 38880 125136 107185 95191 114776 91404 75933
2585G5933L3673l0314n1258J9139m090K241K6551k122J9594l1886M475j6844K6209
$$ 75933 109606 79292 28034 47173 43083 45324 71875 69753 89347 57461 61936 45092 71301
2572G1301J7490N216j3629k2492L5403p050p2253K2277l0107K9676n9812m1245
$$ 71301 88791 94007 80378 57886 93289 86239 13986 36263 6156 35832 -23980 -65225
2560f5225L1765M818L7554l7220J01k2065J2019L2765K2945K391l5303n6884K7584
$$ -65225 -33460 -28642 8912 -28308 -28207 -50272 -38253 -5488 17457 19848 -15455 -72339 -44755
2547d4755J5972j6925M780J7297k2193M2734K0560m5113k7801j0423J6730K9293
$$ -44755 -28783 -45708 -40928 -23631 -45824 -3090 17470 -27643 -55444 -65867 -49137 -19844
2535a9844j7546n248J9315J824k7653j9353j1186L6826M6054k2884K79Q634m8675
$$ -19844 -37390 -42638 -23323 -21499 -49152 -68505 -79691 -42865 3189 -19695 -19416 -10782 -59457
2522e9457J0637K5108L2108l748m5094K4200j6821J2129m3253J4505L2988n0029
$$ -59457 -48820 -23712 8396 4648 -40446 -16246 -33067 -20938 -64191 -49686 -16698 -66727
2510f6727n645Q8827L8779J4244m3511O80k7409k7192O840L5954k3361m3588O433
$$ -66727 -72372 16455 55234 69478 25967 26647 -762 -27954 -21114 14840 -8521 -52109 -45676
2497d5676K7573k710j0035l2378k8907J9567k391M9965o026l3784J3727l4637
$$ -45676 -18103 -20813 -30848 -63226 -92133 -72566 -74957 -24992 -31018 -64802 -51075 -85712
2485h5712M4392J0332J0360p68k4931P440J0565j2119j4219J8000M8802K3453
$$ -85712 -41320 -30988 -20628 -21396 -46327 -38887 -28322 -40441 -54660 -36660 12142 35595
2473C5595p3342j1910l599J2991n482R604k6474k9627M2246n2170r198M0414L9207
$$ 35595 -37747 -49657 -53256 -40265 -45747 -36143 -62617 -92244 -49998 -102168 -111366 -70952 -31745
2460c1745K7243n9187l8313P773j3339P2494K8850m9073j9001j7462M1984L5920
$$ -31745 -4502 -63689 -102002 -94229 -107568 -35074 -6224 -55297 -74298 -91760 -49776 -13856
2448a3856l3237k1865M1394k0158l2306K1529J1746l9664K4400K0895k8912l9733
$$ -13856 -47093 -68958 -27564 -47722 -80028 -58499 -46753 -86417 -62017 -41122 -70034 -109767
2436a09767J6665k603M7433m4129P2648N936k7867k1473l7659O1131L015n1077
$$ -109767 -93102 -95705 -48272 -92401 -19753 -13817 -41684 -63157 -100816 -39685 -36670 -87747
2424h7747J4869j4468L7426k3334M046N458M958N2592j2644q809L6521k4193l0990
$$ -87747 -72878 -87346 -49920 -73254 -69208 -63750 -58792 -6200 -18844 -27653 8868 -15325 -46315
2411d6315K29k1370j1472k1511L8482K9568M1059K2945J6035K0878J1793k5249
$$ -46315 -46086 -67456 -78928 -100439 -61957 -32389 8670 31615 47650 68528 80321 55072
2399E5072l0646k6919j0063P419K7979j2216p413J0438l588o1088J0932L0060
$$ 55072 24426 -2493 -12556 -5137 22842 10626 3213 13651 10063 -51025 -40093 -10033
2387a0033Q0624q794l279K3398L550k474k8630J0464j0375N0799N5954M1574K073
$$ -10033 70591 61797 58518 81916 85466 82992 54362 64826 54451 105250 161204 202778 204851
2374B04851J8322L3399l1165M9131J4339K0779l8411p565O2037L4045L7964j7844
$$ 204851 223173 256572 225407 274538 288877 309656 271245 263680 325717 359762 397726 379882
2362C79882O4088R2497k706L8134O5289O5367O3428J29442P2804M6908M1880M7948
$$ 379882 443970 536467 533761 571895 637184 702551 765979 895421 968225 1015133 1057013 1104961
2350A104961L594m6888L1711N0427N1770J56949Q2497O8985J45056J65420J35097
$$ 1104961 1108555 1061667 1093378 1143805 1195575 1352524 1435021 1504006 1649062 1814482 1949579
2339A949579J76784J90547J90570L25130K59495K41858L15134L75263M34205N32953
$$ 1949579 2126363 2316910 2507480 2832610 3092105 3333963 3649097 4024360 4458565 4991518
2329D991518O62908P74059R03252J233527J512041J637831J144335P21155O52454
$$ 4991518 5654426 6428485 7331737 8565264 10077305 11715136 12859471 13580626 14233080
2320A4233080N30603k12636j268381j703712j719056j093063o70050o54531o33172
$$ 14233080 14763683 14551047 13282666 11578954 9859898 8766835 8096785 7442254 6809082
2311F809082n73091n05697m44971m45540m49324m05973l22597k64273l25995k88241
$$ 6809082 6235991 5730294 5285323 4839783 4390459 3984486 3661889 3397616 3071621 2783380
2301B783380j92354j76571j96708j38806j64714q6513q9411j68979r5230r0693
$$ 2783380 2591026 2414455 2217747 2078941 1914227 1827714 1738303 1569324 1474094 1383401
2291A383401q8013n5761p2863n3800j0987o9451m3530k5748m1702p66n2803o4338
$$ 1383401 1295388 1239627 1166764 1112964 1101977 1032526 988996 963248 921546 920780 867977 803639
2279H03639o5081j1960m5628l0284o4295k4435k5289k0330j0941l9234m9685r35
$$ 803639 738558 726598 680970 650686 586391 561956 536667 516337 505396 466162 416477 415542
2267D15542k7065J0779k9791l7004R569l1496k8609j540q865J1876P361j0760
$$ 415542 388477 399256 369465 332461 342030 310534 281925 280385 271520 283396 290757 279997
2255B79997p2702K1392M2632n6541L6262j436k9318m9696K5314k3068O012l4760
$$ 279997 207295 228687 271319 214778 251040 249604 220286 170590 195904 172836 178848 144088
2243A44088K7847M3267l1831Q401l0844q1318M0189N6395l8122l0856j0043J7054
$$ 144088 171935 215202 183371 191772 160928 79610 119799 176194 138072 107216 97173 114227
2231A14227m3117L3313Q217j5793K819M587K0988l4056m3315j3526K3095m4911
$$ 114227 71110 104423 112640 96847 99666 104253 125241 91185 47870 34344 57439 12528
2219A2528N219L3398o856k4720o832q255R769j3484J0396P456j963j7739J4235
$$ 12528 17747 51145 44289 19569 12737 4482 14251 767 11163 18619 16656 -1083 13152
2206A3152m7135l6869K1447k6163N6075L759r482O413r677J1776N947o5916K7427
$$ 13152 -33983 -70852 -49405 -75568 -19493 -15734 -25216 -18803 -28480 -16704 -10757 -76673 -49246
2193d9246M1587L089m4752r921J1586k4257L8613j8850j4735J7675J1270L370
$$ -49246 -7659 -4570 -49322 -59243 -47657 -71914 -33301 -52151 -66886 -49211 -37941 -34571
2181c4571j2946m4733L5812J336n4147K5416L712J1152k2522J1170N6977Q597
$$ -34571 -47517 -92250 -56438 -55102 -109249 -83833 -80121 -68969 -91491 -80321 -23344 -14747
2169a4747R506l6913p2786q4921J11339k0243k7382L9782l263M0224n1204k6702
$$ -14747 -5241 -42154 -114940 -199861 -88522 -108765 -136147 -96365 -99628 -59404 -110608 -137310
2157a37310R2422o9004L3576M4264j8717l368m9813O3239k1534k8915m6883L7390
$$ -137310 -44888 -113892 -80316 -36052 -54769 -58137 -107950 -44711 -66245 -95160 -142043 -104653
2145a04653O8016J0499l4902m926q464k358j9620M8187j3836p2256n2266R994
$$ -104653 -36637 -26138 -61040 -65966 -74430 -76788 -96408 -48221 -62057 -134313 -186579 -176585
2133a76585M9522j8287j4136M1511k3870k4256J1640M4623O7893k5418j488J9462
$$ -176585 -127063 -145350 -159486 -117975 -141845 -166101 -154461 -109838 -41945 -67363 -68851 -49389
2121d9389k3525P396J7813j8817n0685k5433J3076n929J0113p761j4352L8505
$$ -49389 -72914 -65518 -47705 -66522 -117207 -142640 -129564 -135493 -125380 -133141 -147493 -108988
2109a08988L5610j7383j2555k4524K5044M1160Q761k9480K510o2019o207L9984
$$ -108988 -73378 -90761 -103316 -127840 -102796 -61636 -52875 -82355 -79845 -141864 -148071 -108087
2097a08087m2899L458J1310J4865N492j4501K789J6411J6284k1157K7807m385
$$ -108087 -150986 -147528 -136218 -121353 -115861 -130362 -127573 -111162 -94878 -116035 -88228 -92613
2085i2613r653L4336j1459J2722m7231q256J2474R324j226k3994R355k4909l542
$$ -92613 -102266 -67930 -79389 -66667 -113898 -122154 -109680 -100356 -101582 -125576 -116221 -141130 -144672
2072a44672M1666k2450L6702j9944L782n2691M3104J9668k8917J176l0J1098r965
$$ -144672 -103006 -125456 -88754 -108698 -104916 -157607 -114503 -94835 -123752 -122576 -122606 -111508 -121473
2059a21473K7696m0997L7465O4352j6611K4041n857R062n2115P468J4683M7310
$$ -121473 -93777 -134774 -97309 -32957 -49568 -25527 -31384 -22322 -74437 -66969 -52286 -4976
2047d976k4230l2248K8324l6497K7115n4559j2349J5969J7043M0664l027m9960
$$ -4976 -29206 -61454 -33130 -69627 -42512 -97071 -109420 -93451 -76408 -35744 -38771 -88731
2035h8731J4088l0209q889Q7294J967o8654k8571j9958K454J8305j6707l9420
$$ -88731 -74643 -104852 -113741 -26447 -24480 -93134 -121705 -141663 -139209 -120904 -137611 -177031
2023a77031K944p318N8784k9972J7540q087K2294J5471j632O199l9485j287L569
$$ -177031 -174087 -181405 -122621 -152593 -135053 -143140 -120846 -105375 -107007 -100808 -140293 -141580 -138011
2010a38011Q592L8898l9957j8184P914l7975R529M7607K2969m1103k5102J222
$$ -138011 -129419 -90521 -130478 -148662 -140748 -178723 -169194 -121587 -98618 -139721 -164823 -163601
1998a63601K5190N9106j779m2619J944L7172J2265o52r1946K8490K1981l2958
$$ -163601 -138411 -79305 -81084 -123703 -121759 -84587 -72322 -72974 -164920 -136430 -114449 -147407
1986a47407l8332L069P9674Q856K315q313M2344k2327o5399O741J2432O225J5013
$$ -147407 -185739 -182670 -102996 -94140 -91825 -100138 -57794 -80121 -145520 -138779 -126347 -120122 -105109
1973a05109j6753j9627J9142O3886M716J0819q4026o363M3313M960L0234J6045
$$ -105109 -121862 -141489 -122347 -58461 -53745 -42926 -126952 -133315 -90002 -85042 -54808 -38763
1961c8763Q614o7387m5714M3469q554k0642J3693j0007M4222j4593l2075o919
$$ -38763 -30149 -97536 -143250 -99781 -108335 -128977 -115284 -125291 -81069 -95662 -127737 -134656
1949a34656J248k9264n286J3652N3407l1056k9598k6716K1034K5840K1082K3213
$$ -134656 -133408 -162672 -167958 -154306 -100899 -131955 -161553 -188269 -167235 -141395 -120313 -97100
1937i7100n0537J9888P484K7136r807k7943j6504N8146m852J6154p680k0966P850
$$ -97100 -147637 -127749 -120265 -93129 -102936 -130879 -147383 -89237 -94089 -77935 -85615 -106581 -98731
1924i8731o7031J6394J2857m6493K0731M0754j1670l0420M1477L987L9372M518
$$ -98731 -165762 -149368 -136511 -183004 -162273 -121519 -133189 -163609 -122132 -118145 -78773 -74255
1912g4255n9461k58r277j7890K0868J3128L0315n304l1559K0975J7738L1755q766
$$ -74255 -133716 -133974 -143251 -161141 -140273 -127145 -96830 -102134 -133693 -112718 -94980 -63225 -71991
1899g1991n1263j4j1348j7493n9265M9321L9150m1977P726L4218l9061N4297P197
$$ -71991 -123254 -123268 -134616 -152109 -211374 -162053 -122903 -164880 -157154 -122936 -161997 -107700 -100503
1886a00503l6940L0921K8410k0852j1955j3445L298l1494K3225J7936k2224K2014
$$ -100503 -137443 -106522 -78112 -98964 -110919 -124364 -121066 -152560 -129335 -111399 -133623 -111609
1874a11609J5470N814k520J039L3752n0218j7754M24k3904K3790p452N8695r092
$$ -111609 -96139 -90325 -92845 -91806 -58054 -108272 -126026 -125602 -149506 -125716 -133168 -74473 -83565
1861h3565l6942j6177K507J1607J0470P169p271k842L5790K006l0313L5714k6287
$$ -83565 -120507 -136684 -134177 -122570 -112100 -104931 -112202 -115044 -79254 -77248 -107561 -71847 -98134
1848i8134k3517O0865o4067J4042J7719j1159K6270k6637K3888J9728k447J1304
$$ -98134 -121651 -60786 -124853 -110811 -93092 -104251 -77981 -104618 -80730 -61002 -63449 -52145
1836e2145k020J2208p2754K883N4206q731m0084K6429j7933m1767O2532L0307
$$ -52145 -54165 -41957 -114711 -111828 -57622 -66353 -106437 -80008 -97941 -139708 -77176 -46869
1824d6869n7037M8430l0374m038K5738Q309n0748j3300J745k455k916k5483m0047
$$ -46869 -103906 -55476 -85850 -89888 -64150 -55841 -106589 -119889 -118144 -120599 -123515 -148998 -189045
1811a89045K5590O347N8475q04J3098k1510j4612L625P599o500L042j8893R894
$$ -189045 -163455 -157108 -98633 -99437 -86339 -107849 -122461 -118836 -111237 -117737 -114695 -133588 -123694
1798a23694j3561j0239J4711N226K5473q2631J8464M7193L9515J5648J560o91
$$ -123694 -137255 -147494 -132783 -127557 -102084 -184715 -166251 -119058 -79543 -63895 -62335 -63026
1786f3026J6540O395l5447j123j2845J27J9256n670J7753m8448m4434k2737N0945
$$ -63026 -46486 -40091 -75538 -76661 -89506 -89379 -70123 -75793 -58040 -106488 -150922 -173659 -122714
1773a22714K2022o0979J3572M1689M7351L3928o588P72r583K300R353n361l9406
$$ -122714 -100692 -161671 -148099 -106410 -59059 -25131 -31719 -30947 -40530 -38230 -28877 -34238 -73644
1760g3644p37k3682M2430j9296O8705q1857K503J901l9742N52k3008N4723M2528
$$ -73644 -74381 -98063 -55633 -74929 -6224 -88081 -85578 -83677 -123419 -122867 -145875 -91152 -48624
1747d8624o0398n9712K0050Q4233l9579J5246j2392O4051l1501l3334J8368N584
$$ -48624 -109022 -168734 -148684 -64451 -104030 -88784 -101176 -37125 -68626 -101960 -83592 -78008
1735g8008p290l5922J0737j859q951Q036R459J4060l3576Q116O2284J0464R381
$$ -78008 -85298 -121220 -110483 -112342 -121293 -113257 -103798 -89738 -123314 -115198 -52914 -42450 -33069
1722c3069J3138r13o2071K8773l1428o409k988k717k0610K2926J6721J8264j3412
$$ -33069 -19931 -20844 -82915 -54142 -85570 -91979 -94967 -97684 -118294 -95368 -78647 -60383 -73795
1709g3795k0228k582K6269K2718l3345o8420r849N5217N6880p467m021o7225K5104
$$ -73795 -94023 -96605 -70336 -47618 -80963 -149383 -159232 -104015 -47135 -54602 -58623 -125848 -100744
1696a00744N7071K0153m623p5338R773M0582L7091j1716o9207N7686n160l6378
$$ -100744 -43673 -23520 -28143 -103481 -93708 -53126 -16035 -27751 -96958 -39272 -44432 -80810
1684h0810m6757M0802j8826m5700Q755N572J8916O9711J0459k370L919m6716L3988
$$ -80810 -127567 -86765 -105591 -151291 -142536 -136964 -118048 -48337 -37878 -40248 -36329 -83045 -49057
1671d9057K9531l3791k5991l548K6894j2721j3494J2644m406p482K581n961J3710
$$ -49057 -19526 -53317 -79308 -82856 -55962 -68683 -82177 -69533 -73939 -81421 -78840 -84801 -71091
1658g1091L4482k4516J921m8350M8156L1653j5767j8503m8541J6065K7519M933
$$ -71091 -36609 -61125 -59204 -107554 -59398 -27745 -43512 -62015 -110556 -94491 -66972 -62039
1646f2039k9844L0687q750m1131Q439N8313M5335j05812j1625J2148k4913O1969
$$ -62039 -91883 -61196 -69946 -111077 -102638 -44325 1010 -104802 -116427 -104279 -129192 -67223
1634f7223M9567o610j1205j0978O206N440p8178k9504M0086J5581P321K4841m2911
$$ -67223 -17656 -24266 -35471 -46449 -40243 -34803 -112981 -142485 -102399 -86818 -79497 -54656 -97567
1621i7567K1940J2640O880r335o834J2767J8329O0191m0721K9032o7205n2071
$$ -97567 -75627 -62987 -56107 -65442 -72276 -59509 -41180 19011 -21710 7322 -59883 -111954
1609a11954P593M4706J6080J2010K193k0281k45j6750k3722K7494j2076j5968
$$ -111954 -104361 -59655 -43575 -31565 -29372 -49653 -49898 -66648 -90370 -62876 -74952 -90920
1597i0920L1760Q992J314K87m51R490M067l8696N174J8713j7539k471J8634K7952
$$ -90920 -59160 -50168 -48854 -48567 -49018 -39528 -35461 -74157 -68983 -50270 -67809 -70280 -51646 -23694
1583b3694n595k5069O640l189j235m1710J4036K5550o570J2949k1636R5399R300
$$ -23694 -29289 -54358 -47718 -50907 -52142 -93852 -79816 -54266 -60836 -47887 -69523 25876 35176
1570C5176o1871j380p665J1469J3874M831n2445l8460J5599O8973K6315l9545
$$ 35176 -26695 -28075 -35740 -24271 -10397 -5566 -58011 -96471 -80872 -11899 14416 -25129
1558b5129m3030o96K9116p835l670N4724l4190j5096L6492m9459j4547M6383J062
$$ -25129 -68159 -68855 -39739 -47574 -51244 3480 -30710 -45806 -9314 -58773 -73320 -26937 -25875
1545b5875p5682j8022K4411J1764M0589M5723k9686l571n053J1001K5774m6814
$$ -25875 -101557 -119579 -95168 -83404 -42815 2908 -26778 -30349 -35402 -24401 1373 -45441
1533d5441l2224j1130J6887M6156K0037j8305j2392o6225q230O4291L223r111
$$ -45441 -77665 -88795 -71908 -25752 -5715 -24020 -36412 -102637 -110867 -46576 -43353 -52464
1521e2464L0216J5309J4672m2486K2633R111n9169p346N513K8816J5521k4153
$$ -52464 -22248 -6939 7733 -34753 -12120 -3009 -62178 -69524 -64011 -35195 -19674 -43827
1509d3827K9617m3064k3343L0323O8k271P94L3901K41K4741p7505J4446J9603
$$ -43827 -14210 -57274 -80617 -50294 -50226 -52497 -51703 -17802 -17561 7180 -70325 -55879 -36276
1496c6276l7472J5392k101j6257L4662J7713j0170N951L3231k8911n9421K7322
$$ -36276 -73748 -58356 -60457 -76714 -42052 -24339 -34509 -28558 4673 -24238 -83659 -56337
1484e6337M1138L022j806N096K4460l4829l2838O3623k2915m3192J6018O9359
$$ -56337 -15199 -12177 -13983 -8887 15573 -19256 -52094 11529 -11386 -54578 -38560 30799
1472C0799l1298n1627k1216L2612O4610L759p2709L6399J0899m691J0764p350
$$ 30799 -499 -52126 -73342 -40730 23880 27639 -45070 -8671 2228 -2463 8301 951
1460I51l2631M208L819J1778k1327k1452k556L3579N7634j4130n4961j2218K4284
$$ 951 -31680 -27472 -23653 -11875 -33202 -54654 -57210 -23631 34003 19873 -35088 -47306 -23022
1447b3022P869L515R856j8663m4210P208M7459P21m7574j4088K2713N5311L1120
$$ -23022 -15153 -11638 -1782 -20445 -64655 -57447 -9988 -9267 -56841 -70929 -48216 7095 38215
1434C8215l712j02916q320N6013J7206n4681m4009J0057N1818K0049l3998O2135
$$ 38215 34503 -68413 -76733 -20720 -3514 -58195 -102204 -92147 -40329 -20280 -54278 7857
1422G857k0083m4290P4309K6073k9968j3185P026k2716J8617J0321P881J7750
$$ 7857 -12226 -56516 17793 43866 13898 713 7739 -14977 3640 13961 21842 39592
1410C9592k6398j1772k5976L3187j3620j2413J7140l359o4024m7770k008j4961
$$ 39592 13194 1422 -24554 8633 -4987 -17400 -260 -3619 -67643 -115413 -117421 -132382
1398a32382O6481j116L4288M138J1682j6335L1650J5029j4780k0529J0790j9379
$$ -132382 -65901 -67017 -32729 -28591 -16909 -33244 -1594 13435 -1345 -21874 -11084 -30463
1386c0463K0297l9719K2820o265k9184M998P4048M2949o3820k9546M136r69q326
$$ -30463 -10166 -49885 -27065 -33330 -62514 -57516 16532 59481 -4339 -33885 -29749 -30718 -39044
1373c9044O0616J147n3493p149K4855j44M959M3604k2351k4782k0357M0027N2911
$$ -39044 21572 22719 -30774 -37923 -13068 -13212 -8253 35351 13000 -11782 -32139 7888 60799
1360F0799m560k0015l6615N6007k9469k1879J7500K0512l2584o743M2066J0327
$$ 60799 56239 36224 -391 55616 26147 4268 21768 42280 9696 2953 45019 55346
1348E5346r792l685l6785j8266J316j6446j4334O74O3584J0729k917P656K723
$$ 55346 45554 41869 5084 -13182 -11866 -28312 -42646 -41972 21612 32341 29424 37080 39803
1335C9803n54M108k1013o3155J2884J2860L3264Q156j3073l1983M6435K9752j3751
$$ 39803 39249 43357 22344 -40811 -27927 -15067 18197 26353 13280 -18703 27732 57484 43733
1322D3733m3594k7258k2465O9937o3012J7460O0321j7656m5633K5166p364J4859
$$ 43733 139 -27119 -49584 20353 -42659 -25199 35122 17466 -28167 -3001 -10365 4494
1310D494j3730k4827N298K8194p93j1546j2439M86K904K1231L2751j9293K884
$$ 4494 -9236 -34063 -28765 -571 -1364 -12910 -25349 -24863 -21959 -728 32023 12730 15614
1297A5614j541k0656j4661O569L3286M4969n8119j3288j1607j9229N0330j5359
$$ 15614 14073 -6583 -21244 -14675 18611 63580 5461 -7827 -19434 -38663 11667 -3692
1285c692n6104L9761m749k7609L0546J1030q836P0465m936m1106l154M7187p273
$$ -3692 -59796 -20035 -24784 -52393 -21847 -10817 -19653 50812 45876 4770 1616 48803 41530
1272D1530o6220Q277P3201J7328m9095r533j7281q0261N8999K574L2640L4511
$$ 41530 -24690 -16413 56788 74116 25021 15488 -1793 -82054 -23055 -20481 12159 46670
1260D6670m811O1m4708n942j0440N8112N7784o9118l1977K2536l6996J3188k1579
$$ 46670 41859 41920 -2788 -8730 -19170 38942 96726 27608 -4369 18167 -18829 -5641 -27220
1247b7220j5821N6981K0186k9554k7828J626M5486n459q421O4087l6996n376m3005
$$ -27220 -43041 13940 34126 4572 -23256 -21630 23856 18397 9976 74063 37067 31691 -11314
1234a1314L3634O528k9265k1246j4596j3892O4599N807j9200K4509J1870k2128
$$ -11314 22320 28848 -417 -21663 -36259 -50151 14448 20255 1055 25564 37434 15306
1222A5306j7595J0328J2838n4849K5058K9831l997j1019r223J5659r047k6449
$$ 15306 -2289 8039 20877 -33972 -8914 20917 16920 5901 -3322 12337 3290 -23159
1210b3159J7349P0244J7220m3365k4184J2957J4409K3206J8940j7282m7108J347
$$ -23159 -5810 64434 81654 38289 14105 27062 41471 64677 83617 66335 19227 20574
1198B0574J8473q974Q068k7784j1995J6922r413J9501n0980K8642l526K6260K0328
$$ 20574 39047 30073 38141 10357 -1638 15284 5871 25372 -25608 3034 -492 25768 46096
1185D6096j2158l2149L1535n314p701K0948n205l4448R253j1542K8255j898j972
$$ 46096 33938 1789 33324 28010 20309 41257 36052 1604 10857 -685 27570 25672 23700
1172B3700L8100K8231l1745k9966j9489J8693J230j5871j4140J6215l922n194
$$ 23700 61800 90031 58286 28320 8831 27524 28754 12883 -1257 14958 11036 5842
1160E842L7590J6635l7672k110M0370k4309o428l06K4794O759k4579L3466K5575
$$ 5842 43432 60067 22395 20285 60655 36346 29918 29612 54406 61165 36586 70052 95627
1147I5627j4802n1434L4499p024j5034K0974K3495l0632o4631N1652N65K3886
$$ 95627 80825 29391 63890 56866 41832 62806 86301 55669 -8962 42690 43255 67141
1135F7141j0185K6890k067j5640k1866j9507J735j2086N5119n215j4609R781n8584
$$ 67141 56956 83846 81779 66139 44273 24766 26501 14415 69534 64319 49710 59491 907
1122I07J4322l0723M1739L1758j0098L5928j8338p7353j3340N5807K7051j7124
$$ 907 15229 -15494 26245 58003 47905 83833 65495 -11858 -25198 30609 57660 40536
1110D0536l2788J7666J8873n436l9175j2098K9471j0505K4598O630n447o736L5958
$$ 40536 7748 25414 44287 38851 -324 -12422 17049 6544 31142 37772 32325 25589 61547
1097F1547N9561p168l3017l1702L5602o0085P278L2289k5615n2065L2136j6276
$$ 61547 121108 113940 80923 49221 84823 24738 32016 64305 38690 -13375 18761 2485
1085B485N201O3226N696j225l5813k5248O755M5998j2875k4815K3503k2818n5281
$$ 2485 7686 70912 76608 75383 39570 14322 21077 67075 54200 29385 52888 30070 -25211
1072b5211M4015n95o18K8413j4402j9231L0530j6183j1540O1822O355j7227j3084
$$ -25211 18804 18209 17591 46004 31602 12371 42901 26718 15178 77000 83355 66128 53044
1059E3044n4926J0410J0887M102j8875l3922K7643O5301o7517K8934K8651m1108
$$ 53044 -1882 8528 19415 23517 4642 -29280 -1637 63664 -3853 25081 53732 12624
1047A2624J8328K4649k8334K2917Q651L5420L073m8292m9592k5931K5964j1015
$$ 12624 30952 55601 27267 50184 58835 94255 97328 49036 -556 -26487 -523 -11538
1035a1538M6212j9124M2259j8649M750J1805l7642o5813O772J5948K9610K5231
$$ -11538 34674 15550 57809 39160 43910 55715 18073 -47740 -40968 -25020 4590 29821
1023B9821j6932L4597L1007j0629j1395J2016J687l3493M669l2749k3824M2501
$$ 29821 12889 47486 78493 67864 56469 68485 70172 36679 41348 8599 -15225 27276
1011B7276P602K8464J8352j345K2217m2076k7398N9517o2969L4L3072l1998l9932
$$ 27276 34878 63342 81694 80349 102566 60490 33092 92609 29640 29674 62746 30748 -9184
998i184M393L9830l789O474J9850O186O906k4728k9191j8674o402K7158R618j751
$$ -9184 -4791 35039 31250 37724 57574 63760 70666 45938 16747 -1927 -8329 18829 28447 26696
984B6696j9604K1797o733j187M2053N068k7028o87l324j0225K1582K681L1899
$$ 26696 7092 28889 22156 20969 63022 68090 41062 40375 37051 26826 48408 51089 82988
971H2988l7888N374R078k4017N7372j2565k8117k9285K015k4067r733J2521L9080
$$ 82988 45100 50474 59552 35535 92907 80342 52225 22940 24955 888 -8845 3676 42756
958D2756L246j9083j8678M616K6289J3806J3172q826J1062L344l7092R687L7232
$$ 42756 46002 26919 8241 12857 39146 52952 66124 57298 68360 71704 34612 44299 81531
945H1531M1066q159k6546n6854k2770M1681l7982j2451M4126K1427k8149j3754
$$ 81531 122597 114438 87892 31038 8268 49949 11967 -484 43642 65069 36920 23166
933B3166j6317P544J0639L9046q067j7828K9667j1433o1812M2746J3043j7587
$$ 23166 6849 14393 25032 64078 56011 38183 67850 56417 -5395 37351 50394 32807
921C2807o4294M2181N8142m375K2336p927p2154J9822K5794n958R777l2258Q538
$$ 32807 -31487 10694 68836 64461 86797 78870 6716 26538 52332 46374 56151 23893 32431
908C2431N156K4472n2823J0926Q33K3297l7990M2044O1837o7642K4686J5205o2957
$$ 32431 37587 62059 9236 20162 20995 44292 6302 48346 110183 42541 67227 82432 19475
895A9475k8310K3584j9295L1463J7102j2763P183p10M1980L504l7942n627R120
$$ 19475 -8835 14749 -4546 26917 44019 31256 38439 37729 79709 83213 45271 39644 48764
882D8764O041O340p518k1879k2985o858K7649M296r084j013J3464K0788K0816
$$ 48764 54805 61145 53627 31748 8763 1905 29554 33850 24766 23753 37217 58005 78821
869G8821J4768n7735J6283P538p543J8869J0014n0263j4777K0034j0839O260q587
$$ 78821 93589 35854 52137 59675 52132 71001 81015 30752 15975 36009 25170 31430 22843
856B2843j281j2011l7055J3225J6436L9667n70j220l0623K6704L9984l234j2965
$$ 22843 21562 9551 -27504 -14279 2157 41824 41254 40034 9411 36115 76099 72865 59900
843E9900j3249j8741O16j9551j313J6153K1429M0798l0261p693k9671j8978R735
$$ 59900 46651 27910 28526 8975 7662 23815 45244 86042 55781 48088 18417 -561 9174
830I174M0270J0429R20K359P0030p4819m0653J660k5432P320L9603N9268M5403
$$ 9174 49444 59873 60793 63152 133182 58363 17710 19370 -6062 1258 40861 100129 145532
817A45532n8585k8154j9723j6306K9810J5796n1955M8734j4944J5062j6652l149
$$ 145532 86947 58793 39070 22764 52574 68370 16415 65149 50205 65267 48615 45466
805D5466j9444j2982M1699j5693M8248m9795k4730L4979P499l4594j1895j8153
$$ 45466 26022 13040 54739 39046 87294 37499 12769 47748 55247 20653 8758 -9395
793i395N3763K0001J836M01L1022l5928O130J0719l1925J9194K8151k8835J9767
$$ -9395 44368 64369 66205 66606 97628 61700 67830 78549 46624 65818 93969 65134 84901
780H4901j1777k8240K8502l3985j1864j461M6957J4376r50o3176m5675o73K8997
$$ 84901 73124 44884 73386 39401 27537 26076 73033 87409 86459 23283 -22392 -23065 5932
767E932Q1491j3414L1480k1165o7786k7518J1367J1830L1298J5194O079j7909
$$ 5932 87423 74009 105489 84324 16538 -10980 387 12217 43515 58709 64788 46879
755D6879l5844l3288L9041J8250j2100J5776k6180L6634M1182k2661k9247k1953
$$ 46879 11035 -22253 16788 35038 22938 38714 12534 49168 90350 67689 38442 16489
743A6489j2712K3223j6841j0137L2379k3295N704L1067k3233m3245J5061M2178
$$ 16489 3777 27000 10159 22 32401 9106 14810 45877 22644 -20601 -5540 36638
731C6638M0636J8245K4995p1314n6954N2627K0853k2117N946J3843Q944J7038
$$ 36638 77274 95519 120514 49200 -7754 44873 65726 43609 49555 63398 72342 89380
719H9380j0939m9200n656P5402j0461n1635j4454J9256k376K2648J9507l4818
$$ 89380 78441 29241 23585 98987 88526 36891 22437 41693 39317 61965 81472 46654
707D6654o300j001J0708L1211O37k3361L3904J1763j1153k7770q517n529P693
$$ 46654 40354 39353 50061 81272 81909 58548 92452 104215 93062 65292 56775 51246 58939
694E8939k7056m1802O4806L9253M667k9375K2046o284l017J8150l6557r427m962
$$ 58939 31883 -9919 54887 94140 98807 69432 91478 85194 82177 100327 63770 54343 49381
681D9381L7824k4563o9569o987p015J4650R0942O516k4426N861k9653N0272m5521
$$ 49381 87205 62642 -6927 -13914 -20929 -6279 84663 91179 66753 72614 42961 93233 47712
668D7712k6524K8328M2475L2837k816n5443m5753L0446L6402n0792r176k92J8911
$$ 47712 21188 49516 91991 124828 122012 66569 20816 51262 87664 36872 27696 27404 46315
655D6315K1483k63o1734m582L609J3628N5240l2702N2442L094l8183O168k0806
$$ 46315 67798 67535 5801 1219 4828 18456 73696 40994 93436 96530 58347 64515 43709
642D3709j021k723l9999l1295j8505K2860K4313K2649L9274K648r819k4215k0373
$$ 43709 42688 39965 -34 -31329 -49834 -26974 -2661 19988 59262 61910 52091 27876 7503
629G503j7434M3036o0661n317J7676K3263L6495N8154K8658n4385J439l9819m3763
$$ 7503 -9931 33105 -27556 -32873 -15197 8066 44561 102715 131373 76988 78427 38608 -5155
616e155Q501J52L9696M4399o864O347l1079q643O453N7660k9133m8626l0478j2640
$$ -5155 3346 3498 43194 87593 80729 87076 55997 47354 53807 111467 82334 33708 3230 -9410
602i410N6862L5370l9862n64n0248j3264M8701K2368J0870K0226l2453o101M302
$$ -9410 47452 82822 42960 42396 -7852 -21116 27585 49953 60823 81049 48596 42495 46797
589D6797k8293k939L4112o4425r390N1916j3579k713K0079n8525J9998O2470k784
$$ 46797 18504 15565 49677 -14748 -24138 27778 14199 11486 31565 -26960 -6962 55508 52724
576E2724l556k3066j5493M7026K3558j357K220l9969j0045k201j3005M026J7560
$$ 52724 49168 26102 10609 57635 81193 79836 82056 42087 32042 29841 16836 20862 38422
563C8422L8669k1463l7398J2853l0851J9462k3068M1192N088n6277N925K5538
$$ 38422 77091 55628 18230 31083 232 19694 -3374 37818 42906 -13371 -7446 18092
551A8092k739l6821K9751K4099l274r853J7895k4043O267K6405p358j2225L9289
$$ 18092 15353 -21468 8283 32382 29108 19255 37150 13107 19374 45779 38421 26196 65485
538F5485k8821o9188K6580k3532J1117K5164K9811J726j6625j1904K2561J3357
$$ 65485 36664 -32524 -5944 -29476 -18359 6805 36616 38342 21717 9813 32374 45731
526D5731k8080m2837o68L683K3174O8286P178j6098l0499J1321J7710k7268M185
$$ 45731 17651 -25186 -25854 -22171 1003 69289 76467 60369 29870 41191 58901 31633 35818
513C5818J1759L1731l2380n4689K593J8620l6313j0829K1432j2420K8978k6082
$$ 35818 47577 79308 46928 -7761 -5168 13452 -22861 -33690 -12258 -24678 4300 -21782
501b1782N0632K1775j2141k0426j391L9482j1840j6823l4904J112L8858K4605
$$ -21782 28850 50625 38484 18058 16667 56149 44309 27486 -7418 -6306 32552 57157
489E7157l886L0562k9416j6619n2707Q463L2511k4699J899R7L15m0023k4444N1861
$$ 57157 53271 83833 54417 37798 -14909 -6446 26065 1366 3265 3362 3677 -36346 -60790 -8929
475h929O0995m2639j2186j7144q8730K2547L1933P3276M97m3738K3904k1230m7503
$$ -8929 52066 9427 -2759 -19903 -108633 -86086 -54153 19123 19620 -24118 -214 -21444 -68947
462f8947O9764R1978n6570j3548n4113q886L8216j8905j9048l4229K3695J7402
$$ -68947 817 92795 36225 22677 -31436 -40322 -2106 -21011 -40059 -74288 -50593 -33191
450c3191m8168K3028r40J434L6714J0273k623k8242M2765J9832J277L0551j5572
$$ -33191 -81359 -58331 -59271 -57837 -21123 -10850 -13473 -41715 1050 20882 22159 52710 37138
437C7138n5355L9215k7249N824m802j0407k042k764K9224k6230l7185N828K6935
$$ 37138 -18217 20998 -6251 -427 -5229 -15636 -17678 -20442 8782 -17448 -54633 -48805 -21870
424b1870n1931N1113O135j8320P665L954l592o201N4316O323M0961j3463r9549
$$ -21870 -73801 -22688 -16553 -34873 -27208 -23254 -26846 -33047 21269 27592 68553 55090 -44459
411d4459j8936J0012Q847L7120N893o2056j9521L4047J4493n146o401J7004p956
$$ -44459 -63395 -53383 -44536 -7416 -1523 -63579 -83100 -49053 -34560 -39706 -46107 -29103 -37059
398c7059O2055J423q59m3772m8389O2347o165L0420k1403l712J3494m4311L131
$$ -37059 24996 26419 25560 -18212 -66601 -4254 -10419 20001 -1402 -5114 8380 -35931 -32800
385c2800L6685k7959j0056J6395M807P284k7224r952L1891J0743k8044o509j5100
$$ -32800 3885 -24074 -34130 -17735 -12928 -5644 -32868 -42820 -10929 -186 -28230 -34739 -49839
$$ [...]
##END NTUPLES=NMR SPECTRUM
##END=
