##TITLE=1H_DE-80H_X3
 200.13MHz, d2o
 8 sc
 
 19ns.26.2.2025
##JCAMPDX= 6.0         $$ Bruker NMR JCAMP-DX V2.0
##DATA TYPE= NMR SPECTRUM
##DATA CLASS= NTUPLES
##ORIGIN= UXNMR, Bruker Analytische Messtechnik GmbH
##OWNER= pz
$$ XWIN-NMR		Version 3.5
$$ Wed Oct 15 14:48:30 2025 Russian Standard Time (UT+4h)  Yarkov@DPX200
##.OBSERVE FREQUENCY= 200.1313
##.OBSERVE NUCLEUS= ^1H
##.ACQUISITION MODE= SIMULTANEOUS
##.ACQUISITION SCHEME= undefined
##.AVERAGES= 8
##.DIGITISER RES= 18
##SPECTROMETER/DATA SYSTEM= spect
##.PULSE SEQUENCE= zg30
##.SOLVENT NAME= CDCl3
##.SHIFT REFERENCE= (INTERNAL, CDCl3, 0, 15.4759)
##AUDIT TRAIL= $$ (NUMBER, WHEN, WHO, WHERE, WHAT)
$$ ##TITLE= Audit trail, XWIN-NMR		Version 3.5
$$ ##JCAMPDX= 5.01
$$ ##ORIGIN= Bruker BioSpin GmbH
$$ ##OWNER= Yarkov
$$ C:/Bruker/XWIN-NMR/data/yarkov2/nmr/H-C/1/pdata/1/auditp.txt
$$ ##AUDIT TRAIL=  $$ (NUMBER, WHEN, WHO, WHERE, WHAT)
(   1,<2025-10-15 14:47:32.56 +0400>,<Yarkov>,<DPX200>,
      <created by zg, POWCHK disabled, PULCHK disabled
       configuration hash MD5:
       00 E9 B6 7A A2 85 ED C7 34 08 36 98 17 FE 4E 26
       data hash MD5: 16K
       A0 B9 6B E7 E7 00 C4 E2 9B 6C 37 09 90 5B 5B 64>)
(   2,<2025-10-15 14:47:43.34 +0400>,<Yarkov>,<DPX200>,
      <Start of raw data processing
       efp BC_mod = 2 LB = 0.25 FT_mod = 6 PKNL = 1 PHC0 = -3350.054 PHC1 = 8.932312 SI = 16K 
       data hash MD5: 16K
       10 D2 72 B6 E2 8F A2 4E AA 59 22 5C E9 0C 16 48>)
(   3,<2025-10-15 14:47:54.46 +0400>,<Yarkov>,<DPX200>,
      <abs ABSG = 5 
       data hash MD5: 16K
       81 4D 8A 75 AB 2F 54 9F 3D ED 57 C8 67 03 D5 C4>)
$$ ##END=
$$ 
$$ hash MD5
$$ 81 2E FE 3A D5 5D 25 08 3F ED 86 E0 7D BA 1F CE
##$RELAX= 
##$RELAX= 
##$RELAX= 
##$RELAX= 
##$RELAX= 
##$RELAX= 
$$ Bruker specific parameters
$$ --------------------------
##$DU= <C:/Bruker/XWIN-NMR>
##$EXPNO= 1
##$NAME= <H-C>
##$PROCNO= 1
##$TYPE= <nmr>
##$USER= <yarkov2>
##$AMP= (0..31)
100 100 100 100 100 100 100 100 100 100 100 100 100 100 100 100 100 100 
100 100 100 100 100 100 100 100 100 100 100 100 100 100 
##$AQSEQ= 0
##$AQ_mod= 1
##$AUNM= <au_zg>
##$AUTOPOS= <>
##$BF1= 200.13
##$BF2= 200.13
##$BF3= 200.13
##$BF4= 200.13
##$BF5= 200.13
##$BF6= 200.13
##$BF7= 200.13
##$BF8= 200.13
##$BYTORDA= 1
##$CFDGTYP= 0
##$CFRGTYP= 5
##$CHEMSTR= <none>
##$CNST= (0..31)
1 1 145 1 1 1 1 1 1 1 1 1 1 1 1 1 1 1 1 1 1 1 1 1 1 1 1 1 1 1 1 1 
##$CPDPRG= <>
##$CPDPRG1= <>
##$CPDPRG2= <>
##$CPDPRG3= <>
##$CPDPRG4= <mlev>
##$CPDPRG5= <mlev>
##$CPDPRG6= <mlev>
##$CPDPRG7= <mlev>
##$CPDPRG8= <mlev>
##$CPDPRGB= <>
##$CPDPRGT= <>
##$D= (0..31)
0 0.7 0 0 0 0 0 0 0 0 0 0.03 0 0 0 0 0 0 0 0 0 0 0 0 0 0 0 0 0 0 0 0 
##$DATE= 1760525252
##$DBL= (0..7)
120 120 120 120 120 120 120 120 
##$DBP= (0..7)
150 150 150 150 150 150 150 150 
##$DBP07= 0
##$DBPNAM0= <>
##$DBPNAM1= <>
##$DBPNAM2= <>
##$DBPNAM3= <>
##$DBPNAM4= <>
##$DBPNAM5= <>
##$DBPNAM6= <>
##$DBPNAM7= <>
##$DBPOAL= (0..7)
0.5 0.5 0.5 0.5 0.5 0.5 0.5 0.5 
##$DBPOFFS= (0..7)
0 0 0 0 0 0 0 0 
##$DE= 6
$$ [...]
##$SUBNAM3= <"">
##$SUBNAM4= <"">
##$SUBNAM5= <"">
##$SUBNAM6= <"">
##$SUBNAM7= <"">
##$SUBNAM8= <"">
##$SUBNAM9= <"">
##$SW= 18.0517328524113
##$SWIBOX= (0..15)
0 0 2 0 0 0 0 0 0 0 0 0 0 0 0 0 
##$SW_h= 3612.71676300578
##$TD= 16384
##$TD0= 1
##$TE= 0
##$TE2= 300
##$TE3= 300
##$TEG= 300
##$TL= (0..7)
0 120 120 120 120 120 120 120 
##$TP= (0..7)
150 150 150 150 150 150 150 150 
##$TP07= 0
##$TPNAME0= <>
##$TPNAME1= <>
##$TPNAME2= <>
##$TPNAME3= <>
##$TPNAME4= <>
##$TPNAME5= <>
##$TPNAME6= <>
##$TPNAME7= <>
##$TPOAL= (0..7)
0.5 0.5 0.5 0.5 0.5 0.5 0.5 0.5 
##$TPOFFS= (0..7)
0 0 0 0 0 0 0 0 
##$TUNHIN= 0
##$TUNHOUT= 0
##$TUNXOUT= 0
##$USERA1= <user>
##$USERA2= <user>
##$USERA3= <user>
##$USERA4= <user>
##$USERA5= <user>
##$V9= 5
##$VALIST= <valist>
##$VCLIST= <CCCCCCCCCCCCCCC>
##$VD= 0
##$VDLIST= <DDDDDDDDDDDDDDD>
##$VPLIST= <PPPPPPPPPPPPPPP>
##$VTLIST= <TTTTTTTTTTTTTTT>
##$WBST= 1024
##$WBSW= 4
##$XGAIN= (0..3)
0 0 0 0 
##$XL= 0
##$YL= 0
##$YMAX_a= 813447
##$YMIN_a= -1111988
##$ZGOPTNS= <>
##$ZL1= 120
##$ZL2= 120
##$ZL3= 120
##$ZL4= 120
##$ABSF1= 18.02569
##$ABSF2= -0.02620506
##$ABSG= 5
##$ABSL= 3
##$ALPHA= 0
##$AQORDER= 0
##$ASSFAC= 0
##$ASSFACI= 0
##$ASSFACX= 0
##$ASSWID= 0
##$AUNMP= <proc_1d>
##$AZFE= 0.1
##$AZFW= 0.1
##$BCFW= 0
##$BC_mod= 2
##$BYTORDP= 0
##$COROFFS= 0
##$CY= -3
##$DATMOD= 1
##$DC= 0
##$DFILT= <>
##$DTYPP= 0
##$F1P= 0
##$F2P= 0
##$FCOR= 1
##$FTSIZE= 16384
##$FT_mod= 6
##$GAMMA= 0
##$GB= 0
##$INTBC= 1
##$INTSCL= 3.241238e-09
##$ISEN= 128
##$LB= 0.25
##$LEV0= 0
##$LPBIN= 0
##$MAXI= 10000
##$MC2= 0
##$MEAN= 0
##$ME_mod= 0
##$MI= 1.114404
##$NCOEF= 0
##$NC_proc= -6
##$NLEV= 6
##$NOISF1= 3.799351
##$NOISF2= 2.8
##$NSP= 0
##$NTH_PI= 0
##$NZP= 0
##$OFFSET= 15.47585
##$PC= 1
##$PHC0= -3350.054
##$PHC1= 8.932312
##$PH_mod= 1
##$PKNL= yes
##$PPARMOD= 0
##$PSCAL= 0
##$PSIGN= 0
##$REVERSE= no
##$SF= 200.130009176333
##$SI= 16384
##$SIGF1= 3
##$SIGF2= 2
##$SINO= 0.751879
##$SIOLD= 32768
##$SREGLST= <19F.Aceton>
##$SSB= 0
##$STSI= 16384
##$STSR= 0
##$SW_p= 3612.71676300578
##$SYMM= 0
##$S_DEV= 0
##$TDeff= 16384
##$TDoff= 0
##$TI= <>
##$TILT= no
##$TM1= 0
##$TM2= 0
##$TOPLEV= 0
##$USERP1= <user>
##$USERP2= <user>
##$USERP3= <user>
##$USERP4= <user>
##$USERP5= <user>
##$WDW= 1
##$XDIM= 16384
##$YMAX_p= 327270100
##$YMIN_p= -1496126
$$ End of Bruker specific parameters
$$ ---------------------------------
##NTUPLES= NMR SPECTRUM
##VAR_NAME=  FREQUENCY,     SPECTRUM/REAL,   SPECTRUM/IMAG
##SYMBOL=    X,             R,               I
##VAR_TYPE=  INDEPENDENT,   DEPENDENT,       DEPENDENT
##VAR_FORM=  AFFN,          ASDF,            ASDF
##VAR_DIM=   16384,         16384,           16384
##UNITS=     HZ,            ARBITRARY UNITS, ARBITRARY UNITS
##FACTOR=    0.220516191357247, 1,           1
##FIRST=     3097.18202358237, 0,            0
##LAST=      -515.53473942341, 0,            0
##MIN=       -515.53473942341, -1496126,     0
##MAX=       3097.18202358237, 327270100,    0
$$ Real data points
##PAGE= N=1
##DATA TABLE= (X++(R..R)), XYDATA
$$ [...]
7475B347468K15098K31442L9416J31116L95409L64726M02142L11722N14181M01776
7465E354496K25833J67202J03233Q191p8150j38985k64718j76207j50841l1571
7455E018483M3886p7798j55076N6382k22460k23715K4412m9356j168J53750J58604
7444D725944J8139K30529M89567K25229J46802M87778M05723L02763K66609Q7392
7434G386475M6446J18428K9176n1430j68829r8995L8514N243j2229l7677j65066
7423G090056j95611k46899n1094k21504j72880j07828k84564k9772L7044m1446
7413E775502m811J9221O4727J7095L8753O493K531l7427j30681j94418J02940
7402E659925j9864l9723j00558j89703j62118r4108k08188n7180q9308k10319
$$ y = [2347468, 2562566, 2794008, 2833424, 2964540, 3359949, 3724675, 4126817, 4438539, 4952720, 5354496, 5580329, 5747531, 5850764, 5858955, 5780805, 5641820, 5377102, 5200895, 5050054, 5018483, 5062369, 4984571, 4829495, 4885877, 4663417, 4439702, 4464114, 4414758, 4413590, 4567340, 4725944, 4744083, 4974612, 5464179, 5689408, 5836210, 6323988, 6729711, 7032474, 7299083, 7386475, 7432921, 7551349, 7580525, 7529095, 7360266, 7261271, 7299785, 7305028, 7292799, 7255122, 7090056, 6894445, 6647546, 6596452, 6374948, 6202068, 6094240, 5809676, 5779904, 5816948, 5775502, 5770691, 5789912, 5854639, 5871734, 5910487, 5916980, 5919511, 5882084, 5751403, 5556985, 5659925, 5640061, 5600338, 5499780, 5310077, 5147959, 5053851, 4845663, 4788483, 4699175, 4488856]
7392D488856M741M0897l0923j7447n2529k0796J19844J53704Q0353N068J63831
7381D935599J06388J11895P2689m6512n0640k8177M3176j18870n0688J31451j78554
7370D927757k68759j20780j83776j14568j63722k22732l9322j93356o7148j0095
7360C543499L3198j41837K2652n6396j99823j940k3753M0804p268j47120Q339
7349C070355k9257J52781k47557O562J86598M4451j18516o5028j31408J259k6604
7338B843636q6982L192R4601L3129j62642m0969P6591j0224N1289r5462j44738
7327B561421j30897j03666Q7244J0813Q2200J4618j18517j32442m863Q2590p2073
7316B276428j99586j7143n0522J1873j15138m5823o1917p9011N2648p633N3533
$$ y = [4488856, 4493597, 4534494, 4503571, 4486124, 4433595, 4412799, 4532643, 4686347, 4766700, 4771768, 4935599, 5041987, 5153882, 5226571, 5180059, 5129419, 5101242, 5144418, 5025548, 4974860, 5106311, 4927757, 4658998, 4538218, 4354442, 4239874, 4076152, 3853420, 3814098, 3620742, 3553594, 3543499, 3576697, 3434860, 3457512, 3401116, 3201293, 3199353, 3175600, 3216404, 3209136, 3062016, 3070355, 3041098, 3193879, 2946322, 2952884, 3139482, 3183933, 3065417, 3000389, 2868981, 2870240, 2843636, 2756654, 2759846, 2854447, 2887576, 2724934, 2683965, 2760556, 2750332, 2801621, 2706159, 2561421, 2430524, 2326858, 2414102, 2424915, 2507115, 2521733, 2403216, 2270774, 2265911, 2348501, 2276428, 2076842, 2059699, 2009177, 2021050, 1905912, 1860089, 1798172, 1719161, 1771809, 1764176, 1817709]
7305A817709j98926j12345N9580Q0765r5376j84335j28746j12054j01135p6225
7295I48912O7762k4817j3767j15316m0053n1244j0040N7350P7047j11935o6407
7284G17492M8465L337p0653K697j45493r4106O0276J08161Q8564o5279j52400
7273E01061o2013k0498J8463L404k05402J2389P2665q4373p7412L269k9770n8314
7261G3469m4602m6438Q7743m029j55186J23506J58151m0878j16585m8690K13127
7250A99588J4536L8032q8102J35943N1661R6848J29476o70J25381J38079O5777
7239I06549n5761k73423N6280N1530Q0438p4930k58214J83681n1716q8168O1545
7228E37811J16313J02643q7566Q775K16071J75582O709J37579J32012J28360J86057
$$ y = [1817709, 1618783, 1506438, 1566018, 1646783, 1551407, 1367072, 1238326, 1126272, 1025137, 948912, 1016674, 991857, 978090, 862774, 822721, 771477, 761437, 818787, 895834, 783899, 717492, 765957, 769294, 698641, 701338, 555845, 461739, 522015, 630176, 718740, 653461, 501061, 439048, 418550, 437013, 440417, 235015, 247404, 320069, 235696, 158284, 161553, 131783, 73469, 28867, -17571, 70172, 66143, -89043, 34463, 192614, 151736, 35151, -13539, 199588, 214124, 252156, 164054, 299997, 351658, 448506, 577982, 577312, 702693, 840772, 906549, 850788, 577365, 633645, 685175, 765613, 690683, 432469, 616150, 564434, 476266, 537811, 654124, 756767, 669201, 677976, 894047, 1069629, 1076338, 1213917, 1345929, 1474289, 1660346]
7217A660346M5768R4998k2604j42079l1080M3580m0807l0117k04185M1152k5413
7206A389559j98048r8961j24086n581L93o8718k6902l3880n7292J02859J57695
7195A037038o1016J629J12722K30723k4706K16J5275l191N5702J11491K0186o3089
7183A432980K6130q7074q3248J8240J43824L9740j43312j30418K24604P0842O5939
7172A578247J44524K8314P9237Q7598Q0577n5841m3379m8229Q7820l9428o5187
7161A834253l5675j32037n2932j95591n7055Q6416k06690p034q8868j8780q8598
7150A037409k16488r430j9415q9113q2709l7663R4689R1997m06J42292j42742
7139G68421k08245k3004P4779K2718m3314L2642r498J36065n2467j64806N0870
$$ y = [1660346, 1706114, 1801112, 1778508, 1636429, 1605349, 1648929, 1608122, 1578005, 1373820, 1414972, 1389559, 1191511, 1092550, 968464, 962883, 963276, 894558, 867656, 833776, 776484, 879343, 1037038, 976022, 977651, 1090373, 1321096, 1296390, 1296606, 1311881, 1308690, 1364392, 1475883, 1496069, 1432980, 1459110, 1372036, 1288788, 1307028, 1450852, 1490592, 1347280, 1216862, 1441466, 1512308, 1578247, 1722771, 1751085, 1830322, 1917920, 1998497, 1942656, 1899277, 1851048, 1938868, 1899440, 1834253, 1798578, 1666541, 1613609, 1418018, 1360963, 1447379, 1240689, 1233655, 1144787, 1126007, 1037409, 820921, 811491, 792076, 702963, 620254, 582591, 677280, 769277, 768871, 911163, 768421, 560176, 537172, 611951, 634669, 591355, 623997, 614499, 750564, 698097, 533291, 584161]
7128E84161J02487P6560j5913R8583N1059L6852K9325j0574j5691P2761O4560
7117A074170J22167L3957N3943K14763p712J77562J47348j37923L9874M1972J03388
7106A863509P2563N870P4276l48p2612J21339Q2153r9927J21223P5427K20672
7095B464145J06162J83914K24563j7814l3570j50384J36792k9544l31479l11787
7085B240998n6654k57612m9881R5369k93135j47990K881o12k39001j20119q6185
7074A088059p8151p7093l0688l9988L5886J1771l1147J9661j4723N3722n8800
7063H78509p6510L1722p6318k1211l1256n7668l8945l5590m0610j70963m0723
7052C20437J34337j18267k3387L6156j55748j42641j0359J74903J2733k6757k8287
$$ y = [584161, 686648, 763208, 747295, 845878, 896937, 933789, 963114, 952540, 936849, 1009610, 1074170, 1196337, 1230294, 1284237, 1499000, 1491288, 1668850, 1816198, 1678275, 1718149, 1760121, 1863509, 1936072, 1941942, 2016218, 2015870, 1943258, 2064597, 2146750, 2046823, 2168046, 2243473, 2464145, 2570307, 2754221, 2978784, 2960970, 2927400, 2777016, 2913808, 2884264, 2552785, 2240998, 2184344, 1926732, 1876851, 1972220, 1679085, 1531095, 1533976, 1533364, 1294363, 1174244, 1088059, 1009908, 932815, 902127, 862139, 898025, 909796, 878649, 898310, 883587, 937309, 878509, 801999, 833721, 757403, 736192, 704936, 647268, 608323, 572733, 532123, 361160, 320437, 454774, 336507, 313120, 349276, 193528, 50887, 40528, 215431, 228164, 201407, 173120]
7041A73120j13275l2701K67200Q6296l8690r5828j5214J44385j01083N5172Q7004
7030D16386R2358j1151R6840K15978K03035J57054M5462K85784J48569J81210
7020A831525M0936O4861r9806j21733j42502L2425o0402k72823k12329j50198
7010I09954j57156k30455m9495j11940j42336k3309j35790j78807j0729k4820
7000a54883k6721j33747j7335O292L0327m7955r2767N049K6081J1667l3332O0144
6988c67180J4799P5017P9236k318K8844j05811L7751J75523P2109l70L5640J50254
6976A93494R0133q7369j7759L0233j97497j43902P1014O5966Q943J15287J13329
6965B41872Q9224l5250N3040k14432j83217q9037n1739k3816m1425o9971o9147
$$ y = [173120, 59845, 27144, 294344, 380640, 341950, 246122, 230908, 375293, 274210, 329382, 416386, 508744, 497593, 594433, 810411, 1013446, 1170500, 1215962, 1501746, 1650315, 1831525, 1872461, 1937322, 1837516, 1715783, 1573281, 1605706, 1545304, 1272481, 1060152, 909954, 752798, 522343, 472848, 360908, 218572, 195263, 59473, -119334, -130063, -154883, -181604, -315351, -332686, -326394, -296067, -344022, -436789, -431740, -405659, -393992, -427324, -367180, -352381, -277364, -198128, -200446, -171602, -277413, -239662, -64139, 7970, 7600, 43240, 193494, 283627, 196258, 178499, 208732, 11235, -132667, -61653, 4313, 13256, 128543, 241872, 331096, 295846, 348886, 134454, -48763, -137800, -189539, -213355, -254780, -324751, -393898]
6954c93898P7838k17722o1191J20912m4063n9643j34450J8456J57224k43166j8211
6943g97914P2416m7443r9197l5770j03435M2978O1629m0573n30o0161n567P5410
6931i38157O3872l9705Q729P1809q3254K9411J90573L094j08537j5427Q8448L1310
6919f97834J33425J87235P0523L7195m3256O2874M1246L4959q9395k7822O6329
6908b24521N289M1848k5088K1085J17025J41328j07354o2850q2539j17401p3770
6897c66948p7884l488K1842j64357o6465M8231r6439p415j27213j46410l2475
6886a019021O4849o8612p0860M907r9670P6932J34295o2341r0231p5635l0837
6875a236224m4580K5633N8410L915j01m2614m6341p7941p3625m7667J27657k6208
$$ y = [-393898, -316060, -533782, -594973, -474061, -518124, -577767, -712217, -693761, -536537, -779703, -797914, -725498, -772941, -872138, -907908, -1011343, -968365, -906736, -947309, -947839, -1008000, -1013567, -938157, -874285, -913990, -905261, -833452, -916706, -887295, -696722, -693628, -802165, -817592, -729144, -697834, -564409, -377174, -306651, -269456, -312712, -249838, -208592, -173633, -263028, -290850, -224521, -219232, -177384, -202472, -181387, -64362, 76966, -30388, -93238, -175777, -293178, -366948, -444832, -448320, -426478, -590835, -657300, -609069, -705508, -712923, -840136, -986546, -1019021, -954172, -1022784, -1093644, -1088737, -1188407, -1111475, -977180, -1039521, -1129752, -1205387, -1236224, -1280804, -1255171, -1196761, -1192846, -1192947, -1235561, -1281902, -1359843, -1433468, -1481135, -1353478, -1379686]
6863a379686R1221J09110j2623O2857m6616J8148n8706l7153M3045J58J01929
6852a108316p2021l6949l7786j564o194J4484M6417J04126k9858j23044J07732
6841a142973P3572j2131j30585j46413n923L3600L1366O826L5495P1259P4134
6830a111773L9303m2733j920L713K03557Q1481k1601j75193O3694N5687j31480
6819a037265r4772p052R3782j18627n8247K4653Q0590k7317j60212L941r954k0658
6807a331138q138Q5717P3358K0984j5508N1134n2539Q8290n0984m0384M7962j12148
6795a243394j1729N8047Q2656P6054j00596J86623k313p2557J79797K40976K43443
6784c62993j30J68624J93205O6954J18900K33334j0848l8890j41574L5206j64586
$$ y = [-1379686, -1288465, -1179355, -1191978, -1129121, -1175737, -1157589, -1216295, -1253448, -1210403, -1210245, -1108316, -1180337, -1217286, -1255072, -1256636, -1262830, -1248346, -1201929, -1097803, -1127661, -1250705, -1142973, -1069401, -1081532, -1212117, -1358530, -1364453, -1330853, -1299487, -1292661, -1257166, -1185907, -1111773, -1072470, -1115203, -1117123, -1113410, -909853, -828372, -849973, -1025166, -961472, -905785, -1037265, -1132037, -1139089, -1045307, -1163934, -1222181, -1197528, -1116938, -1144255, -1304467, -1300526, -1310480, -1331138, -1339276, -1253559, -1180201, -1159217, -1174725, -1123591, -1176130, -1087840, -1138824, -1179208, -1131246, -1243394, -1255123, -1197076, -1114420, -1038366, -1138962, -952339, -954652, -1027209, -847412, -606436, -362993, -363123, -194499, -1294, 65660, 184560, 417894, 407046, 368156, 226582, 261788, 97202]
6773I7202j93996k10785j00113m8457j63115q6870J05652j27610k6147o7016J0100
6762h11155l4737p1360o6497o1318q30M9748m8813O8967p2319m5047r435m931
6750a107727J65949N8209n5906k9211J20578J27107K31927J95448J52381L583
6740a37662K74259J25877O9321n348K9545O7183O252M2038q328j41398j24848
6729A96891j30681n2063P1250q5329l9087j8183O6475N8477O5590J06727N824
6718B45891j52831j31549J2247p0945j09322j29061R7081R0230O4286K059j4694
6707i6608J1809Q334n8260p4105j53729j202M041o1435J35601R3190Q4201O4579
6695d3584k2059M564R2816P9843o8605p2001j30235j09143J7186q8949p359l697
$$ y = [97202, -96794, -307579, -407692, -456149, -619264, -706134, -600482, -728092, -754239, -821255, -811155, -845892, -917252, -983749, -1045067, -1045897, -996149, -1044962, -975995, -1048314, -1093361, -1102796, -1107727, -941778, -883569, -939475, -968686, -848108, -721001, -489074, -293626, -141245, -137662, 136597, 262474, 331795, 326447, 355992, 423175, 429427, 471465, 463137, 321739, 196891, 66210, 14147, 85397, 68, -39019, -57202, 9273, 67750, 133340, 240067, 245891, 93060, -38489, -26242, -97187, -206509, -335570, -238489, -148259, -83973, -81914, -96608, -84799, -76465, -134725, -208830, -362559, -363761, -359720, -421155, -285554, -192364, -108163, -43584, -65643, -61079, 31737, 111580, 42975, -29026, -159261, -268404, -251218, -340167, -347526, -351223]
6683c51223M8842J19414N0132J35923j35398j40315p7461p5396j65645o0221J5255
6672f36093p9022j9968K9208l1166K9935r4456j46530J3364O4582j27343J6825
6661i80664m5528k7959N7858n4348j04854J5647n2504k5254m1927j0376K5391
6650a244518o1957J11208K8533r7568m2006J44367J4185j29295p1716J79790m1400
6639a210377R2234m9163n3836N563l420j2222N0184m7513m6067j23792L5477r8131
6627a461063l5063J44997J0873J26679j5086K1572J05901o4033j19390k893L5422
6616a252084R7717M7133O2708K0924N3435j04491o477J08896P6232N6930n9011
6605h98088K5986Q9490O9912j5838J12109j5577J23635n442o4606k4819L0907
$$ y = [-351223, -302381, -182967, -132835, 3088, -132310, -272625, -350086, -425482, -591127, -651348, -636093, -715115, -735083, -705875, -737041, -707106, -801562, -948092, -934728, -870146, -997489, -980664, -1026192, -1054151, -996293, -1050641, -1155495, -1139848, -1192352, -1217606, -1259533, -1269909, -1244518, -1306475, -1195267, -1166734, -1264302, -1306308, -1161941, -1147756, -1277051, -1348767, -1168977, -1210377, -1118143, -1167306, -1221142, -1215579, -1218999, -1231221, -1181037, -1228550, -1274617, -1398409, -1362932, -1461063, -1496126, -1351129, -1340256, -1213577, -1228663, -1207091, -1101190, -1165223, -1284613, -1287506, -1252084, -1154367, -1107234, -1044526, -1023602, -970167, -1074658, -1081135, -972239, -896007, -839077, -898088, -872102, -782612, -712700, -728538, -616429, -632006, -508371, -513813, -578419, -603238, -572331]
6594e72331P4824o7786K24943N1400K8923K6688Q0449J85323J57246J3382O3394
6583B66455Q1716J5882J07388K02290K9375p6168J44833L13495L69466J97302
6573A652034J73445K40708L01682K17436K97982J87877N9540j743O0349O5113
6563C254423p7227O2692J15051J41941O672N8999J83612K41143K74675J36469
6553D398450K97681L25001L92246L81236L38394N07166N62424P03767Q57460J183693
6543I947518J111807J222952J438559J399628J299243J208122R36858O18590J45424
6534A9328701k83202n86815p35125n24762o04493m44936l30306m33795l20356
6525A5064911j75150j43907j00686j06260j71755j14545m894m0518J28538L9611
$$ y = [-572331, -497507, -565293, -340350, -288950, -260027, -233339, -152890, 32433, 189679, 203061, 266455, 348171, 364053, 471441, 673731, 703106, 626938, 771771, 1085266, 1454732, 1652034, 1825479, 2066187, 2367869, 2585305, 2883287, 3071164, 3130704, 3128961, 3189310, 3254423, 3177196, 3239888, 3354939, 3496880, 3503552, 3562551, 3746163, 3987306, 4261981, 4398450, 4696131, 5021132, 5413378, 5794614, 6133008, 6640174, 7202598, 7906365, 8763825, 9947518, 11059325, 12282277, 13720836, 15120464, 16419707, 17627829, 18564687, 19183277, 19328701, 19045499, 18458684, 17723559, 17198797, 16594304, 16149368, 15819062, 15385267, 15064911, 14889761, 14745854, 14645168, 14538908, 14367153, 14252608, 14247714, 14207196, 14335734, 14375345]
6515A4375345J32553L45890M47110M04938M15258Q11244Q56300R56269R39334
6506A9684241P69169N99307L52246j52877o19885q36309r89630j228219j217099
6497A6360944j145487j205898r64557r46595p86958o45834o79214p94826o75512
6488H516063n44679n84676l77553l77101l12752l66573k23272j76787k65673j67812
6478E119185q1037l00443j54667j84141j60224j39859k86807k16069j18017j35311
6468C342610r9258j58253j12403j24358j78558p8313r0005j05410q8682J077m2679
6457B265768j01320j77298k1569r2108j05445o3618o648j83869j03415q0964j02584
6446A226930m0036o3472j00547p5748q9103L87o9045j13071j2848o3039q9202
$$ y = [14375345, 14507898, 14853788, 15300898, 15705836, 16121094, 16932338, 17788638, 18744907, 19684241, 20453410, 21052717, 21404963, 21252086, 20632201, 19795892, 18806262, 17578043, 16360944, 15215457, 14009559, 13045002, 12098407, 11311449, 10665615, 9986401, 9191575, 8516063, 7971384, 7386708, 7009155, 6632054, 6319302, 5952729, 5729457, 5552670, 5286997, 5119185, 5038148, 4737705, 4583038, 4398897, 4238673, 4098814, 3812007, 3595938, 3477921, 3342610, 3243352, 3085099, 2972696, 2848338, 2669780, 2591467, 2501462, 2396052, 2307370, 2308447, 2265768, 2164448, 1987150, 1965581, 1873473, 1768028, 1704410, 1697762, 1513893, 1410478, 1329514, 1226930, 1186894, 1123422, 1022875, 947127, 858024, 858411, 789366, 676295, 663447, 600408, 511206]
6435E11206P164m0346j45975k7478k8701m82n8338j73409k5380J19696N5098Q298
6423B01353k3451q53k9090m4591j09677O5262p8185M0326l8633l7975L6385j74535
6411a93664J2925n9323J80020k677k7506r06l3247J261p4401J8502r7943q8465
6399c65424M1630n4254r565J06078N1917m4431O2719m5597o4858J64541p6987
6388b34231N8173j29709J18208k7868j48929L7393j29452M2515r4864K5477k6638
6377e09925O0352j02416k325J8752O3040M0593K411O471j70464K1621R8833O644
6365d66413m3644o625J33830P127K4925J67426k7892j88295P3314n3591o1808
6354d41646R2648o6138l0488m6898m627R8017J31910n0034Q8053o9441M9987J25383
$$ y = [511206, 518370, 478024, 332049, 304571, 275870, 275388, 217050, 43641, 18261, 137957, 193055, 201353, 177902, 177049, 147959, 103368, -6309, 58953, -19232, 21094, -17539, -55514, -19129, -193664, -180739, -240062, -60042, -62719, -90225, -91131, -124378, -123117, -197518, -179016, -276959, -365424, -323794, -378048, -387613, -281535, -229618, -274049, -211330, -256927, -321785, -157244, -234231, -176058, -305767, -187559, -215427, -364356, -326963, -456415, -413900, -508764, -483287, -509925, -449573, -551989, -554314, -535562, -472522, -431929, -429518, -423047, -593511, -571890, -473057, -466413, -510057, -516682, -382852, -375725, -350800, -183374, -211266, -399561, -326247, -379838, -441646, -348998, -415136, -445624, -492522, -497149, -399132, -267222, -317256, -229203, -298644, -248657, -123274]
6342a23274P1186r182R1648j9586o3167j03447k5203K532q6361o799Q756Q1344
6330a81553P6997r9631p0005r6823Q2829j942M3399P5028n5931m7654j02606M2813
6318c35079O7103j39j22655l8315Q8537J95358q5048l6122L4860j5309j0432j2145
6306b69386J50245R7299N447P4693j88375j68190R6268J14611J81540J21358M0951
6295B56461k9275q4573K8940r083M5713J27823n7167J5273l1223o2973J38793
6284C38709J09535k0k5164J40364M9777Q4468J58424J4939J53267P8572P6117
6273A178988j3962r908J97239P7642l549o4496K6347R4039K24869J44710J23640
6262A975559J12164K04580K14384L07888L29430L83362L56846L36240K50279K62456
$$ y = [-123274, -52088, -61270, 30378, 10792, -52375, -155822, -181025, -178493, -264854, -271653, -262897, -181553, -104556, -204187, -274192, -371015, -288186, -290128, -246729, -171701, -227632, -275286, -377892, -335079, -267976, -268115, -390770, -429085, -340548, -145190, -230238, -266360, -231500, -246809, -257241, -269386, -119141, -21842, -16395, 58298, -130077, -298267, -201999, -87388, 94152, 215510, 256461, 227186, 142613, 171553, 162470, 208183, 336006, 278839, 294112, 262889, 199916, 338709, 448244, 448224, 423060, 563424, 613201, 697669, 856093, 871032, 1024299, 1102871, 1178988, 1165026, 1155118, 1352357, 1429999, 1426450, 1361954, 1388301, 1482340, 1707209, 1851919, 1975559, 2087723, 2292303, 2506687, 2814575, 3144005, 3527367, 3884213, 4220453, 4470732, 4733188]
6252D733188K37398J93520J52779R6823L4916m3427K9427L127M0679q3043Q727
6241E404114J8892j08064R139j1938j96981l947R3136J24801N2909K06258K97444
6230E885763K37839L18024M18236O97857P42365P59386P06056O57017N69569N12863
6220A1504975L05879k3252j36584l57742m26993m19311l13821l40472r2785k00685
6210I499209j14667j63418j19862J3199q8701l4561o5817r53R887J87927J95145
6199I317388J79610J69949L43854L49853M62991N09704O46247M60367N48240O60190
6189A3648393N71482K90738L99334L94727L29261M81601L32008L12219L54949
6180A7114712J27580J36624K57593J68595M331J54028K37828N4047K67288K78205
$$ y = [4733188, 4970586, 5164106, 5316885, 5413708, 5448624, 5405197, 5434624, 5437751, 5478430, 5395387, 5404114, 5423006, 5314942, 5324081, 5312143, 5115162, 5111215, 5204351, 5329152, 5382061, 5588319, 5885763, 6123602, 6441626, 6859862, 7557719, 8300084, 9059470, 9765526, 10422543, 10992112, 11504975, 11810854, 11787602, 11651018, 11293276, 10866283, 10446972, 10133151, 9792679, 9699894, 9499209, 9384542, 9221124, 9101262, 9114461, 9025760, 8991199, 8925382, 8924429, 8934316, 9122243, 9317388, 9496998, 9666947, 10010801, 10360654, 10823645, 11333349, 11979596, 12439963, 12988203, 13648393, 14219875, 14510613, 14909947, 15304674, 15633935, 16115536, 16447544, 16759763, 17114712, 17242292, 17378916, 17636509, 17805104, 17809435, 17963463, 18201291, 18255338, 18522626, 18800831]
6170A8800831K6174j3040J30562p9005L560m4014k2145L5942M0601k2529P4253
6159A8931190J83183J57342r769J26110K30635K29931K10518L74212L62306K39309
6149B1034967J74356M79716L42959M51149N49504O13001N65600K98950L91708
6140B4901910J11328o7704k19126k33001l08283k91492l35938k24425j95609j38105
6130B2999555k64432j64501k0238J3958P4298m195K58494M08304N76255O08506
6120B4486004P27948J020503J308717J503864J957887K131680K449202K860490
6112C8446295K852314K808979K535880K204360J558428N63621k60182j054335
6104D9655360j351601j225654j098225q05669n34351o01151m11483j02725j21973
$$ y = [18800831, 18827005, 18813965, 18944527, 18865522, 18869082, 18825068, 18802923, 18838865, 18879466, 18856937, 18931190, 19114373, 19271715, 19261946, 19388056, 19618691, 19848622, 20059140, 20433352, 20795658, 21034967, 21209323, 21689039, 22031998, 22483147, 23032651, 23645652, 24211252, 24510202, 24901910, 25013238, 24945534, 24726408, 24493407, 24185124, 23893632, 23557694, 23333269, 23137660, 22999555, 22735123, 22570622, 22550384, 22564342, 22638640, 22634445, 22892939, 23301243, 23877498, 24486004, 25213952, 26234455, 27543172, 29047036, 31004923, 33136603, 35585805, 38446295, 41298609, 44107588, 46643468, 48847828, 50406256, 50969877, 50709695, 49655360, 48303759, 47078105, 45979880, 45174211, 44639860, 44038709, 43627226, 43524501, 43402528]
6095D3402528J05888K59404L72909Q70216J280119J753077K382492L051244L903093
6086E7380970M473146N124216N417529N206810M559853L522679J874924l32185
6078H7227942k270646l864267m383173m110655l702017l042502k628715k448835
6070F0777132k106170k070635k076783j671888j433533j377338j113006n51350
6062D8376429k06958M03504P83985J272616J551956J955459J892890J843423J252516
6053E9125820L91581l75098j502827k245680k828408k670814k529757k377385
6045D4987432k081588j975912j779139j856548j578282j595806j540838j288479
6037C1290840j233420j088135j090931p44676q00609p29677n08708n17171m08087
$$ y = [43402528, 43508416, 43767820, 44140729, 45010945, 46291064, 48044141, 50426633, 53477877, 57380970, 61854116, 66978332, 72395861, 77602671, 82162524, 85685203, 87560127, 87227942, 84957296, 81093029, 76709856, 72599201, 68897184, 65854682, 63225967, 60777132, 58670962, 56600327, 54523544, 52851656, 51418123, 50040785, 48927779, 48376429, 48169471, 48572975, 49356960, 50629576, 52181532, 54136991, 56029881, 57873304, 59125820, 59517401, 59142303, 57639476, 55393796, 52565388, 49894574, 47364817, 44987432, 42905844, 40929932, 39150793, 37294245, 35715963, 34120157, 32579319, 31290840, 30057420, 28969285, 27878354, 27133678, 26333069, 25603392, 25094684, 24577513, 24169426]
6028B4169426l47008l44336k64054l02956l46298k85323l13449l79219l18242
6019B1268541l14964n04922m09212m09770k64755l49049l77569k19052l28736
6010A8090512k89408j59617j97668j99024l2170j01186k603o4701K2450O7189
6000A7133774k9833q82R3295o3473N3597r950O5179K0061N0008R2659l8874J06928
5988A7472489N9294K0941j39330j93155k74981q5662K7262j99540m00224j98600
5978A6088494k15265q3814N6871o4304M8474J74216Q4281K44941K52304K35989
5968A6822187J92834J71104K34529J78504J36628j9736O5799J0456L3958J59478
5958A7985741J36816q4316n1558L0498M59r9903q0257k59355k20970j34309j50005
$$ y = [24169426, 23822418, 23478082, 23214028, 22911072, 22564774, 22279451, 21966002, 21586783, 21268541, 20953577, 20448655, 20039443, 19629673, 19364918, 19015869, 18638300, 18419248, 18090512, 17801104, 17641487, 17443819, 17244795, 17212625, 17111439, 17108836, 17044135, 17066585, 17133774, 17103941, 17103059, 17196354, 17132881, 17186478, 17176528, 17241707, 17261768, 17311776, 17404435, 17365561, 17472489, 17531783, 17552724, 17413394, 17220239, 16945258, 16859596, 16886858, 16687318, 16287094, 16088494, 15873229, 15789415, 15846286, 15781982, 15830456, 16004672, 16088953, 16333894, 16586198, 16822187, 17015021, 17186125, 17420654, 17599158, 17735786, 17716050, 17781849, 17792305, 17826263, 17985741, 18122557, 18038241, 17986683, 18017181, 18017640, 17917737, 17837480, 17578125, 17357155, 17222846, 17072841]
5947A7072841j31857q3761j5751k01242L3010K0860j97835o2555o7774M3748K9769
5936A6439453q6348k5887J74813o1533j63929L9408N8349L3028J7144k11498o430
5925A6206570n9520L0772K4013n0564m2973j01689m5074n5803j43748m6684n321
5914A5709979m1639L9026J11634K09812L4766J36178J41599K31997K59208J78335
5904A7010895K94612K63499J87920K44998K16679o7624l48627j46074m8947j66627
5894A7440704l89483k93631k03435m13779l68815l26763k90421p3972l05629k44327
5884A4530449m9289k0573n8446q8365j43122J79441K3283k3630R0274l7769n6024
5873A4346229j4706j8323k09036m5554J922M4320P5091j45299j82244L4794k27728
$$ y = [17072841, 16940984, 16857223, 16841472, 16640230, 16673240, 16694100, 16496265, 16433710, 16365936, 16409684, 16439453, 16353105, 16327218, 16502031, 16440498, 16276569, 16315977, 16374326, 16407354, 16424498, 16213000, 16206570, 16147050, 16177822, 16201835, 16151271, 16108298, 16006609, 15961535, 15905732, 15761984, 15715300, 15709979, 15668340, 15707366, 15819000, 16028812, 16063578, 16199756, 16341355, 16573352, 16832560, 17010895, 17305507, 17569006, 17756926, 18001924, 18218603, 18150979, 17802352, 17656278, 17607331, 17440704, 17051221, 16757590, 16554155, 16140376, 15771561, 15444798, 15154377, 15080405, 14774776, 14530449, 14481160, 14460587, 14402141, 14313776, 14170654, 14350095, 14373378, 14349748, 14440022, 14402253, 14346229, 14331523, 14313200, 14104164, 14058610, 14060532, 14104852, 14179943, 14034644, 13852400, 13887194, 13659466]
5862A3659466k90772j43636j24518j62396k74516k46036j22876j67632j47602
5853A1979482q0556j064j86831p6200l6885J13461r1019j66564j45372n9457j06374
5842A1142621j00007L9183k36564j98025k26858k34759j79452o7348k74275j34853
5832I529663j08485j58456k04754j50080n2827j86024j27243j52304j33358n3756
5822H202376k20245o1636q3472o0712o6640n7945Q0712p388j28657j19733N826
5811G482486j95518j74562K3099m8051j80261k39364n9182j13868j24757q5183
5801F284839l5540m3872l8168j55239j40090m8593j25528l3523j29551k00634
5791E334101l9180j39403n3318r5918l9267n0219J05751L3029p4620N5139M7285
$$ y = [13659466, 13368694, 13225058, 13100540, 12938144, 12663628, 12417592, 12294716, 12127084, 11979482, 11898926, 11897862, 11711031, 11634831, 11597946, 11711407, 11620388, 11453824, 11308452, 11248995, 11142621, 11042614, 11081797, 10845233, 10647208, 10420350, 10185591, 10006139, 9938791, 9664516, 9529663, 9421178, 9262722, 9057968, 8907888, 8855061, 8669037, 8541794, 8389490, 8256132, 8202376, 7982131, 7920495, 7837023, 7776311, 7709671, 7651726, 7732438, 7725050, 7596393, 7476660, 7482486, 7286968, 7112406, 7135505, 7087454, 6907193, 6667829, 6608647, 6494779, 6370022, 6284839, 6249299, 6205427, 6167259, 6012020, 5871930, 5823337, 5697809, 5664286, 5534735, 5334101, 5294921, 5155518, 5102200, 5006282, 4967015, 4916796, 5022547, 5055576, 4980956, 5036095, 5083380]
5780E083380Q1795L4942J18980J56073K2599N4113R7359J85819K04064Q4029l3511
5769F089642K29216L4571K005J7491R1001j3681k0410K44998R3865J02898n080
5758F866516J16594m443J10341J04567J30400J67508N9914J10972K97833L05315
5748H265517K56893J07058J24484K32273J22180J29514J43985m3318J88165J55513
5738I682264l3797N6218j35407J38302J76513J54802K71076J59957J97360J84816
5728A0852104K48514K4959J55426N2288k05071O1470J82962K6019Q1821J20675
5718A1601167M9119j63352O583k26679O520R8058j7355M7435J34146M5281J23647
5707A1704570L03086M76600M36604M60760M80641N12865L85050K30875J99238
$$ y = [5083380, 5165175, 5200117, 5319097, 5475170, 5497769, 5551882, 5649241, 5835060, 6039124, 6123153, 6089642, 6318858, 6353429, 6355434, 6372925, 6463926, 6450245, 6429835, 6674833, 6768698, 6871596, 6866516, 6983110, 6978667, 7089008, 7193575, 7323975, 7491483, 7551397, 7662369, 7960202, 8265517, 8522410, 8629468, 8753952, 8986225, 9108405, 9237919, 9381904, 9338586, 9526751, 9682264, 9648467, 9704685, 9569278, 9707580, 9884093, 10038895, 10309971, 10469928, 10667288, 10852104, 11100618, 11125577, 11281003, 11333291, 11128220, 11189690, 11372652, 11398671, 11480492, 11601167, 11650286, 11486934, 11493517, 11266838, 11273358, 11371416, 11354061, 11401496, 11535642, 11580923, 11704570, 12007656, 12484256, 12920860, 13381620, 13862261, 14375126, 14760176, 14991051, 15190289]
5698A5190289l1633k70752k15071k26231r9438k83962k73400j80226k34455p2801
5688A3302320j96645j75222p3773m1191j18754R5944K40892J22985K72400K95652
5678A3724608M65057Q29727Q35208R14328J025735J031549J019173Q62045P12343
5669B1419773M30965R582j98601n36559l30821l09923j40559j40969j18302L2698
5659B0117284P3065j4044L3990R8011M8965J77269L14720K18073M22086O34863
5649B2124282P19519Q32673R64487J208016J426675J475738J723798J794080J906739
5640C4176007K079910K148892K127865K318167K680218L071833L486743L994415
5632E6084050M181334M216142M016807L433767K300084J315138L04839l23957
$$ y = [15190289, 15158656, 14887904, 14672833, 14446602, 14347164, 14063202, 13789802, 13609576, 13375121, 13302320, 13105675, 12930453, 12856680, 12815489, 12696735, 12792679, 13033571, 13156556, 13428956, 13724608, 14189665, 15019392, 15854600, 16768928, 17794663, 18826212, 19845385, 20707430, 21419773, 21850738, 21860320, 21661719, 21125160, 20794339, 20484416, 20343857, 20202888, 20084586, 20117284, 20190349, 20176305, 20210295, 20308306, 20357271, 20534540, 20849260, 21067333, 21489419, 22124282, 22843801, 23676474, 24640961, 25848977, 27275652, 28751390, 30475188, 32269268, 34176007, 36255917, 38404809, 40532674, 42850841, 45531059, 48602892, 52089635, 56084050, 60265384, 64481526, 68498333, 71932100, 74232184, 75547322, 75852161, 75528204]
5624G5528204m47962j90755M39279J088983J587260K198357K876653L613773M483381
5615I1177173N368977O436622P274881Q126908R046663R786564J0617598J1379667
5607A59215053J1884836J2086224J1961696J1301977R729803P419654M264688
5600B27863931L20712l544418o372291p613928p542664p328502p248614p298986
5592A81235240p102940p070142o784894o377023n934046n211944m526364m078931
5584A34148956l660455l406412l206992k643719k421352j917357j616099j455231
5576A13821339j423825j337942j836059k699995l607948m391406n100763n182220
5568H8241181m807393m497656m019776l934725l615737l439062l065166k946132
$$ y = [75528204, 75080242, 74889487, 75328766, 76417749, 78005009, 80203366, 83080019, 86693792, 91177173, 96546150, 102982772, 110257653, 118384561, 127431224, 137217788, 147835386, 159215053, 171099889, 183186113, 195147809, 206449786, 216179589, 223599243, 227863931, 228184643, 224640225, 218267934, 210654006, 203111342, 195782840, 188534226, 181235240, 174132300, 167062158, 160277264, 153900241, 147966195, 142754251, 138227887, 134148956, 130488501, 127082089, 123875097, 121231378, 118810026, 116892669, 115276570, 113821339, 112397514, 111059572, 109223513, 106523518, 102915570, 98524164, 93423401, 88241181, 83433788, 78936132, 74916356, 70981631, 67365894, 63926832, 60861666, 57915534]
5560E7915534k744730k529296k356625k065458j869247j746308j374359j334680
5552D1894831j325761j181696j068125j205091j022060q94924r28536r30597q21790
5543C2516251p65525p91070q21969o45697n67557n83815n43949o35707m42418
5534B6718544m13067k78222k37135j99689j94240j32879j85684k69024k78795
5525B4529809n63189o40776n43773m66674l57257m67544m48593l36886k76491
5516B0428626k51453m16831m21625l95058l23025l50307q0366m4657J31778J61104
5506A8438186K04099L44986M32871M64287L69736L84071m5700k37571l81048p19968
5496A9253949o61941n03923l62315l75778k68078k78189j99952r5364j70884p0184
$$ y = [57915534, 55170804, 52641508, 50284883, 48219425, 46350178, 44603870, 43229511, 41894831, 40569070, 39387374, 38319249, 37114158, 36092098, 35197174, 34268638, 33338041, 32516251, 31750726, 30959656, 30137687, 29491990, 28924433, 28340618, 27796669, 27160962, 26718544, 26305477, 26027255, 25790120, 25590431, 25396191, 25263312, 25077628, 24808604, 24529809, 23966620, 23325844, 22782071, 22315397, 21958140, 21490596, 21042003, 20705117, 20428626, 20177173, 19760342, 19338717, 18943659, 18620634, 18270327, 18189961, 18145304, 18277082, 18438186, 18642285, 18987271, 19420142, 19884429, 20254165, 20638236, 20592536, 20354965, 19973917, 19253949, 18592008, 18088085, 17725770, 17349992, 17081914, 16803725, 16603773, 16508409, 16337525, 16267341]
5486A6267341P6395K7690K08177L36436M84161O27763R72625J280592J389441
5477B1670621J628494J699107J715891J410972Q85955K12991n82089j240606j466817
5468B5934519j267525r86729r71390q18663p92465n46753l06557l68925m58019
5459A9417493j53107n5182J21720R5721L14929O22215R60988J317701J571829
5450B4214307K018704K131965K253934K250540J649822P94136q0683j259881k123487
5441C1849357k234063j753094j395653j225106j090170j058560q54846p52667
5433B1485198p05546o71987m90255m71914k33491p5463J93582M06986M50700R26117
5423B0813927J108731J400808J470013J502106J374689R23622K93343m65997j209762
$$ y = [16267341, 16343736, 16371426, 16579603, 16916039, 17400200, 18027963, 19000588, 20281180, 21670621, 23299115, 24998222, 26714113, 28125085, 29011040, 29224031, 28641942, 27401336, 25934519, 24666994, 23680265, 22708875, 21890212, 21097747, 20550994, 20244437, 19875512, 19417493, 19264386, 19209204, 19330924, 19426645, 19741574, 20363789, 21324777, 22642478, 24214307, 26233011, 28364976, 30618910, 32869450, 34519272, 35313408, 35232725, 33972844, 31849357, 29615294, 27862200, 26466547, 25241441, 24151271, 23092711, 22237865, 21485198, 20779652, 20107665, 19617410, 19145496, 18912005, 18836542, 19030124, 19437110, 19887810, 20813927, 21922658, 23323466, 24793479, 26295585, 27670274, 28593896, 28887239, 28421242, 27211480]
5414B7211480j537812j698133j542371j030373r57647r31178r19948r37470o86090
5405A6970458p36416o15858o22022m67494l25382l21601q3023j21181P13J89290
5395A3867484K48409L98268L98508L39060L62040R4886j27167n24158p43649p70973
5385A3542708p83263o80555m56997m88025l88886n10639l74593l96528m73660
5376H989562l13535l03716k42623j20880k78585k13728n0824j10119j00533j03147
5366G151872k5193p1602j29748j38580l0425j43380k17140k03759q8224r6557
5356F007264k26799k10548k10441j01003o9099l4329k08362L6325J0805J345n7586
5345D937572n2899P6830n0900r6597Q926j25237M6482r3360j73988j22259k3051
$$ y = [27211480, 25673668, 23975535, 22433164, 21402791, 20445144, 19513966, 18594018, 17656548, 16970458, 16234042, 15618184, 14996162, 14528668, 14203286, 13881685, 13798662, 13677481, 13678194, 13867484, 14115893, 14514161, 14912669, 15251729, 15613769, 15708655, 15581488, 15057330, 14313681, 13542708, 12759445, 12078890, 11621893, 11133868, 10744982, 10234343, 9859750, 9463222, 8989562, 8676027, 8372311, 8129688, 8008808, 7730223, 7516495, 7465671, 7355552, 7255019, 7151872, 7126679, 7055077, 6925329, 6786749, 6756324, 6612944, 6395804, 6192045, 6103821, 6007264, 5780465, 5569917, 5359476, 5258473, 5189374, 5155045, 4946683, 4983008, 4993813, 4995158, 4937572, 4884673, 4961503, 4910603, 4814006, 4822932, 4697695, 4744177, 4650817, 4476829, 4354570, 4331519]
5334D331519J6065j08636j8910p3561K00r8253m1835j37851M3820q6580J3344
5323C839322J28617n2360k3122l5421N399L8849J18447M7327O6311L11181Q5620
5312D530170O6178P6849Q8978o013m809j13112j09243J6466L0189j41389l5527
5301D398737o4114O3015M318R4061M9265j82471J4172M5150M4934q8498L7915
5290D416484M4566K1870J3590n6369P9647N7824p7237N8033Q1542L9439J22158
5279D801547N2181L2979o6986O6231j65973j04168j23932j37920r9438j53924
5269D100597n5042j90186j12417k2927L8947j8843j34748o6886q137K8368k9738
5258C528988p0379r6121o8239l1715l4281p6769P8708O5999M7540K0610p1033
$$ y = [4331519, 4347584, 4238948, 4220038, 4146477, 4146677, 4048424, 4006589, 3868738, 3912558, 3825978, 3839322, 3967939, 3915579, 3892457, 3857036, 3862435, 3901284, 4019731, 4067058, 4133369, 4444550, 4530170, 4596348, 4673197, 4762175, 4756162, 4751353, 4638241, 4528998, 4545464, 4575653, 4434264, 4398737, 4334623, 4397638, 4401956, 4496017, 4545282, 4362811, 4376983, 4422133, 4467067, 4378569, 4416484, 4461050, 4482920, 4496510, 4440141, 4519788, 4577612, 4500375, 4558408, 4639950, 4679389, 4801547, 4853728, 4886707, 4819721, 4885952, 4719979, 4615811, 4491879, 4353959, 4254521, 4100597, 4045555, 3855369, 3742952, 3720025, 3758972, 3740129, 3605381, 3538495, 3530358, 3558726, 3528988, 3458609, 3362488, 3294249, 3262534, 3228253, 3151484, 3230192, 3296191, 3343731, 3364341, 3293308]
5247C293308l802Q770n0035k1261J27796J9132j34391j03239J14990J1111l0567
5236C231812J0744L3510j98057M5949J06039n7334k4480J0582N8771N387O2545
5225C285468l1743N0050P767N9444J06055m1850k8499k3218p6001J03570R6741
5214C507784P7169Q6773J02068J12474j33676j5710J61436M0701l9792O0806P570
5203C967603J33707K16844k5178O8923R3650M8289Q8342R3617K81396K5913j83880
5192D809226m1298O1561p293k0308j6379P3775J66663K38499Q6845J41744J88853
5181E681888M4489l4245K49444J92806K73771J80623J57627L50728L65935M53630
5171G916696N48389N95970P80492O52655Q75733Q43900P17909Q18151N66810O08647
$$ y = [3293308, 3289506, 3298276, 3248241, 3226980, 3354776, 3373908, 3239517, 3136278, 3251268, 3262379, 3231812, 3242556, 3276066, 3078009, 3123958, 3229997, 3172663, 3148183, 3158765, 3217536, 3222923, 3285468, 3253725, 3303775, 3311542, 3370986, 3477041, 3435191, 3406692, 3383474, 3307473, 3411043, 3507784, 3584953, 3671726, 3773794, 3886268, 3752592, 3736882, 3898318, 3939019, 3899227, 3960033, 3967603, 4101310, 4318154, 4292976, 4361899, 4455549, 4503838, 4592180, 4685797, 4967193, 4993106, 4809226, 4767928, 4829489, 4822196, 4801888, 4785509, 4859284, 5025947, 5264446, 5351291, 5493035, 5681888, 5726377, 5692132, 5941576, 6134382, 6408153, 6588776, 6746403, 7097131, 7463066, 7916696, 8465085, 9061055, 9841547, 10494202, 11369935, 12213835, 12931744, 13749895, 14316705, 14925352]
5161A4925352O29957J92865j7138k94506k35149m03911l35219k86403j75280J0767
5151A4011335j30716j67363p6433J60416r4659J6595J66910J69356J14057K48031
5141A4417529M14854N19362N69227P32686R36614J233777J338287J384486J553425
5132B3100247J285446R76750O52531K3593m24887n83374n53375o47769k40622
5123B3588540p5518j61467k2959R0323M1368j11649j69841j36626k96575m11654
5113B2333942m51085m41411l07729k64105k81239j7510K12130K80058K59814L25035
5103B1647900M96437O22435N34743P46582Q86308J092969R94644O28612N79051
5094B8229681O18532N45583L39309o32990j157543j144138r76805q32954o89884
$$ y = [14925352, 15555309, 15748174, 15731036, 15436530, 15201381, 14797470, 14462251, 14175848, 14000568, 14011335, 13880619, 13713256, 13636823, 13797239, 13702580, 13719175, 13886085, 14055441, 14169498, 14417529, 14832383, 15351745, 15920972, 16653658, 17590272, 18824049, 20162336, 21546822, 23100247, 24385693, 25362443, 26014974, 26038567, 25613680, 25030306, 24476931, 23829162, 23588540, 23513022, 23351555, 23328596, 23418919, 23460287, 23348638, 23178797, 23042171, 22745596, 22333942, 21882857, 21441446, 21133717, 20869612, 20588373, 20570863, 20782993, 21063051, 21322865, 21647900, 22144337, 22766772, 23301515, 24048097, 24934405, 26027374, 27022018, 27650630, 28229681, 28848213, 29393796, 29733105, 29100115, 27942572, 26798434, 25821629, 24988675, 24298791]
5085B4298791l66364m53669n77523m11239m70169m02720l00168m23863k21778
5076B0671298p859j8885J15346K19213K09255K6957J409j21125j50894l36408
5066B0608307m23621l90568m27773k72287k90071l09597m13632l61595m05849
5057A7313314k90085l57612l17201k83502l42596k33693r583k48325k96203j92161
5047A4742353j60447l3720N4401O4701k4377K02195K30023J31699L8816J53150
5037A5398794K70016Q3920K00978K34196K67812K09664K64793L43800J21742K15545
5027A7611260L46890K95326K46845K74098L56153L27914L65839K46287N13050
5018B0583662M34496K96256K90862M80851O07634N86502N17220N75618P18649
$$ y = [24298791, 23932427, 23478758, 22901235, 22489996, 22019827, 21617107, 21316939, 20893076, 20671298, 20663439, 20644554, 20759900, 20979113, 21188368, 21215325, 21216734, 21095609, 20944715, 20608307, 20184686, 19794118, 19366345, 19094058, 18803987, 18494390, 18080758, 17719163, 17313314, 17023229, 16665617, 16348416, 16064914, 15722318, 15488625, 15479042, 15230717, 14934514, 14742353, 14581906, 14548186, 14602587, 14667288, 14642911, 14845106, 15075129, 15206828, 15245644, 15398794, 15668810, 15752730, 15953708, 16187904, 16455716, 16665380, 16930173, 17273973, 17395715, 17611260, 17958150, 18253476, 18500321, 18774419, 19130572, 19458486, 19824325, 20070612, 20583662, 21018158, 21314414, 21605276, 22086127, 22693761, 23280263, 23797483, 24373101, 25091750]
5009B5091750O97617Q04328P94103R90563Q56680R10819R07087J103947J231109
5000C3388003J279964J447958J421342J732656J789112J708170J469523J460882
4992D5697610J297484Q30471K71327M4384L18405O51789Q01797Q93029J113851
4983E1920147J023900J136175J176984J069175J186225J252733Q91094Q63220
4975F0519653Q67785O49261P58319P17443N71005M48282N83990N79776O64784
4966F6360298R09610R33366J189515J159421J277186J591390J666732J812953
4958G6900471J728235J853949K040147J925580J853237J876917J937661J837205
4950I1953402J429439J230443J124045R83769Q45104R55466J248140J317262J510998
$$ y = [25091750, 25789367, 26593695, 27387798, 28378361, 29235041, 30145860, 31052947, 32156894, 33388003, 34667967, 36115925, 37537267, 39269923, 41059035, 42767205, 44236728, 45697610, 46995094, 47825565, 48096892, 48141276, 48459681, 49111470, 49913267, 50806296, 51920147, 52944047, 54080222, 55257206, 56326381, 57512606, 58765339, 59656433, 60519653, 61387438, 62036699, 62795018, 63512461, 64083466, 64531748, 65115738, 65695514, 66360298, 67269908, 68203274, 69392789, 70552210, 71829396, 73420786, 75087518, 76900471, 78628706, 80482655, 82522802, 84448382, 86301619, 88178536, 90116197, 91953402, 93382841, 94613284, 95737329, 96721098, 97566202, 98521668, 99769808, 101087070, 102598068]
4941A02598068J360964J529826J759075J867771J915967K150705J992591K085610
4933A17260577K088428J681460J355231J101852O67724K70455M9165k62223j73938
4924A24038731j32623J54644K95976Q95999J275685J816506K530919K872906L323055
4915A37071798L575961L329506K989404K186367J099435k317j119092j787807
4907A47343255k655269l175881l078976l115822k624975k178023j496927j209403
4899A27807979o00714k03829J91533K12525R8441K77904m67208j258686k128333
4890A23929612l216197m165698m216115m064112l591564l070743k684646k273904
4882I6646633k072464j876093j716919j548491j396939j083170r72629r08708
$$ y = [102598068, 103959032, 105488858, 107247933, 109115704, 111031671, 113182376, 115174967, 117260577, 119349005, 121030465, 122385696, 123487548, 124155272, 124425727, 124474892, 124212669, 124038731, 123906108, 124060752, 124356728, 125252727, 126528412, 128344918, 130875837, 133748743, 137071798, 140647759, 143977265, 146966669, 149153036, 150252471, 150250154, 149131062, 147343255, 144687986, 141512105, 138433129, 135317307, 132692332, 130514309, 129017382, 127807979, 127207265, 127003436, 127194969, 127407494, 127505935, 127783839, 127316631, 126057945, 123929612, 120713415, 116547717, 112331602, 108267490, 104675926, 101605183, 98920537, 96646633, 94574169, 92698076, 90981157, 89432666, 88035727, 86952557, 85979928, 85071220]
4874H5071220o67854o06007q42736p87052q05407r34859r72444j084004j010633
4865G7360224j051046r07363p13523m44145j98465j41242n0318Q9424l4910l26566
4855G3582070m59235o43010p53192r76443j211444j112068j212329j192061j314063
4846F4708225j204889j140336j053685j206993j168333j131874j096406j009235
4838E5696474r78761j027454r91869r84319q03673q88177o68249p51185o58687
4829D7944100o11561o15999o62902p82546o90709p15982o86509o80774p32063
4820D1765055o73851o18504o00939o34105n46226k22865l70552n05889l63617
4811C7228507j99238k33686l06951k31508k26535j51069k01934j64528j85300
$$ y = [85071220, 84403366, 83797359, 82954623, 82167571, 81362164, 80427305, 79454861, 78370857, 77360224, 76309178, 75401815, 74688292, 74244147, 74045682, 73904440, 73854122, 73943546, 73908636, 73582070, 73122835, 72479825, 71726633, 70750190, 69538746, 68426678, 67214349, 66022288, 64708225, 63503336, 62363000, 61309315, 60102322, 58933989, 57802115, 56705709, 55696474, 54717713, 53690259, 52698390, 51714071, 50910398, 50022221, 49353972, 48602787, 47944100, 47332539, 46716540, 46053638, 45271092, 44580383, 43864401, 43177892, 42497118, 41765055, 41091204, 40472700, 39871761, 39237656, 38691430, 38468565, 38098013, 37592124, 37228507, 37029269, 36795583, 36488632, 36257124, 36030589, 35879520, 35677586, 35513058, 35327758]
4802C5327758l65589j26122j68356k09118k11549k6759l5208r942J60843M4515
4792C4380473J14693J83419J86951P5266J76411K15248M29835L87802K73975M29543
4782C6853616J43498J95896J33492K61847J88342K76494K22127K76415K43965
4773C8795692L03654K96248L87709M63504M52629M03402N67022L65145K26427
4764D2261432L02677K79109K00905L5480K27044P9039J65436J33900j2906J67897
4754D3840013K02566Q5392K96646L39214L7541K13197L45775L78218L72509L45317
4744D6456388K17759L43546K52229K35967J76933J34398j58158r5446k3568p9759
4734D7460289l14361j89552k13320k99176j05510k85497k00881m46023j36480
$$ y = [35327758, 34962169, 34836047, 34667691, 34458573, 34247024, 34220265, 34185057, 34175115, 34335958, 34380473, 34495166, 34678585, 34865536, 34940802, 35117213, 35332461, 35762296, 36150098, 36424073, 36853616, 36997114, 37193010, 37326502, 37588349, 37776691, 38053185, 38275312, 38551727, 38795692, 39099346, 39395594, 39783303, 40246807, 40699436, 41102838, 41669860, 42035005, 42261432, 42564109, 42843218, 43044123, 43079603, 43306647, 43385686, 43551122, 43685022, 43672116, 43840013, 44042579, 44127971, 44424617, 44763831, 44801372, 45014569, 45360344, 45738562, 46111071, 46456388, 46674147, 47017693, 47269922, 47505889, 47682822, 47817220, 47659062, 47563616, 47540048, 47460289, 47145928, 46956376, 46743056, 46443880, 46338370, 46052873, 45851992, 45405969, 45269489]
4725D5269489k1122k35501j49088j86n6685J06521M1785j50142J7415P7578j80372
4714D4719692J36514J38404O2286O6449R2324Q8336K60642K11850L34559J78175
4704D6289231J67791R602K9812j7383j71089j44315j34232k35225k46573k95012
4694D5252607l46964n4317j50026N0356j1216J04519J87926L56665M42781L04772
4684D6137103L94076N48007M64688O06500P12645P87885R32697J047427J180242
4675E2811270J272010J438296J411466J578752J803337J666367J661851J251042
4667F4894391J199364J341684J534917J905098K347963K764750L291241L791992
4659H3071400M224665M736594N484138O418652P047222Q041017Q975499J0139422
$$ y = [45269489, 45248367, 45012866, 44863778, 44863592, 44806907, 44913428, 44955213, 44805071, 44822486, 44900064, 44719692, 44856206, 44994610, 45056896, 45123345, 45215669, 45304005, 45564647, 45776497, 46111056, 46289231, 46457022, 46466624, 46496436, 46479053, 46307964, 46163649, 46029417, 45794192, 45547619, 45252607, 44905643, 44851326, 44701300, 44751656, 44740440, 44844959, 45032885, 45389550, 45832331, 46137103, 46531179, 47079186, 47543874, 48150374, 48863019, 49650904, 50583601, 51631028, 52811270, 54083280, 55521576, 56933042, 58511794, 60315131, 61981498, 63643349, 64894391, 66093755, 67435439, 68970356, 70875454, 73223417, 75988167, 79279408, 83071400, 87296065, 92032659, 97516797, 103935449, 110982671, 119023688, 127999187, 138138609]
4651A38138609J1497352J2919415J4525551J6279658J7978274J9673327K1170289
4644B52182475K1441453K0664533J7519403J1367869M094367m083481j1889116
4637C11297503j5920750j6167267j4517713j2863077j2360210j2547517j2475057
4630B14445912j2444237j2406687j1786749j0952366r883751q845725q160299
4623A39966098p124295o420685n980597n266094n036270m662821m185191l965087
4615I7325058l417439l088429k892722k503641k229663k159949k184278j906342
4607G6942595j966946k090479k175134k195343k275394k232621k090523k086882
4599E9829273k089083j732036j567207j614044j423739j140893j065083j227492
$$ y = [138138609, 149635961, 162555376, 177080927, 193360585, 211338859, 231012186, 252182475, 273623928, 294288461, 311807864, 323175733, 327270100, 323186619, 311297503, 295376753, 279209486, 264691773, 251828696, 239468486, 226920969, 214445912, 202001675, 189594988, 177808239, 166855873, 156972122, 148126397, 139966098, 132841803, 126421118, 120440521, 115174427, 110138157, 105475336, 101290145, 97325058, 93907619, 90819190, 87926468, 85422827, 83193164, 81033215, 78848937, 76942595, 74975649, 72885170, 70710036, 68514693, 66239299, 64006678, 61916155, 59829273, 57740190, 56008154, 54440947, 52826903, 51403164, 50262271, 49197188, 47969696]
4591D7969696j081265p26688q19450q70117q79098r44544j016726j086028j193358
4582C9352422r21636r94606q65468q12157p92575n94529n62999m66041o22601
4573C2719810m53616l00941l51846k29096j72554j88653j13398j73481k08130
4564C0528095j11218q2206j97322j87787o4410j3473J21883O8111J49392J19630
4554C0330695K57869N21871N83914Q20178Q27101R62636R89186J378896J858281
4545C8530627K386159K886285L445569L777594L808650L715026L102844K100070
4537F3752824P11121j060154k519214l037662k868820k491188k137533j809205
4529D8540169j667506j528031j488410j383545j228709j060212j052007p32085
$$ y = [47969696, 46888431, 46161743, 45342293, 44472176, 43593078, 42648534, 41631808, 40545780, 39352422, 38430786, 37436180, 36570712, 35758555, 34965980, 34371451, 33808452, 33342411, 32719810, 32266194, 31965253, 31613407, 31384311, 31211757, 31023104, 30909706, 30736225, 30528095, 30416877, 30334671, 30137349, 29949562, 29885152, 29871679, 29993562, 30061673, 30211065, 30330695, 30588564, 31110435, 31694349, 32514527, 33341628, 34304264, 35293450, 36672346, 38530627, 40916786, 43803071, 47248640, 51026234, 54834884, 58549910, 61652754, 63752824, 64463945, 63403791, 60884577, 57846915, 54978095, 52486907, 50349374, 48540169, 46872663, 45344632, 43856222, 42472677, 41243968, 40183756, 39131749, 38399664]
4521C8399664o98510m98224l67864l76655q8272l22257j93841l41318m80757m72761
4511C4559205l30274l41450k44090j81147k7359J6214J11105N6928j2316J96941
4501C3803757L7015L11065N02817M31156O29370P55324P92521J091187J238910
4492C9593122J382846J442377J455292J332165R53947O99173J91517o8662k39610
4483D6742167r0560o8107j43170j96028n10375p63050j099325j362839j350352
4474D1158361j490500j268312j367680j424330j354965j016351j052727j002949
4466C1180547q99070q03221o84375n93792o10352n14830m41662n93356l07915
4457B5731974j92745j92578k76011p0878P720q1972M8868N1518K26596L34640
$$ y = [38399664, 37701154, 37202930, 36835066, 36458411, 36370139, 36047882, 35854041, 35512723, 35031966, 34559205, 34228931, 33887481, 33643391, 33462244, 33434885, 33451099, 33562204, 33619132, 33606816, 33803757, 33840772, 34151837, 34654654, 35085810, 35715180, 36470504, 37263025, 38354212, 39593122, 40975968, 42418345, 43873637, 45205802, 46159749, 46858922, 47050439, 46981777, 46742167, 46651607, 46583500, 46440330, 46244302, 45733927, 44970877, 43871552, 42508713, 41158361, 39667861, 38399549, 37031869, 35607539, 34252574, 33236223, 32183496, 31180547, 30281477, 29478256, 28793881, 28200089, 27589737, 27074907, 26633245, 26039889, 25731974, 25539229, 25346651, 25070640, 24999762, 25007482, 24925510, 24974378, 25025896, 25252492, 25587132]
4447B5587132M08629M61966M34373O10519L19882K99071J4840j00027j11033l12247
4437B7613105m66403n36759n08907n57930n69986m91845o00769m88112k51616
4428B3140778l32773l68224l50143m24886l55009k79364m16607n89164m26822
4419A9597786m44782k18479l10514l03492l15262k45332k04071j94659k68676
4410A7092519k35592k3794k30889q0297l6092j43378O411j50691p5454l9330o5261
4399A6018152j915K4770r1693j21823n7995n9728q0139k373K4035N0556J13593
4388A5815440Q1739J67857Q7268J23740K32463R1719J85733J80023K60896Q7254
4378A7314132o6044j65574k62073k55994r2591m2112j63473q4094r8711n0864
$$ y = [25587132, 25995761, 26457727, 26892100, 27502619, 27822501, 28121572, 28136412, 28036385, 27925352, 27613105, 27146702, 26609943, 26101036, 25543106, 24973120, 24481275, 23880506, 23392394, 23140778, 22808005, 22439781, 22089638, 21664752, 21309743, 21030379, 20613772, 20024608, 19597786, 19153004, 18934525, 18624011, 18320519, 18005257, 17759925, 17555854, 17361195, 17092519, 16856927, 16833133, 16602244, 16521947, 16485855, 16342477, 16348888, 16198197, 16122743, 16083413, 16018152, 16016237, 16041007, 15949314, 15827491, 15769496, 15709768, 15629629, 15627256, 15651291, 15701847, 15815440, 15897179, 16065036, 16152304, 16276044, 16508507, 16600226, 16785959, 16965982, 17226878, 17314132, 17248088, 17082514, 16820441, 16564447, 16471856, 16429744, 16266271, 16182177, 16083466, 16032602]
4368A6032602m1546n8165j5882p4628m1453M1894q6369o5970M7887J64190P8540
4357A5981100J17058O0188P8653J81566K05704P8758P0524J64307L08466J80414
4347A7426738J43815K03743K55945K60285R6470L38739M39352L41841L69336M93722
4337B0369986L20227K96211L12432J69453K61433P8289K31314K55422K17695P1131
4327B2583593J12245M0018k0433J23334L9336n6154J15952K1670m4470R9779L8197
4316B3053067J6701L2493o8688m6668o5575K63748J31446L3652J21211J22520
4306B3593907J00796J77355K87452K23674J91882J63310L02677L50467M59728
4297B5851248N93768O76913J053274J287665J225199J297638J303816J206765
$$ y = [16032602, 15991056, 15932891, 15917009, 15842381, 15800928, 15842822, 15756453, 15690483, 15738370, 15902560, 15981100, 16098158, 16158346, 16236999, 16418565, 16624269, 16703027, 16773551, 16937858, 17246324, 17426738, 17570553, 17774296, 18030241, 18290526, 18386996, 18725735, 19165087, 19506928, 19876264, 20369986, 20690213, 20986424, 21298856, 21468309, 21729742, 21808031, 22039345, 22294767, 22512462, 22583593, 22695838, 22735856, 22715423, 22838757, 22878093, 22821939, 22937891, 22959561, 22915091, 23014870, 23053067, 23069768, 23102261, 23033573, 22986905, 22921330, 23185078, 23316524, 23350176, 23471387, 23593907, 23694703, 23872058, 24159510, 24383184, 24575066, 24738376, 25041053, 25391520, 25851248, 26445016, 27121929, 28175203, 29462868, 30688067, 31985705, 33289521, 34496286]
4289C4496286J173154N37606l69161q30635p25223p08303o44760m39632m34450
4280C2054882l88175l10653k41983l09808k56614j80329p923k18341n7134R7235
4270C0181157R2060J29926K96842J87043J14815J89384K55945L13032J90100K71668
4260C2221972K49555J81468K39675K83169L22634L68504L94879K03788K53470
4251C4719114L02695K25487L08234L42055L47298K34351K68071J82012K86469
4242C7215786K65455J57000L16742K78670K36195k6976J51339K21123K80788K38320
4232C9334442J81655j53545N3069J62847k6009K2334J39796J68454N0587M4097
4222C9977727J21294J75079J35537J99649L33084J87890K03032K77018L03964
$$ y = [34496286, 35669440, 36207046, 35837885, 35007250, 34282027, 33573724, 32928964, 32489332, 32054882, 31666707, 31356054, 31114071, 30804263, 30547649, 30367320, 30359397, 30141056, 30083922, 30181157, 30273217, 30403143, 30699985, 30887028, 31001843, 31191227, 31447172, 31760204, 31950304, 32221972, 32471527, 32652995, 32892670, 33175839, 33498473, 33866977, 34261856, 34465644, 34719114, 35021809, 35247296, 35555530, 35897585, 36244883, 36479234, 36747305, 36929317, 37215786, 37481241, 37638241, 37954983, 38233653, 38469848, 38442872, 38594211, 38815334, 39096122, 39334442, 39516097, 39362552, 39415621, 39578468, 39552459, 39574793, 39714589, 39883043, 39933630, 39977727, 40099021, 40274100, 40409637, 40609286, 40942370, 41130260, 41333292, 41610310, 41914274]
4213D1914274L49730K82692L42486K40783M34161L91677M33985M63374M31334
4204D5284496M33368N46223O30395M89047M80366N60726N14022N22722M71666
4195D9933031M48351N53960M84975M57748M60536N33341M60479M55173N08460
4186E4296054N05639N46576M12791N49884M38947L18683K46446L17092J76532
4177E7808644L57342L67057M16598J69131K18044J65743P5932J38057J7389j31472
4167E9602465k49217k11417l40081m86481l95340m23841n83154o00945n78797
4158E5733192n97556o92476n65755o53132p69723q00959n57945n98993n56956
4149D9939697n30695m87298m62045j76653o7624k2400j28972j3398Q7948r2384
$$ y = [41914274, 42264004, 42546696, 42889182, 43129965, 43564126, 43955803, 44389788, 44853162, 45284496, 45717864, 46264087, 46894482, 47383529, 47863895, 48424621, 48938643, 49461365, 49933031, 50381382, 50935342, 51420317, 51878065, 52338601, 52871942, 53332421, 53787594, 54296054, 54801693, 55348269, 55761060, 56310944, 56749891, 57068574, 57315020, 57632112, 57808644, 58165986, 58533043, 58949641, 59118772, 59336816, 59502559, 59578491, 59716548, 59733937, 59602465, 59353248, 59141831, 58801750, 58315269, 57919929, 57496088, 56912934, 56311989, 55733192, 55135636, 54443160, 53877405, 53224273, 52454550, 51653591, 51095646, 50496653, 49939697, 49409002, 48921704, 48459659, 48283006, 48215382, 48192982, 48064010, 48050612, 48138560, 48046176]
4139D8046176k77176l59303l68157o30405m74096n61302o99106m91846m39207
4130D3745578n22895m99042n01155m99287n23866o45472p93151p69162q12204
4121C8179344q05484q39050r91963o35908q81238o49083p47136q53746o79185
4112C1096551n83360m73019n21046m53169m46187m41472k64796l68092l08555
4103B7236855l08295l10636j29157k60716n3522j38228j61929n8341L9382M2088
4093B5897501O4849M5842k827m0595N4372j08889j56553j11191j73124j66512
4083B5302873j61910j42935j93585j31163r4741k43780k36422j45991l17502j93682
4073B3441162n1577l31088m35642k84938k23886k99124k34898k84566l03210j62992
$$ y = [48046176, 47769000, 47409697, 47041540, 46411135, 45937039, 45375737, 44676631, 44184785, 43745578, 43222683, 42723641, 42222486, 41723199, 41199333, 40553861, 39760710, 38991548, 38179344, 37373860, 36534810, 35542847, 34906939, 34025701, 33376618, 32629482, 31775736, 31096551, 30513191, 30040172, 29519126, 29065957, 28619770, 28178298, 27913502, 27545410, 27236855, 26928560, 26617924, 26488767, 26228051, 26174529, 26036301, 25874372, 25816031, 25855413, 25897501, 25962350, 26008192, 26005365, 25964770, 26019142, 25910253, 25753700, 25642509, 25469385, 25302873, 25140963, 24998028, 24804443, 24673280, 24578539, 24334759, 24098337, 23952346, 23634844, 23441162, 23389585, 23058497, 22622855, 22337917, 22114031, 21814907, 21580009, 21295443, 20992233, 20829241]
4063B0829241r7579k46386k02610j64930k2542o6170n3139l2280J03093K13337
4053B0260035K22814Q7258J48222J68541P9664N5996N2561K36941J00438P1776
4043B1484246K59457L05035J66919Q1952J54598L00440K96556J99974K2738J57402
4033B3429317K77814K97107J14255J96614K45548J44045J52494J99721K94690
4024B5351605M42297K76428K34857L13035J23451K12673L35148J44674K67283
4015B7701451L11964J38346K50002K57766M06458K88339K88146L33136K61882
4006C0237490J95847J29928L8485j82804j33866o6031j49017j36842o952M2809
3996B9969047j51307l2353N1032m9649k1342J05767Q5372Q2345J29258K92189
$$ y = [20829241, 20731662, 20485276, 20282666, 20117736, 20095194, 20029024, 19975885, 19943605, 20046698, 20260035, 20482849, 20570107, 20718329, 20886870, 20966534, 21022530, 21075091, 21312032, 21412470, 21484246, 21743703, 22048738, 22215657, 22297609, 22452207, 22752647, 23049203, 23249177, 23271915, 23429317, 23707131, 24004238, 24118493, 24315107, 24560655, 24704700, 24857194, 25056915, 25351605, 25793902, 26070330, 26305187, 26618222, 26741673, 26954346, 27289494, 27434168, 27701451, 28013415, 28151761, 28401763, 28659529, 29065987, 29354326, 29642472, 29975608, 30237490, 30433337, 30563265, 30601750, 30418946, 30285080, 30219049, 30070032, 29933190, 29926238, 29969047, 29817740, 29785387, 29836419, 29786770, 29765428, 29871195, 29956567, 30038912, 30168170, 30460359]
3986C0460359L77116L98322N52929O57377R27171Q97228J109462J260898J524404
3977C8165266J559816J508014J455422J393970J250193J086809Q32634P02143
3969D7954267O75264N29527N72634M73348N44651O18292N54449L08347L78238
3960E2609017L19833N4293j50828l51814m48557o44959p35968r10972q58049p70086
3950D8111910p04341q22220p49979o36555o29862m64358m77018l52084m46230
3941D2829263l14488j15363k79052j98299j1379M2355O8707J22478K87784J81874
3931D2613880L27843L00965M46092N00778M56043K86634M16942M27155N37801
3922D6314133N43522L89184N84065M88172N49778P46092O55842O14306N40249
$$ y = [30460359, 30837475, 31235797, 31788726, 32446103, 33373274, 34270502, 35379964, 36640862, 38165266, 39725082, 41233096, 42688518, 44082488, 45332681, 46419490, 47252124, 47954267, 48629531, 49159058, 49731692, 50205040, 50749691, 51367983, 51922432, 52230779, 52609017, 52928850, 52983143, 52832315, 52480501, 52031944, 51386985, 50651017, 49740045, 48881996, 48111910, 47407569, 46585349, 45835370, 45198815, 44568953, 44104595, 43627577, 43275493, 42829263, 42514775, 42399412, 42120360, 41922061, 41910682, 41953037, 42021744, 42144222, 42432006, 42613880, 42941723, 43242688, 43688780, 44189558, 44645601, 44932235, 45349177, 45776332, 46314133, 46857655, 47246839, 47830904, 48319076, 48868854, 49614946, 50270788, 50885094, 51425343]
3913E1425343M43907O99737O30031M84991O59168O74713N43561M25402M77677
3904E6464530N27954N28912O95580N30151N97234O65678M10584L31917L68437
3895F1120977K81739J22220J93468K55784K32628K10564L23587M62337K73454
3886F3476758K89721L63936M67961M48361L98681L84751L62477N99197O15676
3877F7407519M50216P36942P68671P67479Q75114R60021J014826J133101J085325
3868G5199214J148892J063503J359236J270167J297124J274456J536953J688107
3860H5837652J573919J802458J701897J555866J640223J388736J253935J045250
3852I7799936P71122O92681O11975O99975P51582P98734P80805P53163O08312
$$ y = [51425343, 51869250, 52568987, 53199018, 53684009, 54343177, 55017890, 55561451, 55986853, 56464530, 56992484, 57521396, 58216976, 58747127, 59344361, 60010039, 60420623, 60752540, 61120977, 61402716, 61524936, 61718404, 61974188, 62206816, 62417380, 62740967, 63203304, 63476758, 63766479, 64130415, 64598376, 65046737, 65445418, 65830169, 66192646, 66791843, 67407519, 67857735, 68594677, 69363348, 70130827, 71005941, 71965962, 72980788, 74113889, 75199214, 76348106, 77411609, 78770845, 80041012, 81338136, 82612592, 84149545, 85837652, 87411571, 89214029, 90915926, 92471792, 94112015, 95500751, 96754686, 97799936, 98571058, 99263739, 99875714, 100575689, 101327271, 102126005, 102906810, 103659973, 104268285]
3843A04268285Q22660O14419M09533K82898O7837n5261j7403j80376j27415m2788
3833A06042389K09159L44189N73907P74706R97556R02310Q18565P28108K51243
3824A11642132j20460m91244j010810j372903j039396q69140o87189n41748m06833
3815A05102409l29269m82909n32849j56069q7179k77594j86204m6106K81541M58173
3805A03743944N33476O55509J023596R72561J002258J202254J048235O47190L27788
3796A11156811l08322q73876j414581j365611j260281j125378r81376q54293q75085
3787A02098008q56677p99789p31918o08017o90628m74014m10138k00479k97802
3778I7028546k70616k38590j11105j11121J8188J9235j68135p7570K07246K81538
$$ y = [104268285, 105090945, 105705364, 106114897, 106397795, 106465632, 106410371, 106392968, 106212592, 106085177, 106042389, 106251548, 106595737, 107169644, 107944350, 108941906, 109844216, 110662781, 111390889, 111642132, 111521672, 111030428, 110019618, 108646715, 107607319, 106738179, 106050990, 105509242, 105102409, 104773140, 104290231, 103757382, 103601313, 103514134, 103236540, 103050336, 103004230, 103285771, 103743944, 104277420, 104932929, 105956525, 106929086, 107931344, 109133598, 110181833, 110829023, 111156811, 110848489, 109974613, 108560032, 107194421, 105934140, 104808762, 103827386, 102973093, 102098008, 101241331, 100441542, 99709624, 99101607, 98410979, 97936965, 97526827, 97326348, 97028546, 96757930, 96519340, 96408235, 96297114, 96315302, 96334537, 96166402, 96088832, 96296078, 96577616]
3768I6577616K54118K92761K00547L07989L05122K63691L55881L10839M22815
3759I9291379M38533J28045J00716K82921M07363L54100K13038M93051O65848
3750A02374994N99295N08250N92767P58150O45316N45578M54086N19365N95547
3741A07593348M40906L11295K64454J55485L523k24292l35199m07248n94862o61322
3731A06546088r50165j144276r48267j264017j338888j446114j482237j612684
3723I6359440j737157j894136k023682k197127k082756k184288k250404k134504
3715G9855386k034463k090969k002214j769070j794806j728918j803205j506854
3707F5124887j559153j481287j572939j300167j362086j252264j253733j220561
$$ y = [96577616, 96831734, 97124495, 97325042, 97633031, 97938153, 98201844, 98557725, 98868564, 99291379, 99729912, 99857957, 99958673, 100241594, 100648957, 101003057, 101216095, 101709146, 102374994, 102974289, 103482539, 104075306, 104833456, 105478772, 106024350, 106478436, 106997801, 107593348, 108034254, 108345549, 108610003, 108765488, 108769011, 108544719, 108209520, 107802272, 107207410, 106546088, 105595923, 104451647, 103503380, 102239363, 100900475, 99454361, 97972124, 96359440, 94622283, 92728147, 90704465, 88507338, 86424582, 84240294, 81989890, 79855386, 77820923, 75729954, 73727740, 71958670, 70163864, 68434946, 66631741, 65124887, 63565734, 62084447, 60511508, 59211341, 57849255, 56596991, 55343258, 54122697]
3699E4122697r44652r69690q71445r25434r58372p74012n54754p66887o35989
3690D6721462n32671n24426n33351o25568m59842l06378k57894k84122j62505
3681D3034705j73955q6045p9239r7539M3568J57096J15603J31337K10492L32147
3671D3588170L85283L56782M61741M34926M34758M88705K91932K45287J58207
3662D6845791J77454j50685k65482k62845l29954k78150l85476k87474m62233
3653D4600946m90304m93427n47184n30911p70727q80225r40232r62115q91049
3644C8094772r96414r95575r07007q53290r66864q91689o73496p15508o30045
3635C0464884n30372o31133m90507m25050l58222l89747l47640k75154k48316
$$ y = [54122697, 53178045, 52208355, 51336910, 50411476, 49453104, 48679092, 48124338, 47357451, 46721462, 46188791, 45664365, 45131014, 44505446, 44045604, 43739226, 43481332, 43197210, 43034705, 42860750, 42774705, 42695466, 42597927, 42641495, 42798591, 42914194, 43045531, 43256023, 43588170, 43973453, 44330235, 44791976, 45226902, 45661660, 46150365, 46442297, 46687584, 46845791, 47023245, 46872560, 46607078, 46344233, 46014279, 45736129, 45350653, 45063179, 44600946, 44110642, 43617215, 43070031, 42539120, 41768393, 40888168, 39947936, 38985821, 38094772, 37098358, 36102783, 35195776, 34342486, 33375622, 32483933, 31810437, 31094929, 30464884, 29934512, 29303379, 28812872, 28387822, 28029600, 27639853, 27292213, 27017059, 26768743]
3626B6768743j07240j73100j31296k71015n0472J8145k6743p9087q7636N9281
3616B5919580Q920N7763q417n7555J85776L0219n3155j00525J74675R941j88786
3605B5978436j04022m0187J48284K486j40787j19356P1924j4209L1264R0035l0173
3594B5873695P4121Q8400L5220K27386N7761J38619J30776K08227J61494L47905
3584B7343604K42181K56480J61644O4722P6829R6082K2264M0504J84283J69690
3574B8658283K17958P1304J02606K2905j68431j25346j85355j8461k1243m952
3564B8549268L1909N7636P1681L11450L22235K68403K15821K13280L67644K90044
3554C0699371J34798J75102j7172Q5773J39009K00504L88210K33368K62671M53253
$$ y = [26768743, 26661503, 26488403, 26357107, 26086092, 26035620, 26053765, 26027022, 25947935, 25860299, 25919580, 25928500, 25986263, 25977846, 25920291, 26106067, 26136286, 26083131, 25982606, 26157281, 26167222, 25978436, 25874414, 25834227, 25982511, 25984997, 25844210, 25724854, 25796778, 25782569, 25813833, 25903868, 25873695, 25947816, 26036216, 26071436, 26298822, 26356583, 26495202, 26625978, 26834205, 26995699, 27343604, 27585785, 27842265, 28003909, 28068631, 28145460, 28241542, 28263806, 28304310, 28488593, 28658283, 28876241, 28947545, 29050151, 29073056, 28904625, 28779279, 28593924, 28575463, 28554220, 28549268, 28581177, 28638813, 28710494, 29021944, 29344179, 29612582, 29828403, 30041683, 30409327, 30699371, 30834169, 31009271, 30992099, 31077872, 31216881, 31417385, 31805595, 32038963, 32301634, 32754887]
3544C2754887L79387J34083L00863K34977J9956O7677M51682M60675L79647M51178
3534C5635012O01529O69222O12997M44357N51998N47100N47183L87836M89460
3525D0486694N42931M65623M38447M94622N58507N76295O31275M99882P97786
3516D5492062P51795O97066Q94612Q50919R31871R30655J009819J072236J096417
3507E3727452J102975J093903J347796J469540J577378J734532J840302K227109
3499F6120987K032915K264481K454596K462730K679743K717125L040514L297246
3491H7070337L687757L982998M342147M798885N293717N770190N946879O057567
3483A26950477N940558N413801M440585L207541J747456K51553p31786j484130
$$ y = [32754887, 33134274, 33268357, 33569220, 33804197, 33824153, 33891830, 34343512, 34804187, 35183834, 35635012, 36236541, 36905763, 37518760, 37963117, 38515115, 39062215, 39609398, 39997234, 40486694, 41029625, 41495248, 41933695, 42428317, 42986824, 43563119, 44194394, 44694276, 45492062, 46243857, 46940923, 47835535, 48686454, 49618325, 50548980, 51558799, 52631035, 53727452, 54830427, 55924330, 57272126, 58741666, 60319044, 62053576, 63893878, 66120987, 68153902, 70418383, 72872979, 75335709, 78015452, 80732577, 83773091, 87070337, 90758094, 94741092, 99083239, 103882124, 109175841, 114946031, 120892910, 126950477, 132891035, 138304836, 142745421, 145952962, 147700418, 147951971, 147220185, 145736055]
3475A45736055j920424k287968k370923k457998k330261j920821j525024r82076
3467A29940560l95796L57554N45714O97349R44041Q27892K88451l39453j140550
3458A31725762j345917j106377m96380k38690o89920j433527k385264l532128
3450A20497559l772429l544491l351752k793211k496064k437286k219351k074736
3442I7808239j978984j501810r60004n19517k72244J80283L85078N37601M56796
3433I4135438p6827o03067j550632k076156j944475j410257j288799j404366j584999
3424H2195860k064872k188934k031001j915320j776642j795550j938781j670459
3416F6814301j651557j394772j200131j161606r22817m73656k57606L7993J92977
$$ y = [145736055, 143815631, 141527663, 139156740, 136698742, 134368481, 132447660, 130922636, 129940560, 129544764, 129902318, 130448032, 131145381, 132089422, 132917314, 133205765, 132866312, 131725762, 130379845, 129273468, 128777088, 128538398, 127848478, 126414951, 124029687, 120497559, 116725130, 113180639, 109828887, 107035676, 104539612, 102102326, 99882975, 97808239, 95829255, 94327445, 93367441, 92847924, 92575680, 92755963, 93141041, 93678642, 94135438, 94058611, 93455544, 91904912, 89828756, 87884281, 86474024, 85185225, 83780859, 82195860, 80130988, 77942054, 75911053, 73995733, 72219091, 70423541, 68484760, 66814301, 65162744, 63767972, 62567841, 61406235, 60483418, 60009762, 59752156, 59790149, 59983126]
3407E9983126M43591P72925P11403N03566K16637l80978p14280j210497j582201
3398E8743292j664334j479242j222135j181402r02114q21189p31320o41799m57899
3389D9641858m85204n76603m39328m53358l32237j37648J67475M04106N11538
3380D8300599O08734P41309P52191N23583L83004j04456n87640r34754j001366
3371D8681204j053440j144532j022183r55616q45507p64697q21321p57773p24938
3362D0591197o66628n91311n31198m39424l89362l21140k48839l23597k17418
3353C6862280k02054k52963k93649k03829L8247j2433j50459J449M2989Q7463
3343C5917041J86988J93528K07494K85152L92842K76630M25897M69932L78547
$$ y = [59983126, 60426717, 61199642, 61911045, 62414611, 62631248, 62250270, 61535990, 60325493, 58743292, 57078958, 55599716, 54377581, 53196179, 52294065, 51472876, 50741556, 50099757, 49641858, 49156654, 48580051, 48140723, 47687365, 47355128, 47217480, 47384955, 47789061, 48300599, 48909333, 49650642, 50402833, 50926416, 51309420, 51204964, 50617324, 49682570, 48681204, 47627764, 46483232, 45461049, 44505433, 43659926, 42895229, 42073908, 41316135, 40591197, 39924569, 39333258, 38802060, 38362636, 37973274, 37652134, 37403295, 37079698, 36862280, 36660226, 36407263, 36113614, 35909785, 35948032, 35935599, 35785140, 35786589, 35829578, 35917041, 36104029, 36297557, 36505051, 36790203, 37183045, 37459675, 37885572, 38355504, 38734051]
3334C8734051N90201Q71869R77272J355758J607081J626500J093082N80168K29854
3325D7665836L16332M18386N99642Q19196J148718J402790J731374K037771K442757
3316E8582802K889498L223518L649682L948539M556887N290978O113143P011492
3308I5266539Q841171J1785613J5060195J8828956K1892735K3000414K4735555
3301B19411178K5091011J7608239R090671j84790j4656939k1615356j9985344
3294B14758670j4794811j0416550r154747q393165p404733o815035o287753n265606
3286A46226270m313547l363490k286341n41626J123955L123418N432412Q694634
3278A54095685J2284999J6105579J8238472J9095642K1236370J9621008J1489615
$$ y = [38734051, 39324252, 40196121, 41173393, 42529151, 44136232, 45762732, 46855814, 47435982, 47665836, 47982168, 48400554, 49000196, 49819392, 50968110, 52370900, 54102274, 56140045, 58582802, 61472300, 64695818, 68345500, 72294039, 76850926, 82141904, 88255047, 95266539, 104107710, 115893323, 130953518, 149782474, 171675209, 194675623, 219411178, 244502189, 262110428, 271201099, 271016309, 256359370, 234744014, 214758670, 199963859, 189547309, 180392562, 171999397, 164594664, 157779629, 151491876, 146226270, 141912723, 138549233, 136262892, 135721266, 136845221, 139968639, 145401051, 154095685, 166380684, 182486263, 200724735, 219820377, 241056747, 260677755, 272167370]
3271B72167370M153683o968409j9788099k2935585j9956071j4729851j1643991
3264A80299047j1173252j0613150r732662r575223r109039q453016p791927p105673
3256A06745105n996242m995714m115991l597304l140834k656059k307665k037996
3248G7897300j566766j104281j106619j088529j250182j415623j921387k309217
3240F6134696k328555k361841k262741j972166j761391j688116j581703j369086
3232E0809097j369762j029744p82393p72334q86610m93188l56917k03536j13090
3223D4801523k5323R5557J85640L96662N70721M99191N05642L73647j47128m26645
3213D6829487j140304j223668j393330j328303j048737q28158q53098q16305o51910
$$ y = [272167370, 276321053, 269352644, 249564545, 226628960, 206672889, 191943038, 180299047, 169125795, 158512645, 148779983, 139204760, 130095721, 121642705, 113850778, 106745105, 100748863, 95753149, 91637158, 88039854, 84899020, 82242961, 79935296, 77897300, 76330534, 75226253, 74119634, 73031105, 71780923, 70365300, 68443913, 66134696, 63806141, 61444300, 59181559, 57209393, 55448002, 53759886, 52178183, 50809097, 49439335, 48409591, 47627198, 46854864, 45968254, 45475066, 45118149, 44914613, 44801523, 44776200, 44871757, 45057397, 45454059, 46024780, 46523971, 47029613, 47403260, 47256132, 46829487, 45689183, 44465515, 43072185, 41743882, 40695145, 39866987, 39013889, 38197584, 37545674]
3204C7545674o90735o53225p23047n98165o06989o99209n21956l25226k88539
3195C2438583j91604l25114k85429j59140j91641j90850k6026r6441j27918j57034
3185C0687386Q6387P1866M8682K43986J89147J36748J37432L62036L31790L17426
3175C2612886M23277M08813N22568N91523L03803L20915L39311M37085K08700
3166C6168881L16705L04704J16092K27746L54251K43164J93721J73405J51454
3157C8250123K87670M08781N37095L79376N12194N64698N00467O63522R17642
3148D3021568P43449Q78805Q97227J032285J355698J191282J298472J259067J146097
3139E2823950J056661Q56379P30943M22710J77116j87206n21561o61913m90054
$$ y = [37545674, 36854939, 36201714, 35478667, 34880502, 34273513, 33574304, 33052348, 32727122, 32438583, 32246979, 31921865, 31636436, 31477296, 31285655, 31094805, 31068779, 30972338, 30844420, 30687386, 30773773, 30845639, 30894321, 31138307, 31327454, 31464202, 31601634, 31963670, 32295460, 32612886, 33036163, 33444976, 33967544, 34559067, 34862870, 35183785, 35523096, 35960181, 36168881, 36485586, 36790290, 36906382, 37134128, 37488379, 37731543, 37925264, 38098669, 38250123, 38537793, 38946574, 39483669, 39863045, 40375239, 40939937, 41440404, 42103926, 43021568, 43765017, 44643822, 45541049, 46573334, 47929032, 49120314, 50418786, 51677853, 52823950, 53880611, 54736990, 55467933, 55890643, 56067759, 55880553, 55358992, 54697079, 54207025]
3130E4207025n68628m35734j96077l31375L193R355J86834K10082K18929M93005
3120E3796609O54622N61480N07104N11014N64139N77072L89535L00271J55145
3111E8016991J82543J9864k39997l98773n45807o11826q58673q73440r64577j074514
3101E2651791r13056r76105r09926r48215n59232o92740n55922l31086m18311
3092D6347198k89952k64151l02029k90109n18433o48037o92347q30654q17336
3083D1694150p32546q87333j021317j098223j055927j028356j127253j171693
3075C3571502q88817r16689r80359p74868n86605p02634p69790q00102o58123
3066B6493515n08540m04277o05903o24209m44873m72653l42123m56996n42903
$$ y = [54207025, 53638397, 53202663, 53006586, 52675211, 52678404, 52687759, 52874593, 53084675, 53303604, 53796609, 54451231, 55012711, 55519815, 56030829, 56594968, 57172040, 57561575, 57861846, 58016991, 58199534, 58219398, 57979401, 57580628, 57034821, 56422995, 55564322, 54690882, 53726305, 52651791, 51738735, 50762630, 49852704, 48904489, 48345257, 47652517, 47096595, 46765509, 46347198, 46057246, 45793095, 45491066, 45200957, 44682524, 44034487, 43342140, 42511486, 41694150, 40961604, 40074271, 39052954, 37954731, 36898804, 35870448, 34743195, 33571502, 32682685, 31765996, 30785637, 30010769, 29424164, 28721530, 27951740, 27151638, 26493515, 25984975, 25580698, 24974795, 24350586, 23905713, 23433060, 23090937, 22633941, 22091038]
3057B2091038m36124m05434l67064m47445n82038l58737k84110m24308n19977
3048A8265801m69828l16402k33195l57985k98175l25952k12529j98446l98969
3039A5454320k48228j84525k80881j08158k19643j29626j98911k18146k61346
3030A3604856j76941J351j59527k99983j34627l8631j96756j03019P8297q5370
3020A2489650j37423j17522J6770J04571N9318k18711j54737j3164q5146k81119
3010A1662487j13062j50609j54598k14818k60355j80005j58731q8313k02700j66267
3000I973029j8718k01402r6794j02561j20594M1446N0098q7216M5909r9079j35120
2989I248998O7738p8547N6568K4406j8507j15444j71765k26995k84558j48880
$$ y = [22091038, 21654914, 21249480, 20882416, 20434971, 19852933, 19494196, 19210086, 18785778, 18265801, 17795973, 17479571, 17246376, 16888391, 16590216, 16264264, 16051735, 15853289, 15454320, 15206092, 15021567, 14740686, 14632528, 14412885, 14283259, 14084348, 13866202, 13604856, 13427915, 13429266, 13269739, 12969756, 12835129, 12796498, 12599742, 12496723, 12575020, 12489650, 12352227, 12234705, 12251475, 12356046, 12415364, 12196653, 12041916, 12028752, 11943606, 11662487, 11549425, 11398816, 11244218, 11029400, 10769045, 10589040, 10430309, 10341996, 10139296, 9973029, 9954311, 9752909, 9656115, 9553554, 9432960, 9474406, 9524504, 9437288, 9483197, 9384118, 9248998, 9316736, 9238189, 9294757, 9319163, 9300656, 9185212, 9013447, 8786452, 8501894, 8353014]
2979H353014o6290j47129j09694j64102k1486p0477k35600j56290j05981q5125
2969G190840q4590p5850j01404j49679j9381J18433r4671k14480j07517q9959
2959F371742m3051Q38j16588o3399j19906o0452o04l6082r8581k3337n5647j17061
2947E637872q3702p5947N2516m0624P3918k9560N8890r3265r4460o8137p9437
2936E258064o9619l0340J6534k32881L8637r031j72743P128R4304O9170p8739
2925D890484m8061q0038r3190L4173k4638l2948k5692j84498M8042M9774q8204
2914D445204n074L0385K9815N1611q5554j27699j1741k3706j57818q0560k5444
2903D039419P668n4177O2407j13250j36538J5809O6325k1520o7308m1350q861
$$ y = [8353014, 8286724, 8139595, 8029901, 7865799, 7844313, 7773836, 7538236, 7381946, 7275965, 7190840, 7106250, 7030400, 6928996, 6779317, 6759936, 6878369, 6783698, 6569218, 6461701, 6371742, 6328691, 6329529, 6212941, 6149542, 6029636, 5969184, 5968580, 5932498, 5833917, 5810580, 5754933, 5637872, 5554170, 5478223, 5530739, 5490115, 5564033, 5534473, 5593363, 5500098, 5405638, 5337501, 5258064, 5188445, 5158105, 5174639, 4941758, 4980395, 4971364, 4798621, 4805749, 4900053, 4969223, 4890484, 4842423, 4762385, 4669195, 4703368, 4678730, 4645782, 4620090, 4435592, 4483634, 4533408, 4445204, 4440130, 4470515, 4500330, 4551941, 4466387, 4338688, 4326947, 4303241, 4145423, 4064863, 4039419, 4047087, 3992910, 4055317, 3942067, 3805529, 3821338, 3887663, 3866143, 3798835, 3757485, 3748624]
2892C748624j2560J3619K4713O730J1008m0664r3142O1560J8036O0908o5366j03834
2880C629632r1764k7156J15645K3718j30823j46501M70M9582j736r1360K0667
2869C350374j770M0770l1354M4291m8198m1556m1175k6251J59780k9097n6023
2858C319791m97j00692j00221N1694K1950n3686Q6104j01984j17096R3903M3876
2847C143142l4916j8463j63527J7574J5211m3561N6880K3256K6308R1997j761
2836C112140j27997n3941o4139L0788O7654O8215j07610q6020o4298K9893K1144
2825B825829l1617l5306J03237P4404j39685m4001o6091n0078K2447j32841M7650
2814B573948J16206p487l2526n2285j28988m7476J44142n7284N2567O648J44013
$$ y = [3748624, 3736064, 3749683, 3774396, 3781126, 3792134, 3751470, 3658328, 3719888, 3737924, 3798832, 3733466, 3629632, 3537868, 3510712, 3626357, 3650075, 3519252, 3372751, 3373221, 3422803, 3421067, 3329707, 3350374, 3348604, 3389374, 3358020, 3402311, 3354113, 3312557, 3271382, 3245131, 3404911, 3375814, 3319791, 3319294, 3218602, 3118381, 3170075, 3192025, 3138339, 3224443, 3122459, 3005363, 3099266, 3143142, 3108226, 3089763, 2926236, 2943810, 2959021, 2915460, 2972340, 2995596, 3021904, 3113901, 3112140, 2984143, 2930202, 2866063, 2896851, 2964505, 3032720, 2925110, 2839090, 2774792, 2804685, 2825829, 2794212, 2758906, 2862143, 2936547, 2796862, 2752861, 2686770, 2636692, 2659139, 2526298, 2573948, 2690154, 2682667, 2650141, 2597856, 2468868, 2421392, 2565534, 2508250, 2560817, 2567465, 2711478]
2803B711478k4011K9108j24231j68721p9156k6141j9331m482N7314O1215j55282
2792B257760j7204q3762J6600K5077k5622o8409J1863J13039j24177j04311K3266
2781B024120n2002Q7385j05178l3935R3628M6132j8599M2340r776j77411O5091
2770A961795O8580j68444K2997J08597k2333J2797j32616n9478J5637M6157P1852
2759A925541R9800q7902M2417j22073q5297O2546o184j5580n590k5003j00456
2748A682219k3218M6376k9547M720p7204l0375l095j06179J34876K4422q8286
2737A534709k3479R7255l342p0736J7852j47857K7231k1830O3862K5845o6273
2726A433237K3627o2832P863R5509m3765J00865j0453p1918k18064j8897J81274
$$ y = [2711478, 2687467, 2716575, 2592344, 2423623, 2344467, 2318326, 2298995, 2294513, 2351827, 2413042, 2257760, 2240556, 2156794, 2173394, 2198471, 2172849, 2104440, 2116303, 2229342, 2105165, 2000854, 2024120, 1972118, 2059503, 1954325, 1920390, 2014018, 2060150, 2041551, 2083891, 2074115, 1896704, 1961795, 2030375, 1861931, 1884928, 1993525, 1971192, 1983989, 1851373, 1791895, 1807532, 1853689, 1925541, 2025341, 1937439, 1979856, 1857783, 1772486, 1835032, 1828848, 1813268, 1807678, 1782675, 1682219, 1659001, 1705377, 1675830, 1680550, 1603346, 1572971, 1569876, 1463697, 1598573, 1622995, 1534709, 1511230, 1608485, 1605143, 1534407, 1552259, 1404402, 1431633, 1409803, 1473665, 1499510, 1433237, 1456864, 1394032, 1401895, 1497404, 1453639, 1554504, 1544051, 1472133, 1254069, 1235172, 1416446]
2715A416446k2840K3470O3294r3656n8614R076J1955M4111J00132j24426J6979
2704A385927j33221P4301l4398K974P3805Q6452o4121O9039R3211j25850j20334
2693A307785j06128l5384Q903J10061r0009k4435j1442j44382J13049n2558Q5801
2682A161261J09633j12502O6831l3974L2226k08006m8112M7034J0902P4093N5717
2671A155103K0905P1769j09623n8914j10746L4612J8536j9590J0898j566o9294
2660I42090J01408r5443m0531O3474m3982k6810m3776R6475m2713k2027Q4206
2649I72371q12j00418m264J0694O5313M5760K3845N1368o7929k1831n5656l2996
2637H85445k6568k3964k6010L129J6234K8901l0974l9463M8430K0949j13651m1715
$$ y = [1416446, 1393606, 1417076, 1480370, 1386714, 1328100, 1337176, 1349131, 1393242, 1493374, 1368948, 1385927, 1252706, 1327007, 1292609, 1295583, 1369388, 1455840, 1391719, 1460758, 1553969, 1428119, 1307785, 1201657, 1166273, 1175176, 1285237, 1195228, 1170793, 1159351, 1014969, 1128018, 1075460, 1161261, 1270894, 1158392, 1225223, 1191249, 1223475, 1015469, 967357, 1014391, 1025293, 1099386, 1155103, 1176008, 1247777, 1138154, 1079240, 968494, 1003106, 1021642, 1002052, 1012950, 1011384, 942090, 1043498, 948055, 907524, 970998, 927016, 900206, 856430, 952905, 910192, 888165, 972371, 971559, 871141, 866877, 877571, 942884, 988644, 1012489, 1063857, 995928, 974097, 918441, 885445, 858877, 834913, 808903, 812032, 828266, 857167, 826193, 786730, 835160, 856109, 742458, 700743]
2625G00743J11457K1683j42785L9386k3552J01443O2203j30001J22387K6662m6529
2614H43097J08536M884o5370N5246j88229K9917J92819o2718p5311k1701L7928
2603H59098J4259L4817j25215j07342L8912Q636j21279O5850Q6839o5912m3146
2592F45517p0435K095P0347J7521j07590k3482j4641J7222K8343j48052J07177
2581E24022P0460r4016P3446j22610j3786N9876J7603k2410K2904K0999k8635
2570E07853l1062N1580l0431l9454m09N1539j3326Q46m8318L6454k2425L3528
2558D96375j06130L7965J30282n1024r8924Q189N9269P1194J600q6592Q9506j95576
2546C56134J7724k339l5332M7251J00580r4537j7023L7239L4781o056O9596l9820
$$ y = [700743, 812200, 833883, 691098, 730484, 706932, 808375, 870578, 740577, 862964, 889626, 843097, 951633, 956517, 891147, 946393, 758164, 788081, 980900, 918182, 842871, 821170, 859098, 873357, 908174, 782959, 675617, 714529, 723165, 601886, 667736, 754575, 688663, 645517, 575082, 577177, 647524, 665045, 557455, 533973, 519332, 536554, 564897, 416845, 524022, 594482, 500466, 573912, 451302, 437516, 497392, 514995, 492585, 515489, 536488, 507853, 476791, 528371, 497940, 458486, 458077, 509616, 496290, 497136, 448818, 485272, 462847, 496375, 390245, 428210, 558492, 507468, 408544, 416733, 476002, 547196, 548796, 462204, 551710, 356134, 373858, 371519, 336187, 383438, 484018, 389481, 372458, 409697, 444478, 438422, 508018, 468198]
2534D68198L710p7906r4564N5220O2912J4805k3414M5687k4448l747r7091O939
2522C36301n9373K6555k3676n1917j8117j31115O9784M1116Q9965j2819j01816
2511A64888R3454R2580k5380J8620j06730J8669J57617n2848r2773N3870l0767
2500B91200l9802J20451Q4424m6978j08139R2069n4369j32065M9918Q8711j4063
2489C31357J4376Q7588j13518o1911k1566K9575Q3787j06806J29637k4889o3449
2478B84181N3046r9932K836M8993q7603J07354k3989j4344o8224J5283r427j4424
2466A93750O2549o104n6447r0130R4929J22768n6150P635N9643q0893p7948K2484
2454A96086N6234J89081j24498n4488O8070K114n0598j33801J20426j4420j8547
$$ y = [468198, 471908, 394002, 299438, 354658, 417570, 432375, 408961, 454648, 430200, 426453, 329362, 336301, 276928, 303483, 279807, 227890, 209773, 78658, 148442, 189558, 279523, 266704, 164888, 258342, 350922, 325542, 344162, 237432, 256101, 413718, 360870, 268097, 321967, 291200, 251398, 371849, 456273, 409295, 301156, 393225, 338856, 206791, 256709, 345420, 331357, 345733, 433321, 319803, 257892, 236326, 265901, 349688, 242882, 372519, 347630, 284181, 337227, 237295, 240131, 289124, 201521, 308875, 284886, 270542, 202318, 217601, 208174, 193750, 256299, 250195, 193748, 103618, 198547, 321315, 265165, 272800, 332443, 251550, 173602, 196086, 252320, 441401, 316903, 262415, 330485, 332599, 282001, 148200, 268626, 254206, 235659]
2443B35659L0750o4555m4421J02133j00981J8146J50153p2559p0773O357J48662
2432C38571L3667o313N2420j8050K709M4362J05903p9746p3690J08905L9363j20814
2420D27287K0931J27962J4325J371O209j51246q3660J41712N0786q1743p7771
2409C96163L800J19987j4884J1505k6885J22924J03854N9277o7973l7183n4530
2398F16055k1763R2334Q3765m563m1166L2842L8734P7336k1211l6572R7046k466
2386I10371L1571J68995N6800J49933q2988K3083j2742P5831Q1832J17491L6026
2375A556203P2519J18569J18249J96433J80678L60612J58380J7518L7236N9217
2365B875614K6087K4454J47678J83905J77531L04204K07230K48894M21357M30290
$$ y = [235659, 266409, 201854, 157433, 259566, 158585, 176731, 326884, 254325, 183552, 189909, 338571, 372238, 365925, 418345, 400295, 403004, 447366, 553269, 473523, 399833, 508738, 548101, 427287, 448218, 576180, 590505, 591876, 598085, 446839, 363179, 504891, 555677, 473934, 396163, 399963, 519950, 505066, 516571, 489686, 612610, 716464, 775741, 707768, 670585, 616055, 594292, 686626, 770391, 765828, 724662, 757504, 796238, 873574, 852363, 815791, 912837, 910371, 941942, 1110937, 1167737, 1317670, 1234682, 1257765, 1245023, 1320854, 1402686, 1520177, 1556203, 1628722, 1747291, 1865540, 2061973, 2242651, 2603263, 2761643, 2779161, 2816397, 2875614, 2901701, 2926155, 3073833, 3257738, 3435269, 3739473, 3946703, 4195597, 4616954, 5047244]
2355E047244N33790M99408N77079N15651N38121P72257Q79589R65784J517192
2346A1846115K262212K806425L451025L503569L468755L426131L902239K537266
2338C7203737J123017k196942m613418l665969k639183j910380k099335j927940
2330A9273587j713072j312307j294028j143426j107628j068268r69279o96055
2322I969524n76547o02710n75089n46496o14167m04144l50710k52327l96167l73759
2312E277408l18596j00879j70972l42132k75402j58899l0952o5720k51792l80748
2302C181316r3350m2312j4810j42281k37007j67650j15130r5586k0604k8110M6839
2291B271315j56361J6062j50740p2175J8408p5872j4657j57500m4100k7412r9421
$$ y = [5047244, 5581034, 6080442, 6657521, 7173172, 7711293, 8483550, 9363139, 10328923, 11846115, 14108327, 16914752, 20365777, 23869346, 27338101, 30764232, 34666471, 37203737, 38326754, 36129812, 31516394, 27850425, 25211242, 23300862, 21201527, 19273587, 17560515, 16248208, 14954180, 13810754, 12703126, 11634858, 10665579, 9969524, 9392977, 8790267, 8215178, 7668682, 7054515, 6650371, 6299661, 6047334, 5651167, 5277408, 4958812, 4857933, 4686961, 4344829, 4069427, 3910528, 3879576, 3813856, 3562064, 3181316, 3087966, 3045654, 3030844, 2888563, 2651556, 2483906, 2368776, 2273190, 2252586, 2224476, 2271315, 2114954, 2131016, 1980276, 1908101, 1926509, 1850637, 1835980, 1678480, 1634380, 1606968, 1507547]
2280A507547L2468p6909q6849n9936j57440M029L7445j8467k5097Q345M6949j76057
2268A036028q5478k5025j6639k348o5974Q7340J07101m3265r4753j2447j44006
2257G40534j366m040M9042r807o0049l723o9716R8936p6278l2223J27058m3635
2245G14733j34972k3607N0713k7782P6182p5518M0888m783Q2781q6860r5505o7751
2233D48519n211R2387P2507p65o7987M181N2242M675o7869j8222m2625j01430
2221C70402n6637M8039l0353J9722R4101M2702o2140N6140k1115Q0773j2952j08390
2209D20292j22086M7111K6393r9029P3390q0314N5762m1921L9399O5278J8926
2198D03201j25803r608O8219L3455J05079q9500m0013j20537q5896n8706O7538
$$ y = [1507547, 1540015, 1463106, 1376257, 1316321, 1158881, 1162910, 1200355, 1181888, 1156791, 1165136, 1212085, 1036028, 950550, 925525, 908886, 906538, 840564, 927904, 1035005, 991740, 896987, 884540, 740534, 739168, 735128, 784170, 774363, 714314, 710591, 640875, 739811, 663533, 631310, 758368, 714733, 579761, 556154, 606867, 579085, 655267, 579749, 620637, 615854, 698635, 611775, 516270, 448519, 443308, 535695, 608202, 607437, 539450, 543631, 595873, 600548, 532679, 514457, 471832, 370402, 313765, 361804, 331451, 351173, 445274, 487976, 425836, 481976, 460861, 541634, 528682, 420292, 298206, 345317, 371710, 272681, 346071, 265757, 321519, 279598, 318997, 384275, 403201, 277398, 267790, 336009, 369464, 474543, 385043, 345030, 224493, 138597, 79891, 147429]
2187A47429l0398J07687P7812r9680N8453j59100L2041J17700n4395q1936l4264
2176H1349L2539N5843J8928q3937k3723K6680L9154p3800J02959Q8525m4534m8915
2164A71068j14605R157j0371J8312o1025R6513Q5065j05695r1120J6114P4228
2153H7641n4312L5837N089j22196M556K25419O8097o5445n9237k1167l6005Q3577
2141A51854k3180m9805q2960J29757L1573j22925l3588J18181L0660j31593r3619
2130g5645L4333K334K839l2233L1991J02460M6131r4777k7437j59451j9967K06045
2118A6623n7400n4979R6527L4910j16909O9778L7177l1285j50449J68148n1726
2107c9585L8893m961k415R9516N003O5908p3309m703o2678n5547R57l7830J2183
$$ y = [147429, 117031, 224718, 302530, 202850, 261303, 102203, 134244, 251944, 197549, 115613, 81349, 113888, 169731, 188659, 104722, 80999, 107679, 146833, 73033, 175992, 264517, 219983, 171068, 56463, 65620, 55249, 73561, 12536, 109049, 194114, 88419, -2701, 13413, 87641, 33329, 69166, 74255, -47941, -43385, 182034, 250131, 184686, 125449, 104282, 68277, 151854, 128674, 78869, -4091, 125666, 157239, 34314, 726, 118907, 149567, 17974, -75645, -41312, -38978, -36139, -68372, -36381, 66079, 112210, 17433, -10004, -169455, -189422, 16623, -40777, -95756, 771, 35681, -81228, -11450, 25727, -5558, -156007, 12141, -39585, -692, -5653, -8068, 91448, 96451, 162359, 89050, 84347, 21669, -33878, -32921, -70751, -58568]
2094e8568n127r629L2841K8616P2225M2227j12699q7166K4088J9472k206n4706
2082a10632M8757P6049M2799r026M7655Q0586k53j13762m9057R3753J0753M4219
2070A61841q3737K3823l5600k6698Q7225m2380L6595q0372K4604m403m0049p1070
2058e0221n4098Q6888O3060P5277j15800l8780j17776O6018O8867J19938K9031
2047A32404j21842m98l9305n0573m0956M27l9852P0638k5748J7484J09573O2935
2035G4687j2068n4489j36454J28718P2582r0930k4476o0514M2194N773P989m3396
2023i0384q9951N2225j67820J51117K7431J39841j4634o7154Q6344j53598q3375
2012b09958j8216m7308K3246J53025m2521k7779q0756O9102L8866J0504j2368
$$ y = [-58568, -63695, -73324, -40483, -11867, 60358, 102585, -10114, -97280, -73192, -53720, -55926, -110632, -61875, 14174, 56973, 47947, 95602, 176188, 175935, 62173, 13116, 106869, 117622, 161841, 78104, 101927, 66327, 39629, 126854, 84474, 121069, 40697, 65301, 60898, 20849, -50221, -104319, -17431, 45629, 120906, 5106, -33674, -151450, -85432, -16565, 103373, 132404, 10562, 10064, -29241, -79814, -120770, -120343, -160195, -89557, -115305, -97821, 11752, 74687, 62619, 8130, -128324, 394, 72976, -17954, -42430, -102944, -60750, -54977, -46988, -90384, -180335, -128110, -295930, -144813, -117382, 22459, 7825, -59329, 27015, -126583, -209958, -228174, -275482, -252236, -99211, -141732, -169511, -250267, -181165, -142299, -131795, -144163]
2001a44163N0775o4332K0995M2682m8609n8376Q2333O8232j1009P8927O836l3487
1989i196n2120m0591n439j5607L5252O0288o4469k9267p9864j414K10235j05376
1977i7568p4800k6599Q922j19999M140J03357Q516R8531k0254j5611J4681N5685
1965f0999p3759M8376q1433N1957j811j59059K8111O1551J57400r5122J3844l745
1953a14689p159q6571Q960J0214q330j2814p4928K9487L8737O3717n1686k7522
1941b32584j05785K43344j7261j88552j4189P1755m297J8001M9343Q1140J27923
1930B8838k37425L1794k9233k8832J20053O0362J335J11120r4511j39092J25589
1919e0002j5820n8575j47660N8709L6024q8073N4573j5470k4621n0193R727m9559
$$ y = [-144163, -93388, -157720, -136725, -94043, -142652, -201028, -118695, -50463, -61472, 17455, 24291, -9196, -61316, -101907, -107346, -122953, -87701, -27413, -91882, -121149, -201013, -202427, 7808, -97568, -172368, -198967, -190045, -310044, -305904, -202547, -194031, -95500, -115754, -131365, -116684, -60999, -134758, -86382, -167815, -115858, -117669, -276728, -248617, -187066, -29666, -124788, -110944, -114689, -121848, -208419, -199459, -189245, -197575, -210389, -285317, -255830, -217093, -153376, -205062, -232584, -338369, -95025, -112286, -300838, -315027, -243272, -247569, -229568, -180225, -99085, 28838, -208587, -176793, -206026, -234858, -114805, -54443, -53108, 58012, -36499, -175591, -50002, -65822, -124397, -272057, -213348, -177324, -265397, -210824, -226294, -250915, -301108, -291381, -340940]
1907c40940j09896J22999L2121L4760M2618p448m6352K6649L4782M5244p6852
1896b42315Q0786L2370p2034P529o457r4969j447Q2780l4012J73752P9851n9355
1884e3521P235k2316k5735j02833j0476J17829P9914r5408m4794k2413l0894Q4245
1872a19167k7005n71J7980N036n8601M1534Q1242m7838p1178p1935o846J23437
1860a33912P5203q0031q6375m6591J07265l1996J4812j3873o8347j6896R5517
$$ y = [-340940, -450836, -327837, -295716, -260956, -218338, -225786, -272138, -245489, -210707, -165463, -242315, -161529, -129159, -201193, -193664, -200121, -295090, -296537, -213757, -247769, -74017, 5834, -53521, -46286, -68602, -94337, -197170, -207646, -89817, -9903, -105311, -150105, -172518, -203412, -119167, -146172, -146743, -128763, -123727, -182328, -140794, -59552, -107390, -178568, -250503, -257349, -133912, -58709, -138740, -225115, -271706, -164441, -196437, -181625, -195498, -263845, -280741, -185224]
$$ [...]
##END NTUPLES=NMR SPECTRUM
##END=
