##TITLE=1H_DE-80H_X3
 200.13MHz, d2o
 8 sc
 
 19ns.26.2.2025
##JCAMPDX= 6.0         $$ Bruker NMR JCAMP-DX V2.0
##DATA TYPE= NMR SPECTRUM
##DATA CLASS= NTUPLES
##ORIGIN= UXNMR, Bruker Analytische Messtechnik GmbH
##OWNER= pz
$$ XWIN-NMR		Version 3.5
$$ Tue Oct 14 15:08:05 2025 Russian Standard Time (UT+4h)  Yarkov@DPX200
##.OBSERVE FREQUENCY= 200.1313
##.OBSERVE NUCLEUS= ^1H
##.ACQUISITION MODE= SIMULTANEOUS
##.ACQUISITION SCHEME= undefined
##.AVERAGES= 8
##.DIGITISER RES= 18
##SPECTROMETER/DATA SYSTEM= spect
##.PULSE SEQUENCE= zg30
##.SOLVENT NAME= CDCl3
##.SHIFT REFERENCE= (INTERNAL, CDCl3, 0, 17.9549)
##AUDIT TRAIL= $$ (NUMBER, WHEN, WHO, WHERE, WHAT)
$$ ##TITLE= Audit trail, XWIN-NMR		Version 3.5
$$ ##JCAMPDX= 5.01
$$ ##ORIGIN= Bruker BioSpin GmbH
$$ ##OWNER= Yarkov
$$ C:/Bruker/XWIN-NMR/data/yarkov2/nmr/H-C/1/pdata/1/auditp.txt
$$ ##AUDIT TRAIL=  $$ (NUMBER, WHEN, WHO, WHERE, WHAT)
(   1,<2025-10-14 15:06:54.23 +0400>,<Yarkov>,<DPX200>,
      <created by zg, POWCHK disabled, PULCHK disabled
       configuration hash MD5:
       00 E9 B6 7A A2 85 ED C7 34 08 36 98 17 FE 4E 26
       data hash MD5: 16K
       59 5C 61 3F 7D 04 C3 90 A8 97 44 F1 32 5A 72 23>)
(   2,<2025-10-14 15:07:00.62 +0400>,<Yarkov>,<DPX200>,
      <Start of raw data processing
       efp BC_mod = 2 LB = 0.25 FT_mod = 6 PKNL = 1 PHC0 = -2644.588 PHC1 = 15.19097 SI = 16K 
       data hash MD5: 16K
       A2 EB 49 30 5D 1D 6A C4 72 F6 20 6A 71 43 8A B2>)
(   3,<2025-10-14 15:07:19.75 +0400>,<Yarkov>,<DPX200>,
      <pk PHC0 = -156.4 PHC1 = 0 
       data hash MD5: 16K
       44 F0 75 1D 62 BA 99 64 8A D1 12 E7 5A 27 51 68>)
(   4,<2025-10-14 15:07:24.10 +0400>,<Yarkov>,<DPX200>,
      <abs ABSG = 5 
       data hash MD5: 16K
       3A 92 E5 57 64 8D 78 9A 10 14 E4 36 10 6F A9 B6>)
$$ ##END=
$$ 
$$ hash MD5
$$ 75 CD FD CE DE 31 F1 09 71 99 70 45 57 D7 52 D2
##$RELAX= 
##$RELAX= 
##$RELAX= 
##$RELAX= 
##$RELAX= 
##$RELAX= 
$$ Bruker specific parameters
$$ --------------------------
##$DU= <C:/Bruker/XWIN-NMR>
##$EXPNO= 1
##$NAME= <H-C>
##$PROCNO= 1
##$TYPE= <nmr>
##$USER= <yarkov2>
##$AMP= (0..31)
100 100 100 100 100 100 100 100 100 100 100 100 100 100 100 100 100 100 
100 100 100 100 100 100 100 100 100 100 100 100 100 100 
##$AQSEQ= 0
##$AQ_mod= 1
##$AUNM= <au_zg>
##$AUTOPOS= <>
##$BF1= 200.13
##$BF2= 200.13
##$BF3= 200.13
##$BF4= 200.13
##$BF5= 200.13
##$BF6= 200.13
##$BF7= 200.13
##$BF8= 200.13
##$BYTORDA= 1
##$CFDGTYP= 0
##$CFRGTYP= 5
##$CHEMSTR= <none>
##$CNST= (0..31)
1 1 145 1 1 1 1 1 1 1 1 1 1 1 1 1 1 1 1 1 1 1 1 1 1 1 1 1 1 1 1 1 
##$CPDPRG= <>
##$CPDPRG1= <>
##$CPDPRG2= <>
##$CPDPRG3= <>
##$CPDPRG4= <mlev>
##$CPDPRG5= <mlev>
##$CPDPRG6= <mlev>
##$CPDPRG7= <mlev>
##$CPDPRG8= <mlev>
##$CPDPRGB= <>
##$CPDPRGT= <>
##$D= (0..31)
0 0.7 0 0 0 0 0 0 0 0 0 0.03 0 0 0 0 0 0 0 0 0 0 0 0 0 0 0 0 0 0 0 0 
##$DATE= 1760440013
##$DBL= (0..7)
120 120 120 120 120 120 120 120 
##$DBP= (0..7)
150 150 150 150 150 150 150 150 
##$DBP07= 0
##$DBPNAM0= <>
##$DBPNAM1= <>
##$DBPNAM2= <>
$$ [...]
##$SUBNAM3= <"">
##$SUBNAM4= <"">
##$SUBNAM5= <"">
##$SUBNAM6= <"">
##$SUBNAM7= <"">
##$SUBNAM8= <"">
##$SUBNAM9= <"">
##$SW= 18.0517328524113
##$SWIBOX= (0..15)
0 0 2 0 0 0 0 0 0 0 0 0 0 0 0 0 
##$SW_h= 3612.71676300578
##$TD= 16384
##$TD0= 1
##$TE= 0
##$TE2= 300
##$TE3= 300
##$TEG= 300
##$TL= (0..7)
0 120 120 120 120 120 120 120 
##$TP= (0..7)
150 150 150 150 150 150 150 150 
##$TP07= 0
##$TPNAME0= <>
##$TPNAME1= <>
##$TPNAME2= <>
##$TPNAME3= <>
##$TPNAME4= <>
##$TPNAME5= <>
##$TPNAME6= <>
##$TPNAME7= <>
##$TPOAL= (0..7)
0.5 0.5 0.5 0.5 0.5 0.5 0.5 0.5 
##$TPOFFS= (0..7)
0 0 0 0 0 0 0 0 
##$TUNHIN= 0
##$TUNHOUT= 0
##$TUNXOUT= 0
##$USERA1= <user>
##$USERA2= <user>
##$USERA3= <user>
##$USERA4= <user>
##$USERA5= <user>
##$V9= 5
##$VALIST= <valist>
##$VCLIST= <CCCCCCCCCCCCCCC>
##$VD= 0
##$VDLIST= <DDDDDDDDDDDDDDD>
##$VPLIST= <PPPPPPPPPPPPPPP>
##$VTLIST= <TTTTTTTTTTTTTTT>
##$WBST= 1024
##$WBSW= 4
##$XGAIN= (0..3)
0 0 0 0 
##$XL= 0
##$YL= 0
##$YMAX_a= 718849
##$YMIN_a= -582436
##$ZGOPTNS= <>
##$ZL1= 120
##$ZL2= 120
##$ZL3= 120
##$ZL4= 120
##$ABSF1= 12.82268
##$ABSF2= -5.229121
##$ABSG= 5
##$ABSL= 3
##$ALPHA= 0
##$AQORDER= 0
##$ASSFAC= 0
##$ASSFACI= 0
##$ASSFACX= 0
##$ASSWID= 0
##$AUNMP= <proc_1d>
##$AZFE= 0.1
##$AZFW= 0.1
##$BCFW= 0
##$BC_mod= 2
##$BYTORDP= 0
##$COROFFS= 0
##$CY= -3
##$DATMOD= 1
##$DC= 0
##$DFILT= <>
##$DTYPP= 0
##$F1P= 0
##$F2P= 0
##$FCOR= 1
##$FTSIZE= 16384
##$FT_mod= 6
##$GAMMA= 0
##$GB= 0
##$INTBC= 1
##$INTSCL= 3.241238e-09
##$ISEN= 128
##$LB= 0.25
##$LEV0= 0
##$LPBIN= 0
##$MAXI= 10000
##$MC2= 0
##$MEAN= 0
##$ME_mod= 0
##$MI= 1.114404
##$NCOEF= 0
##$NC_proc= -6
##$NLEV= 6
##$NOISF1= 3.799351
##$NOISF2= 2.8
##$NSP= 0
##$NTH_PI= 0
##$NZP= 0
##$OFFSET= 17.95494
##$PC= 1
##$PHC0= -2800.988
##$PHC1= 15.19097
##$PH_mod= 1
##$PKNL= yes
##$PPARMOD= 0
##$PSCAL= 0
##$PSIGN= 0
##$REVERSE= no
##$SF= 200.12951304581
##$SI= 16384
##$SIGF1= 3
##$SIGF2= 2
##$SINO= 0.751879
##$SIOLD= 32768
##$SREGLST= <19F.Aceton>
##$SSB= 0
##$STSI= 16384
##$STSR= 0
##$SW_p= 3612.71676300578
##$SYMM= 0
##$S_DEV= 0
##$TDeff= 16384
##$TDoff= 0
##$TI= <>
##$TILT= no
##$TM1= 0
##$TM2= 0
##$TOPLEV= 0
##$USERP1= <user>
##$USERP2= <user>
##$USERP3= <user>
##$USERP4= <user>
##$USERP5= <user>
##$WDW= 1
##$XDIM= 16384
##$YMAX_p= 491594885
##$YMIN_p= -675012
$$ End of Bruker specific parameters
$$ ---------------------------------
##NTUPLES= NMR SPECTRUM
##VAR_NAME=  FREQUENCY,     SPECTRUM/REAL,   SPECTRUM/IMAG
##SYMBOL=    X,             R,               I
##VAR_TYPE=  INDEPENDENT,   DEPENDENT,       DEPENDENT
##VAR_FORM=  AFFN,          ASDF,            ASDF
##VAR_DIM=   16384,         16384,           16384
##UNITS=     HZ,            ARBITRARY UNITS, ARBITRARY UNITS
##FACTOR=    0.220516191357247, 1,           1
##FIRST=     3593.3135582495, 0,             0
##LAST=      -19.4032047562778, 0,           0
##MIN=       -19.4032047562778, -675012,     0
##MAX=       3593.3135582495, 491594885,     0
$$ Real data points
##PAGE= N=1
##DATA TABLE= (X++(R..R)), XYDATA
$$ [...]
4221B724129R229O9117J29505N8811M3259m1250k4685l916k3061O5535m4650r4530
4209B867493m258j6118r3790j05829r6132o2673j2551o6768r6197r6146j6520
4198B200511L6973j15279J0176o9097j5727n5312J0351M6471k8333o5200o1874
4187A893660m515l3445j7699m2420P5518l9811p1298K8767M9643J650n6341L515
4175A787224L0553m604j7794n2758n695L2912J4550k2715p1464n0011j7771J7572
4163A639999k6696K0390R392l819J0427K0616K1175n2318J0648n6025j139P3991
4151A666641J6267l1583k8161N1570k8995m8696k5247L1649O6109L2956J5638
4140A718148r466k4378N1205M3461M0423M2048p5317m1053N9351L5445m7933K6940
$$ plain form
4221 2724129 2733358 2802475 2931980 2990791 3034050 2992800 2968115 2964199 2941138 3006673 2962023 2867493
4209 2867493 2863235 2847117 2753327 2647498 2551366 2488693 2476142 2409374 2313177 2217031 2200511
4198 2200511 2237484 2122205 2132381 2063284 2047557 1992245 2002596 2049067 2020734 1955534 1893660
4187 1893660 1889145 1855700 1838001 1795581 1871099 1831288 1759990 1788757 1838400 1840050 1783709 1787224
4175 1787224 1817777 1813173 1795379 1742621 1736926 1769838 1784388 1761673 1690209 1640198 1622427 1639999
4163 1639999 1613303 1633693 1643085 1639266 1649693 1670309 1691484 1639166 1649814 1593789 1592650 1666641
4151 1666641 1682908 1651325 1623164 1674734 1645739 1597043 1571796 1603445 1669554 1702510 1718148
4140 1718148 1708682 1684304 1735509 1778970 1819393 1861441 1786124 1745071 1804422 1839867 1791934 1818874
4128A818874L1539n7068l8896M4067o2246J7547M054N308M5602K5431K496K0079
4116A856787N8523J2279L4766J0651n4838N059J0208L9788N024J3959o268M74
4104A986412j6279J9407Q4218M374m1342j3838l4344J4299P2888j8449j5840L7599
4092B079105n641O1873j3025K5184J01859P898O1562N3385J4570M1653L7878K9057
4080B495358O043J3074L6590m484M7694M5492P0949M0548m7104R403L6510M9768
4068B799841M0210n1424J5275O8771o5143m73M8476k8912K9251O0144K1534K5960
4056B963510O1260L0230k3766M6170L2219N9704J8561K0637O160l4459Q7732j9137
4044C248821J7851K3183m549M8508n7954k2683J6077l1164L9698M8378K1741j9039
$$ plain form
4128 1818874 1850413 1793345 1754449 1798516 1736270 1753817 1757871 1763179 1808781 1834212 1836708 1856787
4116 1856787 1915310 1927589 1962355 1973006 1918168 1923227 1933435 1973223 1978247 1992206 1985938 1986412
4104 1986412 1970133 1989540 2073758 2078132 2036790 2022952 1988608 2002907 2075795 2057346 2041506 2079105
4092 2079105 2073464 2135337 2122312 2147496 2249355 2257253 2318815 2372200 2386770 2428423 2466301 2495358
4080 2495358 2501401 2514475 2551065 2546581 2594275 2639767 2710716 2751264 2704160 2713563 2750073 2799841
4068 2799841 2840051 2788627 2803902 2872673 2807530 2807057 2855533 2826621 2855872 2916016 2937550 2963510
4056 2963510 3024770 3055000 3031234 3077404 3109623 3169327 3187888 3208525 3214685 3180226 3267958 3248821
4044 3248821 3266672 3289855 3285306 3333814 3275860 3253177 3269254 3238090 3277788 3326166 3347907 3328868
4032C328868J4747n3055r639o491J6883N0246N445j832k1046o3339m1594o241
4020C212952P894l8231j0313j1622l3108k7385k1643K1127L7469n0835l6982k4332
4008C024991P6958O1948n6204J1252P5153l636N644N8986L8048N8540P3324O9399
3996C494403P3723M2879P4850O7727R5305P3964R6324L1480k4519N4539K8664
3985D109339L8980N5880K1511j9732Q4403l4867M0822J6965N9488P177J15853
3974D495819K6957J08119R9667M9893K11356N4614J26278O3186J5984O9875O7340
3963E389088K0407O4319N5882L5456k5133k6753J1619l6585m3963N190l3072j01558
3951E314897r411P5205l6742o6334n366P605L748j9229L2099J7776N0229N8205
$$ plain form
4032 3328868 3343615 3290560 3280921 3274430 3291313 3341559 3347004 3345172 3324126 3260787 3219193 3212952
4020 3212952 3220846 3182615 3172302 3160680 3127572 3100187 3078544 3099671 3137140 3086305 3049323 3024991
4008 3024991 3101949 3163897 3107693 3118945 3194098 3190462 3196106 3255092 3293140 3351680 3425004 3494403
3996 3494403 3568126 3611005 3685855 3753582 3848887 3922851 4019175 4050655 4026136 4080675 4109339
3985 4109339 4148319 4204199 4225710 4205978 4290381 4255514 4296336 4313301 4372789 4379966 4495819
3974 4495819 4522776 4630895 4730562 4780455 4991811 5046425 5172703 5235889 5251873 5321748 5389088
3963 5389088 5409495 5473814 5529696 5565152 5540019 5513266 5524885 5488300 5444337 5449527 5416455 5314897
3951 5314897 5305486 5380691 5343949 5277615 5272249 5279854 5283602 5264373 5296472 5314248 5364477 5422682
3939E422682j0766Q3000j479O1411J16090L0771R0066J25012J0823O9155J29944
3928F126709P2032J35930Q4660O2925J36609J15893M3914P2511R9753L2428Q7091
3917G070455K7514O7302J11164j0342P3103L3580j3082M1264M5469L5628p724
3906G474331P719L5723l647N7600P082k0550Q6047J03055O2740j0117J395P7100
3894G878478O7070J9555M8757P7805K0770O5207P5732K9056J4100N143K9221K6750
3882H357644M3024M7675Q7961k9239p0934j9141n0883Q208q0324k4820l8125n2385
3870H178661m9424k3513L8667J6357k2825L1573K3230J3799K3941J47934Q5996
3859H464396R3104J32711J67195J47079J27357J38528J25036J45800J90671J45444
$$ plain form
3939 5422682 5411916 5494916 5493437 5554848 5670938 5701709 5791775 5916787 5927610 5996765 6126709
3928 6126709 6198741 6334671 6419331 6482256 6618865 6734758 6778672 6851183 6950936 6983364 7070455
3917 7070455 7097969 7165271 7276435 7266093 7339196 7372776 7359694 7400958 7446427 7482055 7474331
3906 7474331 7482050 7517773 7514126 7571726 7578808 7558258 7644305 7747360 7810100 7799983 7801378 7878478
3894 7878478 7945548 7965103 8013860 8091665 8112435 8177642 8253374 8282430 8296530 8301673 8330894 8357644
3882 8357644 8400668 8448343 8536304 8507065 8436131 8416990 8366107 8374315 8293991 8269171 8231046 8178661
3870 8178661 8129237 8105724 8144391 8160748 8137923 8169496 8192726 8206525 8230466 8378400 8464396
3859 8464396 8557500 8690211 8857406 9004485 9131842 9270370 9395406 9541206 9731877 9877321
3849I877321R8797J04529M1864P4779R5750J43378J64693K37799J93148J58126
3839A1190184K34680K87457J97321L36477L13097L02390N07805M49247M33482
3830A4252140N57937M73323N05928N82569O07326O02713O44241O05968N74285
3821A9406430N38366O03831O79322P54479P18781Q41643R04709R58164J137525
3812B6543250J186396J318175J403879J591556J804715K002774K242988K441986
3804D0535719K723615K855887K945958K906582K716413K426497J965246J611560
3796F0687477R27952L01266q4500n37959p61439q37218q01648o78903n57438k30116
3786E7427474q8738L1860J91271M29976N90071O99726R47840J237020J440217
$$ plain form
3849 9877321 9976118 10080647 10122511 10197290 10293040 10436418 10601111 10838910 11032058 11190184
3839 11190184 11424864 11712321 11909642 12246119 12559216 12861606 13369411 13818658 14252140
3830 14252140 14810077 15283400 15789328 16371897 16979223 17581936 18226177 18832145 19406430
3821 19406430 19944796 20548627 21227949 21982428 22701209 23542852 24447561 25405725 26543250
3812 26543250 27729646 29047821 30451700 32043256 33847971 35850745 38093733 40535719
3804 40535719 43259334 46115221 49061179 51967761 54684174 57110671 59075917 60687477
3796 60687477 61615429 61916695 61832195 61294236 60532797 59695579 58893931 58215028 57657590 57427474
3786 57427474 57338736 57370596 57561867 57991843 58581914 59281640 60229480 61466500 62906717
3777F2906717J779002K259097K747603L240867L763137M244837M485135M677463
3769I0103858M547443M070490L543073K564297J466960L10913r79445k107610
3761A03519979l048021l603363l933914l861320l573382l460247l120103k897814
3753G6021815k652933k422911k369885k163735j970080j843888j505972j228839
3745E9863572r66191n14486q6967M15877O86131J016946J190727J273685J221777
3736F4101071J062309P14179L82878j34134p54479j413155j958134k370104k681590
3727E6948841k820681k723440k658542k535617k397302k293977k182101k125862
3719C7211319j994394j879161j784846j792856j539560j390809j274283j172953
$$ plain form
3777 62906717 64685719 66944816 69692419 72933286 76696423 80941260 85426395 90103858
3769 90103858 94651301 98721791 102264864 104829161 106296121 106607034 105627589 103519979
3761 103519979 100471958 96868595 92934681 89073361 85499979 82039732 78919629 76021815
3753 76021815 73368882 70945971 68576086 66412351 64442271 62598383 61092411 59863572
3745 59863572 58897381 58382895 58295928 58711805 59397936 60414882 61605609 62879294 64101071
3736 64101071 65163380 65877559 66260437 66126303 65371824 63958669 62000535 59630431 56948841
3727 56948841 54128160 51404720 48746178 46210561 43813259 41519282 39337181 37211319
3719 37211319 35216925 33337764 31552918 29760062 28220502 26829693 25555410 24382457
3711B4382457j075675q40985q42926p94628p32858p48767o64334o61919n58471
3702A7461894o08280n85357n61383n10931m41448m33285m04569l43365l86412
3693A3186864l54295l24057k80859l01657k46185k22355k09743j06729j93704
3684A0947280k98486k07274j44709j48059j05150r1303k25092k30404k19675j13849
3674I163279j39671k01633j07117j46054j05008r8772j18736q9302p0172j08453
3664G978361j42051j34983M593n5811m7602j6108J8207m4510j8108L983p0167
3653G475804J0840n3905n800j7317j21480l5288o4964o0407j2710j21054o607
3642F987112n7919q7940l6970n3809j1619j3429k6641m9868J2052n2814m2355
$$ plain form
3711 24382457 23306782 22465797 21622871 20828243 20095385 19346618 18682284 18020365 17461894
3702 17461894 16853614 16268257 15706874 15195943 14754495 14321210 13916641 13573276 13186864
3693 13186864 12832569 12508512 12227653 11925996 11679811 11457456 11247713 11140984 10947280
3684 10947280 10648794 10441520 10296811 10148752 10043602 9952299 9727207 9496803 9277128 9163279
3674 9163279 9023608 8821975 8714858 8568804 8463796 8365024 8246288 8156986 8086814 7978361
3664 7978361 7836310 7701327 7705920 7650109 7602507 7586399 7604606 7560096 7541988 7545971 7475804
3653 7475804 7486644 7432739 7426939 7409622 7288142 7252854 7187890 7127483 7114773 6993719 6987112
3642 6987112 6929193 6841253 6804283 6750474 6738855 6725426 6698785 6648917 6660969 6608155 6565800
3631F565800r8303q2427l9637l2707q6037n9217j4230k6824j29632r265J8737
3620F006258o9824j04154j8001J3690l9225l6975l4405j31502l2952j1862o0720
3609E480328j1964o4075l5942p2504m5850n8263k5841k5089l7047j08932m123
3598D990698L8656J9927n9580q6182p0774o4840m804M5814p2726p1707k970P658
3586D669170j09538q6826K3718l5904j9845l187j5983P957l9669m1695m0393J3879
3574D321684o4737j5244o8705p6835j4298K2827N7108l8444j4966k6240j66624
3563C915526m9620P4277m920k2791j1848K6134j44145j201j5903l376R4025p2881
3551C783277M4473M5278o0046k8596m2461r261J075N2673j8390o2939M9832L483
$$ plain form
3631 6565800 6467497 6385070 6345433 6312726 6226689 6167472 6153242 6126418 5996786 5987521 6006258
3620 6006258 5936434 5832280 5814279 5827969 5788744 5751769 5717364 5585862 5552910 5541048 5480328
3609 5480328 5468364 5404289 5368347 5295843 5249993 5191730 5165889 5140800 5103753 4994821 4990698
3598 4990698 5029354 5049281 4989701 4903519 4832745 4767905 4763101 4808915 4736189 4664482 4661512 4669170
3586 4669170 4559632 4472806 4496524 4460620 4440775 4437588 4421605 4429562 4389893 4348198 4307805 4321684
3574 4321684 4256947 4241703 4172998 4096163 4081865 4104692 4161800 4123356 4108390 4082150 3915526
3563 3915526 3865906 3940183 3935263 3912472 3900624 3926758 3782613 3781412 3765509 3762133 3856158 3783277
3551 3783277 3827750 3873028 3812982 3784386 3741925 3732664 3733739 3786412 3768022 3705083 3754915 3758398
3539C758398k1853N4888l8381M1643M3487L5224n3276j9592m5722p060k0837K7042
3527C753961N8063K565k092j71M9309O8869m581J9534J3289o0078K4370l7K4094
3514C947095J156L0138M3548M7321n0940n8048O6027M4838M8211j3669n4592N5546
3502D106631O2081P4545J774j5495R043K2568N6855O7109P3433L1133l2398O4374
3490D521653M2742L6501q639O5959O133M575J13623N1238K2042P8676j3132L0914
3478D952285M4024M2719R5127p78N7147j5277R8965J07114J5055m45J6827O5807
3466E478570m195K8254N9271O5034M3675O3368k7760M5950J09871M8273Q0225
3455E990536J09377J32111N4654K1641M6683K09648M5481N8533J16818J02864
$$ plain form
3539 3758398 3736545 3791433 3753052 3794695 3838182 3873406 3820130 3800538 3754816 3747756 3726919 3753961
3527 3753961 3812024 3814589 3812497 3812326 3861635 3930504 3925923 3945457 3958746 3898668 3923038 3923001 3947095
3514 3947095 3948251 3978389 4021937 4069258 4018318 3960270 4026297 4071135 4119346 4105677 4051085 4106631
3502 4106631 4168712 4243257 4245031 4229536 4238579 4261147 4318002 4385111 4458544 4489677 4457279 4521653
3490 4521653 4564395 4600896 4592257 4658216 4664349 4668924 4782547 4833785 4855827 4934503 4921371 4952285
3478 4952285 4996309 5039028 5134155 5133377 5190524 5175247 5274212 5381326 5396381 5395936 5412763 5478570
3466 5478570 5474375 5502629 5561900 5626934 5670609 5733977 5706217 5752167 5862038 5910311 5990536
3455 5990536 6099913 6232024 6286678 6308319 6355002 6564650 6610131 6668664 6785482 6888346
3445F888346Q4771L4125q979P0502N4054N4387K9267P7291P4371K3488L0310R8792
3433G510725O4457R8248k427M2888K22990N4517R4797R0074K15231J57644J88222
3422H737366J56348J62502J45733J66357K33304K20920K65192J31934J98082K26373
3412A0644111J63441K18530J32048J46002J68984J76478J88090K35502K62355
3403A2335541K55307K78054L08258L83871L19582L85506M38892M30758M19118
3394A5554887M21151N47778O05254N95705O30921P92704P72517P50825Q59137
3385B1530879R95196R82519J102379J209479J218385J392100J539029J659326
3377C1629292J846637J889913K114753K223913K370058K620166K833429L015245
$$ plain form
3445 6888346 6973117 7007242 6998263 7068765 7122819 7177206 7206473 7283764 7358135 7381623 7411933 7510725
3433 7510725 7575182 7673430 7671003 7713891 7936881 7991398 8086195 8176269 8391500 8549144 8737366
3422 8737366 8893714 9056216 9201949 9368306 9601610 9822530 10087722 10219656 10417738 10644111
3412 10644111 10807552 11026082 11158130 11304132 11473116 11649594 11837684 12073186 12335541
3403 12335541 12590848 12868902 13177160 13561031 13880613 14266119 14705011 15135769 15554887
3394 15554887 15976038 16523816 17129070 17724775 18355696 19148400 19920917 20671742 21530879
3385 21530879 22526075 23508594 24610973 25820452 27038837 28430937 29969966 31629292
3377 31629292 33475929 35365842 37480595 39704508 42074566 44694732 47528161 50543406
3369E0543406L273787L506900L830350M107704M482752M943949N483180O134861
3361H6306889O673543P318317P763183Q404248Q801312R183255R275331Q942581
3353A52668659Q480143P662638O495799N196508L602940J905275q0638j904570
3345A84026754l530036n035254o003416o621246p062821p270469p552290p634982
3337A33316240p570313p423605p184474o967892o602184o274891n815746n378007
3329H0099128n083649m697981m226886l878098l571652l269913k998232k734970
3321D9637747k547078k367950k087895j993572j925715j846729j682844j638687
3313C3547277j530776j483174j471761j288965j222275j122519j048832j079528
$$ plain form
3369 50543406 53817193 57324093 61154443 65262147 69744899 74688848 80172028 86306889
3361 86306889 92980432 100298749 108061932 116466180 125267492 134450747 143726078 152668659
3353 152668659 161148802 168811440 175307239 180503747 184106687 186011962 185931324 184026754
3345 184026754 180496718 175461464 169458048 162836802 155773981 148503512 140951222 133316240
3337 133316240 125745927 118322322 111137848 104169956 97567772 91292881 85477135 80099128
3329 80099128 75015479 70317498 66090612 62212514 58640862 55370949 52372717 49637747
3321 49637747 47090669 44722719 42634824 40641252 38715537 36868808 35185964 33547277
3313 33547277 32016501 30533327 29061566 27772601 26550326 25427807 24378975 23299447
3305B3299447r92351q97676q24536q32718q16919o97788p09843o66582n88043
3296A6272991n03726m93699n32813m73408n02547m51457m13157m01384l26949
3287A2173851k75601l12412l03589l23186l05306k35074k39612k84824k02830
3278I691417j52317k36024k04890k47580j10583j64345j44703j75279j33570j29833
3268G992293j24924j04999j85364j19619n9074j14531r3267j47163j86542j37880
3258F718930o4081k2196j23650k9515j05916o5684l5214n3910m6565n6692J1482
3247F126989o1641r5432j7370n1497o4133m2666p9502j5387j17035n6913p7339
3236E448074m1712K0262j27193j7427k6255l3254l8876p6265m1486l98k939L1785
$$ plain form
3305 23299447 22307096 21409420 20584884 19752166 18935247 18237459 17527616 16861034 16272991
3296 16272991 15769265 15275566 14742753 14269345 13766798 13315341 12902184 12500800 12173851
3287 12173851 11898250 11585838 11282249 10959063 10653757 10418683 10179071 9894247 9691417
3278 9691417 9539100 9303076 9098186 8850606 8740023 8575678 8430975 8255696 8122126 7992293
3268 7992293 7867369 7762370 7577006 7457387 7398313 7283782 7190515 7043352 6856810 6718930
3258 6718930 6654849 6632653 6509003 6479488 6373572 6307888 6272674 6218764 6172199 6115507 6126989
3247 6126989 6065348 5969916 5952546 5901049 5836916 5794250 5714748 5699361 5582326 5525413 5448074
3236 5448074 5406362 5426624 5299431 5282004 5255749 5222495 5183619 5107354 5065868 5065470 5062531 5094316
3224E094316J6024j05809N1508R2745N458M7807l150O8441n2737m3319n7374p1551
3212E042359r6178q3740p1047n8540r3852n8382j02889l0088l9647k7609m3607
3201D336780j7203L6503q0578J6918K5769K8929M9374Q7629K9503M5462M204O6363
3189D629653M5004m5044L398j21176p9763j10178k8293j1805o2339l4524o8612
3178D116321o1134m7339K0739l3646o0412m3625L2155o9426n8075j4832P370M9881
3166C837977J01444R9080M1441n120m699l7307k2626m0354L0736m526k8478r2549
3154C875019j2440n8986q9796l5793K4309p1031q2509O6927p847O1321l4586l1750
3142C602838o891K8219N1678M7549r930K0553P6975Q6064J1364K1555J19550k0826
$$ plain form
3224 5094316 5110340 5004531 5056039 5148784 5154242 5202049 5198899 5267340 5214603 5171284 5113910 5042359
3212 5042359 4946181 4862441 4791394 4732854 4639002 4580620 4477731 4447643 4407996 4380387 4336780
3201 4336780 4319577 4356080 4275502 4292420 4318189 4347118 4396492 4484121 4513624 4559086 4563290 4629653
3189 4629653 4674657 4629613 4633011 4511835 4432072 4321894 4293601 4281796 4219457 4184933 4116321
3178 4116321 4055187 4007848 4028587 3994941 3934529 3890904 3923059 3853633 3795558 3780726 3788096 3837977
3166 3837977 3939421 4038501 4079942 4074822 4070123 4032816 4010190 3969836 4000572 3996046 3967568 3875019
3154 3875019 3862579 3803593 3713797 3678004 3702313 3631282 3548773 3615700 3607853 3669174 3634588 3602838
3142 3602838 3595947 3624166 3675844 3723393 3713463 3734016 3810991 3897055 3908419 3929974 4049524 4028698
3130D028698J5544k1755j7318J03444J13896J23907J94287J47627J57127J83926
3120E029383J62506J85764K06612K6830m4650m6773j69648j29165j48166j18508
3110D954185j61808j06532j26952p7643r0805j74870j09330r1741n1508q6368
3100C876628q9290n856j14316r2908l8805q9785m1450n0918j14441n3760L2217
3089C217316n5113K3266O2713m8716k9646j8857k2086K4858k6930o056J1971P655
3077C140375P656j7724J39j4233r914M0291r0572m346L2318J7118R9092J1022
3065C211222M229m0578N7014P327j7365N7545K9285R0210Q7345o7463K9147J25818
3053C573736R8414J7405l6018O8160Q8715R877P1847j6024K9419M3167M455Q165
$$ plain form
3130 4028698 4044242 4022487 4005169 4108613 4222509 4346416 4540703 4688330 4845457 5029383
3120 5029383 5191889 5377653 5584265 5611095 5566445 5519672 5350024 5220859 5072693 4954185
3110 4954185 4792377 4685845 4558893 4481250 4390445 4215575 4106245 4014504 3962996 3876628
3100 3876628 3787338 3781482 3667166 3574258 3535453 3445668 3404218 3353300 3238859 3185099 3217316
3089 3217316 3162203 3185469 3248182 3199466 3169820 3150963 3128877 3153735 3126805 3120749 3132720 3140375
3077 3140375 3148031 3130307 3130446 3116213 3106299 3146590 3056018 3051672 3083990 3101108 3200200 3211222
3065 3211222 3215451 3174873 3231887 3239214 3221849 3279394 3308679 3398889 3486234 3418771 3447918 3573736
3053 3573736 3672150 3689555 3653537 3721697 3810412 3820289 3892136 3876112 3905531 3948698 3953153 3961318
3041C961318O8590p221M1547J0333n7964K7066p0486m5148k9225N0870Q6446j08065
3029C928061l2148N3046N8091M2719p6041J9265K7490K7191N18j0143m0519m1214
3017C956316K3026L3689m2090n054L0074O401K4147o0969p601L1237J6007N9004
3005D064187l4215M6003K2732P9744J0159j3990J04488J8635N3925P7818J0185
2994D439671N5520J0306P3459J11486M3307P5011m290Q2106K6865J304J01902
2983E016647L2229L8675P5335l1157R4318J30588M1086J00263M1576R000J10943
2972E659503R4907M2643J35367l4069k3528o5788r9610o5772r7580l6156K3135
2961E533052K2551k6440l7465l3454n5331r9151O717q652l9436J3134M842J7469
$$ plain form
3041 3961318 4029908 4022687 4064234 4074567 4016603 4043669 3973183 3928035 3898810 3949680 4036126 3928061
3029 3928061 3895913 3948959 4007050 4049769 3973728 3992993 4020483 4047674 4048192 4038049 3997530 3956316
3017 3956316 3979342 4013031 3970941 3965887 3995961 4002362 4026509 3965540 3957939 3989176 4005183 4064187
3005 4064187 4029972 4075975 4098707 4178451 4188610 4174620 4279108 4297743 4351668 4429486 4439671
2994 4439671 4495191 4505497 4578956 4690442 4733749 4808760 4804470 4886576 4913441 4914745 5016647
2983 5016647 5048876 5087551 5162886 5131729 5226047 5356635 5397721 5497984 5539560 5548560 5659503
2972 5659503 5754410 5797053 5932420 5898351 5874823 5809035 5709425 5643653 5546073 5509917 5533052
2961 5533052 5555603 5529163 5491698 5458244 5402913 5303762 5310479 5301827 5262391 5275525 5280367 5297836
2949E297836k6049r988n253N2063P727k1124p6713m7825L3101M2923M9308j4984
2937E281022k1315M2704l2930j6849k9335j0045M0061L0329L8863L6970O8558
2926E428033M8317J9865l2153k5745L9305L5318M9269P9365N04M1597K1676r1689
2914E613662K6203P1851k3729l6169N2936Q0667J04227n0j07712L4589K3495R6224
2902E936194j5037j8664L5184L2326P0855R2345N546P2001N2663M3560k3058M2319
2890F326234J14261K4061J37938O8255N9778J43913J33182J21894J90258R9828
2880G419602O2383J13149L9846J54693J18449J14105O9958N7619J25545Q6915
2870H362264j7549J01027J38646J33272J33154P1558J49397J02812Q6787Q3830
$$ plain form
2949 5297836 5271787 5261799 5256546 5308609 5316336 5295212 5218499 5170674 5203775 5246698 5296006 5281022
2937 5281022 5259707 5302411 5269481 5252632 5223297 5213252 5253313 5283642 5322505 5359475 5428033
2926 5428033 5476350 5496215 5464062 5438317 5477622 5512940 5562209 5641574 5642078 5683675 5705351 5613662
2914 5613662 5639865 5711716 5687987 5651818 5704754 5785421 5889648 5889598 5781886 5816475 5839970 5936194
2902 5936194 5921157 5902493 5937677 5970003 6040858 6133203 6138749 6210750 6263413 6306973 6283915 6326234
2890 6326234 6440495 6464556 6602494 6670749 6730527 6874440 7007622 7129516 7319774 7419602
2880 7419602 7481985 7595134 7634980 7789673 7908122 8022227 8092185 8149804 8275349 8362264
2870 8362264 8344715 8445742 8584388 8717660 8850814 8922372 9071769 9174581 9261368 9345198
2860I345198M8497J26456J11073J98965J33620J39623J55833L4636J23490J87276
2850A0604667J24624J23959J79611O5800L4403Q6393R0467K4141l549Q9921R6538
2839A1516975K8374J41675L9263P5559J83790J23606L3120J45401R6017Q5187
2829A2468967k0306L6007P310p5147n8630j20201k2098J4991k6734o0837M3178
2818A2186500N8458j2015M1210n382k2263M0873L128K7751m2792q832J1613n0837
2806A2227412O0953L0496K1289J5363p6257N5307M5095M3021L4151O751P8037
2795A2541618P8402O9676R8422R0140Q3755J80603J45009L7688J19223R3779J47555
2784A3685870J61750R7428K02076J28755J28819L04178J65615J23038K28618K13513
$$ plain form
2860 9345198 9393695 9520151 9631224 9830189 9963809 10103432 10259265 10293901 10417391 10604667
2850 10604667 10729291 10853250 11032861 11098661 11133064 11219457 11309924 11334065 11330516 11420437 11516975
2839 11516975 11545349 11687024 11726287 11801846 11985636 12109242 12142362 12287763 12383780 12468967
2829 12468967 12448661 12484668 12491978 12416831 12358201 12238000 12215902 12230893 12204159 12143322 12186500
2818 12186500 12244958 12232943 12274153 12268771 12246508 12287381 12290509 12318260 12275468 12266636 12278249 12227412
2806 12227412 12288365 12318861 12340150 12355513 12279256 12334563 12379658 12422679 12456830 12463581 12541618
2795 12541618 12620020 12689696 12788118 12878258 12962013 13142616 13287625 13325313 13444536 13538315 13685870
2784 13685870 13847620 13945048 14147124 14275879 14404698 14708876 14874491 14997529 15226147 15439660
2774A5439660J74260K68491L10028L08796K70010K44594L32161L76157L45780
2765A8069937L53488L51603L69313M93534N06755N64405M64350N17390N62424
2756B2253199O09708O51097O73785P13275P03738P38439Q86922R34198R05003
2747B9069364R96298J131401J215636J329177J391607J428100J503700J714794
2739C9780077J781686J923592J935554K114309K291437K342634K536792K736820
2731E7442901K919293L087386L376448L711721L958433M126888M248252M392578
2723H7263900M401281M175849L880808L504372L028575K437815J911981J335495
2715A11940076R78022O38297N86401P06311Q48772J026661J374612J679397J922874
$$ plain form
2774 15439660 15613920 15882411 16192439 16501235 16771245 17015839 17348000 17724157 18069937
2765 18069937 18423425 18775028 19144341 19637875 20144630 20709035 21173385 21690775 22253199
2756 22253199 22862907 23514004 24187789 24901064 25604802 26343241 27230163 28164361 29069364
2747 29069364 30065662 31197063 32412699 33741876 35133483 36561583 38065283 39780077
2739 39780077 41561763 43485355 45420909 47535218 49826655 52169289 54706081 57442901
2731 57442901 60362194 63449580 66826028 70537749 74496182 78623070 82871322 87263900
2723 87263900 91665181 95841030 99721838 103226210 106254785 108692600 110604581 111940076
2715 111940076 112918098 113556395 114142796 114849107 115697879 116724540 118099152 119778549 121701423
2706A21701423K247879K618713K999226L334673L792434M249273M631142N275119
2698A50849882N830027O245586O792207P235296P513486P583382P565914P123880
2690B06739660O386455N537946M392114L231222K042004R01195j08706p88319
2682B28333571j114040j179368r91193o64014m22125k89249l27155l97946o69412
2673B22279069p70941r86586j145093j129658j053114p02623j68639L42690Q19227
2664B17484332J439672K030881K409189K523784K342268J885179J072236J3090
2656B31200631j260977k626971l770958m900362n643939n995521o078833n720508
2648A95202562n021100m242644l457212k885681k460849k329640k397597k644065
$$ plain form
2706 121701423 123949302 126568015 129567241 132901914 136694348 140943621 145574763 150849882
2698 150849882 156679909 162925495 169717702 176952998 184466484 192049866 199615780 206739660
2690 206739660 213126115 218664061 223056175 226287397 228329401 229230596 229121890 228333571
2682 228333571 227219531 226040163 225048970 224384956 223962831 223673582 223346427 222948481 222279069
2673 222279069 221508128 220521542 219376449 218246791 217193677 216491054 216322415 216665105 217484332
2664 217484332 218924004 220954885 223364074 225887858 228230126 230115305 231187541 231200631
2656 231200631 229939654 227312683 223541725 218641363 212997424 207001903 200923070 195202562
2648 195202562 190181462 185938818 182481606 179595925 177135076 174805436 172407839 169763774
2640A69763774k963058l654552m430491n160837n932665o322282o405879o068215
2632A28825795n750034n209710m849306m438621m114392l898326l546102l256936
2624I3762368k935160k700626k477488k197920k119719k053799j924503j902458
2616G5450695j846086j888247j959198j949095j858731j806529j745755j625124
2608F0771930j520899j387124j321580j297006j186470j175454j178080j192634
2600E0512683j201490j249124j216951j164764j126226j178891j134372j071143
2592D1169722r78531j023553j104871r50055r09834q89306q94458r16795p96037
2583C2706282p11650o60241o81140o90539o96577o20020o23881n52738n08701
$$ plain form
2640 169763774 166800716 163146164 158715673 153554836 147622171 141299889 134894010 128825795
2632 128825795 123075761 117866051 113016745 108578124 104463732 100565406 97019304 93762368
2624 93762368 90827208 88126582 85649094 83451174 81331455 79277656 77353153 75450695
2616 75450695 73604609 71716362 69757164 67808069 65949338 64142809 62397054 60771930
2608 60771930 59251031 57863907 56542327 55245321 54058851 52883397 51705317 50512683
2600 50512683 49311193 48062069 46845118 45680354 44554128 43375237 42240865 41169722
2592 41169722 40191191 39167638 38062767 37112712 36202878 35313572 34419114 33502319 32706282
2583 32706282 31994632 31334391 30653251 29962712 29266135 28646115 28022234 27469496 26960795
2574B6960795n82021n42720n35996n41134m44992l67557m29979m83227l84578
2565B2648591l38525l60657l33976l16161m66624l01745k81334k23794k37526
2556A9788249k67831k95504k57278k47652k76185j66429j27911j82574k19495
2547A7747390j74474j07003k04372j21136j33500j10125j04280j13787r0033j11782
2537A6476898m5789n0892k4416k7795M4490k9245K40J8590M8662k0220L6373M9744
2525A6476640n436R027N8026L5289M5146J3067m372m874R125o315k6692j0326
2513A6588305Q6918L2730Q3595L7776N9851O8198L0167O5558P3624Q7524M4490
2502A7258736Q4590N7441Q1215O4326K3757J06441J19392J2971O524O6984l8642
$$ plain form
2574 26960795 26378774 25836054 25300058 24758924 24313932 23946375 23516396 23033169 22648591
2565 22648591 22310066 21949409 21615433 21299272 20832648 20530903 20249569 20025775 19788249
2556 19788249 19520418 19224914 18967636 18719984 18443799 18277370 18149459 17966885 17747390
2547 17747390 17572916 17465913 17261541 17140405 17006905 16896780 16792500 16678713 16588680 16476898
2537 16476898 16431109 16380217 16355801 16328006 16372496 16343251 16343491 16362081 16410743 16390523 16426896 16476640
2525 16476640 16471204 16480231 16538257 16573546 16618692 16631759 16627387 16622513 16631638 16625323 16598631 16588305
2513 16588305 16675223 16707953 16791548 16829324 16889175 16957373 16987540 17053098 17126722 17214246 17258736
2502 17258736 17343326 17400767 17481982 17546308 17570065 17676506 17795898 17808869 17815393 17882377 17843735
2491A7843735p530r4645r512M8242P6277m5040L0545K3310j7662k958N3496O3801
2479A7962059J04278K1229n8996J6687K3734M7076J0412N1473N5765L3220Q759
2468A8275696J59777Q8526Q4127J46441R9008P1533J31242J62891J54939K13416
2458A9587596J96781K08761K06299J95678L06825K81647L30373M18217L31595
2449B2063772L31507L84583N00463N59042M62774N93285P10523P68268P97837
2440B7172054Q43952P85411P89395Q16870Q09939P79745Q08530Q13956P57555
2431C4377407Q59715J043896R51801J122286J258517J382802J537257J690254
2423D4223935J897625J927864K181027K358981K509785K928639L257745L527728
$$ plain form
2491 17843735 17836205 17741560 17732048 17780290 17856567 17811527 17842072 17865382 17847720 17844762 17898258 17962059
2479 17962059 18066337 18087566 18028570 18045257 18068991 18116067 18126479 18177952 18233717 18266937 18275696
2468 18275696 18435473 18523999 18608126 18754567 18853575 18925108 19056350 19219241 19374180 19587596
2458 19587596 19784377 19993138 20199437 20395115 20701940 20983587 21313960 21732177 22063772
2449 22063772 22395279 22779862 23280325 23839367 24302141 24895426 25605949 26374217 27172054
2440 27172054 28016006 28801417 29590812 30407682 31217621 31997366 32805896 33619852 34377407
2431 34377407 35237122 36281018 37232819 38355105 39613622 40996424 42533681 44223935
2423 44223935 46121560 48049424 50230451 52589432 55099217 58027856 61285601 64813329
2415F4813329L972972M423800M868165N100816N287228N350810N574697O095848
2407A05487665O643497P539395Q656971R878323J1313296J3380936J5845940J8465213
2399A97211236K1010765K2606307K2485243K0877828J8492953J5526831J1265259
2392C29476422N027296k345859r571973j5261138j8459343j8698884j7013908
2385B53152613j5164369j3849084j3316051j2810642j2446938j2185480j1770382
2378A61609667j1268449j0680306j0080715r349362q505487p746250o885383o102779
2370I0990936n445194m866333m418696l922122l523250l234106l013703k772440
2362E9795092k632583k475510k415587k243804k136436j971583j903716j870948
$$ plain form
2415 64813329 68786301 73210101 78078266 83179082 88466310 93817120 99391817 105487665
2407 105487665 112131162 119670557 128327528 138205851 149519147 162900083 178746023 197211236
2399 197211236 218222001 240828308 263313551 284191379 302684332 318211163 329476422
2392 329476422 334503718 332157859 322585886 307324748 288865405 270166521 253152613
2385 253152613 237988244 224139160 210823109 198012467 185565529 173380049 161609667
2378 161609667 150341218 139660912 129580197 120230835 111725348 103979098 97093715 90990936
2370 90990936 85545742 80679409 76260713 72338591 68815341 65581235 62567532 59795092
2362 59795092 57162509 54686999 52271412 50027608 47891172 45919589 44015873 42144925
2354D2144925j692535j686565j519842j401547j377073j251215j209668j130177
2346C0876303r21610r57984r15557q24267p35740p27368p24470n90680n23110
2337B3955517n32258n47876n13954m03635m38603m51490l72233l68354l07641
2328B0019473l99976l39323l39607k41571k10552k40543k85448k96730l55457
2319A7310266l25732k82194l69376l11952l31443k22580k88966k08298j94315
2310A4775410j96345k04912k23396r6553j53570j49019j47817j03067p0588k6044
2300A3404099o8747J0657O5325K6955M7784j626R8421J88499J29148J39310K07993
2289A4247818L08040L07827L67580M03976M70249M21214K71592K11461K26286
$$ plain form
2354 42144925 40452390 38765825 37245983 35844436 34467363 33216148 32006480 30876303
2346 30876303 29954693 28996709 28081152 27256885 26521145 25793777 25069307 24478627 23955517
2337 23955517 23423259 22875383 22361429 21957794 21519191 21067701 20695468 20327114 20019473
2328 20019473 19619497 19280174 18940567 18698996 18488444 18247901 17962453 17665723 17310266
2319 17310266 16984534 16702340 16332964 16021012 15689569 15466989 15178023 14969725 14775410
2310 14775410 14579065 14374153 14150757 14054204 13900634 13751615 13603798 13500731 13430143 13404099
2300 13404099 13335352 13346009 13411334 13438289 13486073 13484447 13582868 13771367 13900515 14039825 14247818
2289 14247818 14555858 14863685 15231265 15635241 16105490 16526704 16798296 17009757 17236043
2280A7236043J22155j4254r4022k00580j31614j61465k33971j75957K3987m647
2270A6365675r339L2380M6294J47499J08713K19899J25023J24119Q103O9789j00498
2259A7137657k38617l00809l68695l90126m34288l89978l58175k64407k61171
2250A4131391k03982k01797k24259k16495p9221j62531j31320j52863k24942k62598
2240A2271383j17549r6182j14951n8401j00876j01345k7384q222n6251j24083
2230A1466139o8926q7752j01188j41704o7162q1901j78835j57853j18218j93400
2220A0269200k04711j79766j51515q3323j45461j77171j62724j37760j30000j01022
2210H795747j08458r5431p4703j18400j15061j01877j05311j19949q4283j27344
$$ plain form
2280 17236043 17358198 17343944 17249922 17049342 16917728 16756263 16522292 16346335 16370322 16365675
2270 16365675 16356336 16388716 16435010 16582509 16691222 16911121 17036144 17160263 17168366 17238155 17137657
2259 17137657 16899040 16598231 16229536 15839410 15405122 15015144 14656969 14392562 14131391
2250 14131391 13927409 13725612 13501353 13284858 13205637 13043106 12911786 12758923 12533981 12271383
2240 12271383 12153834 12057652 11942701 11884300 11783424 11682079 11654695 11646473 11590222 11466139
2230 11466139 11397213 11309461 11208273 11066569 10999407 10917506 10738671 10580818 10462600 10269200
2220 10269200 10064489 9884723 9733208 9649885 9504424 9327253 9164529 9026769 8896769 8795747
2210 8795747 8687289 8591858 8517155 8398755 8283694 8181817 8076506 7956557 7872274 7744930
2200G744930p7178p0617q5972p1334n4825l8353n8105j09051r7418n0745j33687
2189F897645q3016o9718n6237l1002n9259j12226j17097j23681l9671p5173j18489
2178F012076r1557Q031m1382l6630K524q4134l3263J350j16043P160o689n3681
2166E567762J8945J4524m2516q4698p4594j8376N5908R6600P6381p4026j9756
2155E516154L5065m125l5630m976j3758N6470Q0313P7212j2631K2407M9180L8294
2143E803975m1254l5076M4879l4556k718R170P4111p4864q6132M7711k8444k3488
2131E653314P2124J34028M8295M4388L8877L6164Q9029L6489N88J07212O8048
2120F328556m747J4329Q7567O0862j3398J41631J13553L8847N0304K3709m1674
$$ plain form
2200 7744930 7667752 7597135 7511163 7439829 7385004 7346651 7288546 7179495 7082077 7031332 6897645
2189 6897645 6814629 6744911 6688674 6657672 6598413 6486187 6369090 6245409 6205738 6130565 6012076
2178 6012076 5920519 5928550 5887168 5850538 5853062 5768928 5735665 5737015 5620972 5628132 5621443 5567762
2166 5567762 5586707 5601231 5558715 5474017 5399423 5381047 5436955 5533555 5609936 5535910 5516154
2155 5516154 5551219 5547094 5511464 5506488 5492730 5549200 5629513 5706725 5694094 5716501 5765681 5803975
2143 5803975 5762721 5727645 5772524 5737968 5735250 5744420 5818531 5743667 5657535 5705246 5676802 5653314
2131 5653314 5725438 5859466 5907761 5952149 5991026 6027190 6116219 6152708 6153296 6260508 6328556
2120 6328556 6323809 6338138 6425705 6486567 6473169 6614800 6728353 6767200 6817504 6841213 6799539
2109F799539n0504k4548j03369m7273m3332l9337k3970j02703L3001k9963K9893
2098F397434M8837M2500Q2740O4949P1564Q2649J4710Q6309J20650k8555J1843
2087F995630O7805l2434j00681m5403n5649n1096n9841p3002o7918k9106q7474
2076F460831m6980o2060o6820n2337k0715K2383M9404N890n6482l206N8006m8159
2064F239755l7070m0913K6670L5295P4343N6823k3442L2584J1268L5609j5773
2053F395149P2330L4925L5569M5389K1894o0164J32922J8725j3268M7488j3016
2042F717943j1326O4240J03524J2185J10993J06526N1628Q8563J04252M0726Q7435
2031G476689N2042o898K1139R0256P6823K3584m6814O0162J06751O0667J3498
$$ plain form
2109 6799539 6749035 6724487 6621118 6573845 6530513 6491176 6467206 6364503 6397504 6367541 6397434
2098 6397434 6446271 6488771 6571511 6636460 6708024 6790673 6805383 6891692 7012342 6983787 6995630
2087 6995630 7063435 7031001 6930320 6884917 6829268 6778172 6718331 6645329 6577411 6548305 6460831
2076 6460831 6413851 6351791 6284971 6232634 6211919 6234302 6283706 6289596 6233114 6229908 6287914 6239755
2064 6239755 6202685 6161772 6188442 6223737 6298080 6354903 6331461 6364045 6375313 6410922 6395149
2053 6395149 6467479 6502404 6537973 6583362 6605256 6545092 6678014 6696739 6683471 6730959 6717943
2042 6717943 6706617 6770857 6874381 6886566 6997559 7104085 7155713 7244276 7348528 7389254 7476689
2031 7476689 7528731 7521833 7542972 7633228 7710051 7733635 7686821 7746983 7853734 7914401 7927899
2020G927899k1601O1430O9171J01462J15388Q1399P9462o604M0818J19034N9941
2009H627799J03628J28141J29035J40257J62123R8906J15191J51590J25818J05388
1999I887876J46585J73108J69545J66343J60350K03972J76038K10681K09993K75585
1989A1780076J86100K32248L47853L29055K94636L13963L23353L15343L88463
1980A4511090L89995M53416M91765M88952N43013N50033O28492O70658O84304
1971A9411718P23977Q55012Q63407R16372J004625J133511J107511J234666J331111
1962B8581910J390227J551626J501097J669569J849685J917080K079172K128508
1954D2668874K311593K393461K483298K773035K885616K962156K996879L250756
$$ plain form
2020 7927899 7906298 7967728 8036899 8138361 8253749 8335148 8414610 8408006 8448824 8567858 8627799
2009 8627799 8731427 8859568 8988603 9128860 9290983 9389889 9505080 9656670 9782488 9887876
1999 9887876 10034461 10207569 10377114 10543457 10703807 10907779 11083817 11294498 11504491 11780076
1989 11780076 11966176 12198424 12546277 12875332 13169968 13483931 13807284 14122627 14511090
1980 14511090 14901085 15354501 15846266 16335218 16878231 17428264 18056756 18727414 19411718
1971 19411718 20135695 20990707 21854114 22770486 23775111 24908622 26016133 27250799 28581910
1962 28581910 29972137 31523763 33024860 34694429 36544114 38461194 40540366 42668874
1954 42668874 44980467 47373928 49857226 52630261 55515877 58478033 61474912 64725668
1946F4725668L326200L349330L447427L605637L752012L763717L918994M000763
1938I3889748M038924M078874M128322M208957M093651M075245M005330L869382
1930A26388433L815142L674948L501483L355740L160307L034329K840652K706985
1922A52478019K429350K185899J984249J725675J413187J058953O48328L14686
1914A64238346k1566l75611p01739r69028j237322j447143j677627j995094k238100
1905A53575116k305148k615244k908609l161355l422807l543563l767630l882347
1897A27968413m016467l999332l984939m087217l957617l993740m029582l967596
1889I5931923l924420l894510l808025l713316l697730l584767l503365l371323
$$ plain form
1946 64725668 68051868 71401198 74848625 78454262 82206274 85969991 89888985 93889748
1938 93889748 97928672 102007546 106135868 110344825 114438476 118513721 122519051 126388433
1930 126388433 130203575 133878523 137380006 140735746 143896053 146930382 149771034 152478019
1922 152478019 154907369 157093268 159077517 160803192 162216379 163275332 163923660 164238346
1914 164238346 164216780 163841169 163139430 162170402 160933080 159485937 157808310 155813216 153575116
1905 153575116 151269968 148654724 145746115 142584760 139161953 135618390 131850760 127968413
1897 127968413 123951946 119952614 115967675 111880458 107922841 103929101 99899519 95931923
1889 95931923 92007503 88112993 84304968 80591652 76893922 73309155 69805790 66434467
1881F6434467l284387l118537k967086k762712k709241k562867k370514k341329
1873D4317794k218952k096962j980129j765536j725234j658294j570061j458306
1865B9844320j381905j254576j191535j061538j055486r34376q97833q80827p56724
1856B0429520p01568o48292o48146o04005n49446m72159m91023m52301l80285
1847A5482295l16934k96772l76064l25473k75163k57368j86099k66758j82772
1838A2998892j65102k07107j67542k11757j68567j52656j64836j12858r7425j55234
1828A1395808r1042q8483j78410j35976j46430q6227o0053p0550j37228j51439
1818A0249970o9132j02245j13261r8516q7564m9498n9498j08688j9225o0374j00711
$$ plain form
1881 66434467 63150080 60031543 57064457 54301745 51592504 49029637 46659123 44317794
1873 44317794 42098842 40001880 38021751 36256215 34530981 32872687 31302626 29844320
1865 29844320 28462415 27207839 26016304 24954766 23899280 22964904 22067071 21186244 20429520
1856 20429520 19727952 19079660 18431514 17827509 17278063 16805904 16314881 15862580 15482295
1847 15482295 15165361 14868589 14492525 14167052 13891889 13634521 13448422 13181664 12998892
1838 12998892 12833790 12626683 12459141 12247384 12078817 11926161 11761325 11648467 11551042 11395808
1828 11395808 11304766 11216283 11037873 10901897 10755467 10669240 10609187 10538637 10401409 10249970
1818 10249970 10180838 10078593 9965332 9866816 9779252 9729754 9670256 9561568 9542343 9481969 9381258
1807I381258m6114j26129K3609k9053p271m1094m7297N098m2047j6761l3402Q138
1795I028935k8035o1633j015l3037P2913M8210l5755R585m0708J9724N2175L8115
1783I069474l4199k3262J3436O2711P2661K2506N0981N8755K3775N5546M0265
1772I412649Q6335J41363Q4711O5527M6796Q5545R6221J08076J08925N1177N738
1761A0293063N8495P017L0625K2291N9317L5546P91N07J758J8183k683m4759q1359
1748A0398792J8063k1267l1594p7531m1165j01102m7307m9252j20152m7628l0534
1737I849323l0339n1752o7246j3290k9267p6880r1974P427j529k6369m1313K6768
1725I453559l0058m950K4275J0557J01129k073k0773L0100P2329O9396J03758
$$ plain form
1807 9381258 9335144 9209015 9232624 9203571 9196300 9155206 9107909 9113007 9070960 9054199 9020797 9028935
1795 9028935 9000900 8939267 8938252 8905215 8978128 9026338 8990583 9000168 8959460 8979184 9031359 9069474
1783 9069474 9035275 9012013 9025449 9088160 9160821 9183327 9234308 9293063 9316838 9372384 9412649
1772 9412649 9498984 9640347 9725058 9790585 9837381 9922926 10019147 10127223 10236148 10287325 10293063
1761 10293063 10351558 10358575 10389200 10411491 10470808 10506354 10507145 10507652 10509410 10527593 10524910 10480151 10398792
1748 10398792 10416855 10395588 10363994 10286463 10245298 10144196 10096889 10047637 9927485 9879857 9849323
1737 9849323 9818984 9767232 9699986 9686696 9657429 9580549 9488575 9496002 9494473 9468104 9426791 9453559
1725 9453559 9423501 9418551 9442826 9453383 9554512 9552439 9531666 9561766 9634095 9703491 9807249
1714I807249N4870M0554P5283J38177J04593P7992Q9592P4644J24801O7834O7132
1703A0722721Q4858K7414J21339N8054O4252J06756M5744R3398Q4409O1854J44851
1692A1615650L6861L5466O5443Q7659P6229L6985P6623N3763J02263O4421M0232
1681A2291595K9802P1474O2567R6153R2352M3631R7846Q5153Q4243J47775J56629
1670A3259220J73710J48260J03609J02293M8755J78472K07553J37754J34967J55970
1660A4650563K09686J35598K16177K37970K09587J60908J70468J95552J98794
1651A6385303K52557K25298K33438K69483K67425K53939K33713K71876L16395
1642A8709427L55982L97672L52879L25247K81731M18715M75803N08298M30601
$$ plain form
1714 9807249 9862119 9902673 9977956 10116133 10220726 10298718 10388310 10462954 10587755 10655589 10722721
1703 10722721 10807579 10834993 10956332 11014386 11078638 11185394 11231138 11324536 11408945 11470799 11615650
1692 11615650 11652511 11687977 11753420 11841079 11917308 11954293 12030916 12084679 12186942 12251363 12291595
1681 12291595 12321397 12392871 12455438 12551591 12643943 12687574 12785420 12870573 12954816 13102591 13259220
1670 13259220 13432930 13581190 13684799 13787092 13835847 14014319 14221872 14359626 14494593 14650563
1660 14650563 14860249 14995847 15212024 15449994 15659581 15820489 15990957 16186509 16385303
1651 16385303 16637860 16863158 17096596 17366079 17633504 17887443 18121156 18393032 18709427
1642 18709427 19065409 19463081 19815960 20141207 20422938 20841653 21317456 21825754 22256355
1633B2256355M52056N73908O47710O06333O81425P95830P58405P77405R34891
1624B8484318J021215J013562J086363J228277J300025J349852J418483J539433
1616C8441528J551446J575294J735067J712864J734748J672651J698233J638536
1608E1760367J560670J671439J469435J494789J469956J397127J370258J283839
1600F3477880J314248J075289R61220P64951P32801N17297L59684K66339J66165
1591F9635874Q313p5583j27995q3924j15615r9252r7068n9193p8546o1203R0775
1580F8936583M0301M9256K77239M43472M66754P53587Q97079J094270J372466
1571G4331007J604356J832228K122804K493755K748870L107768L471547L781936
$$ plain form
1633 22256355 22708411 23282319 23930029 24536362 25217787 26013617 26772022 27549427 28484318
1624 28484318 29505533 30519095 31605458 32833735 34133760 35483612 36902095 38441528
1616 38441528 39992974 41568268 43303335 45016199 46750947 48423598 50121831 51760367
1608 51760367 53321037 54992476 56461911 57956700 59426656 60823783 62194041 63477880
1600 63477880 64792128 65867417 66828637 67593588 68326389 68843686 69203370 69469709 69635874
1591 69635874 69644187 69568604 69440609 69356685 69241070 69141818 69044750 68985557 68907011 68845808 68936583
1580 68936583 68976884 69026140 69303379 69746851 70213605 70967192 71864271 72958541 74331007
1571 74331007 75935363 77767591 79890395 82384150 85133020 88240788 91712335 95494271
1563I5494271M173183M403619M692191M992733N182981N260683N437790N488421
1555A35125872N490135N486505N382465N367664N321418N260571N209960N011314
1547A77655904M927157M784048M433037M177032L776711L305867K807555K317147
1539B08184458J839482J483670J145981Q65578O24757N02241M64536M19745M11539
1530B15941987L60452L83612L63569N32482O36892P20850R44611J032673J228461
1521B22145589J462649J679088J863193K012506K266110K422973K604166K686112
1513B39142386L029517L279485L413653L626579L771873L883230L874145L820217
1505B67841085L817778L639866L486994L419606L257525L125402L171654L303243
$$ plain form
1563 95494271 99667454 104071073 108763264 113755997 118938978 124199661 129637451 135125872
1555 135125872 140616007 146102512 151484977 156852641 162174059 167434630 172644590 177655904
1547 177655904 182583061 187367109 191800146 195977178 199753889 203059756 205867311 208184458
1539 208184458 210023940 211507610 212653591 213519169 214143926 214646167 215110703 215530448 215941987
1530 215941987 216302439 216686051 217049620 217582102 218218994 218939844 219884455 220917128 222145589
1521 222145589 223608238 225287326 227150519 229163025 231429135 233852108 236456274 239142386
1513 239142386 242171903 245451388 248865041 252491620 256263493 260146723 264020868 267841085
1505 267841085 271658863 275298729 278785723 282205329 285462854 288588256 291759910 295063153
1497B95063153L452825L584600M028907M535031N234694O077482P111775Q294214
1489C37382681R536501J0808406J1961923J3106372J3918609J4301330J4236495
1482D25252317J3708473J2716014J1146976R304101P385995N363284L467558K059021
1474D90403739R50655K40491k54282p45745j192811j987938l076822m593552o570579
1465D73173156q736337j0957664j3222006j5345199j7127457j8208635j8835522
1458C70740336j8918916j8523641j7744284j6899125j5815329j4845023j3937883
1451B54056135j3197142j2501586j1724978j0930433j0284630r715106r006047
1444A76696213q500801p890870p311126o917040o464328o082654n683216n378980
$$ plain form
1497 295063153 298515978 302100578 306129485 310664516 315899210 321976692 329088467 337382681
1489 337382681 346919182 357727588 369689511 382795883 396714492 411015822 425252317
1482 425252317 438960790 451676804 462823780 472127881 479513876 484877160 488344718 490403739
1474 490403739 491354394 491594885 491340603 490594858 489402047 487414109 484337287 479743735 473173156
1465 473173156 464436819 453479155 440257149 424911950 407784493 389575858 370740336
1458 370740336 351821420 333297779 315553495 298654370 282839041 267994018 254056135
1451 254056135 240858993 228357407 216632429 205701996 195417366 185702260 176696213
1444 176696213 168195412 160304542 152993416 146076376 139612048 133529394 127846178 122467198
1436A22467198n007344m910633m650364m502750m323435m182367m111153l929889
1428H6849263l724514l595539l434880l288983l226540k961975k980400k682880
1420F0953552k490652k359577k288400k119364k030631j867667j711366j670265
1412D4415630j555779j525420j368215j296712j209200j123829j108819j004081
1404C4223575r64232j001118q91233q89644p74424p70763p46425p05418o64478
1395B6815840o35692o78719o74296n49003n25336n76586n24299m63260l99799
1386B1788850n29996m49640n06966l51681l71349m21676m67502m77668l00927
1377A7911445l31330l74656l68028k53967k84225l45143l16645l19178k75144
$$ plain form
1436 122467198 117459854 112549221 107898857 103396107 99072672 94890305 90779152 86849263
1428 86849263 83124749 79529210 76094330 72805347 69578807 66616832 63636432 60953552
1420 60953552 58462900 56103323 53814923 51695559 49664928 47797261 46085895 44415630
1412 44415630 42859851 41334431 39966216 38669504 37460304 36336475 35227656 34223575
1404 34223575 33259343 32258225 31366992 30477348 29702924 28932161 28185736 27480318 26815840
1395 26815840 26180148 25501429 24827133 24278130 23752794 23176208 22651909 22188649 21788850
1386 21788850 21258854 20809214 20302248 19950567 19579218 19157542 18690040 18212372 17911445
1377 17911445 17580115 17205459 16837431 16583464 16299239 15954096 15637451 15318273 15043129
1368A5043129k80237k65887j93863j66117k66288k78061k41313k99114j72386
1359A2879863j96358k65563j12123j27114k46301k21311j38057j06920j46827
1350A1319289j70521j80423k03420j99207j58813r0710n3369q4720j37359j90734
1340I850013j58106q3453j10497j54230j14680j26471j09124k4521j27004q7115
1330H754812j54163j28447j10711k7546p0522j28950l8901p1964j32340r8221
1320G793047l6543o2026q4763q8039o5351l6143k9029k070j28097p3422o0063
1309G127501j30758N659p1800p1573o7485j6958k5111j09431r0185k8605k4305
1298F496949m1409m0378p4597n2760K0668K5329l8810q3255r701j137p8952o8516
$$ plain form
1368 15043129 14762892 14497005 14303142 14137025 13870737 13592676 13351363 13052249 12879863
1359 12879863 12683505 12417942 12305819 12178705 11932404 11711093 11573036 11466116 11319289
1350 11319289 11148768 10968345 10764925 10565718 10406905 10316195 10262826 10178106 10040747 9850013
1340 9850013 9691907 9608454 9497957 9343727 9229047 9102576 8993452 8968931 8841927 8754812
1330 8754812 8600649 8472202 8361491 8333945 8263423 8134473 8095572 8023608 7891268 7793047
1320 7793047 7756504 7694478 7609715 7521676 7456325 7420182 7391153 7389083 7260986 7187564 7127501
1309 7127501 6996743 7002402 6930602 6859029 6791544 6774586 6749475 6640044 6549859 6521254 6496949
1298 6496949 6455540 6415162 6340565 6287805 6308473 6333802 6294992 6211737 6202036 6200899 6121947 6053431
1286F053431L4777l3792L2030O933j6858M3497M2709M4893P2946L0942R79j4396
1274F298091L5442K1084K1637J6975P7531N047L9861K316l0796P9616Q8101Q780
1262F663685K5609M5061M2573l495P2438K4824Q8901J04658J685M0432P461N7620
1250G171452L4891Q4476N832J44647P1939O5275P1998J57799N1416O5882J28752
1239H054359J20543Q9951J24753N7342J20780J73284P7605J72861J22019J45821
1229I259318O0617Q9760M8104j8371J7081K8923J3946k7395l0486n2838K7190
1218I415849M8318l83R595Q851L3548P5241J70687J49389J62020J56779J57495
1207A0387389J45445J42745J86586R6594N0975O2544J54478J43226M1320n820
$$ plain form
1286 6053431 6088208 6054416 6086446 6093379 6076521 6120018 6162727 6207620 6280566 6311508 6312487 6298091
1274 6298091 6333533 6354617 6376254 6393229 6470760 6475807 6515668 6517984 6487188 6566804 6654905 6663685
1262 6663685 6689294 6734355 6776928 6773433 6845871 6870695 6959596 7064254 7065939 7106371 7113832 7171452
1250 7171452 7206343 7290819 7296651 7441298 7513237 7578512 7650510 7808309 7859725 7925607 8054359
1239 8054359 8174902 8264853 8389606 8446948 8567728 8741012 8818617 8991478 9113497 9259318
1229 9259318 9319935 9409695 9457799 9439428 9456509 9485432 9499378 9471983 9441497 9388659 9415849
1218 9415849 9464167 9463784 9473379 9482230 9515778 9591019 9761706 9911095 10073115 10229894 10387389
1207 10387389 10532834 10675579 10862165 10958759 11009734 11072278 11226756 11369982 11411302 11405482
1197A1405482j37104j54412r5316o6473q9694m8012j6640o118r0986j07827P562
1186A0600462N6217k043L6660J34026J76170J62463J29524R7930J08774J63489
1176A1663672N6788L1105j9552n014m9676k09850k07955k19859m21255l05940
1166A0312464l10236k37931j70389j84380j79978j86794j52890n1147q8934j50151
1156H599634r0825l2103o7013o073K9167L9158Q7690Q599J60260N5167Q7702J22598
1144H993961J3170J20416Q4044n0429o5770q2445q0239j74447j95952j79476j12820
1133H270013j17828o0671l6091j52289j63286p1509p8885r6292j33017o5734o2823
1122G231588n9564j0985J8824q9635Q418N8710Q5090N6806J28851P3629O8282
$$ plain form
1197 11405482 11268378 11113966 11018650 10952177 10862483 10814471 10797831 10791713 10700727 10592900 10600462
1186 10600462 10656679 10654636 10691296 10825322 11001492 11163955 11293479 11391409 11500183 11663672
1176 11663672 11720460 11751565 11732013 11726999 11677323 11467473 11259518 11039659 10618404 10312464
1166 10312464 10002228 9764297 9593908 9409528 9229550 9042756 8889866 8838719 8749785 8599634
1156 8599634 8508809 8476706 8409693 8403620 8432787 8471945 8559635 8568234 8728494 8783661 8871363 8993961
1144 8993961 9007131 9127547 9211591 9161162 9095392 9012947 8932708 8758261 8562309 8382833 8270013
1133 8270013 8152185 8091514 8055423 7903134 7739848 7668339 7589454 7493162 7360145 7294411 7231588
1122 7231588 7172024 7161039 7179863 7090228 7098646 7157356 7242446 7299252 7428103 7501732 7570014
1111G570014M7738l8291r783J3239o7566j73066j52907p3000j82934j58252r09
1100F774283j0624k0383j57265l7715O821q2356m2916Q666p2044K1809n0666k4983
1088F312627m9852k1490Q447M8933k9423M3759L6677L525k3370N1934K7114R7139
1076F506020P7131Q4765R4265J0871P1899L9747K9278J23985J45500J14689J57439
1065G455589J85019Q2121J54416J12369K03994K53324J26668J87159K35695M02562
1055I398916L14451M55291N03146O12021Q44963R96690J073981Q53741P89251
1046A5842451Q14677O52662L75177r7991n38366q98762r56029p33363m81472k62100
1036A3716884l13040k69659k28149k78871k51519k15028j99467J8212J9922N2269
$$ plain form
1111 7570014 7617752 7579461 7569678 7582917 7515351 7342285 7189378 7116378 6933444 6775192 6774283
1100 6774283 6763659 6743276 6586011 6548296 6555117 6472761 6429845 6438511 6366467 6388276 6337610 6312627
1088 6312627 6262775 6241285 6249732 6298665 6269242 6313001 6349678 6353203 6329833 6381767 6408881 6506020
1076 6506020 6583151 6667916 6762181 6773052 6844951 6884698 6913976 7037961 7183461 7298150 7455589
1065 7455589 7640608 7722729 7877145 7989514 8193508 8446832 8573500 8760659 8996354 9398916
1055 9398916 9713367 10168658 10671804 11283825 12128788 13125478 14199459 15053200 15842451
1046 15842451 16657128 17309790 17684967 17586976 17048610 16149848 15193819 14460456 13978984 13716884
1036 13716884 13403844 13134185 12906036 12627165 12375646 12160618 11961151 11979363 11999285 12051554
1026A2051554K11622L53333M76547P09502Q22595P53272P62808O18501O30330
1017A7390064L77123O9961l35982p60285j177706j012411p14386n83233m99255
1008A2753890m40866m83430l63134l91792n02394l73097l29538l45455k95003
999I229181k36025j74545k14124p8056j07792j27700r7359j28335n1684j0849
989H002712j7495j55957q5430o0799j32173m7522k9282n6064q7132m3926j04435
978G182497n0794l1711J5963p8609j29708P169n6127n2830l3185N402L6580j8679
966F795968n560J5839N878j114l353j0998n4144l7037m0730L660j09254j5754
954F543401p9151J1604j5459p6007k7689j663p3263k2856m0704o9758l3942q640
$$ plain form
1026 12051554 12263176 12616509 13093056 13802558 14625153 15378425 16141233 16759734 17390064
1017 17390064 17767187 17837148 17501166 16740881 15563175 14550764 13836378 13253145 12753890
1008 12753890 12313024 11829594 11466460 11074668 10572274 10199177 9869639 9524184 9229181
999 9229181 8993156 8818611 8604487 8526431 8418639 8290939 8193580 8065245 8013561 8002712
989 8002712 7985217 7829260 7743830 7683031 7550858 7503336 7474054 7417990 7330858 7286932 7182497
978 7182497 7131703 7099992 7115955 7037346 6907638 6914807 6858680 6805850 6772665 6778067 6814647 6795968
966 6795968 6790408 6806247 6812125 6811011 6807658 6796660 6742516 6705479 6664749 6668409 6559155 6543401
954 6543401 6464250 6475854 6460395 6384388 6356699 6355036 6281773 6258917 6218213 6148455 6114513 6105873
942F105873p423m9625k8857K7865j7807K0347n1099n5712K7297O4669M5115m5767
930F034876o5874N1002k6914m3283l3383L8048m4875j37274J405L7844K4022o1787
918E773807n5666J560l2643N326k2836L0394m2252n9693K0452l0507J4370m3711
906E558601n038K0574K3226n7892n7919o6650M4010K7256K6554n0483l0583n7186
894E374470N1147K7429J1144n0191J3919l873l0954M4384p362k2008L4834o9122
882E373817l9571l0180o6946k6571o2004P915k2770M288r379p204l6735k6384
870E058276P9106L364r8820n6333p630m1481m0082K9540N443L7672m6852j03824
858D818379k4905J1178L4532K824m7628j8733j08865l7277m4763n9040j4503J1126
$$ plain form
942 6105873 6098450 6048825 6019968 6047833 6030026 6050373 5999274 5943562 5970859 6035528 6080643 6034876
930 6034876 5969002 6020004 5993090 5949807 5916424 5954472 5909597 5772323 5773728 5811572 5835594 5773807
918 5773807 5718141 5719701 5687058 5692384 5669548 5699942 5657690 5597997 5618449 5587942 5602312 5558601
906 5558601 5553563 5574137 5597363 5539471 5481552 5414902 5458912 5486168 5512722 5462239 5431656 5374470
894 5374470 5425617 5453046 5464190 5413999 5427918 5424045 5393091 5437475 5430113 5408105 5442939 5373817
882 5373817 5334246 5304066 5237120 5210549 5148545 5156460 5133690 5137978 5128599 5121395 5084660 5058276
870 5058276 5137382 5140746 5041926 4985593 4977963 4936482 4896400 4925940 4931383 4969055 4922203 4818379
858 4818379 4793474 4804652 4839184 4842008 4794380 4775647 4666782 4629505 4584742 4525702 4511199 4522325
846D522325j16106o4862j486n0299l651k2369n5676M2496J046j9644j11305j9532
834D100937l999j17876p0300o6867J0679n2422j8511n8407l1723l7396k1815J0023
822C642323q5326l7149J3318l4712j8056n6219k5880l8033K5842q7873q7055j5567
810C195613l656k0823J5927n5896P038j3202K76K0495p0368m8604l6617j7058
798B973125o1420k5007l3096P1271k0950l7453j660r7675r9659P6981j2860k9579
786B702018n4552k4733r279p1936L001M6642l8081m7959K225p6191k0683K9483
774B439955K7971n2203o446J97j9847n0928j7161J173k0561M1576K324n5582m5841
761B244627K4010k4705m0103K6633k1534j15724n491M1929l2694l1278p096l885
$$ plain form
846 4522325 4406219 4341357 4339871 4289572 4285921 4263552 4207876 4250372 4251418 4231774 4120469 4100937
834 4100937 4096938 3979062 3908762 3841895 3852574 3800152 3781641 3723234 3691511 3654115 3632300 3642323
822 3642323 3556997 3519848 3533166 3498454 3480398 3424179 3398299 3360266 3386108 3298235 3211180 3195613
810 3195613 3191957 3171134 3187061 3131165 3138203 3125001 3125277 3145772 3075404 3026800 2990183 2973125
798 2973125 2911705 2886698 2853602 2924873 2903923 2866470 2864810 2767135 2667476 2744457 2731597 2702018
786 2702018 2647466 2622733 2613454 2541518 2544519 2591161 2553080 2505121 2507346 2431155 2410472 2439955
774 2439955 2467926 2415723 2409277 2409474 2389627 2338699 2321538 2322711 2302150 2343726 2346050 2290468 2244627
761 2244627 2268637 2243932 2203829 2230462 2208928 2093204 2087713 2129642 2096948 2065670 2058574 2054689
749B054689j6159M4463k052n8615n6469m2943l9733j5356l9843j3854L2153N8472
737A904753N2836m2408m8435o3877j998J9152N2480k8173m8369p3298m0103r8661
725A583899r069K1017L4447m3638J2635L65n8621K7167K6435K5968n0209q8529
713A481867l3238J534p841r033q52M796l908J4192p5813k8423J5864L1666l6105
700A354706L78l9184P816j5409K2780l2176k1800m660l0693o0554r829l1675n4755
687A084945J1315j1487o849p15k7555o995J04572K1932p3569L9146l6496N7620
675A155864l4595q6179l1573L1139j6391j6346m241K229n874k2968N997k0520
663I56542o8753l5559N3332l0023j1477l5388N4948j8533o342J5665l4984k533
$$ plain form
749 2054689 2038530 2082993 2080941 2022326 1965857 1922914 1883181 1867825 1827982 1814128 1846281 1904753
737 1904753 1957589 1915181 1866746 1802869 1800871 1820023 1872503 1844330 1795961 1722663 1682560 1583899
725 1583899 1574830 1595847 1630294 1586656 1599291 1599656 1541035 1568202 1594637 1620605 1570396 1481867
713 1481867 1448629 1450163 1442322 1433289 1432437 1437233 1433325 1447517 1371704 1343281 1359145 1390811 1354706
700 1354706 1355084 1315900 1323716 1308307 1331087 1298911 1277111 1272451 1241758 1181204 1171375 1139700 1084945
687 1084945 1096260 1084773 1077924 1077209 1049654 1042659 1147231 1169163 1095594 1134740 1098244 1155864
675 1155864 1121269 1035090 1003517 1034656 1018265 1001919 997678 999907 994033 971065 977062 956542
663 956542 887789 852230 905562 875539 864062 828674 883622 865089 858747 874412 839428 836895
651H36895m6487l4763p975L5097l6187n3550N8195m047o2569k2773N4451J6523
639G32810l1100p8772K3568K5771j6043j4092m06J6880q7255j4455K8400L321
627E88627L0859n0422L6165n9583j5861O7592m4444l4057O6084j3565q5974K0619
615E06040K6265o273J6079m5685L8699N9080n2447L4530j4609j38667O713j1066
603D18659O782L0413j2720l4027l1492L1709M1820m1399L2789j1555m3289M21
591C88111k3826K173K9184p1250K4916N7687m7646Q117K6699k6916L820o8698
579C02371j7052L4119O1008j1122n6438p1031j2597J7931j359K7722j6564K4745
567B81733q0128n441M1828K2035N819P224q283j1112J5894J3687m6312p8632j4549
$$ plain form
651 836895 790408 755645 747670 782767 746580 693030 751225 747178 684609 661836 716287 732810
639 732810 701710 622938 646506 672277 656234 642142 641736 658616 571361 556906 585306 588627
627 588627 619486 569064 605229 545646 529785 597377 552933 518876 584960 571395 485421 506040
615 506040 532305 526032 542111 496426 535125 594205 541758 576288 561679 423012 429725 418659
603 418659 425441 455854 443134 409107 377615 409324 451144 409745 442534 430979 387690 388111
591 388111 364285 366458 395642 324392 349308 406995 359349 367466 394165 367249 371069 302371
579 302371 285319 319438 380446 369324 312886 241855 229258 247189 245830 273552 256988 281733
567 281733 201605 196164 237992 260027 265846 273070 264787 253675 269569 283256 236944 158312 143763
554A43763J6996M3205P1927K0736j4040j23880J1092m0894j1064K0328j6559l2663
542H8947Q4924J5235r2030r520k2087q8840N2158k8664K5524K747l325j4020K335
529A3384J0673k3201M102O3665L6081J2193m7227j8645j7356j4009N8159l4212
517D3607n0641J160j7990K4425K6296j4017q4844M2866Q8144l7554k4623k8195
505c1366J0526L173J841P0078j0376o5327k8448J5474r63J934N272n2398M627
492g5953l8453k2208k1455K3132n601M9159m9289K5163J4356m0931l5062k4790
480b01932J7906J23447M836n2245r225J7073j8648K7800m3934p1582M1165M594
468a60745L9674k2472j2642M2819q984j487q1658P375P0759M0835m7772M5588
$$ plain form
554 143763 160759 203964 275891 296627 282587 158707 169799 128905 117841 138169 121610 88947
542 88947 173871 189106 97076 87556 65469 -23371 28787 123 25647 28394 25069 11049 13384
529 13384 24057 856 4958 68623 104704 116897 69670 51025 33669 19660 77819 43607
517 43607 -7034 -5874 -23864 561 26857 12840 -72004 -29138 59006 21452 -3171 -31366
505 -31366 -20840 -17667 -15826 54252 43876 -21451 -49899 -34425 -35388 -33454 -28182 -80580 -75953
492 -75953 -114406 -136614 -158069 -134937 -140538 -91379 -140668 -115505 -101149 -142080 -177142 -201932
480 -201932 -184026 -60579 -55743 -107988 -117213 -100140 -118788 -90988 -134922 -206504 -165339 -160745
468 -160745 -121071 -143543 -156185 -113366 -122350 -123837 -205495 -198120 -127361 -86526 -134298 -88710
456h8710n4077j5233J6872q5375k5068L3264L4038l8159q484O0058N3068j9943
444a37749l2321o8759k3563K5243p9486J714L2532N3347L2930l5467k4319j4893
432b70791K5017P420K2115K6105o3787m066M8055l4960J6916k1032r486J8274
420b40220K2880n3625M3737l0611q1184L9095K7242N5185L9781K3273O751q3542
408b31238j4100L2491k8274n530m5699m0257k6842L3016k2665p1770k1653J5551
396d26970J3492j6639L0321r5027m5614k4372M240J042N3413K3344j07683j772
384e92225Q9390m0694p5470l3192M7325P7510l041j9606q6436k0968J8791K3684
372f14932l019N176P8200o2833j6041N4992N82k1022p477l1407K0880k0862L952
$$ plain form
456 -88710 -142787 -158020 -141148 -226523 -251591 -218327 -184289 -222448 -230932 -170874 -117806 -137749
444 -137749 -170070 -238829 -262392 -237149 -316635 -314921 -282389 -229042 -196112 -231579 -255898 -270791
432 -270791 -245774 -238354 -216239 -190134 -253921 -257987 -209932 -244892 -227976 -249008 -258494 -240220
420 -240220 -217340 -270965 -227228 -257839 -339023 -299928 -272686 -217501 -177720 -154447 -147696 -231238
408 -231238 -245338 -212847 -241121 -246651 -292350 -332607 -359449 -326433 -349098 -420868 -442521 -426970
396 -426970 -413478 -430117 -399796 -494823 -540437 -564809 -560569 -559527 -506114 -482770 -590453 -592225
384 -592225 -502835 -543529 -618999 -652191 -604866 -527356 -530397 -550003 -636439 -657407 -638616 -614932
372 -614932 -617951 -612775 -534575 -597408 -613449 -558457 -557875 -578897 -586374 -617781 -596901 -617763 -613811
359f13811L1267J3710J1609k0117L1623J1316j1566l5711L3160J733l8365Q369
347e76783l1858M2095K4175j682m023p8674j2345q890j6035M0623k4444O485K4878
334f16478R605m2691L2213J0611j6511R819j441M6337J1473O1338j1553L755n6495
321e60018k5412p297k4989K8403K4614O9941J3673q8306p858O4203N8505R487
309d45054q5148L1586L6920k4895j5823J3180m1156k4873K8002J9097K1113O0035
297d27016k6406r6873k546K0038J2014M414R260K8029L5436M060Q595M4551K8914
284c57530l3042L0577m3769J6626M0166p5487n4236M7044M4649J1551o8353M1748
272d00056Q363K7144Q718n1967m994J8777O237J2239k1337R875N119j003J9748
$$ plain form
359 -613811 -582544 -568834 -557225 -577342 -545719 -534403 -545969 -581680 -548520 -546787 -585152 -576783
347 -576783 -608641 -566546 -542371 -544053 -548076 -626750 -639095 -647985 -664020 -623397 -647841 -641356 -616478
334 -616478 -606873 -649564 -617351 -606740 -623251 -613432 -614873 -568536 -557063 -495725 -507278 -503523 -560018
321 -560018 -585430 -592727 -617716 -589313 -564699 -494758 -481085 -569391 -577249 -513046 -454541 -445054
309 -445054 -530202 -498616 -461696 -486591 -502414 -489234 -530390 -555263 -527261 -508164 -487051 -427016
297 -427016 -453422 -550295 -552841 -532803 -520789 -516375 -507115 -479086 -443650 -439590 -430995 -386444 -357530
284 -357530 -390572 -359995 -403764 -387138 -346972 -422459 -476695 -429651 -385002 -373451 -441804 -400056
272 -400056 -391693 -364549 -355831 -407798 -412792 -394015 -387778 -375539 -396876 -387001 -381882 -382885 -363137
259c63137k5225j1508m0970J8547j2436K6926L5419j8696k9022N6110O22p4237
247d37607j00K9842L1125J4442K1621l7718r193K0456r8787o2663Q6205k7545
235d69922k5712R6954k9708k3106q642k7204l1897Q4769O5230j9939m1700k2536
223d53413k069l0940K1541l2343o4764L3735K1002q373o8739J4841P5402L6909
211d57211l4564R32m3199n9439N525j8550k6576K3535Q5468P828o7962J8198J0542
198e55473j9495m2806R053K6329J1191k4909o3751j557l7960LO5139L8337j24500
185g20399p2957J1158k4882k213L4522k9886J3016k2327J1046K3937o697k4943
173h10625l9835k6980q651O8876N7609q6222n6008L2533Q931n6048K32l4630J0507
$$ plain form
259 -363137 -388362 -399870 -440840 -422293 -434729 -407803 -372384 -391080 -420102 -363992 -363370 -437607
247 -437607 -437707 -407865 -376740 -362298 -340677 -378395 -387588 -367132 -465919 -528582 -442377 -469922
235 -469922 -495634 -398680 -428388 -451494 -460136 -487340 -519237 -434468 -369238 -389177 -430877 -453413
223 -453413 -455482 -486422 -464881 -497224 -561988 -528253 -507251 -515624 -584363 -569522 -494120 -457211
211 -457211 -491775 -490843 -534042 -593481 -587956 -606506 -633082 -609547 -524079 -516251 -584213 -566015 -555473
198 -555473 -574968 -617774 -608721 -582392 -571201 -596110 -659861 -661418 -699378 -699375 -634236 -595899 -720399
185 -720399 -793356 -782198 -807080 -809293 -774771 -804657 -791641 -813968 -802922 -778985 -785682 -810625
173 -810625 -850460 -877440 -886091 -817215 -759606 -845828 -901836 -869303 -860372 -916420 -916188 -950818 -940311
160i40311O908J3043m4520o0226L9554L4717j1246r4479j4766L4371M4763m6490
148a038682K0150L4964o0365L4220M0948r7314J4899M6520l4638L0374l7828p1129
136a117881K0912L9664O6396L9766k2525j056l016L530O9545l229j023Q215l7453
123i38155L5138J30762L2702M8098N1165L8021J12841Q9447J19588J54200J50761
112B4568J22134J17273J34337R2627P4341J20813J42407J99613K17089K51985
102A497187K21203J91420K98815M36177N69357P18446R86670J195181J279529
93G393985J249070J322652J105050R82010O78284m19095j596977j889415j549914
84G275650j028728o80924o76342n90070m84993n14650m64159m19607m34259l56807
$$ plain form
160 -940311 -933403 -920360 -964880 -1025106 -985552 -950835 -962081 -1056560 -1071326 -1036955 -992192 -1038682
148 -1038682 -1018532 -983568 -1043933 -1009713 -968765 -1066079 -1051180 -1004660 -1039298 -1008924 -1046752 -1117881
136 -1117881 -1096969 -1057305 -990909 -951143 -973668 -974724 -977740 -974210 -904665 -907894 -908917 -900702 -938155
123 -938155 -903017 -772255 -739553 -691455 -640290 -602269 -489428 -399981 -280393 -126193 24568
112 24568 146702 263975 398312 490939 565280 686093 828500 1028113 1245202 1497187
102 1497187 1718390 1909810 2208625 2644802 3214159 3932605 4919275 6114456 7393985
93 7393985 8643055 9965707 11070757 12052767 12731051 12311956 10714979 8825564 7275650
84 7275650 6246922 5565998 4889656 4299586 3814593 3299943 2835784 2416177 1981918 1625111
74A625111l34857l44000k87422k70925k17280j64905j59648j13876j44395p5667
64d87864q3014j21463j15486l5761l8104r3697n7918o136l5372k0601K6487n2552
52a121481j1554m4812k5024k3633J5869q545r8519O5553m3194J1272O8732p048
40a222384k9023m473r627J3299M2775r400K3070j476j6799L8586R2549J9045k0102
27a083960J8963M918J5861L3041R7525N7324J7904K1405K9698J6858M8160O0104
15f62199J8560O6180J13854L0943N2944N3809K5618N7613N3921M0155K5144R6055
3b7403P2687L1486J12727
0A89497
$$ plain form
74 1625111 1290254 946254 658832 387907 170627 5722 -153926 -267802 -412197 -487864
64 -487864 -570878 -692341 -807827 -843588 -881692 -975389 -1033307 -1039443 -1074815 -1095416 -1068929 -1121481
52 -1121481 -1133035 -1177847 -1202871 -1226504 -1210635 -1219180 -1317699 -1252146 -1295340 -1284068 -1215336 -1222384
40 -1222384 -1251407 -1255880 -1265507 -1252208 -1209433 -1218833 -1195763 -1197239 -1214038 -1175452 -1082903 -1063858 -1083960
27 -1083960 -1064997 -1060079 -1044218 -1011177 -913652 -856328 -838424 -817019 -787321 -770463 -722303 -662199
15 -662199 -643639 -577459 -463605 -432662 -379718 -325909 -300291 -242678 -188757 -148602 -123458 -27403
3 -27403 45284 76770 189497
0 189497
$$ Imaginary data points
##PAGE= N=2
##DATA TABLE= (X++(I..I)), XYDATA
16383h770076J12884Q6262K7426Q7506J54466O5870O9431Q7457O4687P2336Q7036
16372g854715O7775Q3911R4786J21860Q5565Q0330R8956R5277R3774R3449P1926
16361f867106L6099J17163Q0215N6955J06011Q4559M9749Q3719J04263R5052L9996
16350f013325R8941J37932K1846J06149P8107L2540M2641O5459J29153O8005P6543
16339e156009J27212R1676N9388O1507N5824O7315P4905P6565R9292J9819P7561
16328d344945O4951R6364R1857M0155N4863P1670J04720M0183Q9378O5908N8339
16317c566557R6496L8864P1100P1006R3716N1128L1982K1077P4381P8635O5776
16306b872396L3937O1405P1523J09644J05868J3112O3897M6100M6210N9395M5678
$$ plain form
16383 -8770076 -8657192 -8570930 -8543504 -8455998 -8301532 -8235662 -8166231 -8078774 -8014087 -7941751 -7854715
16372 -7854715 -7786940 -7703029 -7608243 -7486383 -7400818 -7320488 -7221532 -7126255 -7032481 -6939032 -6867106
16361 -6867106 -6831007 -6713844 -6633629 -6576674 -6470663 -6386104 -6336355 -6252636 -6148373 -6053321 -6013325
16350 -6013325 -5914384 -5776452 -5754606 -5648457 -5570350 -5537810 -5495169 -5429710 -5300557 -5232552 -5156009
16339 -5156009 -5028797 -4937121 -4877733 -4816226 -4760402 -4693087 -4618182 -4541617 -4442325 -4422506 -4344945
16328 -4344945 -4279994 -4183630 -4091773 -4051618 -3996755 -3925085 -3820365 -3780182 -3690804 -3624896 -3566557
16317 -3566557 -3470061 -3431197 -3360097 -3289091 -3195375 -3144247 -3112265 -3091188 -3016807 -2938172 -2872396
16306 -2872396 -2838459 -2777054 -2705531 -2595887 -2490019 -2476907 -2413010 -2366910 -2320700 -2261305 -2215627
16295b215627J14461O8881O5664M6895M3275O8770P3462M4479J1281Q8352J03808
16284a486299o745P6680N7077N4606J22652n891N4919M7424J17305L8587j3941
16273i43626K3174Q4763L3398N1665Q5335M8554K3999R4700L1866M5879O3164
16262c57129j4490L6889Q4974N5712K0532K6939K8195P8901N965N4267J07297
16251A28052L3977L9986N5836K0298R4420M6235j9461J2201P8363R3359M6161
16240F29427L0688P4299L6256J8438L8686P155J9440J8442Q1359j742o3715p278
16228H81455P5331J38377J5428L719J04995O4278K9243K3517N5729l8568L0788
16217A384292M1153O620L8339k4009r120J05229L1214n2372N9598M5277M4811
$$ plain form
16295 -2215627 -2101166 -2032285 -1966621 -1919726 -1876451 -1807681 -1734219 -1689740 -1678459 -1590107 -1486299
16284 -1486299 -1493044 -1416364 -1359287 -1304681 -1182029 -1187920 -1133001 -1085577 -968272 -929685 -943626
16273 -943626 -920452 -835689 -802291 -750626 -665291 -616737 -592738 -498038 -466172 -420293 -357129
16262 -357129 -371619 -334730 -249756 -194044 -173512 -146573 -118378 -39477 -33512 20755 128052
16251 128052 162029 202015 257851 278149 372569 418804 399343 411544 489907 583266 629427
16240 629427 660115 734414 770670 789108 827794 834949 854389 872831 954190 952448 888733 881455
16228 881455 956786 1095163 1110591 1114310 1219305 1283583 1312826 1336343 1392072 1353504 1384292
16217 1384292 1425445 1432065 1470404 1446395 1437275 1542504 1573718 1521346 1580944 1626221 1671032
16206A671032K1254o599L7302Q49J24067J36470n2403l2762J2891l2002N4009
16195A934108M6707L8535L8425K4090M0154J0789M7521K2405K4976o2182J499
16184B167027K4638J4379N4781l0982L1169N3323K4192l4052P7287R6083m9936
16173B427909l0303N8877N4756n015k9234K5413K5362K0704M2337L1050j9441
16162B602415M1790J1027K1023P5633L0443R106k2736k7628k7762L186K6118k5613
16150B717002O733J16556O0382R063R845J6599m8197k0377j8342K0554N8287J9058
16138B947163m9421L6229O2920M2318n9828N648P2312l2893k5823M9095N3985
16127C101705j4963j94l3842n527N2378K7395k3769P8051k708m0115N1853j6345
$$ plain form
16206 1671032 1692286 1685687 1722989 1723838 1847905 1984375 1931972 1899210 1912101 1880099 1934108
16195 1934108 1980815 2019350 2057775 2081865 2122019 2132808 2180329 2202734 2227710 2165528 2167027
16184 2167027 2191665 2206044 2260825 2229843 2261012 2314335 2338527 2304475 2381762 2477845 2427909
16173 2427909 2397606 2456483 2511239 2506224 2476990 2502403 2527765 2548469 2590806 2621856 2602415
16162 2602415 2644205 2655232 2676255 2751888 2782331 2791437 2768701 2741073 2713311 2716497 2742615 2717002
16150 2717002 2723735 2840291 2900673 2909736 2919581 2936180 2887983 2867606 2849264 2869818 2928105 2947163
16138 2947163 2897742 2933971 2996891 3039209 2979381 2985029 3057341 3024448 2998625 3047720 3101705
16127 3101705 3086742 3086548 3052706 3047179 3099557 3126952 3103183 3181234 3178526 3138411 3190264 3173919
16115C173919j4714M5674K0814l8105J0678n1495N673O4036K545k8521N2738K4192
16103C267434l3793j8114m798l9206L6665O5138P473n9661L2950L1420j4620n81
16091C270307L547j8705m0174M3647J1201k7572K856K348J4897M4224K3608P760
16079C337944m7294J8211L423k2881j5948L54M52j8748J12763m674J9548O6577
16067C449727q2643l9163J6543R41M1923J6806m2455O1718k1911m8233M8284k2017
16055C379520K091j0385L7928j1358m209Q269n7042k2200N9815M7651o5817L5767
16043C400030L7033J8229j8232K6k5577J4566N4473o1771L1007L7384m3580m7853
16031C395735k034N1012k5579L5063L2009m851L2533o9338q5594M351N0114M2641
$$ plain form
16115 3173919 3159205 3204879 3225693 3187588 3198266 3146771 3152444 3216480 3219025 3190504 3243242 3267434
16103 3267434 3233641 3215527 3210729 3171523 3208188 3273326 3280799 3221138 3254088 3285508 3270888 3270307
16091 3270307 3273854 3255149 3214975 3258622 3269823 3242251 3245107 3247455 3262352 3306576 3330184 3337944
16079 3337944 3290650 3308861 3312284 3289403 3273455 3273809 3274261 3255513 3368276 3363602 3383150 3449727
16067 3449727 3367084 3327921 3344464 3345405 3387328 3404134 3361679 3423397 3401486 3353253 3401537 3379520
16055 3379520 3381611 3371226 3409154 3397796 3393587 3401856 3344814 3322614 3382429 3430080 3364263 3400030
16043 3400030 3437063 3455292 3437060 3437086 3411509 3426075 3480548 3418777 3449784 3487168 3443588 3395735
16031 3395735 3393701 3444713 3419134 3454197 3486206 3481355 3513888 3444550 3358956 3363307 3413421 3456062
16019C456062n6313k7895O8529M0510l3261k0630m7614R935k46N4718o8796o05
16007C374394L9306P9482M2925n278o7706m575K6088L196o3497m7211j7570Q977
15995C368531L8008P5425K3401l3252j2677k075M1747k9055M3373n158N975o0586
15983C453657j4399m5954r030M2226O5966q9431M2347M1843n0424J6611j3523
15972C439889j8008m4090M973k7231K0310K5407L1104k0400M1485Q4449j4683
15961C523205l9952J3046N466n9652J8616L2066l5816j8844m1984K8681M8323
15950C473155J8705j2804k2053R996o6724J3938R126j9235o2790p61M6612J9420
15938C406585m482m096J0290J342M7602J0733K2337k2898m012k9574P7171R815
$$ plain form
16019 3456062 3399749 3371854 3440383 3480893 3447632 3427002 3379388 3389323 3389077 3443795 3374999 3374394
16007 3374394 3413700 3493182 3536107 3530829 3463123 3458548 3484636 3487832 3424335 3377124 3359554 3368531
15995 3368531 3406539 3481964 3505365 3472113 3459436 3457361 3499108 3470053 3513426 3508268 3514243 3453657
15983 3453657 3439258 3393304 3384274 3426500 3492466 3403035 3445382 3487225 3436801 3453412 3439889
15972 3439889 3421881 3377791 3382764 3355533 3375843 3401250 3432354 3411954 3453439 3537888 3523205
15961 3523205 3483253 3496299 3501765 3442113 3460729 3492795 3456979 3438135 3396151 3424832 3473155
15950 3473155 3491860 3479056 3457003 3466999 3400275 3414213 3423339 3404104 3341314 3340553 3387165 3406585
15938 3406585 3402103 3398007 3408297 3409639 3457241 3467974 3490311 3467413 3463401 3433827 3510998 3520813
15926C520813n3689K9514o2621K5588N3996J0212o4513J2085N5551j1596j9598
15915C495742k9370k4643M339L7034K5179j5630J7362o8610n2516M6765P1895
15904C507547J6970m6554m1423m5415j1673M6445J4296N4677p6585J0000J15743
15893C544028m9766l7994K2538k2728K0695J7102J3400k8114k7108J0315r408
15882C452960O4769m4299m2172L5214n208L9534j1023k6309n9585M6023R310K3571
15870C482785L1842l4316K2458m8829l3161K5248q978N7734j855l1460P8066l4887
15858C504647o6964L1996L8912p344K7655m8201J2524p6084q705o056m1055N1012
15846C412337Q6139l1637j1758L7489M0075o887k9269K703l5755l4072J8725L030
$$ plain form
15926 3520813 3467124 3496638 3434017 3459605 3513601 3523813 3459300 3471385 3526936 3515340 3495742
15915 3495742 3466372 3441729 3446068 3483102 3508281 3492651 3510013 3441403 3388887 3435652 3507547
15904 3507547 3524517 3477963 3436540 3391125 3379452 3425897 3440193 3494870 3418285 3428285 3544028
15893 3544028 3494262 3456268 3478806 3456078 3476773 3493875 3507275 3479161 3452053 3462368 3452960
15882 3452960 3517729 3473430 3431258 3466472 3461264 3500798 3489775 3463466 3403881 3449904 3459214 3482785
15870 3482785 3514627 3480311 3502769 3453940 3420779 3446027 3437049 3494783 3492928 3461468 3539534 3504647
15858 3504647 3437683 3469679 3508591 3501247 3528902 3480701 3493225 3417141 3408436 3402380 3361325 3412337
15846 3412337 3498476 3466839 3455081 3492570 3532645 3525758 3496489 3499192 3463437 3429365 3448090 3451120
15834C451120J8219j4768l9899P2277J3171J9412k8011L9414J0867j8038k7809
15823C495955R817Q9950j5558o7350M0803L0229k5356K817M1354m9266q6971J1613
15811C478037K3171K7950j0741m369l5880q049o4574N5634N7632n2063O802L7664
15799C511214N532J584k5290k064J3164j1359l6408L5665M9413L222n3464J5450
15787C506659J958Q078l262q2723J0033K7917P1042M860l4539L5005N5340m3819
15775C556549l8637M2171p050j1094L0465j7918n3211l2121L9848k625N7748M22
15763C564547k323J134r99p1025k1934J8642l48l113l8249L8688k8031k5636K9065
15750C460418P9012k3308J0308l1775m3115K4351R2313m3286m7866M1421r5064
$$ plain form
15834 3451120 3469339 3454571 3414672 3486949 3500120 3519532 3491521 3530935 3541802 3523764 3495955
15823 3495955 3505772 3595722 3580164 3512814 3553617 3583846 3558490 3561307 3602661 3553395 3466424 3478037
15811 3478037 3501208 3529158 3518417 3514048 3478168 3470119 3405545 3461179 3518811 3466748 3473550 3511214
15799 3511214 3516746 3518330 3493040 3490976 3504140 3492781 3456373 3492038 3541451 3544673 3491209 3506659
15787 3506659 3508617 3516695 3513433 3430710 3440743 3468660 3539702 3544562 3510023 3545028 3600368 3556549
15775 3556549 3517912 3560083 3553033 3541939 3572404 3554486 3501275 3469154 3509002 3506377 3564125 3564547
15763 3564547 3562224 3563358 3562359 3491334 3469400 3488042 3487694 3484581 3446332 3485020 3456989 3431353 3460418
15750 3460418 3539430 3516122 3526430 3494655 3451540 3475891 3568204 3524918 3477052 3518473 3423409
15739C423409k5724O9617J7806j8322j6056Q3223l228N6539j1533p6905m2229
15728C456597Q0742P0522m8694n3389J0870Q464n408K3303k7085M1630J5631n2297
15716C520886k9968O0857j1133m6739r0923P1645N117k1854p786r7k2077N174
15704C433102M4332k8845N5849n057l1344L2259m862k1527l1347J5572K5176j6987
15692C466321l8176P6256L6651O216j5050l6407o9481N0319N2144K0677k8613
15681C520857j9286n0383M764J1023J5229O0881k486k0179m0772R2715K2634p4945
15669C520052k7548L693p4575Q3102J8118K8327j3384m9053j3397j6165l197l2759
15657C423214N6775J5081J0640k7870r755j1334k1839P1158K2794o7145j6146
$$ plain form
15739 3423409 3397685 3467302 3485108 3466786 3450730 3533953 3530725 3587264 3575731 3498826 3456597
15728 3456597 3537339 3607861 3559167 3505778 3516648 3525112 3519704 3543007 3515922 3557552 3573183 3520886
15716 3520886 3490918 3551775 3540642 3493903 3402980 3474625 3479742 3457888 3450102 3450005 3427928 3433102
15704 3433102 3477434 3448589 3504438 3499381 3468037 3500296 3495434 3473907 3442560 3458132 3483308 3466321
15692 3466321 3428145 3504401 3541052 3547268 3532218 3495811 3426330 3476649 3528793 3549470 3520857
15681 3520857 3501571 3451188 3455952 3466975 3482204 3543085 3540599 3520420 3479648 3572363 3594997 3520052
15669 3520052 3492504 3496197 3421622 3504724 3522842 3551169 3537785 3488732 3475335 3459170 3455973 3423214
15657 3423214 3479989 3495070 3505710 3477840 3468085 3456751 3434912 3506070 3528864 3461719 3445573
15646C445573J4036P1794K8932J2136n9943J8718N5170r4065L106L4269r731K4033
15634C544028m3147K5319j4870M853L7909p393k6758M895L5408q6383L0656L502
15622C508019L1843M3029K479K5591m3737o2821j4448M6162M5379j1860r0327
15611C479309J2079k5593j871M637k2486L4013L0535M73M1782P8336r6468M0064
15599C574810O7939N251n0150j8161l6856j6338P6033J9992j32903n7508J6927
15588C449036N415L7030J4905K5J04178n2172k0308k6317K8654j3991l4614K0933
15576C512774J1875P9854k7818n1300j3148K0062j5406k9716N092O7444p589K896
15564C555020J7067K1136o7532n455L9473K2727r1176m337N6693m394L6038k4702
$$ plain form
15646 3445573 3459609 3531403 3560335 3572471 3512528 3531246 3586416 3492351 3495457 3529726 3519995 3544028
15634 3544028 3500881 3526200 3511330 3516183 3554092 3546699 3519941 3524836 3560244 3473861 3504517 3508019
15622 3508019 3539862 3582891 3585370 3610961 3567224 3504403 3489955 3536117 3581496 3569636 3479309
15611 3479309 3491388 3465795 3463924 3468561 3446075 3480088 3510623 3511096 3552878 3631214 3534746 3574810
15599 3574810 3642749 3648000 3597850 3579689 3542833 3526495 3602528 3622520 3489617 3432109 3449036
15588 3449036 3454451 3491481 3506386 3506411 3610589 3558417 3538109 3511792 3540446 3526455 3491841 3512774
15576 3512774 3524649 3604503 3576685 3525385 3512237 3532299 3516893 3487177 3492269 3559713 3552124 3555020
15564 3555020 3572087 3593223 3525691 3520236 3559709 3582436 3491260 3486923 3543616 3539222 3575260 3550558
15552C550558M9992o3901j664O4704m7397M9753N426k6415j6057o16L1990j869
15540C594504k4922P3617o0489n6953P2509k5545J8268N3246l3296q7077K396
15529C526258k1958K3797L1591O4261O037n4301R129O32J7M4050n8272o3858l7206
15516C470177r981j8024O8659l013O264R2140N2221m428j22730j5320j0225O2333
15504C568073m162l1449l8735k767J301K6728M1850M377O0643J5693l0960l3025
15492C577567k4010N0364j2603k7062N9725o2363l4131J8166N0836L2192j6564
15481C612117m3669l6687l523l4494m43r269m0175N9709M0890J2849Q001k4095
15469C541211L068k1013J13700r9362r4178Q5378J1168j551m7364L9703K2284
$$ plain form
15552 3550558 3600550 3536649 3534985 3599689 3552292 3602045 3607471 3581056 3564999 3564383 3596373 3594504
15540 3594504 3569582 3643199 3582710 3525757 3598266 3572721 3590989 3644235 3610939 3523862 3526258
15529 3526258 3504300 3528097 3559688 3623949 3629986 3575685 3584814 3585446 3585463 3629513 3571241 3507383 3470177
15516 3470177 3460196 3442172 3510831 3507818 3514082 3606222 3658443 3654015 3531285 3515965 3505740 3568073
15504 3568073 3563911 3532462 3493727 3490960 3492261 3518989 3560839 3565216 3625859 3641552 3610592 3577567
15492 3577567 3553557 3603921 3591318 3564256 3623981 3561618 3527487 3545653 3596489 3628681 3612117
15481 3612117 3568448 3531761 3528238 3493744 3493301 3484032 3443857 3503566 3544456 3557305 3565306 3541211
15469 3541211 3544279 3523266 3636966 3537604 3443426 3528804 3539972 3538421 3491057 3530760 3553044
15458C553044p055L3314j3902q1020j4697O8969M69P2645m1668M2974j1636P9317
15446C680754l8031l3257N0976o3908o379J1801m9257l439O2952j7106K5905N54
15434C621565K8799r8411l2105M6152j9721J0661r439K9010m5574O1503L8735
15423C631175j182M5545K6056o8998o0683Q516R7986j0004m1514m4399o1921M5407
15411C565984L2563j6108J076O709O726J1959j9805O7612k1762P453k5361m450
15399C612596k653o816j9254Q0933m2146o2811M7535k7720M2413q1175n2445P3417
15387C561874M0930N111o2998K9966j3733j1538P3158O5625n939n3564k5823M8546
15375C651615l8366L6415l2233j6491j132L3678j601M435n6953O289L8838L1798
$$ plain form
15458 3553044 3545989 3579303 3565401 3484381 3469684 3538653 3539122 3611767 3570099 3613073 3601437 3680754
15446 3680754 3642723 3609466 3660442 3596534 3590155 3601956 3552699 3549260 3612212 3595106 3621011 3621565
15434 3621565 3650364 3551953 3519848 3566000 3546279 3556940 3547501 3576511 3530937 3592440 3631175
15423 3631175 3629993 3675538 3701594 3632596 3571913 3580429 3678415 3668411 3626897 3582498 3520577 3565984
15411 3565984 3598547 3582439 3583515 3590224 3596950 3608909 3589104 3656716 3634954 3642407 3617046 3612596
15399 3612596 3609943 3603127 3583873 3664806 3622660 3559849 3607384 3579664 3622077 3540902 3488457 3561874
15387 3561874 3602804 3607915 3544917 3574883 3561150 3549612 3622770 3688395 3682456 3628892 3603069 3651615
15375 3651615 3613249 3649664 3617431 3600940 3599808 3633486 3631885 3636320 3579367 3585656 3624494 3656292
15363C656292k1888p0683K8993P3320J5889J3872o8359o3836j5911j96L7253N431
15351C590177L9087N8687K7421m5559n6827j2190Q7650N4848m1958k3978J5845
15340C693203l6282l6901m3639L1669N8351q516o6592K2363J6093n5559m1952
15329C532238n7741l5543Q0304J4990N6629N6158k2251O20K1583N3636L5489L4138
15317C770250n0540r6546k9876j8615o707Q1321n5693P349K1823M7548O0987l1898
15305C699403j9254p7171N0639q559k1684j7601M2831n5677O641l318j7325j3789
15293C565136N6534k8396K5765k0806J0236k9289K2329P2620K0778K0043m1680
15282C673270n4179K0378O112j4627J0654j6214L582L3795p768o5542N1524M8753
$$ plain form
15363 3656292 3634404 3563721 3592714 3666034 3681923 3695795 3627436 3563600 3547689 3547493 3584746 3590177
15351 3590177 3629264 3687951 3715372 3669813 3612986 3600796 3688446 3743294 3701336 3677358 3693203
15340 3693203 3656921 3620020 3576381 3608050 3666401 3657885 3591293 3613656 3629749 3574190 3532238
15329 3532238 3474497 3438954 3519258 3534248 3590877 3647035 3624784 3625404 3646987 3700623 3736112 3770250
15317 3770250 3719710 3623164 3593288 3574673 3567966 3649287 3593594 3600943 3622766 3670314 3731301 3699403
15305 3699403 3680149 3602978 3653617 3645058 3623374 3605773 3648604 3592927 3599568 3596250 3578925 3565136
15293 3565136 3621670 3593274 3619039 3598233 3608469 3579180 3601509 3674129 3694907 3714950 3673270
15282 3673270 3619091 3639469 3645581 3630954 3641608 3625394 3628976 3662771 3655003 3589461 3640985 3689738
15270C689738N3517p547K8159j00557k4427m857K2469o373j5605l8753M1541K2215
15258C659520n8860l1077L5087K9964k304O9016l4641o771o8184l6685J3204O7067
15246C635336k8982J2730L8570j2002O6820m2488k1799K0032r805j33002K2363
15235C547773J0537O5339P423n289m3224j8046K139M0649O4305j5757N356k6356
15223C634849L8135M2968n3142k9153M8466o8852J2429J3561P158N541J5405q311
15211C659054o3141L1495L0473o1032m954R975M4855N9634L2873m5737j0981m2666
15199C639848o926O1045L9160n4300O700j2509l197k9866J397P4837l8501o3411
15187C614277J6875l7596R805M9460K9980N4789q7153n3897O9248Q572n848n4866
$$ plain form
15270 3689738 3743255 3735708 3763867 3663310 3638883 3634026 3656495 3650122 3634517 3595764 3637305 3659520
15258 3659520 3600660 3569583 3604670 3634634 3632330 3701346 3666705 3659934 3591750 3555065 3568269 3635336
15246 3635336 3606354 3619084 3657654 3645652 3712472 3669984 3648185 3668217 3658412 3525410 3547773
15235 3547773 3558310 3623649 3631072 3625783 3582559 3564513 3566652 3607301 3671606 3655849 3661205 3634849
15223 3634849 3672984 3715952 3662810 3633657 3682123 3613271 3625700 3639261 3646419 3651960 3667365 3659054
15211 3659054 3595913 3627408 3657881 3596849 3591895 3601870 3646725 3706359 3739232 3693495 3682514 3639848
15199 3639848 3632922 3693967 3733127 3678827 3685527 3673018 3669821 3639955 3641352 3716189 3677688 3614277
15187 3614277 3631152 3593556 3603361 3652821 3682801 3737590 3650437 3596540 3665788 3674360 3668512 3613646
15175C613646p123M2129k8185J5327k1678O1484L8829j17165m3536P7517O0091
15164C691336J8849q436J9780n6472k346k3675N4812J2539k0334m6253P833n505
15152C642128J6172N7653j9818o8406J6035J2798j3429O8178K718o2561q783K2529
15140C665214j8741M982K9884j690J876j0309K8744J2366M2990O941p8207N1497
15128C735547M290J112r319l471m473L3815n0691k62l6959m8908J01260J9483
15116C741424o2144j7120J0628Q953j7694J2064O0250l0280J5375n3134n043N6042
15104C719321m492L9721m3585j5049J0868l0752R4985m623o1360k6395L1191m1815
15092C668015K0540J7166j6892o3148O69O4312K634R947j2038K4953J6796j524
$$ plain form
15175 3613646 3606523 3648652 3620467 3635794 3614116 3675600 3714429 3597264 3553728 3631245 3691336
15164 3691336 3710185 3701749 3721529 3665057 3662711 3639036 3693848 3706387 3686053 3639800 3647633 3642128
15152 3642128 3658300 3715953 3696135 3627729 3643764 3656562 3643133 3711311 3714029 3651468 3642685 3665214
15140 3665214 3646473 3651455 3681339 3679649 3681525 3671216 3699960 3712326 3755316 3762257 3684050 3735547
15128 3735547 3739837 3740949 3731630 3728159 3723686 3757501 3706810 3706548 3669589 3620681 3721941 3741424
15116 3741424 3679280 3662160 3672788 3681741 3664047 3676111 3736361 3706081 3721456 3668322 3663279 3719321
15104 3719321 3714829 3754550 3710965 3695916 3706784 3676032 3771017 3766394 3705034 3678639 3709830 3668015
15092 3668015 3688555 3705721 3688829 3625681 3626350 3690662 3693296 3703243 3691205 3716158 3732954 3731430
15080C731430q374j888K7925K3173l9161l3741J815N560m6869L9419L8183j6091
15068C721381n4869K6265j8975K6515K4044n3890L9064M1242Q239M8804o8911
15057C738909o5167M1309K1720n6183L104M6123o1486L6484j5918J5742J2366
15046C717003k7722M1537k7030K946O0580j7703n3699K3347K0718m6514p5718
15035C617745J5489O5047K3977k489P520k8191J4218j6003J3134L3932l1859n3205
15023C659315M911J5242M0031R008Q2126k7984q7735N3308o88n1020l8163j0844
15011C647507J0073J9397Q608m820l2938k544M7079P0386j8336o2412j1370L8901
14999C709531N1025K4227r9293k400N4964J3434N876q4366l9791J06102N0496
$$ plain form
15080 3731430 3723056 3721168 3749093 3772266 3733105 3699364 3701179 3706739 3659870 3699289 3737472 3721381
15068 3721381 3666512 3692777 3673802 3700317 3724361 3670471 3709535 3750777 3759016 3807820 3738909
15057 3738909 3673742 3715051 3736771 3680588 3683692 3729815 3668329 3704813 3688895 3704637 3717003
15046 3717003 3689281 3730818 3703788 3706734 3767314 3749611 3695912 3719259 3739977 3693463 3617745
15035 3617745 3633234 3698281 3722258 3719769 3727289 3699098 3713316 3697313 3710447 3744379 3712520 3659315
15023 3659315 3664226 3679468 3719499 3728507 3810633 3782649 3694914 3748222 3747534 3696514 3658351 3647507
15011 3647507 3657580 3676977 3685585 3680765 3647827 3645283 3692362 3762748 3744412 3682000 3670630 3709531
14999 3709531 3760556 3784783 3685490 3683090 3738054 3751488 3757364 3672998 3633207 3739309 3789805
14988C789805m5910P097m9983r571n375M901J1134K5161j375j1103o431m2817
14976C665533n5662P2274J1058L1444L1603k8787n489L0367O5110o930j4173n2681
14964C743667j6148l1016N0202O9389p2384N280j8639k8412J00511l3337M4122
14953C813235n1768k3915O2793l6596k0692K781m4788l508L2320K4385n0157o679
14941C697411N1564Q408L5153M1371r0953R816J3030l8997m403M3921m522K7608
14929C789407j4233M940K8651L5855r1343n4075M0332N3189L9194l2333m435l3530
14917C761619l3755J6179K5829l3886k990k6359p747N651Q444K1282K7973L577
14905C765817J3665O313K1526m6077M581n7260Q884L4730J0018l6953K8770m9366
$$ plain form
14988 3789805 3743895 3750992 3701009 3691438 3686063 3690964 3702098 3727259 3725884 3714781 3708350 3665533
14976 3665533 3609871 3682145 3693203 3724647 3756250 3727463 3721974 3752341 3817451 3810521 3796348 3743667
14964 3743667 3727519 3696503 3746705 3816094 3743710 3748990 3730351 3701939 3802450 3769113 3813235
14953 3813235 3761467 3737552 3800345 3763749 3743057 3745838 3701050 3697542 3729862 3754247 3704090 3697411
14941 3697411 3748975 3757383 3792536 3833907 3742954 3752770 3765800 3726803 3722400 3766321 3761799 3789407
14929 3789407 3775174 3780114 3808765 3844620 3753277 3699202 3739534 3792723 3831917 3799584 3795149 3761619
14917 3761619 3727864 3744043 3769872 3735986 3732996 3706637 3698890 3704541 3712985 3734267 3762240 3765817
14905 3765817 3779482 3785795 3807321 3761244 3765825 3708565 3717449 3752179 3762197 3725244 3754014 3704648
14893C704648j7443M1251J9503n878K0360P5148m1891l2767K9335l9392l2441
14882C720433L6426l5716j507J1133L4342M0608R899J2670p1310P637K9718j7449
14870C776884J8726l1154n9415K4222M9228k302K2593K3953j7591j219m3518K8331
14858C788738M897J0305p633m0477L7948j7921l1278q3214N2372M3947p3218M057
14846C688523J9384O031N6579o1994O4057k624n0359k4111M2976J9479J866K7516
14834C787323k1492n2606m897N0592L4021r63P756j170L6061M55n7780J9094r0571
14821C705823k6400M9426N7326o12n6036k9901K0435l2323M1674M3447l7506k2238
14809C713115j0609J7491J09726J1929n0083o4697J2585L1218o2793n9001O3118
$$ plain form
14893 3704648 3687205 3728456 3747959 3742081 3762441 3837589 3795698 3762931 3792266 3752874 3720433
14882 3720433 3756859 3721143 3719636 3730769 3765111 3805719 3815618 3828288 3756978 3764615 3794333 3776884
14870 3776884 3795610 3764456 3705041 3729263 3778491 3776189 3798782 3822735 3805144 3803925 3760407 3788738
14858 3788738 3793635 3803940 3796307 3755830 3793778 3775857 3744579 3661365 3713737 3757684 3684466 3688523
14846 3688523 3707907 3713938 3770517 3708523 3772580 3769956 3719597 3695486 3738462 3757941 3759807 3787323
14834 3787323 3765831 3713225 3708328 3758920 3792941 3791978 3799734 3798564 3834625 3835080 3777300 3796394 3705823
14821 3705823 3679423 3728849 3786175 3785563 3729527 3699626 3720061 3687738 3729412 3772859 3735353 3713115
14809 3713115 3702506 3719997 3829723 3841652 3791569 3726872 3739457 3770675 3707882 3648881 3711999
14798C711999J00670k7205J5935P833J8197n4955p378K7763n6405O9284L9966
14787C845704k3767J7655K3981o4768R60r127r2888J6122J27544L76n0169mj6987
14774C774632n6101r802k8093L1720L5272M0782M1647p3222P5951Q631o2323L0208
14762C809302P2011J8215n3166K042J8096k7673q9069m6995R4467L8830l8367
14751C797693J4596j7332j9949j2823l0793m2510Q8838N1871j2245J4199m3408
$$ plain form
14798 3711999 3812669 3785464 3801399 3809232 3827429 3772474 3765096 3792859 3736454 3805738 3845704
14787 3845704 3821937 3839592 3863573 3798805 3799765 3790638 3697750 3713872 3841416 3841792 3791623 3791619 3774632
14774 3774632 3718531 3708729 3680636 3712356 3747628 3788410 3830057 3756835 3832786 3841417 3779094 3809302
14762 3809302 3881313 3899528 3846362 3848404 3866500 3838827 3749758 3702763 3797230 3836060 3797693
14751 3797693 3812289 3794957 3775008 3762185 3731392 3688882 3777720 3829591 3817346 3831545 3788137
$$ [...]
##END NTUPLES=NMR SPECTRUM
##END=
