##TITLE=1H_DE-80H_X3
 200.13MHz, d2o
 8 sc
 
 19ns.26.2.2025
##JCAMPDX= 6.0         $$ Bruker NMR JCAMP-DX V2.0
##DATA TYPE= NMR SPECTRUM
##DATA CLASS= NTUPLES
##ORIGIN= UXNMR, Bruker Analytische Messtechnik GmbH
##OWNER= pz
$$ XWIN-NMR		Version 3.5
$$ Tue Oct 14 15:19:55 2025 Russian Standard Time (UT+4h)  Yarkov@DPX200
##.OBSERVE FREQUENCY= 200.1313
##.OBSERVE NUCLEUS= ^1H
##.ACQUISITION MODE= SIMULTANEOUS
##.ACQUISITION SCHEME= undefined
##.AVERAGES= 8
##.DIGITISER RES= 18
##SPECTROMETER/DATA SYSTEM= spect
##.PULSE SEQUENCE= zg30
##.SOLVENT NAME= CDCl3
##.SHIFT REFERENCE= (INTERNAL, CDCl3, 0, 17.9748)
##AUDIT TRAIL= $$ (NUMBER, WHEN, WHO, WHERE, WHAT)
$$ ##TITLE= Audit trail, XWIN-NMR		Version 3.5
$$ ##JCAMPDX= 5.01
$$ ##ORIGIN= Bruker BioSpin GmbH
$$ ##OWNER= Yarkov
$$ C:/Bruker/XWIN-NMR/data/yarkov2/nmr/H-C/1/pdata/1/auditp.txt
$$ ##AUDIT TRAIL=  $$ (NUMBER, WHEN, WHO, WHERE, WHAT)
(   1,<2025-10-14 15:18:55.10 +0400>,<Yarkov>,<DPX200>,
      <created by zg, POWCHK disabled, PULCHK disabled
       configuration hash MD5:
       00 E9 B6 7A A2 85 ED C7 34 08 36 98 17 FE 4E 26
       data hash MD5: 16K
       C5 84 19 E7 6A CF 9C E3 D5 B4 80 29 53 90 9C 23>)
(   2,<2025-10-14 15:18:59.85 +0400>,<Yarkov>,<DPX200>,
      <Start of raw data processing
       efp BC_mod = 2 LB = 0.25 FT_mod = 6 PKNL = 1 PHC0 = -2800.988 PHC1 = 15.19097 SI = 16K 
       data hash MD5: 16K
       62 7F 18 D1 22 FF 18 41 1B 48 7F 4F EA 8D 49 DE>)
(   3,<2025-10-14 15:19:09.21 +0400>,<Yarkov>,<DPX200>,
      <abs ABSG = 5 
       data hash MD5: 16K
       A5 32 37 0C 88 CC 64 37 56 F4 B7 8A 0A BA 56 05>)
$$ ##END=
$$ 
$$ hash MD5
$$ 9B E3 19 3C F3 B2 18 5A 3B D1 92 F8 4C A0 6F 21
##$RELAX= 
##$RELAX= 
##$RELAX= 
##$RELAX= 
##$RELAX= 
##$RELAX= 
$$ Bruker specific parameters
$$ --------------------------
##$DU= <C:/Bruker/XWIN-NMR>
##$EXPNO= 1
##$NAME= <H-C>
##$PROCNO= 1
##$TYPE= <nmr>
##$USER= <yarkov2>
##$AMP= (0..31)
100 100 100 100 100 100 100 100 100 100 100 100 100 100 100 100 100 100 
100 100 100 100 100 100 100 100 100 100 100 100 100 100 
##$AQSEQ= 0
##$AQ_mod= 1
##$AUNM= <au_zg>
##$AUTOPOS= <>
##$BF1= 200.13
##$BF2= 200.13
##$BF3= 200.13
##$BF4= 200.13
##$BF5= 200.13
##$BF6= 200.13
##$BF7= 200.13
##$BF8= 200.13
##$BYTORDA= 1
##$CFDGTYP= 0
##$CFRGTYP= 5
##$CHEMSTR= <none>
##$CNST= (0..31)
1 1 145 1 1 1 1 1 1 1 1 1 1 1 1 1 1 1 1 1 1 1 1 1 1 1 1 1 1 1 1 1 
##$CPDPRG= <>
##$CPDPRG1= <>
##$CPDPRG2= <>
##$CPDPRG3= <>
##$CPDPRG4= <mlev>
##$CPDPRG5= <mlev>
##$CPDPRG6= <mlev>
##$CPDPRG7= <mlev>
##$CPDPRG8= <mlev>
##$CPDPRGB= <>
##$CPDPRGT= <>
##$D= (0..31)
0 0.7 0 0 0 0 0 0 0 0 0 0.03 0 0 0 0 0 0 0 0 0 0 0 0 0 0 0 0 0 0 0 0 
##$DATE= 1760440734
##$DBL= (0..7)
120 120 120 120 120 120 120 120 
##$DBP= (0..7)
150 150 150 150 150 150 150 150 
##$DBP07= 0
##$DBPNAM0= <>
##$DBPNAM1= <>
##$DBPNAM2= <>
##$DBPNAM3= <>
##$DBPNAM4= <>
##$DBPNAM5= <>
##$DBPNAM6= <>
##$DBPNAM7= <>
##$DBPOAL= (0..7)
0.5 0.5 0.5 0.5 0.5 0.5 0.5 0.5 
##$DBPOFFS= (0..7)
0 0 0 0 0 0 0 0 
##$DE= 6
$$ [...]
##$SUBNAM3= <"">
##$SUBNAM4= <"">
##$SUBNAM5= <"">
##$SUBNAM6= <"">
##$SUBNAM7= <"">
##$SUBNAM8= <"">
##$SUBNAM9= <"">
##$SW= 18.0517328524113
##$SWIBOX= (0..15)
0 0 2 0 0 0 0 0 0 0 0 0 0 0 0 0 
##$SW_h= 3612.71676300578
##$TD= 16384
##$TD0= 1
##$TE= 0
##$TE2= 300
##$TE3= 300
##$TEG= 300
##$TL= (0..7)
0 120 120 120 120 120 120 120 
##$TP= (0..7)
150 150 150 150 150 150 150 150 
##$TP07= 0
##$TPNAME0= <>
##$TPNAME1= <>
##$TPNAME2= <>
##$TPNAME3= <>
##$TPNAME4= <>
##$TPNAME5= <>
##$TPNAME6= <>
##$TPNAME7= <>
##$TPOAL= (0..7)
0.5 0.5 0.5 0.5 0.5 0.5 0.5 0.5 
##$TPOFFS= (0..7)
0 0 0 0 0 0 0 0 
##$TUNHIN= 0
##$TUNHOUT= 0
##$TUNXOUT= 0
##$USERA1= <user>
##$USERA2= <user>
##$USERA3= <user>
##$USERA4= <user>
##$USERA5= <user>
##$V9= 5
##$VALIST= <valist>
##$VCLIST= <CCCCCCCCCCCCCCC>
##$VD= 0
##$VDLIST= <DDDDDDDDDDDDDDD>
##$VPLIST= <PPPPPPPPPPPPPPP>
##$VTLIST= <TTTTTTTTTTTTTTT>
##$WBST= 1024
##$WBSW= 4
##$XGAIN= (0..3)
0 0 0 0 
##$XL= 0
##$YL= 0
##$YMAX_a= 610147
##$YMIN_a= -444147
##$ZGOPTNS= <>
##$ZL1= 120
##$ZL2= 120
##$ZL3= 120
##$ZL4= 120
##$ABSF1= 17.95494
##$ABSF2= -0.09695244
##$ABSG= 5
##$ABSL= 3
##$ALPHA= 0
##$AQORDER= 0
##$ASSFAC= 0
##$ASSFACI= 0
##$ASSFACX= 0
##$ASSWID= 0
##$AUNMP= <proc_1d>
##$AZFE= 0.1
##$AZFW= 0.1
##$BCFW= 0
##$BC_mod= 2
##$BYTORDP= 0
##$COROFFS= 0
##$CY= -3
##$DATMOD= 1
##$DC= 0
##$DFILT= <>
##$DTYPP= 0
##$F1P= 0
##$F2P= 0
##$FCOR= 1
##$FTSIZE= 16384
##$FT_mod= 6
##$GAMMA= 0
##$GB= 0
##$INTBC= 1
##$INTSCL= 3.241238e-09
##$ISEN= 128
##$LB= 0.25
##$LEV0= 0
##$LPBIN= 0
##$MAXI= 10000
##$MC2= 0
##$MEAN= 0
##$ME_mod= 0
##$MI= 1.114404
##$NCOEF= 0
##$NC_proc= -7
##$NLEV= 6
##$NOISF1= 3.799351
##$NOISF2= 2.8
##$NSP= 0
##$NTH_PI= 0
##$NZP= 0
##$OFFSET= 17.97477
##$PC= 1
##$PHC0= -2800.988
##$PHC1= 15.19097
##$PH_mod= 1
##$PKNL= yes
##$PPARMOD= 0
##$PSCAL= 0
##$PSIGN= 0
##$REVERSE= no
##$SF= 200.129509077797
##$SI= 16384
##$SIGF1= 3
##$SIGF2= 2
##$SINO= 0.751879
##$SIOLD= 32768
##$SREGLST= <19F.Aceton>
##$SSB= 0
##$STSI= 16384
##$STSR= 0
##$SW_p= 3612.71676300578
##$SYMM= 0
##$S_DEV= 0
##$TDeff= 16384
##$TDoff= 0
##$TI= <>
##$TILT= no
##$TM1= 0
##$TM2= 0
##$TOPLEV= 0
##$USERP1= <user>
##$USERP2= <user>
##$USERP3= <user>
##$USERP4= <user>
##$USERP5= <user>
##$WDW= 1
##$XDIM= 16384
##$YMAX_p= 458979599
##$YMIN_p= -1220845
$$ End of Bruker specific parameters
$$ ---------------------------------
##NTUPLES= NMR SPECTRUM
##VAR_NAME=  FREQUENCY,     SPECTRUM/REAL,   SPECTRUM/IMAG
##SYMBOL=    X,             R,               I
##VAR_TYPE=  INDEPENDENT,   DEPENDENT,       DEPENDENT
##VAR_FORM=  AFFN,          ASDF,            ASDF
##VAR_DIM=   16384,         16384,           16384
##UNITS=     HZ,            ARBITRARY UNITS, ARBITRARY UNITS
##FACTOR=    0.220516191357247, 1,           1
##FIRST=     3597.28181429054, 0,            0
##LAST=      -15.4349487152385, 0,           0
##MIN=       -15.4349487152385, -1220845,    0
##MAX=       3597.28181429054, 458979599,    0
$$ Real data points
##PAGE= N=1
##DATA TABLE= (X++(R..R)), XYDATA
$$ [...]
4051D995673J9236q0788R4234Q2715l0506m897J4338n2549j6682P1085p5071j4358
$$ 4995673 5014909 4934121 5028355 5111070 5080564 5075667 5090005 5037456 5020774 5091859 5016788 5002430
4039E002430J26630R9598J19737M135M2794p5483j64316M8821J64490J24418K7507
$$ 5002430 5129060 5228658 5348395 5352530 5395324 5319841 5155525 5204346 5368836 5493254 5520761
4028E520761j7049P8957J5355J14036M9017j41371O1015J21642L0441K1623n7290
$$ 5520761 5503712 5582669 5598024 5712060 5761077 5619706 5680721 5802363 5832804 5854427 5797137
4017E797137l6015m548J05845m509N6757l6464J62636M5130k3575K08719K3693
$$ 5797137 5761122 5756574 5862419 5857910 5914667 5878203 6040839 6085969 6062394 6271113 6294806
4006F294806j22829L5854K30737R3191P4859J6606L1573j46793R0235L8379L4573
$$ 6294806 6171977 6207831 6438568 6531759 6606618 6623224 6654797 6508004 6598239 6636618 6671191
3995F671191N586L8981M5965l1635J20912J39529M0387k0814J12351O8124k8147
$$ 6671191 6676777 6715758 6761723 6730088 6851000 6990529 7030916 7010102 7122453 7190577 7162430
3984G162430K53528J63533M1887K852K29465J41808L939J60626K54520O9906K25678
$$ 7162430 7415958 7579491 7621378 7624230 7853695 7995503 7999442 8160068 8414588 8484494 8710172
3973H710172L46791J89452J90455J41624N6122J19213L96318J39144K75287K78360
$$ 8710172 9056963 9246415 9436870 9578494 9634616 9753829 10150147 10289291 10564578 10842938
3963A0842938Q0219K02826J95324K699j30093j36990p3403o7294j082P8225J72871
$$ 10842938 10923157 11125983 11321307 11324006 11193913 11056923 10983520 10916226 10915144 10993369 11166240
3952A1166240P0880K4188P0613J98756K13770K15489J34969J8381L17529L23812
$$ 11166240 11237120 11261308 11331921 11530677 11744447 11959936 12094905 12113286 12430815 12754627
3942A2754627L30763J88651K56410L96420L21703L53884N36611N83941M13358
$$ 12754627 13085390 13274041 13530451 13926871 14248574 14602458 15139069 15723010 16136368
3933A6136368L49449M30320J33102k7421n753j61772j80631k08594p4774o2301
$$ 16136368 16485817 16916137 17049239 17021818 17016065 16854293 16673662 16465068 16390294 16327993
3923A6327993n6374j27185m8138q473Q6257J04668J82291J04909J05689K96814
$$ 16327993 16271619 16144434 16096296 16087823 16174080 16278748 16461039 16565948 16671637 16968451
3913A6968451L30639J84484L60389L09727M01361L74922N44837N04679O57234
$$ 16968451 17299090 17483574 17843963 18153690 18555051 18929973 19474810 19979489 20636723
3904B0636723O44825P11400O99540N91308N29761L69169K80820R8042J05757k5876
$$ 20636723 21281548 21992948 22692488 23283796 23813557 24182726 24463546 24561588 24667345 24641469
3894B4641469o211l2204p33K5905M0178j01856q7080n0529P4074O1322K13165
$$ 24641469 24635258 24603054 24602321 24628226 24668404 24566548 24479468 24428939 24503013 24564335 24777500
3883B4777500l9597P4000O7000J13859J02468J36823K07303J96044J35913J74874
$$ 24777500 24737903 24811903 24878903 24992762 25095230 25232053 25439356 25635400 25771313 25946187
3873B5946187L43619L13508J85146J13519J26538K21964K92046j8673J31907J66951
$$ 25946187 26289806 26603314 26788460 26901979 27028517 27250481 27542527 27523854 27655761 27822712
3863B7822712L9083J26286l3678J28479J95832J26632N8483J03720p6116P3404
$$ 27822712 27861795 27988081 27954403 28082882 28278714 28405346 28463829 28567549 28491433 28564837
3853B8564837j28727n1140J60941J13089J75770J20948K37340K94006L90680M88917
$$ 28564837 28436110 28384970 28545911 28659000 28834770 28955718 29193058 29487064 29877744 30366661
3843C0366661M52530O95175P30863Q56501P85501J018245J064270J213333J444628
$$ 30366661 30819191 31514366 32245229 33101730 33887231 34905476 35969746 37183079 38627707
3834C8627707J552063J602328J535230J406672J265958Q74744L30059K315l34115
$$ 38627707 40179770 41782098 43317328 44724000 45989958 46864702 47194761 47197076 46862961
3825D6862961m08262o56243l99148j76436k5777J44525M71177M05463O67627R75965
$$ 46862961 46454699 45798456 45399308 45222872 45197095 45341620 45812797 46218260 46885887 47861852
3815D7861852R86154J035749J361324J451539J740339K067006K328421K804121
$$ 47861852 48848006 49883755 51245079 52696618 54436957 56503963 58832384 61636505
3807F1636505L195184L491127L596003L383033L163709K539452J388444N7828
$$ 61636505 64831689 68322816 71918819 75301852 78465561 81005013 82393457 82451285
3799H2451285r26595j673449j905008j658669j376210p44027l68683J26474M55175
$$ 82451285 81524690 79851241 77946233 76287564 74911354 74167327 73798644 73925118 74380293
3790G4380293N77368Q00374Q37355J228008J323212J274426J516870J384577J249729
$$ 74380293 74957661 75758035 76595390 77823398 79146610 80421036 81937906 83322483 84572212
3781H4572212R11567P54217N45720L12711J99764j10111j45586l56317j025159
$$ 84572212 85483779 86237996 86783716 87096427 87296191 87186080 87040494 86684177 85659018
3772H5659018j435676j823124j940485j648903j467170r09912o62545m74245j60476
$$ 85659018 84223342 82400218 80459733 78810830 77343660 76433748 75771203 75296958 75136482
3763G5136482J12537L66536P51358Q65056J385248J669260K196724K556456K730019
$$ 75136482 75249019 75615555 76366913 77231969 78617217 80286477 82483201 85039657 87769676
3754H7769676L209925L144538K535559J858434J091612j59052j358471k485820
$$ 87769676 90979601 94124139 96659698 98518132 99609744 99450692 98092221 95606401
3746I5606401l264639l452641l546879l309979l101782k930381k636103k370542
$$ 95606401 92341762 88889121 85342242 82032263 78930481 76000100 73363997 70993455
3738G0993455k059684j831264j778945j540984j392372j175917r43966q29259
$$ 70993455 68933771 67102507 65323562 63782578 62390206 61214289 60270323 59441064
3730E9441064o09573l44107o9833J0425L57381O50135R49812J020466J016386
$$ 59441064 58831491 58487384 58417551 58427976 58785357 59435492 60385304 61405770 62422156
3721F2422156J204999R29347N25588L9924p92621j175196j878975k057169j964376
$$ 62422156 63627155 64556502 65082090 65122014 64329393 63154197 61275222 59218053 57253677
3712E7253677k327232k140933j907037j772952j616012j556908j422152j532849
$$ 57253677 54926445 52785512 50878475 49105523 47489511 45932603 44510451 42977602
3704D2977602j388748j068361j266227j189193j011771r31713p86956o72417o57026
$$ 42977602 41588854 40520493 39254266 38065073 37053302 36121589 35334633 34662216 34005190
3695C4005190n04537n64627k58547k73444k38624L9526k9637J12978K2225j91312
$$ 34005190 33500653 32936026 32677479 32404035 32165411 32204937 32175300 32288278 32310503 32119191
3685C2119191k46511k39104l37929n38571m33988l96183m13046m00489j99062
$$ 32119191 31872680 31633576 31295647 30757076 30323088 29926905 29513859 29113370 28914308
3676B8914308j91759k78472r7703k52075j26182l8589n6765k64285n5576k55038
$$ 28914308 28722549 28444077 28346374 28094299 27968117 27929528 27872763 27608478 27552902 27297864
3666B7297864k44727q6355q5539k18359q2826l02799l61818k11391k22576l04357
$$ 27297864 27053137 26966782 26881243 26662884 26580058 26277259 25915441 25704050 25481474 25177117
3656B5177117j03994k33263j47414L549j40982K9341l4772j61440J05658m3748
$$ 25177117 25073123 24839860 24692446 24695995 24555013 24584354 24549582 24388142 24493800 24450052
3646B4450052j07004L7585L1268j11377j36121J52004K43751o7397j7721J83927
$$ 24450052 24343048 24380633 24411901 24300524 24164403 24316407 24560158 24492761 24475040 24658967
3636B4658967L6052j05537N0912O4892q4453j15829m1518j05272k7515j1021p0181
$$ 24658967 24695019 24589482 24640394 24705286 24620833 24505004 24463486 24358214 24330699 24319678 24249497
3625B4249497L3891j34051J9435p4622o7670J04338O5370o5090q0978j24905q2053
$$ 24249497 24283388 24149337 24168772 24094150 24026480 24130818 24196188 24131098 24050120 23925215 23843162
3614B3843162q2615j91819j18292j6677j65632o2159j29366j10215j74793j50929
$$ 23843162 23760547 23568728 23450436 23433759 23268127 23205968 23076602 22966387 22791594 22640665
3604B2640665j53046o5228j76061k39638j19155k7939j46471k66808R887m722
$$ 22640665 22487619 22422391 22246330 22006692 21887537 21859598 21713127 21446319 21456206 21451484
3594B1451484q1881j55249j01904J35454K3479p7066K4780j65060n7075j11074
$$ 21451484 21369603 21214354 21112450 21247904 21271383 21194317 21219097 21054037 20996962 20885888
3584B0885888k49760n0509j81058k33379j51291k24104j65067j52764j03023o4270
$$ 20885888 20636128 20585619 20404561 20171182 20019891 19795787 19630720 19477956 19374933 19310663
3574A9310663k56004j22886j67199N2088k63149m4468P3980j24188r8854k76546
$$ 19310663 19054659 18931773 18764574 18816662 18553513 18509045 18583025 18458837 18359983 18083437
3564A8083437j54186j91530j67275l39749j61257j95863j59447r0511k83260k16032
$$ 18083437 17929251 17737721 17570446 17230697 17069440 16873577 16714130 16623619 16340359 16124327
3554A6124327k43971p2677k07027M5063j79187k08293r5296j78031j37597j94166
$$ 16124327 15880356 15807679 15600652 15645715 15466528 15258235 15162939 14984908 14847311 14653145
3544A4653145j75792k17306o6569o6333j89715o5658k37123k17170P0007j7930
$$ 14653145 14477353 14260047 14193478 14127145 13937430 13871772 13634649 13417479 13487486 13469556
3534A3469556k9753k00864j12134j80839k60062p7703n164k09500j91383O289
$$ 13469556 13439803 13238939 13126805 12945966 12685904 12608201 12603037 12393537 12202154 12208443
3524A2208443j51416j44371j55132j49037k73944j48361l1656p6186L4239j27005
$$ 12208443 12057027 11912656 11757524 11608487 11334543 11186182 11154526 11078340 11112579 10985574
3514A0985574j38244N7029Q433o6340j06706J22858R9037l3591p989J24396o5266
$$ 10985574 10847330 10904359 10912792 10846452 10739746 10862604 10961641 10928050 10920061 11044457 10979191
3503A0979191R1018N6604Q5748Q3118j7060J09792m7165k0463j1580M9726R7211
$$ 10979191 11070209 11126813 11212561 11295679 11278619 11388411 11341246 11320783 11309203 11358929 11456140
3492A1456140J67018J7913m6313n1408N4279J705R9222K2034M3864N1548K03943
$$ 11456140 11623158 11641071 11594758 11543350 11597629 11599334 11698556 11720590 11764454 11816002 12019945
3481A2019945J10464O7615O4018N5935J35086K07724K70136L40515J40301N6622
$$ 12019945 12130409 12198024 12262042 12317977 12453063 12660787 12930923 13271438 13411739 13468361
3471A3468361j08486j05230L3066L8436J16458J41848n1015j9367J01281O1030
$$ 13468361 13359875 13254645 13287711 13326147 13442605 13584453 13533438 13514071 13615352 13676382
3461A3676382o6417j27266o5592K41867K06996P5000J40748K70257J11768J48135
$$ 13676382 13609965 13482699 13417107 13658974 13865970 13940970 14081718 14351975 14463743 14611878
3451A4611878K5915K32817J93157J07364K25862O6268Q5236J8428p9076N7925
$$ 14611878 14637793 14870610 15063767 15171131 15396993 15463261 15548497 15566925 15487849 15545774
3441A5545774J00560j10747m0222O2924P0390j2832J35301J99529K02666J02878
$$ 15545774 15646334 15535587 15495365 15558289 15628679 15615847 15751148 15950677 16153343 16256221
3431A6256221K96991K63808L0482K18750M02425K81681L37000L63523K63418L25398
$$ 16256221 16553212 16817020 16847502 17066252 17468677 17750358 18087358 18450881 18714299 19039697
3421A9039697L69768M48708M68835K45870L26039J9889j30719j16503k6609j62291
$$ 19039697 19409465 19858173 20327008 20572878 20898917 20918806 20788087 20671584 20644975 20482684
3411B0482684L0486M029j52541J21836M5039L8466K41347K13550K10720L18817
$$ 20482684 20513170 20517199 20364658 20486494 20531533 20569999 20811346 21024896 21235616 21554433
3401B1554433M26820L75726L33738L50146L13041N33064N32734N18265N32848
$$ 21554433 21981253 22356979 22690717 23040863 23353904 23886968 24419702 24937967 25470815
3392B5470815P80818Q11332O23236P78723J053421P41954O40066N09340J82199
$$ 25470815 26251633 27062965 27686201 28464924 29518345 30260299 30900365 31409705 31591904
3383C1591904J50242J59439K19043L03545M43901O38952O62337O47180P01905
$$ 31591904 31742146 31901585 32120628 32424173 32868074 33507026 34169363 34816543 35518448
3374C5518448Q96498P56248Q84483R87015J035832J372120J459656J650946J592464
$$ 35518448 36414946 37171194 38055677 39042692 40078524 41450644 42910300 44561246 46153710
3365D6153710J742195K158668K404999K659705L114938L359842L715104M335311
$$ 46153710 47895905 50054573 52459572 55119277 58234215 61594057 65309161 69644472
3357F9644472M667671M804285N151588N293101N189348M926149M284986L917209
$$ 69644472 74312143 79116428 84268016 89561117 94750465 99676614 103961600 107878809
3349A07878809L838911L986527M751006N517492O460654P218043P963125Q674161
$$ 107878809 111717720 115704247 120455253 125972745 132433399 139651442 147614567 156288728
3341A56288728R514475J0126444J0962334J1493808J1813652J2431229J2312716
$$ 156288728 165803203 175929647 186891981 198385789 210199441 222630670 234943386
3334B34943386J1983969J1273384J0349015R090197P386600N031299K267686k31680
$$ 234943386 246927355 258200739 268549754 277639951 285026551 290057850 292325536 292093856
3326B92093856k374543m341570o783452r265285j1040157j1788761j1840525j1304519
$$ 292093856 289719313 285377743 278594291 269329006 258288849 246500088 234659563 223355044
3318B23355044j0799952j0024429r139906q415335p691784p180525o721624o298631
$$ 223355044 212555092 202530663 193390757 184975422 177283638 170103113 163381489 157082858
3310A57082858o151751n926580n345019n208093m908603m392041m060417l808905
$$ 157082858 150931107 145004527 139659508 134451415 129542812 125150771 121090354 117281449
3302A17281449l539152l078024k983241k884520l064843l280567l915042m468252
$$ 117281449 113742297 110664273 107681032 104796512 101731669 98451102 94536060 90067808
3294I0067808m599149m661429m421600m040633l641238l152002l098544l077976
$$ 90067808 85468659 80807230 76385630 72344997 68703759 65551757 62453213 59375237
3286E9375237k730158k543682k247786k253957j847460j704562j701653j520482
$$ 59375237 56645079 54101397 51853611 49599654 47752194 46047632 44345979 42825497
3278D2825497j511316j526406j326230j526340j272625j211274j185288r48276
$$ 42825497 41314181 39787775 38461545 36935205 35662580 34451306 33266018 32317742
3270C2317742r86207r26175r85724p56600q37340p26371o15219o51094n06074
$$ 32317742 31331535 30405360 29419636 28663036 27825696 27099325 26484106 25833012 25326938
3261B5326938n13139o73410m99166m01012k85503j56612k96367j63114k61173
$$ 25326938 24813799 24140389 23641223 23240211 22954708 22798096 22501729 22338615 22077442
3252B2077442j84307k47711k31586k66019l34795l06690k87047k27455j39893
$$ 22077442 21893135 21645424 21413838 21147819 20813024 20506334 20219287 19991832 19851939
3243A9851939l10395l38503j08077k40126k42388k90981j75341j74732j50900
$$ 19851939 19541544 19203041 19094964 18854838 18612450 18321469 18146128 17971396 17820496
3234A7820496k34085n7208L6476j0961Q1212K0631Q0286K40434J70170M656J73236
$$ 17820496 17586411 17529203 17565679 17554718 17635930 17656561 17736847 17977281 18147451 18152107 18325343
3223A8325343j33209m62442o20745m22062m48394m94547j42206J14459q1059p8265
$$ 18325343 18192134 17729692 17108947 16686885 16238491 15743944 15601738 15716197 15635138 15556873
3213A5556873j7450m8623N2370J38967R3929J89079L29401K62864N31893N74076
$$ 15556873 15539423 15490800 15543170 15682137 15776066 15965145 16294546 16557410 17089303 17663379
3203A7663379O28119P05085R93157J081411Q22248Q67633O59990L11447m46368
$$ 17663379 18291498 18996583 19989740 21071151 21893399 22761032 23421022 23732469 23286101
3194B3286101j021887j027200q85723p67663o90650l78931l35077j88492k63426
$$ 23286101 22264214 21237014 20351291 19583628 18892978 18514047 18178970 17990478 17727052
3185A7727052j79006l6593j1397J34806m3302J56234L39921M19461O08708R13788
$$ 17727052 17548046 17511453 17500056 17634862 17591560 17747794 18087715 18507176 19115884 20029672
3175B0029672R88913J147007J317128J436251R90653J005749O67004k4768q23707
$$ 20029672 21018585 22165592 23482720 24918971 25909624 26915373 27582377 27557609 26733902
3166B6733902j596176j544098j198984r81956r98710p01440o26991m53028m57291
$$ 26733902 25137726 23593628 22394644 21412688 20413978 19712538 19085547 18632519 18175228
3157A8175228l70380j58123j76545l82399p3628J56423J32915J80571N30349O25762
$$ 18175228 17804848 17646725 17470180 17087781 17014153 17170576 17303491 17484062 18014411 18640173
3147A8640173P50149Q93821R65452R28210O94877O67773K72806k83395r12665
$$ 18640173 19390322 20284143 21249595 22177805 22872682 23540455 23813261 23529866 22617201
3138B2617201j215027j181628j190740q62096p47134o87470m46511m17624m11364
$$ 22617201 21402174 20220546 19029806 18167710 17420576 16733106 16286595 15868971 15457607
3129A5457607m86580l07842l11738k96021r0868j00642M7486R9604Q8553J15757
$$ 15457607 14971027 14663185 14351447 14055426 13964558 13863916 13911402 14011006 14099559 14215316
3119A4215316L48108L50642K59814K46789M01259K63079L1183j48929k42859l25047
$$ 14215316 14563424 14914066 15173880 15420669 15821928 16085007 16116190 15967261 15724402 15399355
3109A5399355l89903l22706j57686K7080J36676J37022J72798L76250M23755N02571
$$ 15399355 15009452 14686746 14529060 14556140 14692816 14829838 15002636 15378886 15802641 16305212
3099A6305212N69225Q67971R80995O68209N76908O83733J086668J685350K232306
$$ 16305212 16874437 17742408 18723403 19391612 19968520 20652253 21738921 23424271 25656577
3090B5656577K288850J717055J370893O72474n88425j096998j619961k210091
$$ 25656577 27945427 29662482 31033375 31705849 31117424 30020426 28400465 26190374
3082B6190374j682000j159615j313062j111451r97915r48191q65070o62423p48993
$$ 26190374 24508374 23348759 22035697 20924246 19926331 18978140 18113070 17450647 16701654
3073A6701654r20806q10500p09017p11726p37539q43536o34548k26586m40823
$$ 16701654 15780848 14970348 14261331 13549605 12812066 11968530 11333982 11107396 10666573
3064A0666573m26281k55850k33052l19982l24551j77180j59426j92155K7134q3904
$$ 10666573 10240292 9984442 9751390 9431408 9106857 8929677 8770251 8578096 8605230 8521326
3054H521326j36635r3861j69720j42122K9176l8048k1035j37932O958P9581j06662
$$ 8521326 8384691 8290830 8121110 7978988 8008164 7970116 7949081 7811149 7818107 7897688 7791026
3043G791026L7819L8017L2119J790J12144J8631M8646J99170J02915N7069L0254
$$ 7791026 7828845 7866862 7898981 7900771 8012915 8031546 8080192 8279362 8382277 8439346 8469600
3032H469600J5092J45658N0013l8111j7268O7790k2604j61756j50543J53131J65297
$$ 8469600 8484692 8630350 8680363 8642252 8624984 8692774 8670170 8508414 8357871 8511002 8676299
3021H676299j30682j36723m0890o264M484J01376P716J3699Q0187r3818j69804
$$ 8676299 8545617 8408894 8368004 8361740 8366224 8467600 8475316 8489015 8569202 8475384 8305580
3010H305580l4435J48480K6550p4662K34820L9877k5554K8050Q7884K00617L9637
$$ 8305580 8271145 8419625 8446175 8371513 8606333 8646210 8620656 8648706 8736590 8937207 8976844
2999H976844Q2017P1773j25441r7421r8730l3163q3147L1876j9836p0210m0477
$$ 8976844 9058861 9130634 9005193 8907772 8809042 8775879 8692732 8724608 8704772 8634562 8594085
2988H594085m6326r7528L8581L8269l0830m6146J44221Q803j39002r588L2794
$$ 8594085 8547759 8450231 8488812 8527081 8496251 8450105 8594326 8603129 8464127 8454539 8487333
2977H487333Q7771J317N6540N2499Q1708R5774k6998j10157J1782J29792N9384
$$ 8487333 8575104 8576421 8632961 8685460 8767168 8862942 8835944 8725787 8737569 8867361 8926745
2966H926745O9561N3430K3705N1822r8145L9758K8166j38372O1673K18159J22208
$$ 8926745 8996306 9049736 9073441 9125263 9027118 9066876 9095042 8956670 9018343 9236502 9358710
2955I358710O4003k2071n8534R5012J1525R3749K6958K585J67396J48221J36772
$$ 9358710 9422713 9400642 9342108 9437120 9448645 9542394 9569352 9571937 9739333 9887554 10024326
2944A0024326j7688N9261K12543P8892O6676O2080K38501J95111O8205J46659
$$ 10024326 10006638 10065899 10278442 10357334 10424010 10486090 10724591 10919702 10987907 11134566
2934A1134566P5942o8895j04978J19372j82115l792q5495J3584j4616R9054j5294
$$ 11134566 11210508 11141613 11036635 11156007 10973892 10970100 10884605 10898189 10883573 10982627 10967333
2923A0967333k7246m7360j18504J15395n2243M0591m4538m2573J30281R3042N3596
$$ 10967333 10940087 10892727 10774223 10889618 10837375 10877966 10833428 10790855 10921136 11014178 11067774
2912A1067774n3735O1104J33351j9557Q7853N4676J44133n1651L5071j6287K66565
$$ 11067774 11014039 11075143 11208494 11188937 11276790 11331466 11475599 11423948 11459019 11442732 11709297
2901A1709297K17312M5691J12044J43362J59517J82490J32135L0001K52620J62987
$$ 11709297 11926609 11972300 12084344 12227706 12387223 12569713 12701848 12731849 12984469 13147456
2891A3147456Q3457J98718J22605J93553J62147J19700J78508O8892J83222K11527
$$ 13147456 13230913 13429631 13552236 13745789 13907936 14027636 14206144 14275036 14458258 14669785
2881A4669785K96536K81172P9432K73211M20852K40943L13661L33505K23887L12645
$$ 14669785 14966321 15247493 15326925 15600136 16020988 16261931 16575592 16909097 17132984 17445629
2871A7445629N19654J85509L80350O11031M11889M88983O24818O69482O16395
$$ 17445629 17965283 18150792 18531142 19142173 19554062 20043045 20667863 21337345 21953740
2862B1953740N42245O75828N16622L21156L05180L67461J77417k6845j44619J1469
$$ 21953740 22495985 23171813 23688435 24009591 24314771 24682232 24859649 24832804 24688185 24699654
2852B4699654j70536q4361n0336m911j58766p5384o3374J10453K8036r0122J66515
$$ 24699654 24529118 24444757 24394421 24389510 24230744 24155360 24091986 24202439 24230475 24140353 24306868
2841B4306868N8623J69993k4083J6342J37296o3163n6461o9750o3867p2901j78838
$$ 24306868 24365491 24535484 24511401 24527743 24665039 24601876 24545415 24475665 24411798 24338897 24160059
2830B4160059J59605R422p0292J59359J98007J63559K83710K02162L42786K34481
$$ 24160059 24319664 24329086 24258794 24418153 24616160 24779719 25063429 25265591 25608377 25842858
2820B5842858K87529J48647K75202J72824K05266K99316L56181L57178L15248
$$ 25842858 26130387 26279034 26554236 26727060 26932326 27231642 27587823 27945001 28260249
2811B8260249M46828N37006N68707N88731N26290L01447j54249j71260k90222
$$ 28260249 28707077 29244083 29812790 30401521 30927811 31229258 31075009 30903749 30613527
2802C0613527l95120m41653k02753J12405M3480l9130j70795O9322N1593N5519
$$ 30613527 30218407 29776754 29574001 29686406 29729886 29690756 29519961 29589283 29640876 29696395
2792B9696395m9124j85044l61704k69811k15653l81093k87457k94507m98362m43852
$$ 29696395 29647271 29462227 29100523 28830712 28615059 28233966 27946509 27652002 27153640 26709788
2782B6709788k94642j07417l71625j92508o3146k24657j48692Q4413l4172j30392
$$ 26709788 26415146 26307729 25936104 25743596 25680450 25455793 25307101 25391514 25357342 25226950
2772B5226950N364K40743N5837J19259L07186J37540K01218Q6589J16696K28250
$$ 25226950 25232314 25473057 25528894 25648153 25955339 26092879 26294097 26380686 26497382 26725632
2762B6725632L42240J61506Q7602K73235J50438K66379L47539L09249K63673K42715
$$ 26725632 27067872 27229378 27316980 27590215 27740653 28007032 28354571 28663820 28927493 29170208
2752B9170208M16187M10983M60957M90605M61194M56296N91677M91969N54128
$$ 29170208 29586395 29997378 30458335 30948940 31410134 31866430 32458107 32950076 33504204
2743C3504204O14946M77093N49549P74577P90301N64693P99164R59266R03621
$$ 33504204 34119150 34596243 35145792 35920369 36710670 37275363 38074527 39033793 39937414
2734C9937414R93464R51172J061430J098425J240563J333676J389746J498800
$$ 39937414 40930878 41882050 42943480 44041905 45282468 46616144 48005890 49504690
2726D9504690J502336J700832J816254J942313J990216K084989K160456K338722
$$ 49504690 51007026 52707858 54524112 56466425 58456641 60541630 62702086 65040808
2718F5040808K381366K473795K799729L025324L280310L448474L525592L685039
$$ 65040808 67422174 69895969 72695698 75721022 79001332 82449806 85975398 89660437
2710H9660437L932143L757663L800962L747641L983748L770200L684490L237734
$$ 89660437 93592580 97350243 101151205 104898846 108882594 112652794 116337284 119575018
2702A19575018K842698K341147J572169J103237O36197N98846N03411O43048R73954
$$ 119575018 122417716 124758863 126331032 127434269 128070466 128669312 129172723 129815771 130789725
2693A30789725R50215J302502J512736J860317K253112K504279K880703L186380
$$ 130789725 131739940 133042442 134555178 136415495 138668607 141172886 144053589 147239969
2685A47239969L671080M028132M371403M760073N420788N980620O284072O788116
$$ 147239969 150911049 154939181 159310584 164070657 169491445 175472065 181756137 188544253
2677A88544253P379815P467953P649381P365369O969515O374580N237785L920162
$$ 188544253 195924068 203392021 211041402 218406771 225376286 231750866 236988651 240908813
2669B40908813K100298O01400k48822j146369r74727p78609m98678j11157M24271
$$ 240908813 243009111 243610511 243361689 242215320 241240593 240461984 239963306 239852149 240276420
2660B40276420R27046J097067J295872J083967J035747R28324P33700N0884o1256
$$ 240276420 241203466 242300533 243596405 244680372 245716119 246644443 247378143 247429027 247367771
2651B47367771J5641L6433J71690M67447Q95721J589192K441642K968285L767047
$$ 247367771 247383412 247419845 247591535 248058982 248954703 250543895 252985537 255953822 259720869
2642B59720869M442897M456842M071841L219780J903858L45825j847348l556425
$$ 259720869 264163766 268620608 272692449 275912229 277816087 278161912 276314564 272758139
2634B72758139n153209o275526o871148o975093o711236n939197n422636m582672
$$ 272758139 267604930 261329404 254458256 247483163 240771927 234832730 229410094 224827422
2626B24827422l372387k584565j855178j087457r65341j037107j649156k760345
$$ 224827422 221455035 218870470 217015292 215927835 214962494 213925387 212276231 209515886
2618B09515886m035692n500189o378119p132010p448594p254740p036325o237886
$$ 209515886 205480194 199980005 193601886 186469876 179021282 171766542 164730217 158492331
2610A58492331n626879n074963m517249m023013l524118l132648k726913k289412
$$ 158492331 152865452 147790489 143273240 139250227 135726109 132593461 129866548 127577136
2602A27577136j929471j563476j300172j397089j335759j316568j675944j616168
$$ 127577136 125647665 124084189 122784017 121386928 120051169 118734601 117058657 115442489
2594A15442489j627250j730240j663214j543190j686314j400659j028712j050525
$$ 115442489 113815239 112084999 110421785 108878595 107192281 105791622 104762910 103712385
2586A03712385q84048p98979p17214p13781p37871j015695j164150j262758j405721
$$ 103712385 102828337 102029358 101312144 100598363 99860492 98844797 97680647 96417889 95012168
2577I5012168j469824j356728j401810j349751j690136j581458j545705j657905
$$ 95012168 93542344 92185616 90783806 89434055 87743919 86162461 84616756 82958851
2569H2958851j586094j463247j432380j410741j439902j377955j375261j360908
$$ 82958851 81372757 79909510 78477130 77066389 75626487 74248532 72873271 71512363
2561G1512363j258516j400053j411048j261338j207754j227464j020658j083392
$$ 71512363 70253847 68853794 67442746 66181408 64973654 63746190 62725532 61642140
2553F1642140q56771q18314r90565q28453q72157q30664p18533q78868p61180
$$ 61642140 60785369 59967055 58976490 58148037 57275880 56445216 55726683 54847815 54086635
2544E4086635o98135q07000p19028q27897n90280n68025n78289o74349o44825
$$ 54086635 53388500 52581500 51862472 51034575 50444295 49876270 49297981 48623632 47978807
2535D7978807n38403l74903m25666l00433m68565l62885k36446k93220m44746
$$ 47978807 47440404 47065501 46639835 46339402 45870837 45507952 45271506 44978286 44533540
2526D4533540l05618l21642j92531l69944k23309j57284j26625k29736j76814
$$ 44533540 44227922 43906280 43713749 43343805 43120496 42963212 42836587 42606851 42430037
2517D2430037k5422j01383L5337j76066P4127L21397J05472J23046Q6459J90623
$$ 42430037 42404615 42303232 42338569 42162503 42236630 42558027 42663499 42786545 42873004 43063627
2507D3063627K87890L24838N25491L98589M93775K63650L39120L27624L80000
$$ 43063627 43351517 43676355 44201846 44600435 45094210 45357860 45696980 46024604 46404604
2498D6404604L41297K57064K87097L27612L87780L56479K62997K40560M00770
$$ 46404604 46745901 47002965 47290062 47617674 48005454 48361933 48624930 48865490 49266260
2489D9266260L71405K78041L47400L39667K55489K50945K83316K06067K00782
$$ 49266260 49637665 49915706 50263106 50602773 50858262 51109207 51392523 51598590 51799372
2480E1799372K33455K39848J35061J33774J55097L22061L44374J81068L14635
$$ 51799372 52032827 52272675 52407736 52541510 52696607 53018668 53363042 53544110 53858745
2471E3858745L11542J79831L71905M22382L67878R3201L73703M75358K62098K66811
$$ 53858745 54170287 54350118 54722023 55144405 55512283 55605484 55979187 56454545 56716643 56983454
2461E6983454K74957K44760K59531J18847P076n5803p6605m1856k04402k08106
$$ 56983454 57258411 57503171 57762702 57881549 57888625 57832822 57756217 57714361 57509959 57301853
2451E7301853o679k98328j48388k33845j86516r5171j78976N9126J23532K5981
$$ 57301853 57295174 56996846 56848458 56614613 56428097 56332926 56153950 56213076 56336608 56362589
2441E6362589J95336O2648J41425K73652J95640L51596K46307K20714L10192L55372
$$ 56362589 56557925 56620573 56761998 57035650 57231290 57582886 57829193 58049907 58360099 58715471
2431E8715471L40916L03132K97192K35868M06003M48919K89111Q6118K99854P4942
$$ 58715471 59056387 59359519 59656711 59892579 60298582 60747501 61036612 61122730 61422584 61497526
2421F1497526K82733K73217K68978L83047L76597O19325O58760O13845P09922
$$ 61497526 61780259 62053476 62322454 62705501 63082098 63701423 64360183 64974028 65683950
2412F5683950P24116Q69777J101880Q85286J160283J199809J507347J518990J762267
$$ 65683950 66408066 67277843 68379723 69265009 70425292 71625101 73132448 74651438 76413705
2403G6413705J745572K039043K255470K603029K994459L154598L308950L785091
$$ 76413705 78159277 80198320 82453790 85056819 88051278 91205876 94514826 98299917
2395I8299917M238500M727508N190140N603891O185532O843549P221177P692098
$$ 98299917 102538417 107265925 112456065 118059956 124245488 131089037 138310214 146002312
2387A46002312Q555992R351557J0279815J1496716J2701051J3984563J6015107
$$ 146002312 154558304 163909861 174189676 185686392 198387443 212372006 228387113
2380B28387113J8242101K0745082K3340323K5897238K7685149K7909045K7008334
$$ 228387113 246629214 267374296 290714619 316611857 344297006 372206051 399214385
2373C99214385K4554357J9538989J2076739L595129k130251n785709j0054522
$$ 399214385 423768742 443307731 455384470 458979599 456849348 451063639 441009117
2366D41009117j5793549k0421824k2032150k1566816k0174202j9006411j7753129
$$ 441009117 425215568 404793744 382761594 361194778 341020576 322014165 304261036
2359C04261036j7105001j6815082j6919157j6322958j5367159j4375207j3111081
$$ 304261036 287156035 270340953 253421796 237098838 221731679 207356472 194245391
2352A94245391j1982021j0895618r718714q745055p650740o784794o056529n414352
$$ 194245391 182263370 171367752 161649038 152903983 145253243 138468449 132411920 126997568
2344A26997568m739442m186774l839421l547874l394779l506916l938335m081735
$$ 126997568 122258126 118071352 114231931 110684057 107289278 103782362 99844027 95762292
2336I5762292l915481l983238l629677l170626l005153k838433k594561k365989
$$ 95762292 91846811 87863573 84233896 81063270 78058117 75219684 72625123 70259134
2328G0259134k349859k200165j977107j993025k000792k115266j990151j704452
$$ 70259134 67909275 65709110 63732003 61738978 59738186 57622920 55632769 53928317
2320E3928317j602929j505577j428530j097018j077245p68032p06656o67553m70980
$$ 53928317 52325388 50819811 49391281 48294263 47217018 46448986 45742330 45074777 44603797
2311D4603797n35462n35512m79027k72506l72382o87927o60127q24380o12768
$$ 44603797 44068335 43532823 43053796 42781290 42408908 41720981 41060854 40236474 39623706
2302C9623706n83005p34314o99395n05481m90651o10457o84709o15151o38773
$$ 39623706 39040701 38306387 37606992 37101511 36610860 36000403 35315694 34700543 34061770
2293C4061770m21185k57024m06812m99637m23657k62643j49190m9684L126R060
$$ 34061770 33640585 33383561 32976749 32477112 32053455 31790812 31641622 31591938 31595064 31604124
2283C1604124O2589J0723Q2551K39301J87133M09590L51786O23911N25482P91744
$$ 31604124 31666713 31677436 31759987 31999288 32186421 32596011 32947797 33571708 34097190 34888934
2273C4888934R55182Q49401J070902J158143J372502J448059J782887K018588
$$ 34888934 35844116 36693517 37764419 38922562 40295064 41743123 43526010 45544598
2265D5544598K123948K526357K410329K153954J755218J389484M26949o04320
$$ 45544598 47668546 50194903 52605232 54759186 56514404 57903888 58330837 57726517
2257E7726517j683866k139805k100521j764800j277039j090756q45602p61037
$$ 57726517 56042651 53902846 51802325 50037525 48760486 47669730 46824128 46063091
2249D6063091l48091m57607j98420k51267K5918J91420K52084M13807L42137P8437
$$ 46063091 45715000 45257393 45058973 44807706 44833624 45025044 45277128 45690935 46033072 46111509
2239D6111509l34125o03968p60860r64494q83234p03826n53426n07740n19227
$$ 46111509 45777384 45173416 44412556 43448062 42564828 41861002 41307576 40799836 40280609
2230D0280609l00169n8465r905N3309K49841J51575K94443L95483K71535N05168
$$ 40280609 39980440 39921975 39912070 39965379 40215220 40366795 40661238 41056721 41328256 41833424
2220D1833424L63756M76328N99483N63217O94934Q42366P60266J012718J150787
$$ 41833424 42197180 42673508 43272991 43836208 44531142 45373508 46133774 47146492 48297279
2211D8297279P64914P72395K57970M4043m27340l02808j46464j16542J19322J79124
$$ 48297279 49062193 49834588 50092558 50136601 49709261 49406453 49259989 49143447 49262769 49441893
2201D9441893K06185M5343l86556q51247j213000j539495j834124j633732j475558
$$ 49441893 49648078 49693421 49306865 48455618 47242618 45703123 43868999 42235267 40759709
2192D0759709j411283j105394j093457j079810q69327p51736q72285n38499p20886
$$ 40759709 39348426 38243032 37149575 36069765 35200438 34448702 33576417 33037918 32317032
2183C2317032o79958m30557m66803k44324j35579j58832m4850l4792P0p0695L5370
$$ 32317032 31637074 31206517 30739714 30495390 30359811 30200979 30156129 30121337 30121407 30050712 30086082
2172C0086082J36218n1673k00106j95379l21055m81659m47336m49620n42250o21440
$$ 30086082 30222300 30170627 29970521 29775142 29454087 28972428 28525092 28075472 27533222 26911782
2162B6911782m43109l65083n85244m56087m22624o04342l77901k73758k44280
$$ 26911782 26468673 26103590 25518346 25062259 24639635 24035293 23657392 23383634 23139354
2153B3139354j99072l39494k68839l08869l12646m69485m94018l79845l55180
$$ 23139354 22940282 22600788 22331949 22023080 21710434 21240949 20746931 20367086 20011906
2144B0011906k56125j61991m34921k25675j56136l11808j94657j73622k92304
$$ 20011906 19755781 19593790 19158869 18933194 18777058 18465250 18270593 18096971 17804667
2135A7804667j75584j2817j74633q4664k25997O2486k4966n1790j36574k6692
$$ 17804667 17629083 17616266 17441633 17356969 17130972 17193458 17168492 17116702 16980128 16953436
2125A6953436q9912q6507R6382l7405N48Q4989J8650J573m0923P3172J08373N0478
$$ 16953436 16863524 16777017 16873399 16835994 16836542 16921531 16940181 16941754 16900831 16974003 17082376 17132854
2113A7132854J33853Q8254J52246K01472K73039K80304J83748J37930J53079K58208
$$ 17132854 17266707 17354961 17507207 17708679 17981718 18262022 18445770 18583700 18736779 18994987
2103A8994987J10228k5767k06128j85772j55086j00646l0771n9805Q6686J0262
$$ 18994987 19105215 19079448 18873320 18687548 18532462 18431816 18401045 18341240 18427926 18438188
2093A8438188j4705J09190k8003m3096l7643r1588J16325L5583j18503j09637
$$ 18438188 18423483 18532673 18504670 18461574 18423931 18332343 18448668 18484251 18365748 18256111
2083A8256111M8763R6243K4351Q6937J00119Q7459O7651Q8456K96174K53943K31685
$$ 18256111 18304874 18401117 18425468 18512405 18612524 18699983 18767634 18856090 19152264 19406207 19637892
2072A9637892J52325K18395K80527J85229K80835J83389K95169K14843J88875
$$ 19637892 19790217 20008612 20289139 20474368 20755203 20938592 21233761 21448604 21637479
2063B1637479J71037N7844J05483J09796J40171J31119L44149K44675J81289K23492
$$ 21637479 21808516 21866360 21971843 22081639 22221810 22352929 22697078 22941753 23123042 23346534
2053B3346534K01372K9876K27102J64141J03118O8330Q1565N0014k7691p578J5860
$$ 23346534 23547906 23577782 23804884 23969025 24072143 24140473 24222038 24272052 24244361 24236783 24252643
2042B4252643J52595M6213M0787j8702n7535J57285m8006K6428J54667q974Q8747
$$ 24252643 24405238 24451451 24492238 24473536 24416001 24573286 24525280 24551708 24706375 24697401 24786148
2031B4786148j36544J20741Q2232J8171J32975n2476J24923J46044P088k6478
$$ 24786148 24649604 24770345 24852577 24870748 25003723 24951247 25076170 25222214 25229302 25202824
2021B5202824P8116K9290Q6697N6811j6018J91084J90704J45367J11275J51565
$$ 25202824 25280940 25310230 25396927 25453738 25437720 25628804 25819508 25964875 26076150 26227715
2011B6227715J25013J55413J73272K71142K77233J89721K20706J52671K41340
$$ 26227715 26352728 26508141 26681413 26952555 27229788 27419509 27640215 27792886 28034226
2002B8034226K39781J20040J08480P6881K7577N344K48092J45355K71414R9824
$$ 28034226 28274007 28394047 28502527 28579408 28606985 28612329 28860421 29005776 29277190 29377014
1992B9377014R7961K91801K02480J59713J5312M18808K69105J00913J44206K87719
$$ 29377014 29474975 29766776 29969256 30128969 30144281 30563089 30832194 30933107 31077313 31365032
1982C1365032L29431J57079K50753J85000L31998L93554L30226K76837L28178
$$ 31365032 31694463 31851542 32102295 32287295 32619293 33012847 33343073 33619910 33948088
1973C3948088L36262L80422L80414K77872L61492L86761M95512N14153L40138
$$ 33948088 34284350 34664772 35045186 35323058 35684550 36071311 36566823 37080976 37421114
1964C7421114L00737N43766N43242N07571M32706N22859O27538M22210N24844
$$ 37421114 37721851 38265617 38808859 39316430 39749136 40271995 40899533 41321743 41846587
1955D1846587O89204N68474O31849N16969O06959R67793R24599Q92952R56886
$$ 41846587 42535791 43104265 43736114 44253083 44860042 45827835 46752434 47645386 48602272
1946D8602272Q11001J115098J359430J148385J364763J349913J636070J438775
$$ 48602272 49413273 50528371 51887801 53036186 54400949 55750862 57386932 58825707
1938E8825707J774910J862042J709078J814955K154535K293620K214316K424237
$$ 58825707 60600617 62462659 64171737 65986692 68141227 70434847 72649163 75073400
1930G5073400K563022K729579K707694K775530K812034L023693L007198L246498
$$ 75073400 77636422 80366001 83073695 85849225 88661259 91684952 94692150 97938648
1922I7938648L297861L067551L272536L439287L314234L345061L429040L356194
$$ 97938648 101236509 104304060 107576596 111015883 114330117 117675178 121104218 124460412
1914A24460412L188944L381253L180706K931250K724658K597770K634370K445787
$$ 124460412 127649356 131030609 134211315 137142565 139867223 142464993 145099363 147545150
1906A47545150K412465K229620J941847J772525J596638J437318J058548R02007
$$ 147545150 149957615 152187235 154129082 155901607 157498245 158935563 159994111 160896118
1898A60896118N81974M28343j05526k27538p00418p67186j039136j448580j441003
$$ 160896118 161478092 161906435 161800909 161573371 160872953 160105767 159066631 157618051 156177048
1889A56177048j649571j939844k215512k446181k589262k943383l188253l154071
$$ 156177048 154527477 152587633 150372121 147925940 145336678 142393295 139205042 136050971
1881A36050971l278850l385157l542279l307088l636661l599301l708287l715777
$$ 136050971 132772121 129386964 125844685 122537597 118900936 115301635 111593348 107877571
1873A07877571l552039l508010l453247l413598l466140l235746l194092k992200
$$ 107877571 104325532 100817522 97364275 93950677 90484537 87248791 84054699 81062499
1865H1062499k919844k755883k621087k691346k322238k114163j982364j912084
$$ 81062499 78142655 75386772 72765685 70074339 67752101 65637938 63655574 61743490
1857F1743490j771333j723261j478063j258023j295971j378321j289169j372332
$$ 61743490 59972157 58248896 56770833 55512810 54216839 52838518 51549349 50177017
1849E0177017j336498j177744j252711j367583j068527j067904r42502r40825
$$ 50177017 48840519 47662775 46410064 45042481 43973954 42906050 41963548 41022723
1841D1022723q99274p98057q57940p57479p91160q11038q26598q51657o69196
$$ 41022723 40123449 39325392 38467452 37709973 36918813 36107775 35281177 34429520 33760324
1832C3760324p26051q41880n48881o07557l85359m55515n80694m80414k73751
$$ 33760324 33034273 32192393 31643512 31035955 30650596 30195081 29614387 29133973 28860222
1823B8860222k69712k42353j66416j01134k04159o8136r6479p2911l2642q0832
$$ 28860222 28590510 28348157 28181741 28080607 27876448 27808312 27711833 27638922 27606280 27525448
1813B7525448M5014n1166j78982L8998q1531j20989j66844k10768k24091p3856
$$ 27525448 27570462 27519296 27340314 27379312 27297781 27176792 27009948 26799180 26575089 26501233
1803B6501233q7832r1287k15795j83117j50978j23638j26837k63485n5519j54506
$$ 26501233 26413401 26322114 26106319 25923202 25772224 25648586 25521749 25258264 25202745 25048239
1793B5048239l21878j97284k73931p9809k01378k12096k1349j11798o5329q0044
$$ 25048239 24726361 24529077 24255146 24175337 23973959 23761863 23740514 23628716 23563387 23483343
1783B3483343n9166n4487J448R6508Q7270J7029J69483K10866J82832K10739J37243
$$ 23483343 23424177 23369690 23371138 23467646 23554916 23571945 23741428 23952294 24135126 24345865 24483108
1772B4483108J79467J86952J44181K66940K82773M0512J91633K93242J07156J87201
$$ 24483108 24662575 24849527 24993708 25260648 25543421 25583933 25775566 26068808 26175964 26363165
1762B6363165K05999K27380L62998M49696J34987L18685K55743J70004J00507
$$ 26363165 26569164 26796544 27159542 27609238 27744225 28062910 28318653 28488657 28589164
1753B8589164L19096K53177K27281Q5911L69730J98887J49036J40551J76137K97921
$$ 28589164 28908260 29161437 29388718 29474629 29844359 30043246 30192282 30332833 30508970 30806891
1743C0806891J72972J07429J063q333M820Q0963p5582k83789n0880n9257k45080
$$ 30806891 30979863 31087292 31088355 31080022 31084842 31165805 31090223 30806434 30755554 30696297 30451217
1732C0451217j59310j58699n7125n6201j65731k82451j85270j44105q8632q8846
$$ 30451217 30291907 30133208 30076083 30019882 29854151 29571700 29386430 29242325 29153693 29064847
1722B9064847k56200j6806j32576j50276J15397K0590J20584O4466O5214J09199
$$ 29064847 28808647 28791841 28659265 28508989 28624386 28644976 28765560 28830026 28895240 29004439
1712B9004439K03048K92278L50187K16206M26452O90795L89309L67513P12556
$$ 29004439 29207487 29499765 29849952 30066158 30492610 31183405 31572714 31940227 32652783
1703C2652783M29141N64038O27910O81454Q13934O92391O76065O36416R04681
$$ 32652783 33081924 33645962 34273872 34955326 35769260 36461651 37137716 37774132 38678813
1694C8678813Q71814R52226Q91020R77552J030158J037518Q55607Q31097Q23448
$$ 38678813 39550627 40502853 41393873 42371425 43401583 44439101 45294708 46125805 46949253
1685D6949253M29840K88453K92369K96847K33684J98421K03949K15604J92629
$$ 46949253 47379093 47667546 47959915 48256762 48490446 48688867 48892816 49108420 49301049
1676D9301049J52701P1193J29804k8355M0085m3862l22244j69651l77884m97354
$$ 49301049 49453750 49524943 49654747 49626392 49666477 49622615 49300371 49130720 48752836 48255482
1666D8255482l73185k16659l42853l19288p5522j07700j9225p8519R3541M6401
$$ 48255482 47882297 47665638 47322785 47003497 46927975 46820275 46801050 46722531 46816072 46862473
1656D6862473m1979K51535L04436K08309J11454L24125N32369L50556M65769M21179
$$ 46862473 46820494 47072029 47376465 47584774 47696228 48020353 48552722 48903278 49369047 49790226
1646D9790226L92013M55157M78334O02870N64835N69739O71543N91822N52578
$$ 49790226 50182239 50637396 51115730 51718600 52283435 52853174 53524717 54116539 54669117
1637E4669117M19987N21837O30097N61592N48209N39374O69814P81372N86332
$$ 54669117 55089104 55610941 56241038 56802630 57350839 57890213 58560027 59341399 59927731
1628E9927731M44583N34713M75191L60717M11725L50892L75002L10975M15502
$$ 59927731 60372314 60907027 61382218 61742935 62154660 62505552 62880554 63191529 63607031
1619F3607031M64549N48477M89047L62533M85977N93229M93833O58714P20543
$$ 63607031 64071580 64620057 65109104 65471637 65957614 66550843 67044676 67703390 68423933
1610F8423933O39753O46638N87582Q44488R30242R69267J150435J171145J382513
$$ 68423933 69063686 69710324 70297906 71142394 72072636 73041903 74192338 75363483 76745996
1601G6745996J388999J424149J519104J620187J823558J777454J855894J849338
$$ 76745996 78134995 79559144 81078248 82698435 84521993 86299447 88155341 90004679
1593I0004679J890695J788504J960664J770364J603076J691043J672721J674613
$$ 90004679 91895374 93683878 95644542 97414906 99017982 100709025 102381746 104056359
1585A04056359J574015J580203J406861J532845J386899J270613J347995J076018
$$ 104056359 105630374 107210577 108617438 110150283 111537182 112807795 114155790 115231808
1577A15231808R91019J079987P07000O43963N15250K80093N38634M51895J91217
$$ 115231808 116222827 117302814 118009814 118653777 119169027 119449120 119987754 120439649 120630866
1568A20630866L85528L29093L81493N63879N55283P48080N96701O29434N59450
$$ 120630866 121016394 121345487 121726980 122290859 122846142 123594222 124190923 124820357 125379807
1559A25379807Q89616R48492R52453J265090J355597J403948J370896J444246
$$ 125379807 126269423 127217915 128170368 129435458 130791055 132195003 133565899 135010145
1551A35010145J444769J298750J445109J630611J939571K375473K778117K892248
$$ 135010145 136454914 137753664 139198773 140829384 142768955 145144428 147922545 150814793
1543A50814793L234139L303522L362692L595406L604977L799908L875200L920718
$$ 150814793 154048932 157352454 160715146 164310552 167915529 171715437 175590637 179511355
1535A79511355M024842L906086M007660M053000L988346L967819M113857M052474
$$ 179511355 183536197 187442283 191449943 195502943 199491289 203459108 207572965 211625439
1527B11625439L607929L490533L005817K246028J555017J106406N52655K98692
$$ 211625439 215233368 218723901 221729718 223975746 225530763 226637169 227189824 227488516
1519B27488516N3572j96686j77845k38906l58444m69038k49072k00915l28890
$$ 227488516 227542088 227345402 227167557 226928651 226570207 226101169 225852097 225651182 225322292
1510B25322292j91529R9502J46835L90076N77779P29187Q06088J079798J222014
$$ 225322292 225130763 225230265 225377100 225767176 226344955 227074142 227880230 228960028 230182042
1501B30182042J384602J550433J831415J893211J905621K095065K409829K577357
$$ 230182042 231566644 233117077 234948492 236841703 238747324 240842389 243252218 245829575
1493B45829575K710023L137486L254328L456409L608350L789727L885380L928187
$$ 245829575 248539598 251677084 254931412 258387821 261996171 265785898 269671278 273599465
1485B73599465M069507M170188M015844M159405M394320M833099M839618N331960
$$ 273599465 277668972 281839160 285855004 290014409 294408729 299241828 304081446 309413406
1477C09413406N996849O618170P506989Q452257R336271J0270626J1150102J1674654
$$ 309413406 315410255 322028425 329535414 337987671 347323942 357594568 368744670 380419324
1469C80419324J1896607J1689364J1080267R623126Q050872N999774L804254K062643
$$ 380419324 392315931 404005295 415085562 424708688 432759560 438759334 442563588 444626231
1461D44626231K56385r23437j770597k264209k477282k830422l201644l606937
$$ 444626231 444882616 443959179 442188582 439924373 437447091 434616669 431415025 427808088
1453D27808088m499413n809470p103640r031979j0936009j2492239j4117282j5285417
$$ 427808088 423308675 417499205 410395565 401363586 390427577 377935338 363818056 348532639
1445C48532639j5853396j6040961j5771264j5303535j4422299j3300264j2680332
$$ 348532639 332679243 316638282 300867018 285563483 271141184 257840920 245160588
1438B45160588j1827718j0884285j0212380r362924q832541q159371p600538p193135
$$ 245160588 233332870 222448585 212236205 202873281 194040740 185881369 178280831 171087696
1430A71087696o562219o224379n832177n626653n190121m969781m850214m563664
$$ 171087696 164525477 158301098 152468921 146842268 141652147 136682366 131832152 127268488
1422A27268488m515092m230616l967460l823996l820578l725249l396696l190874
$$ 127268488 122753396 118522780 114555320 110731324 106910746 103185497 99788801 96597927
1414I6597927l172683l100465l056743l038404l045103k816836k371928k424830
$$ 96597927 93425244 90324779 87268036 84229632 81184529 78367693 75995765 73570935
1406G3570935k378676k290889k022568j786167j797928j692294j549743j380188
$$ 73570935 71192259 68901370 66878802 65092635 63294707 61602413 60052670 58672482
1398E8672482j358201j170716j164166j060932r47789q51252j131945p21484o34685
$$ 58672482 57314281 56143565 54979399 53918467 52970678 52119426 50987481 50265997 49631312
1389D9631312o46300n83735n23224l00903l99131m30933l66165l04643k46272
$$ 49631312 48985012 48401277 47878053 47577150 47178019 46747086 46380921 46076278 45830006
1380D5830006k05423l65860m69730m63544m72873n42305n01551l74214m81706
$$ 45830006 45624583 45258723 44788993 44325449 43852576 43310271 42808720 42434506 41952800
1371D1952800m91545m23453m07921n50338n88716l49876m55652m97117n10672
$$ 41952800 41461255 41037802 40629881 40079543 39490827 39140951 38685299 38188182 37677510
1362C7677510n75142o24318n57323o91166o66062p43418o84559n06098n95686
$$ 37677510 37102368 36478050 35920727 35229561 34563499 33820081 33135522 32629424 32033738
1353C2033738n80986m10833n01113l63842l82852m30909l09825k66237l18109
$$ 32033738 31452752 31041919 30540806 30176964 29794112 29363203 29053378 28787141 28469032
1344B8469032k59228l00449j30022j41582k79507j69781n6459l0770r9429K3320
$$ 28469032 28209804 27909355 27779333 27637751 27358244 27188463 27132004 27101234 27001805 27025125
1334B7025125j08324n2248j40975j68389p3897j2464p5658l8021j00888p7471
$$ 27025125 26916801 26864553 26723578 26555189 26481292 26468828 26393170 26355149 26254261 26176790
1324B6176790p2873j02040N6859o5983k2391q7122K18443J1307J8788L9426J31490
$$ 26176790 26103917 26001877 26058736 25992753 25970362 25883240 26101683 26112990 26131778 26171204 26302694
1313B6302694J43721J47179J33619J36930J16078M5856M7170K883R9436N7367
$$ 26302694 26446415 26593594 26727213 26864143 26980221 27026077 27073247 27076130 27175566 27232933
1303B7232933J33527P2355J53202M5817m3899M0558K42947O171j05752K1969j68678
$$ 27232933 27366460 27438815 27592017 27637834 27593935 27634493 27877440 27883611 27777859 27799828 27631150
1292B7631150K484J34665J0102R2750K16061J79488Q2861J13724J23313K38920
$$ 27631150 27633634 27768299 27778401 27871151 28087212 28266700 28349561 28463285 28586598 28825518
1282B8825518L05789K54907K65202J22174K63405J03549K21011K25322K43331
$$ 28825518 29131307 29386214 29651416 29773590 30036995 30140544 30361555 30586877 30830208
1273C0830208K94194J76732M47809L59039L63613M49564J91544J58067K53608
$$ 30830208 31124402 31301134 31748943 32107982 32471595 32921159 33112703 33270770 33524378
1264C3524378J40858L73495L79861K36880M05270O10873M34620M52571N71821
$$ 33524378 33665236 34038731 34418592 34655472 35060742 35671615 36106235 36558806 37130627
1255C7130627O36554N38626O08614O60235N44951M82211O47944O46168N22198
$$ 37130627 37767181 38305807 38914421 39574656 40119607 40601818 41249762 41895930 42418128
1246D2418128N90615Q31496O77527P21730O70876Q52933J099100R22912J058178
$$ 42418128 43008743 43840239 44517766 45239496 45910372 46763305 47862405 48785317 49843495
1237D9843495J172580J201306J395882J270964J697966J588383J688282J786327
$$ 49843495 51016075 52217381 53613263 54884227 56582193 58170576 59858858 61645185
1229F1645185J907051J937822K074880K297402K464639K634454K904650L083245
$$ 61645185 63552236 65490058 67564938 69862340 72326979 74961433 77866083 80949328
1221H0949328L283840L687360L875834L954608M028687M128044L957912M073486
$$ 80949328 84233168 87920528 91796362 95750970 99779657 103907701 107865613 111939099
1213A11939099L893449L678938K840780J980455P50754m24872j594271k406169
$$ 111939099 115832548 119511486 122352266 124332721 125083475 124658603 123064332 120658163
1205A20658163k598890k699231k738517k389678k185785k127882j689865j719143
$$ 120658163 118059273 115360042 112621525 110231847 108046062 105918180 104228315 102509172
1197A02509172j283749r09535m56739K71492N97881J033776J046653J257646R42733
$$ 102509172 101225423 100315888 99859149 100130641 100728522 101762298 102808951 104066597 105009330
1188A05009330M47161o0384k86576j46842l7137k18128m49537j023683k141032
$$ 105009330 105456491 105396107 105109531 104962689 104925552 104707424 104257887 103234204 101093172
1179A01093172k862178k928239k782188k725007k482400k250820k124763j819758
$$ 101093172 98230994 95302755 92520567 89795560 87313160 85062340 82937577 81117819
1171H1117819j484632j416981j308125q56269j87977P9141K54091O83611P76101
$$ 81117819 79633187 78216206 76908081 76051812 75863835 75942976 76197067 76880678 77656779
1162G7656779M63603J22988n43766j280128j305438j183345r71416o53986p43400
$$ 77656779 78120382 78243370 77699604 76419476 75114038 73930693 72959277 72305291 71561891
1153G1561891j086908j375440j452138j364702j401874j194036j101401j449483
$$ 71561891 70474983 69099543 67647405 66282703 64880829 63686793 62585392 61135909
1145F1135909j598476j775568j719259j639049j621739j166804j065219q40821
$$ 61135909 59537433 57761865 56042606 54403557 52781818 51615014 50549795 49708974
1137D9708974n33343m34537j46661l3228n7282l7145k24447l54491m50275p81196
$$ 49708974 49175631 48741094 48594433 48561205 48503923 48466778 48242331 47887840 47437565 46656369
1127D6656369p13349n45908o25992m75997l68121O1043J01051M08998P82925R83371
$$ 46656369 45943020 45397112 44771120 44295123 43927002 43988045 44089096 44498094 45281019 46264390
1117D6264390Q44399P23613O21273j36675o97696r18090j260322j128589q23514
$$ 46264390 47108789 47832402 48453675 48317000 47619304 46701214 45440892 44312303 43488789
1108D3488789o79060l97202j21663k3448l58512n73210p14579r73604j111094
$$ 43488789 42809729 42412527 42290864 42267416 41908904 41335694 40621115 39647511 38536417
1099C8536417j143552j008837o94356p42033m92099l14583k62968k00303j65112
$$ 38536417 37392865 36384028 35689672 34947639 34455540 34140957 33877989 33677686 33512574
1090C3512574n2343L3858J48270K28366J82135J9387J5769m2188l60484o00783
$$ 33512574 33460231 33494089 33642359 33870725 34052860 34072247 34088016 34045828 33685344 33084561
1080C3084561p92873q04507o77876n65375l93235n02455l28931j75905j86752
$$ 33084561 32291688 31487181 30809305 30243930 29850695 29348240 29019309 28843404 28656652
1071B8656652p2772j3016r4549k82343n9771k7001J31908K42066J62004K73657
$$ 28656652 28583880 28570864 28476315 28193972 28134201 28107200 28239108 28481174 28643178 28916835
1061B8916835L69534M14089M21190M16808M59723O31314O93743Q36190Q15370
$$ 28916835 29286369 29700458 30121648 30538456 30998179 31629493 32323236 33159426 33974796
1052C3974796R48027J080793J270569J436091J490179K088296K256285K581880
$$ 33974796 34922823 36003616 37274185 38710276 40200455 42288751 44545036 47126916
1044D7126916K937727K758362K637775K636679K714451L172737L757535M490147
$$ 47126916 50064643 52823005 55460780 58097459 60811910 63984647 67742182 72232329
1036G2232329N021033N975768P118272Q599372J0421494J3096234J5554952J6473148
$$ 72232329 77253362 83229130 90347402 98946774 109368268 122464502 138019454 154492602
1028A54492602J6424601J5848440J1925376L470049r019060j6235718j5445629
$$ 154492602 170917203 186765643 198691019 202161068 193142008 176906290 161460661
1021A61460661j2762858r954874p373317n118746m154568l958261m089665l774639
$$ 161460661 148697803 138742929 131369612 126250866 122096298 118138037 114048372 110273733
1013A10273733l562055l006220j882180n63446N51220J870847L140725M641158
$$ 110273733 106711678 103705458 101823278 101259832 101811052 103681899 106822624 111463782
1005A11463782O497549Q633541J1419657J3878584J4131796J3961041J2658877
$$ 111463782 117961331 126594872 138014529 151893113 166024909 179985950 192644827
998A92644827P373494k641268j4106592j8318601j6331236j3776743j1115768
$$ 192644827 200018321 197377053 183270461 164951860 148620624 134843881 123728113
991A23728113r031413p460365p136923o998464o644567o362105o031874n625222
$$ 123728113 114696700 107236335 100099412 93100948 86456381 80094276 74062402 68437180
983F8437180m872856m089824l443656k710037k195197j980524j441114j382164
$$ 68437180 63564324 59474500 56030844 53320807 51125610 49145086 47703972 46321808
975D6321808j058288p93079r05850j105247r42808j063329j268569j343496j376365
$$ 46321808 45263520 44470441 43564591 42459344 41516536 40453207 39184638 37841142 36464777
966C6464777j299798j335320j279133j136476q94854q84892p87805q54164o04112
$$ 36464777 35164979 33829659 32550526 31414050 30519196 29634304 28846499 27992335 27388223
957B7388223o25781m58251m10422l35334k69075k17928o160J03751J61313L59528
$$ 27388223 26762442 26304191 25893769 25558435 25289360 25071432 25065272 25169023 25330336 25689864
947B5689864L28954L14036L62041J21269j47166m40229n81196n82657q18694o33369
$$ 25689864 26018818 26332854 26694895 26816164 26668998 26228769 25647573 25064916 24246222 23612853
937B3612853m53817n01954n55217l13152m46672m15658k97336l03279k73388k56562
$$ 23612853 23159036 22657082 22101865 21788713 21342041 20926383 20629047 20325768 20052380 19795818
927A9795818l03513k03586n0279k70842j22485K14241n362j30748j03605O1967
$$ 19795818 19492305 19288719 19238440 18967598 18845113 19059354 19053992 18923244 18819639 18881606
917A8881606J64748k1902K15168J53678R4012K14877K25664J75895K24660L36001
$$ 18881606 19046354 19024452 19239620 19393298 19487310 19702187 19927851 20103746 20328406 20664407
907B0664407L34371K21614K93883L01637M20061N03807L61245M73836L70410K37779
$$ 20664407 20998778 21220392 21514275 21815912 22235973 22739780 23101025 23574861 23945271 24183050
897B4183050L96413L64639K18510K35699L51031L20916L20330J81042L24538M27151
$$ 24183050 24579463 24944102 25162612 25398311 25749342 26070258 26390588 26571630 26896168 27323319
887B7323319L69092M02770L02054N14893M45846N86176N43122N69990O78189O65268
$$ 27323319 27692411 28095181 28397235 28912128 29357974 29944150 30487272 31057262 31735451 32400719
877C2400719Q52635R13145R37669R00131J109367R42378J065223Q34638P28944
$$ 32400719 33253354 34166499 35104168 36004299 37113666 38056044 39121267 39955905 40684849
868D0684849O28973K86254J52624n8417l85096m61643m61512m49510k91901k94777
$$ 40684849 41313822 41600076 41752700 41694283 41309187 40847544 40386032 39936522 39644621 39349844
858C9349844k78929K1085r2415J33135J49815K85200M38220K45052L07910L26291
$$ 39349844 39070915 39092000 38999585 39132720 39282535 39567735 40005955 40251007 40558917 40885208
848D0885208M93325K90924M88896K42261K34080J30437r2223J0023k42079l87501
$$ 40885208 41378533 41669457 42158353 42400614 42634694 42765131 42672908 42682931 42440852 42053351
838D2053351n86262o33492q08942p55608p95994q63700r18205r78867o55441n36851
$$ 42053351 41467089 40833597 40024655 39269047 38473053 37609353 36691148 35712281 35056840 34519989
828C4519989n87385o37383m92006l56748l68131m36813l29313k74278m56351n11576
$$ 34519989 33932604 33295221 32803215 32446467 32078336 31641523 31312210 31037932 30581581 30070005
818C0070005n59820n35786n07203o76395q28605p09486r63823r34805o95960q89326
$$ 30070005 29510185 28974399 28467196 27790801 26962196 26252710 25288887 24354082 23658122 22768796
808B2768796j000914q63956q18371n52071n93945p61268p05989n93598l57466
$$ 22768796 21767882 20903926 20085555 19533484 18939539 18178271 17472282 16878684 16521218
799A6521218n50529o13601n00761l84245m17329m44714l39308l05429l58303m36160
$$ 16521218 15970689 15357088 14856327 14472082 14054753 13610039 13270731 12965302 12606999 12170839
789A2170839k81421l02136l25168l29672l11911j97202l72902l27606j63638k29216
$$ 12170839 11889418 11587282 11262114 10932442 10620531 10423329 10050427 9722821 9559183 9329967
779I329967j93727k00635k72878l23231k74202k49495j09794l66901j45630M5030
$$ 9329967 9136240 8935605 8662727 8339496 8065294 7815799 7706005 7339104 7193474 7238504
769G238504k93219j85765k06440j57050p7108j71026j59365j58757m7056q4879
$$ 7238504 6945285 6759520 6553080 6396030 6318922 6147896 5988531 5829774 5782718 5697839
759E697839n1873k4991k5066n3712J7659k70721k24801Q5061k4151j64294j54879
$$ 5697839 5645966 5620975 5595909 5542197 5559856 5289135 5064334 5149395 5125244 4960950 4806071
748D806071M876R5453q4488K083k9016j9856m874m2354j7434k10234j14184j44392
$$ 4806071 4810947 4906400 4821912 4823995 4794979 4775123 4770249 4727895 4710461 4500227 4386043 4241651
736D241651k12155j81044N5684n0276r7494m1253N5821j87838j51419j60049o1317
$$ 4241651 4029496 3848452 3904136 3853860 3756366 3715113 3770934 3583096 3431677 3271628 3210311
725C210311O1884N8345k43502J0278K4307j14988j65921L1799N5127J39190J2521
$$ 3210311 3272195 3330540 3087038 3097316 3121623 3006635 2840714 2872513 2927640 3066830 3079351
714C079351j04680l7487r5197l1939j0530j45582j94059r8479n3115j11335j06668
$$ 3079351 2974671 2937184 2841987 2810048 2799518 2653936 2459877 2361398 2308283 2196948 2090280
703B090280j24062l968k794j98379o3083k5338j67967L3684j4276p6469K0878
$$ 2090280 1966218 1962250 1959456 1761077 1697994 1672656 1504689 1538373 1524097 1447628 1468506
692A468506l5621k6944j15286j42844M1814j7729l2990j54092O2688l0442M6638
$$ 1468506 1432885 1405941 1290655 1147811 1189625 1171896 1138906 984814 1047502 1017060 1063698
681A063698J24911j26511q9576j52588J32325n7962o2317j18741N7833o1821J6736
$$ 1063698 1188609 1062098 972522 819934 952259 894297 831980 713239 771072 709251 725987
670G25987L829o6822l9092Q7809m8962j47381O9624r989l926l6689j7412m9686
$$ 725987 729816 662994 623902 711711 662749 515368 584992 575003 571077 534388 516976 467290
658D67290p8936K6899j8754M0346N1976J4648p5046J02650K9129J892j11393q3026
$$ 467290 388354 415253 396499 436845 488821 503469 428423 531073 560202 562094 450701 367675
646C67675r653L2041K3020m5489p5493M5902O1792n5457l2886p7514n6614p5204
$$ 367675 358022 390063 413083 367594 292101 338003 399795 344338 311452 233938 177324 102120
634A02120q676N6549j16676J69965L1782m5925j1156P2502J60817p7220j34006
$$ 102120 93444 149993 33317 203282 235064 189139 177983 250485 411302 334082 200076
623B00076p2076m106j43539M8463N3968k4230L0340l1646m3513L5034J58581n8187
$$ 200076 128000 123894 -19645 28818 82786 58556 88896 57250 13737 48771 207352 149165
611A49165q8838r5791J7751J53071O2362j61388p2250J04058J00419o1667j00840
$$ 149165 60327 -35464 -17713 135358 197720 36332 -35918 68140 168559 106892 6052
600F052K9834q5838m5306K1374M2879M2198K9269j63321P8352L1682m7798J10633
$$ 6052 35886 -49952 -95258 -73884 -31005 11193 40462 -122859 -44507 -12825 -60623 50010
588E0010L3966r5152K0999n5198K5773k7361n1572o6661k0408J02579m4244L4294
$$ 50010 83976 -11176 9823 -45375 -19602 -46963 -98535 -165196 -185604 -83025 -127269 -92975
576i2975M9678j08286j2450r8098Q1220J20972O3849N4569q8756r7109m5507J447
$$ -92975 -43297 -151583 -164033 -262131 -180911 -59939 3910 58479 -30277 -127386 -172893 -171446
564a71446J58952j32607L0275J9405j35848P3779m2641K7307l3886J0353O7657
$$ -171446 -12494 -145101 -114826 -95421 -231269 -157490 -200131 -172824 -206710 -196357 -128700
553a28700j49147j36642k4041R1721j450K4484J28984j16009o792J23694J13517
$$ -128700 -277847 -414489 -438530 -346809 -348259 -323775 -194791 -310800 -317592 -193898 -80381
542h0381j62449o5593p1143M7715J58273j56797m9328O5909l9609j80235N537
$$ -80381 -242830 -308423 -379566 -331851 -173578 -330375 -379703 -313794 -353403 -533638 -528101
531e28101J79537J4324l2236n4006O942J5395J9454j08728k9402k7882N5392j33214
$$ -528101 -348564 -334240 -366476 -420482 -413540 -398145 -378691 -487419 -516821 -544703 -489311 -622525
519f22525P1870J05841q1093J9467m7923j15266J15563j16075L3183J30799j85549
$$ -622525 -550655 -444814 -525907 -506440 -554363 -669629 -554066 -670141 -636958 -506159 -691708
508f91708j13919J4407J23931L5430l8953o3121O3252j20127R3634J10920q2945
$$ -691708 -805627 -791220 -667289 -631859 -670812 -733933 -670681 -790808 -697174 -586254 -669199
497f69199j2974m971O3098O5666j3197j4714O4617r8453K4445M3658j66778k1281
$$ -669199 -682173 -687144 -624046 -558380 -571577 -586291 -521674 -620127 -595682 -552024 -718802 -740083
485g40083r4210M6986O3832P5789q3417j9314L6857r2768k765k1363L1089J32718
$$ -740083 -834293 -787307 -723475 -647686 -731103 -750417 -713560 -806328 -809093 -830456 -799367 -666649
473f66649O000j54825O0407m5683m2313j37748R554Q7586L2443O6667m3326j3125
$$ -666649 -660649 -815474 -755067 -800750 -843063 -980811 -971257 -883671 -851228 -784561 -827887 -841012
461h41012p0436J01076p8549O5416m6406q7836O3213J22943j22395r178j5365
$$ -841012 -911448 -810372 -888921 -823505 -869911 -957747 -894534 -771591 -893986 -903164 -918529
450i18529J0896K146K6623M636m9597J18292k1440J0093O8764N8214j71431n1943
$$ -918529 -907633 -905487 -878864 -874228 -923825 -805533 -826973 -816880 -748116 -689902 -861333 -913276
438i13276l7975p1926J40812l6559M397J73086J364j40311L2198n9496P4077R4123
$$ -913276 -951251 -1023177 -882365 -918924 -914527 -741441 -740077 -880388 -848190 -907686 -833609 -739486
426g39486k330n7690n380M4596j07033n2610k5172L9069R258P4820q4194j07028
$$ -739486 -741816 -799506 -804886 -760290 -867323 -919933 -945105 -906036 -896778 -821958 -906152 -1013180
414a013180k6298P9281L3256K0173r1389p8472J18708J10943M6416j39577J389
$$ -1013180 -1039478 -960197 -926941 -906768 -998157 -1076629 -957921 -846978 -800562 -940139 -938750
403i38750L5701J27594k1968j40450Q184N6200m444J3404J31289m3891k04431
$$ -938750 -903049 -775455 -797423 -937873 -929689 -873489 -877933 -864529 -733240 -777131 -981562
392i81562q226J40149J19398r6831q8283r117k494m7316O82Q2509R1812J88769
$$ -981562 -989788 -849639 -730241 -827072 -915355 -924472 -926966 -974282 -973600 -891091 -799279 -610510
380f10510k98959m3031Q8793l0998j04390m6983K1892R6595P5206N619q1711o8943
$$ -610510 -909469 -952500 -863707 -894705 -999095 -1046078 -1024186 -927591 -852385 -846766 -928477 -997420
368i97420J32348J24685p8844O498m1369j17470j102j02115r2609K3400K7468
$$ -997420 -865072 -740387 -819231 -812733 -854102 -971572 -972674 -1074789 -1167398 -1143998 -1116530
357a116530L5098p7756j535N9014O101J39078N671q7088m5762p9864J76073j3472
$$ -1116530 -1081432 -1159188 -1160723 -1101709 -1095608 -956530 -950859 -1037947 -1083709 -1163573 -987500 -1000972
345a000972j87365r5021J32763J9205L0113J04100k7233j62725j2797Q7067k3878
$$ -1000972 -1188337 -1283358 -1150595 -1131390 -1101277 -997177 -1024410 -1187135 -1199932 -1112865 -1136743
334a136743o1699J61449L5705r8399m4846q3153P4883K2132j03056o6533l1370
$$ -1136743 -1198442 -1036993 -1001288 -1099687 -1144533 -1227686 -1152803 -1130671 -1233727 -1300260 -1331630
323a331630L4276m3405k6465K3845j0825Q6800N7919L3661l319l5603n9668k8820
$$ -1331630 -1297354 -1340759 -1367224 -1343379 -1354204 -1267404 -1209485 -1175824 -1179143 -1214746 -1274414 -1303234
311a303234q0327J01941M2783l2395N9839l3781k5561r0358l2249K0804J06116
$$ -1303234 -1383561 -1281620 -1238837 -1271232 -1211393 -1245174 -1270735 -1361093 -1393342 -1372538 -1266422
300a266422K1994n2622J08751n49l1475P997j23903J2171J0323j73176L8798M6584
$$ -1266422 -1244428 -1297050 -1188299 -1188848 -1220323 -1212326 -1336229 -1324058 -1313735 -1486911 -1448113 -1401529
288a401529O4657K4098K3764K6234j5049p2063J26222n6027J04305N455p1363
$$ -1401529 -1336872 -1312774 -1289010 -1262776 -1277825 -1349888 -1223666 -1279693 -1175388 -1169933 -1241296
277a241296m4921J34851o6899j06182N1781r36j04941J7105K2036J78802O5275
$$ -1241296 -1286217 -1151366 -1218265 -1324447 -1272666 -1273602 -1378543 -1361438 -1339402 -1160600 -1095325
266a095325j60332Q417o1303L1456N6478k9916Q8658N5503r629r0963J9343P1978
$$ -1095325 -1255657 -1247240 -1308543 -1277087 -1220609 -1250525 -1161867 -1106364 -1115993 -1206956 -1187613 -1115635
254a115635J8059p2127j3561m3251J04219J13992p9942K5032N3253j5325k11006
$$ -1115635 -1097576 -1169703 -1183264 -1226515 -1122296 -1008304 -1088246 -1063214 -1009961 -1025286 -1236292
243a236292Q8103M2395m9917K471M716J07836L2701o3435j48191P9058J01996
$$ -1236292 -1148189 -1105794 -1155711 -1153240 -1148524 -1040688 -1007987 -1071422 -1219613 -1140555 -1038559
232a038559o9700N2665L91q7834J07226p4945k2732M5993j16195J67428j8312
$$ -1038559 -1108259 -1055594 -1055203 -1143037 -1035811 -1110756 -1133488 -1087495 -1203690 -1036262 -1054574
221a054574N218P4422n2941j40118o0217o4297J00362J17212P4828L4248K6357
$$ -1054574 -1049356 -974934 -1027875 -1167993 -1228210 -1292507 -1192145 -1074933 -1000105 -965857 -939500
210i39500K491j80439J6573J03300j1731r3320L077k8398l9830m0297j1028J65947
$$ -939500 -937009 -1117448 -1100875 -997575 -1009306 -1102626 -1099549 -1127947 -1167777 -1208074 -1219102 -1053155
198a053155n3356j10154R933m9926L9801J08870j2731m2643j84705k0803K4422
$$ -1053155 -1106511 -1216665 -1206732 -1256658 -1216857 -1107987 -1120718 -1163361 -1348066 -1368869 -1344447
187a344447N4732Q4708j01313k8509r953j23027J52268q129L3274M7217j05918
$$ -1344447 -1289715 -1205007 -1306320 -1334829 -1344782 -1467809 -1315541 -1323670 -1290396 -1243179 -1349097
176a349097L918J9581j39639J6255p4008J6031L8048j40300K766R6566M4894l3723
$$ -1349097 -1345179 -1325598 -1465237 -1448982 -1522990 -1506959 -1468911 -1609211 -1606445 -1509879 -1464985 -1498708
164a498708j931j10071l9556m4574J32918q7269m1196Q6484l7525r5367p5943
$$ -1498708 -1500639 -1610710 -1650266 -1694840 -1561922 -1649191 -1690387 -1603903 -1641428 -1736795 -1812738
153a812738N5035O8043j23269M151n7467q097N4893j40673p1262K059J80305r4851
$$ -1812738 -1757703 -1689660 -1812929 -1808778 -1866245 -1874342 -1819449 -1960122 -2031384 -2029325 -1849020 -1943871
141a943871j03121j65259p947r061j32186J7585R7183k2067j04635K8278N76n5435
$$ -1943871 -2046992 -2212251 -2220198 -2229259 -2361445 -2343860 -2246677 -2268744 -2373379 -2345101 -2344525 -2399960
129b399960L173L8396l2096M5664P8137j01092l6345j16003j07614N1990P9019
$$ -2399960 -2396787 -2358391 -2390487 -2344823 -2266686 -2367778 -2404123 -2520126 -2627740 -2575750 -2496731
118b496731O4704j9313J1271j6304m1944R794j78694L9389J36917J25917K7032
$$ -2496731 -2432027 -2451340 -2440069 -2456373 -2498317 -2488523 -2667217 -2627828 -2490911 -2364994 -2337962
107b337962j26183l9218J29231p8799m2484J43965L8955J16696J38371J75551
$$ -2337962 -2464145 -2503363 -2374132 -2452931 -2495415 -2351450 -2312495 -2195799 -2057428 -1881877
97a881877K2603J23908J67749J53062J87654K85602L12568J85353K11626K39271
$$ -1881877 -1859274 -1735366 -1567617 -1414555 -1226901 -941299 -628731 -443378 -231752 7519
87G519K92680L24701J81992K78242L11514M71965N14164O94147Q24277R08206
$$ 7519 300199 624900 806892 1085134 1396648 1868613 2382777 3076924 3901201 4809407
77D809407J186059J591263K276685K180582J967079J791624J472967O23550l40443
$$ 4809407 5995466 7586729 9863414 12043996 14011075 15802699 17275666 17899216 17558773
68A7558773j693143k640223k367588j982213j391277j379037j209381r58774o14030
$$ 17558773 15865630 13225407 10857819 8875606 7484329 6105292 4895911 3937137 3323107
59C323107r45567p11537m76902m53513m92868l79656l35095k86489k49150l50695
$$ 3323107 2377540 1666003 1189101 735588 242720 -136936 -472031 -758520 -1007670 -1358365
49a358365k56675j06451j79379k20771j51687j94866r4143L5962j52636j48076
$$ -1358365 -1615040 -1721491 -1900870 -2121641 -2273328 -2468194 -2562337 -2526375 -2679011 -2827087
39b827087m3022K9006p4780m4222Q244j03348J4479R3591N1945J6644k4996J7394
$$ -2827087 -2870109 -2841103 -2915883 -2960105 -2951861 -3055209 -3040730 -2947139 -2895194 -2878550 -2903546 -2886152
27b886152N7243J2140J2938L555O2668n0610P4162P2955O3117P990O1392J01096
$$ -2886152 -2828909 -2816769 -2803831 -2800276 -2737608 -2788218 -2714056 -2641101 -2577984 -2569994 -2508602 -2407506
15b407506J99237J27636O3120Q5352Q4396J37221K12645Q4965J578O7860K26355
$$ -2407506 -2208269 -2080633 -2017513 -1932161 -1847765 -1710544 -1497899 -1412934 -1411356 -1343496 -1117141
4a117141K15488P6228J06521J27446
$$ -1117141 -901653 -825425 -718904 -591458
0e91458
$$ -591458
$$ Imaginary data points
##PAGE= N=2
##DATA TABLE= (X++(I..I)), XYDATA
16383a5767986O3340K01047K37488J62994J533K47523J33258J29714K21169K00447
$$ -15767986 -15704646 -15503599 -15266111 -15103117 -15101584 -14854061 -14720803 -14591089 -14369920 -14169473
16373a4169473J92924P0894K09209K86387J4530J59388K39913J86614N3957J11524
$$ -14169473 -13976549 -13905655 -13696446 -13410059 -13395529 -13236141 -12996228 -12809614 -12755657 -12644133
16363a2644133J70224J43868R8119J29788L13461J21273N9149K23169J52761J10496
$$ -12644133 -12473909 -12330041 -12231922 -12102134 -11788673 -11667400 -11608251 -11385082 -11232321 -11121825
16353a1121825K14909J87273R6013N2722K34117J05352O8024J77998K16751J38642
$$ -11121825 -10906916 -10719643 -10623630 -10570908 -10336791 -10231439 -10163415 -9985417 -9768666 -9630024
16343i630024J51682M9158J06422J87240Q9941J22924O8086K20383O7228N7717
$$ -9630024 -9478342 -9429184 -9322762 -9135522 -9045581 -8922657 -8854571 -8634188 -8566960 -8509243
16333h509243K33507K26735P9158J70928J96108J12278Q4662J57923J12965J49851
$$ -8509243 -8275736 -8049001 -7969843 -7798915 -7602807 -7490529 -7405867 -7247944 -7134979 -6985128
16323f985128O5273J29820M5104K689J44450J88435K13986J09678J71157R5270
$$ -6985128 -6919855 -6790035 -6744931 -6742242 -6597792 -6409357 -6195371 -6085693 -5914536 -5819266
16313e819266P3961J1568J55145K11575J51329O2244J42090K16572l09Q460K75819
$$ -5819266 -5745305 -5733737 -5578592 -5367017 -5215688 -5153444 -5011354 -4794782 -4795091 -4786631 -4510812
16302d510812J16357J0596R3144J20463J06312J33106N0856J72216J22239J12600
$$ -4510812 -4394455 -4383859 -4290715 -4170252 -4063940 -3930834 -3879978 -3707762 -3585523 -3472923
16292c472923O4025P2619Q4485J40462R2196J02567J61755N7520J0499K28167
$$ -3472923 -3408898 -3336279 -3251794 -3111332 -3019136 -2916569 -2754814 -2697294 -2686795 -2458628
16282b458628J00497R1661J07844N5037Q5458Q9451J9901J28058J45034m4535
$$ -2458628 -2358131 -2266470 -2158626 -2103589 -2018131 -1928680 -1908779 -1780721 -1635687 -1680222
16272a680222Q2795J51139Q9960J54833M1817J97436J19485r502N8876O6601O6249
$$ -1680222 -1597427 -1446288 -1356328 -1201495 -1159678 -962242 -842757 -852259 -793383 -726782 -660533
16261f60533M3568J46136J09052M9795N5493j493J01895J45446J58543Q0266O2364
$$ -660533 -616965 -470829 -361777 -311982 -256489 -257982 -156087 -10641 147902 228168 290532
16250B90532K043J34369J02813N4173O6697O4771j251J06671J15476p5716R7634
$$ 290532 292575 426944 529757 583930 650627 715398 714147 820818 936294 860578 958212
16239I58212Q0952R7619L9521J41811K1773P8017J89501J19214J707L9101n58
$$ 958212 1039164 1136783 1176304 1318115 1339888 1417905 1607406 1726620 1728327 1767428 1766870
16228A766870J67488n3840P4632Q6642P4566M4066k6691J41591j0699P8199l4517
$$ 1766870 1934358 1880518 1955150 2041792 2116358 2160424 2133733 2275324 2264625 2342824 2308307
16217B308307l1441J26095J15060J13488Q2739K6938L5072K8878R441J09447J62938
$$ 2308307 2276866 2402961 2518021 2631509 2714248 2741186 2776258 2805136 2814577 2924024 3086962
16206C086962K8359o7582M033O4814K04005Q4960o2710Q5679K2021M6800N2338
$$ 3086962 3115321 3047739 3051772 3116586 3320591 3405551 3342841 3428520 3450541 3497341 3549679
16195C549679k31309M7929J91422J45336Q9094j0686l9896o1616M8358Q0243R6
$$ 3549679 3318370 3366299 3557721 3703057 3792151 3781465 3741569 3679953 3728311 3808554 3808650
16184C808650R0779J15685J63293k3324k3741O7990k7327p4689O6864j8902l6200
$$ 3808650 3899429 4015114 4178407 4155083 4131342 4199332 4172005 4097316 4164180 4145278 4109078
16173D109078P4789K18896P6764j19429q6486L8190L3508M9567J72841M3715M9778
$$ 4109078 4183867 4402763 4479527 4360098 4273612 4311802 4345310 4394877 4567718 4611433 4661211
16162D661211L3204j9268K0910J8209Q4845m982m8322K6906r0472j1818N9525
$$ 4661211 4694415 4675147 4696057 4714266 4799111 4794129 4745807 4772713 4682241 4670423 4729948
16151D729948J86121m3093L470q263K1177M0280M430n656m2081J8552K08128o7529
$$ 4729948 4916069 4872976 4876446 4868183 4889360 4929640 4934070 4928414 4886333 4904885 5113013 5045484
16139E045484O4459L7653m0547K904m0773R5533J6061J33738k413j9177L6092
$$ 5045484 5109943 5147596 5107049 5109953 5069180 5164713 5180774 5314512 5312099 5292922 5329014
16128E329014P9154p4641J0129q520L3762l9429n210p8905O4279P6580N2225K7917
$$ 5329014 5408168 5333527 5343656 5335136 5368898 5329469 5324259 5245354 5309633 5386213 5438438 5466355
16116E466355K6115O6391k2838l8189m8084J71412K4257l4985L152l3143p9865
$$ 5466355 5492470 5558861 5536023 5497834 5449750 5621162 5645419 5610434 5613586 5580443 5500578
16105E500578Q5171J47275n6950O914j0264q1405Q7535j688P0033K4565j1884
$$ 5500578 5585749 5733024 5676074 5682988 5672724 5591319 5678854 5677166 5747199 5771764 5759880
16094E759880r701L3015l6071l7620j12015J22020K0237k3118P1589K1478R331
$$ 5759880 5750179 5783194 5747123 5709503 5597488 5719508 5739745 5716627 5788216 5809694 5819025
16083E819025l6816O1391j05375p1622J0320K8299k1192K8977O8873n8633Q7491
$$ 5819025 5782209 5843600 5738225 5666603 5676923 5705222 5684030 5713007 5781880 5723247 5810738
16072E810738O4952O5857l8884j66598Q9436l5729r9907J17278q638J28691N3106
$$ 5810738 5875690 5941547 5902663 5736065 5825501 5789772 5689865 5807143 5798505 5927196 5980302
16061E980302j10220R5257N3712j19548M8091n6385o1302M7650P6581j05948j90980
$$ 5980302 5870082 5965339 6019051 5899503 5947594 5891209 5829907 5877557 5954138 5848190 5657210
16050E657210P8440L2342J25160j40084K3596N2868O5215p5807n7900K18731n4676
$$ 5657210 5735650 5767992 5893152 5753068 5776664 5829532 5894747 5818940 5761040 5979771 5925095
16039E925095j46416Q6041J21271n1851p1239N491P1468o4300p920R3742p7864
$$ 5925095 5778679 5864720 5985991 5934140 5862901 5868392 5939860 5875560 5867640 5961382 5883518
16028E883518m3660J37213K2946q8505l2685m9555j4418J58989Q8474l6365J48387
$$ 5883518 5839858 5977071 6000017 5911512 5878827 5829272 5814854 5973843 6062317 6025952 6174339
16017F174339j41035k0033K8023j09844L0260l4886K3574m1203j2954p3307O5959
$$ 6174339 6033304 6013271 6041294 5931450 5961710 5926824 5950398 5909195 5896241 5822934 5888893
16006E888893j09422m1199J17275o7106J62936M6000p024m527K5743r421l0401
$$ 5888893 5779471 5738272 5855547 5788441 5951377 5997377 5990353 5985826 6011569 6002148 5971747
15995E971747j28827n2764Q0819o8344L8428K659m3147J01964K02500l5342j91123
$$ 5971747 5842920 5790156 5870975 5802631 5841059 5843718 5800571 5902535 6105035 6069693 5878570
15984E878570j24543M1926J38210J724J56890N0465j17185j01247n4929K7447
$$ 5878570 5754027 5795953 5934163 5935887 6092777 6143242 6026057 5924810 5869881 5897328
15974E897328m1520J9441N7725J42392j12816n2775P3841N0599O7192n2408k1499
$$ 5897328 5855808 5875249 5932974 6075366 5962550 5909775 5983616 6034215 6101407 6048999 6027500
15963F027500M800j28833J18967J21362k5723l6085n0278J9914j36787n4494Q342
$$ 6027500 6032300 5903467 6022434 6143796 6118073 6081988 6031710 6051624 5914837 5860343 5868685
15952E868685K7154q4107K1896Q3277J20424J18442n147j02468j20398P8566L8376
$$ 5868685 5895839 5811732 5833628 5916905 6037329 6155771 6150624 6048156 5927758 6006324 6044700
15941F044700r0271j12916M7599N7792P2337O2447P3914Q664J3333n8767j56847
$$ 6044700 5954429 5841513 5889112 5946904 6019241 6081688 6155602 6164266 6177599 6118832 5961985
15930E961985P4915K8545r3452k8527J26915L8570J09073j30150j84409K0694
$$ 5961985 6036900 6065445 5971993 5943466 6070381 6108951 6218024 6087874 5903465 5924159
15920E924159R5643n6197r4229K3657J8066q214K5979O2976R5318j05621M4936
$$ 5924159 6019802 5963605 5869376 5893033 5911099 5902885 5928864 5991840 6087158 5981537 6026473
15909F026473m7198K5018L7106j6704R6336k01257p3361m5578J49941L831O7323
$$ 6026473 5979275 6004293 6041399 6024695 6121031 5919774 5846413 5800835 5950776 5954607 6021930
15898F021930j61717R6127J73721l4405o0877k8215O6567l2199j0797n7434L3074
$$ 6021930 5860213 5956340 6130061 6095656 6034779 6006564 6073131 6040932 6030135 5972701 6005775
15887F005775M4452k5955m3872K9757Q3420r6108p7224J04249J06151k6850j53444
$$ 6005775 6050227 6024272 5980400 6010157 6093577 5997469 5920245 6024494 6130645 6103795 5950351
15876E950351l7743P7809k9173P1726J0296j11400J17808P0354J31037j60109
$$ 5950351 5912608 5990417 5961244 6032970 6043266 5931866 6049674 6120028 6251065 6090956
15866F090956o6141Q042J27898k19782j02188J20298O3952l3134P4472M4560N5691
$$ 6090956 6024815 6032857 6160755 5940973 5838785 5959083 6023035 5989901 6064373 6108933 6164624
15855F164624O9909k06062j8858M7721j6346m4793Q8489m4392L2864Q3270j55759
$$ 6164624 6234533 6028471 6009613 6057334 6040988 5996195 6084684 6040292 6073156 6156426 6000667
15844F000667j39307P9806Q1086K42227j08083k24006o242J43177n660l1640J0390
$$ 6000667 5861360 5941166 6022252 6264479 6156396 5932390 5926148 6069325 6063665 6032025 6042415
15833F042415Q362K6235L006P3794j03212j05550M8640n0433K5713J20305o4759
$$ 6042415 6050777 6077012 6080018 6153812 6050600 5945050 5993690 5943257 5968970 6089275 6024516
15822F024516n2081J37388O9898j80913p5917Q5148k575K5666p0881R8865J035
$$ 6024516 5972435 6109823 6179721 5998808 5922891 6008039 6005464 6031130 5960249 6059114 6060149
15811F060149n881m60o2172p6084J01201J47635k0393J1897j51445J6440J6982
$$ 6060149 6054268 6053808 5991636 5915552 6016753 6164388 6143995 6155892 6004447 6020887 6037869
15800F037869M6559j07731P5346J38438K7998o7473j12915n1119n0154J00487
$$ 6037869 6084428 5976697 6052043 6190481 6218479 6151006 6038091 5986972 5936818 6037305
15790F037305n1148M394k9741L5962O3958P6106n5695q125o5898K7612l2837m3071
$$ 6037305 5986157 5990551 5960810 5996772 6060730 6136836 6081141 6073016 6007118 6034730 6001893 5958822
15778E958822O2407L0330q7693L2093j2978N7253J85087n2353m5345P6416j09921
$$ 5958822 6021229 6051559 5963866 5995959 5982981 6040234 6225321 6172968 6127623 6204039 6094118
15767F094118k2677O5325j6971o0670q5959J43966j4681N4275J4657j1206j01619
$$ 6094118 6071441 6136766 6119795 6059125 5973166 6117132 6102451 6156726 6171383 6160177 6058558
15756F058558k6385j32271R8650l7183j04055N176Q6781J65918r95l0175R5410
$$ 6058558 6032173 5899902 5998552 5961369 5857314 5862490 5949271 6115189 6114194 6084019 6179429
15745F179429J0076j4562N7835q4715J3855r4719j12922N0518j829Q7694l0725
$$ 6179429 6189505 6174943 6232778 6148063 6161918 6067199 5954277 6004795 6002966 6090660 6059935
15734F059935Q973j22523Q2037J36701l0472K3240m5109J19042J5534j10981r0525
$$ 6059935 6068908 5946385 6028422 6165123 6134651 6157891 6112782 6231824 6247358 6136377 6045852
15723F045852J6677j15574P2473O9410n7068o004J3703K3894j32910J30450O5763
$$ 6045852 6062529 5946955 6019428 6088838 6031770 6025766 6039469 6063363 5930453 6060903 6126666
15712F126666M8843j02570j3723M7169j03512J17003L0784o5536M3527r8471J42179
$$ 6126666 6175509 6072939 6059216 6106385 6002873 6119876 6150660 6085124 6128651 6030180 6172359
15701F172359j38384l5187J95974N1361j41417k1437N5680l7063M5590K905P9800
$$ 6172359 6033975 5998788 6194762 6246123 6104706 6083269 6138949 6101886 6147476 6150381 6230181
15690F230181j17831m8763N1759J9096p9803n0665k2373R1247J7042O4404Q5055
$$ 6230181 6112350 6063587 6115346 6134442 6054639 6003974 5981601 6072848 6089890 6154294 6239349
15679F239349p8604K6172O0029j28581K2310R8640K6314j49150j1013K4498k6503
$$ 6239349 6160745 6186917 6246946 6118365 6140675 6239315 6265629 6116479 6105466 6129964 6103461
15668F103461j15595L3330Q178n84J78312m6710j56800m6183K3659M1572m5333
$$ 6103461 5987866 6021196 6029374 6028790 6207102 6160392 6003592 5957409 5981068 6022640 5977307
15657E977307K18486p4639n6310J14453r841o0277J7898J35233M5569j48863q391
$$ 5977307 6195793 6121154 6064844 6179297 6169456 6109179 6127077 6262310 6307879 6159016 6150625
15646F150625r8110m2725N5230J22659J12203p6672j28592r3485J13321M4597
$$ 6150625 6052515 6009790 6065020 6187679 6299882 6223210 6094618 6001133 6114454 6159051
15636F159051n9465L9803O6177k03275Q183N3266J62300Q2923n3373J6941m8497
$$ 6159051 6099586 6139389 6205566 6002291 6010474 6063740 6226040 6308963 6255590 6272531 6224034
15625F224034L5638N1628k1761L0080j1272j40707j544m1261J10290J8162j47109
$$ 6224034 6259672 6311300 6289539 6319619 6308347 6167640 6166096 6124835 6235125 6253287 6106178
15614F106178J0925N5368M483j43512P2732J7888m2164L9920O101r6762l2894
$$ 6106178 6117103 6172471 6176954 6033442 6106174 6124062 6081898 6121818 6127919 6031157 5998263
15603E998263P0250J01002q0235L9169L6283q1797R9462k0926k0032k3870L8309
$$ 5998263 6068513 6169515 6089280 6128449 6164732 6082935 6182397 6161471 6141439 6117569 6155878
15592F155878Q9021L6473l7016l0070m0856J43493j16099r0547K5263j7891P5009
$$ 6155878 6244899 6281372 6244356 6214286 6173430 6316923 6200824 6110277 6135540 6117649 6192658
15581F192658j84235K8942j00550R394J05599P2295k2178J5424J38512k2381q3969
$$ 6192658 6008423 6037365 5936815 5946209 6051808 6124103 6101925 6117349 6255861 6233480 6149511
15570F149511J27028j33649o5821j1239Q1105O2690n4933Q0312j37571J71Q9008
$$ 6149511 6276539 6142890 6077069 6065830 6146935 6209625 6154692 6235004 6097433 6097604 6186612
15559F186612n4243l0881J44920N3053j08564L0123l5940P2888j07518j25594
$$ 6186612 6132369 6101488 6246408 6299461 6190897 6221020 6185080 6257968 6150450 6024856
15549F024856J00977L0524k3675O6405J02234k2977o1681P9553P2097Q0354p7726
$$ 6024856 6125833 6156357 6132682 6199087 6301321 6278344 6216663 6296216 6368313 6448667 6370941
15538F370941j88702j48730K5875J36441m4035k679p937m5752Q0399O1532K8919
$$ 6370941 6182239 6033509 6059384 6195825 6151790 6149111 6141174 6095422 6175821 6237353 6266272
15527F266272J9055m9605J5437n2704j0997k3402J7785k9530O4981j24589J35232
$$ 6266272 6285327 6235722 6251159 6198455 6187458 6164056 6181841 6152311 6217292 6092703 6227935
15516F227935O4943K8665n8115k36635J18857M5356j61917M6695M1975n5388l1928
$$ 6227935 6292878 6321543 6263428 6026793 6145650 6191006 6029089 6075784 6117759 6062371 6030443
15505F030443R6832K9923p034k982K0967r2072N1844L6338n7190O8446J13991
$$ 6030443 6127275 6157198 6150164 6147182 6168149 6076077 6127921 6164259 6107069 6175515 6289506
15494F289506M4021j23234J32694l9397o7386q5567P8616R6879r0474j0424p8907
$$ 6289506 6333527 6210293 6342987 6303590 6236204 6150637 6229253 6326132 6235658 6225234 6146327
15483F146327o1489K9590R0339J3501O4510Q5248q4572r8078l8416N0722J24744
$$ 6146327 6084838 6114428 6204767 6218268 6282778 6368026 6283454 6185376 6146960 6197682 6322426
15472F322426k4982p7532m583j4338j17332r919J97220o7156n9714N0919M0668
$$ 6322426 6297444 6219912 6215329 6200991 6083659 6073740 6270960 6203804 6144090 6195009 6235677
15461F235677j7989r4997p8238L0256n7514L9646J46292k5979j23233J24804J39900
$$ 6235677 6217688 6122691 6044453 6074709 6017195 6056841 6203133 6177154 6053921 6178725 6318625
15450F318625k12194j0798L8680R3341j6223P3190N6583l3363l733P4841r902
$$ 6318625 6106431 6095633 6134313 6227654 6211431 6284621 6341204 6307841 6304108 6378949 6369047
15439F369047j21646l3225m6342K4453J513l104J4751M832k4905J07117j6386
$$ 6369047 6247401 6214176 6167834 6192287 6193800 6190696 6205447 6210279 6185374 6292491 6276105
15428F276105j9291Q223R9148m5431l090N955j05444R1975M4367p4305q5876O9403
$$ 6276105 6256814 6265037 6364185 6318754 6315664 6321619 6216175 6308150 6352517 6278212 6192336 6261739
15416F261739k7385l6376r0821L534J51890R69O385N3287n0928k6685l1755j930
$$ 6261739 6234354 6197978 6107157 6110691 6262581 6263550 6269935 6323222 6272294 6245609 6213854 6211924
15404F211924O1515K4042L6563j32261J30170J7688j93734R249k1072J13092l0849
$$ 6211924 6273439 6297481 6334044 6201783 6331953 6349641 6155907 6165156 6144084 6257176 6226327
15393F226327j06068J88594J7979l3705j01702N686N4100q1748r4692K1765P1506
$$ 6226327 6120259 6308853 6326832 6293127 6191425 6197111 6251211 6169463 6074771 6096536 6168042
15382F168042R644O307J43683p3304J8111m5695L3044M1101L9507m0902l3178
$$ 6168042 6177686 6183993 6327676 6254372 6272483 6226788 6259832 6300933 6340440 6299538 6266360
15371F266360K5644p3584j1742L1534J17400n1095N5212L7401j49585j15647K9361
$$ 6266360 6292004 6218420 6206678 6238212 6355612 6304517 6359729 6397130 6247545 6131898 6161259
15360F161259j7219P3160M0768q3377m7878J08503J36830j04730q8171J15529
$$ 6161259 6144040 6217200 6257968 6174591 6126713 6235216 6372046 6267316 6179145 6294674
15350F294674o1665R4454j94524M2415p068O4271l0789m9587N4853P6832N94j24826
$$ 6294674 6233009 6327463 6132939 6175354 6168286 6232557 6201768 6152181 6207034 6283866 6284460 6159634
15338F159634k0421J5027r66K988k8430N4329J83163j0982j18452j4961J9460
$$ 6159634 6139213 6154240 6153274 6156262 6127832 6182161 6365324 6354342 6235890 6220929 6240389
15327F240389o2055J06820K1289K4774K2715J54865p2279j11922o8255l1878J51620
$$ 6240389 6178334 6285154 6306443 6331217 6353932 6508797 6436518 6324596 6256341 6224463 6376083
15316F376083j6489j28438J59025n6695j33301M7684J64896l2395j50598P3782
$$ 6376083 6359594 6231156 6390181 6333486 6200185 6247869 6412765 6380370 6229772 6303554
15306F303554j09150K7669J7822J26620j68732J5118J92237N7322q470k17588
$$ 6303554 6194404 6222073 6239895 6366515 6197783 6212901 6405138 6462460 6453990 6236402
15296F236402j0465O9409J7351q756R2212J46020n0997j65142M8529J1808L486
$$ 6236402 6225937 6295346 6312697 6303941 6396153 6542173 6491176 6326034 6374563 6386371 6389857
15285F389857r2073j3049J16427k3759o4565n0567j17604N4463J36639R223p7796
$$ 6389857 6297784 6284735 6401162 6377403 6312838 6262271 6144667 6199130 6335769 6344992 6267196
15274F267196l98n8351M5989J21472n5395j57844J00017J86558j47813k367j9219
$$ 6267196 6266798 6208447 6254436 6375908 6320513 6162669 6262686 6449244 6301431 6299064 6279845
15263F279845q8518J37389L8365j162R7115k4799r1141r1800J27238N541l4702
$$ 6279845 6191327 6328716 6367081 6365919 6463034 6438235 6347094 6255294 6382532 6388073 6353371
15252F353371p138n683o5073j13578R0815M2875P2452J0256m5978J8890j2058
$$ 6353371 6346233 6340550 6275477 6161899 6252714 6295589 6368041 6378297 6332319 6351209 6339151
15241F339151n2470O5539j00577L3468o4544Q7553L6138j7169l8792J1033J07813
$$ 6339151 6286681 6352220 6251643 6285111 6220567 6308120 6344258 6327089 6288297 6299330 6407143
15230F407143N1673p0084o1846R8731n7069k25828M2805J12410K9882j360l1698
$$ 6407143 6458816 6388732 6326886 6425617 6368548 6142720 6185525 6297935 6327817 6326457 6294759
15219F294759Q0797j7798L7395k12788n9725J32017J14804K6571n50l493M3112
$$ 6294759 6375556 6357758 6395153 6182365 6122640 6254657 6369461 6396032 6395482 6391989 6435101
15208F435101j68281p0842J57286M2519L9250M8455K2484j41066m6838Q8571k1564
$$ 6435101 6266820 6195978 6353264 6395783 6435033 6483488 6505972 6364906 6318068 6406639 6385075
15197F385075l8539J9568m8534Q4558K1488K7273j07290J00813j34801o6038P2693
$$ 6385075 6346536 6366104 6317570 6402128 6423616 6450889 6343599 6444412 6309611 6243573 6316266
15186F316266M323J44606p4778m7306n7330o477m3999K13565m8521o393n3343
$$ 6316266 6320589 6465195 6390417 6343111 6285781 6279304 6235305 6448870 6400349 6393956 6340613
15175F340613o8331n5047l5379J29525J13852J496R4933j7726q0885o7350J11703
$$ 6340613 6272282 6217235 6181856 6311381 6425233 6426729 6521662 6503936 6423051 6355701 6467404
15164F467404l9756M1597K305l9173K9534j14868P0298J7974L9358J396L0889
$$ 6467404 6427648 6469245 6471550 6432377 6461911 6347043 6417341 6435315 6474673 6476069 6506958
15153F506958o239J7423l5655j02801k7381q3982J8922k3183M9831P9416L8054
$$ 6506958 6500719 6518142 6482487 6379686 6352305 6268323 6287245 6264062 6313893 6393309 6431363
15142F431363o5896R0587k5712j7927P4686n6115m2605j1009k1614J4499o9439
$$ 6431363 6365467 6456054 6430342 6412415 6487101 6430986 6388381 6377372 6355758 6370257 6300818
15131F300818p7091L9122K6057O4216k5611Q4771P6204p6066o0673K2413J7407
$$ 6300818 6223727 6262849 6288906 6353122 6327511 6412282 6488486 6412420 6351747 6374160 6391567
15120F391567R5546k9860n821O8133L6791l6658l6619j03605N3727Q187j9840
$$ 6391567 6487113 6457253 6451432 6519565 6556356 6519698 6483079 6379474 6433201 6441388 6421548
15109F421548m544K427j00182k2981K9925J4070M0252j34126N2373L0475p5431
$$ 6421548 6417004 6419431 6319249 6296268 6326193 6340263 6380515 6246389 6298762 6329237 6253806
15098F253806N1386M1041k4417J20311L8382p0120l7350K697P1173j23259j9260
$$ 6253806 6305192 6346233 6321816 6442127 6480509 6410389 6373039 6375736 6446909 6323650 6304390
15087F304390j00526J50112O9073Q2720K5890J2645j3989q7169K3754M9507o1489
$$ 6304390 6203864 6353976 6423049 6505769 6531659 6544304 6530315 6443146 6466900 6516407 6454918
15076F454918k8442j6044j1157J4512o1651N0652k5458O5940J59299j09465k568
$$ 6454918 6426476 6410432 6399275 6413787 6352136 6402788 6377330 6443270 6602569 6493104 6490536
15065F490536N2116N270j9606o7753K3849j90003N7316N6230K0687j63511l2993
$$ 6490536 6542652 6547922 6528316 6460563 6484412 6294409 6351725 6407955 6428642 6265131 6232138
15054F232138K03404Q8099k11588K2205J05498l8106J60543Q7184J9216k02411
$$ 6232138 6435542 6523641 6312053 6334258 6439756 6401650 6562193 6649377 6668593 6466182
15044F466182j8889q3844L0302P0915j04104J0606K9960p7739p6104J07223J60224
$$ 6466182 6447293 6363449 6393751 6464666 6360562 6371168 6401128 6323389 6247285 6354508 6514732
15033F514732r3558j1359J9917L7765K5759J2187M9121M0323k3717M4497p949
$$ 6514732 6421174 6409815 6429732 6467497 6493256 6505443 6554564 6594887 6571170 6615667 6607718
15022F607718j90030J3396M8354l1472L0380N7991J9865q7587o5553l1156P6735
$$ 6607718 6417688 6431084 6479438 6447966 6478346 6536337 6556202 6468615 6403062 6371906 6448641
15011F448641K6048k6181R6813j00862J9093n2405M9094K5663l7755J1949N3715
$$ 6448641 6474689 6448508 6545321 6444459 6463552 6411147 6460241 6485904 6448149 6460098 6513813
15000F513813J00696Q6087p9581j48910K9184K8096j08723l4144j01277J44302
$$ 6513813 6614509 6700596 6621015 6472105 6501289 6529385 6420662 6386518 6285241 6429543
14990F429543j56173J09841N4166L6330J50056l2982o6887n8000j16073K7693
$$ 6429543 6273370 6383211 6437377 6473707 6623763 6590781 6523894 6465894 6349821 6377514
14980F377514P2004o9942p0650J05851L8475J40658J3664J0373o3350r7713J20652
$$ 6377514 6449518 6379576 6308926 6414777 6453252 6593910 6607574 6617947 6554597 6456884 6577536
14969F577536j27214K4387L1973J46661L695m9733q0917n4979p437K19017k2421
$$ 6577536 6450322 6474709 6506682 6653343 6657038 6607305 6526388 6471409 6463972 6682989 6660568
$$ [...]
##END NTUPLES=NMR SPECTRUM
##END=
