##TITLE=1H_DE-80H_X3
 200.13MHz, d2o
 8 sc
 
 19ns.26.2.2025
##JCAMPDX= 6.0         $$ Bruker NMR JCAMP-DX V2.0
##DATA TYPE= NMR SPECTRUM
##DATA CLASS= NTUPLES
##ORIGIN= UXNMR, Bruker Analytische Messtechnik GmbH
##OWNER= pz
$$ XWIN-NMR		Version 3.5
$$ Fri Oct 10 12:00:39 2025 Russian Standard Time (UT+4h)  Yarkov@DPX200
##.OBSERVE FREQUENCY= 200.1313
##.OBSERVE NUCLEUS= ^1H
##.ACQUISITION MODE= SIMULTANEOUS
##.ACQUISITION SCHEME= undefined
##.AVERAGES= 8
##.DIGITISER RES= 18
##SPECTROMETER/DATA SYSTEM= spect
##.PULSE SEQUENCE= zg30
##.SOLVENT NAME= DMSO
##.SHIFT REFERENCE= (INTERNAL, DMSO, 0, 17.8558)
##AUDIT TRAIL= $$ (NUMBER, WHEN, WHO, WHERE, WHAT)
$$ ##TITLE= Audit trail, XWIN-NMR		Version 3.5
$$ ##JCAMPDX= 5.01
$$ ##ORIGIN= Bruker BioSpin GmbH
$$ ##OWNER= Yarkov
$$ C:/Bruker/XWIN-NMR/data/yarkov2/nmr/H-C/1/pdata/1/auditp.txt
$$ ##AUDIT TRAIL=  $$ (NUMBER, WHEN, WHO, WHERE, WHAT)
(   1,<2025-10-10 11:59:36.25 +0400>,<Yarkov>,<DPX200>,
      <created by zg, POWCHK disabled, PULCHK disabled
       configuration hash MD5:
       00 E9 B6 7A A2 85 ED C7 34 08 36 98 17 FE 4E 26
       data hash MD5: 16K
       3F E1 66 30 A6 A1 10 3A AE C1 B5 2A 2B DB 80 38>)
(   2,<2025-10-10 11:59:49.17 +0400>,<Yarkov>,<DPX200>,
      <Start of raw data processing
       efp BC_mod = 2 LB = 0.25 FT_mod = 6 PKNL = 1 PHC0 = -2644.588 PHC1 = 15.19097 SI = 16K 
       data hash MD5: 16K
       B7 8C 87 AD C7 5C 73 E6 B2 35 67 F9 AA E3 32 2B>)
(   3,<2025-10-10 12:00:01.40 +0400>,<Yarkov>,<DPX200>,
      <abs ABSG = 5 
       data hash MD5: 16K
       E6 29 46 2D 6E 3E C7 E8 2B 17 6A 9D 97 C7 68 78>)
$$ ##END=
$$ 
$$ hash MD5
$$ ED 1B 1D 32 E8 BB 69 F5 FF 59 06 EF 6B 47 E1 FD
##$RELAX= 
##$RELAX= 
##$RELAX= 
##$RELAX= 
##$RELAX= 
##$RELAX= 
$$ Bruker specific parameters
$$ --------------------------
##$DU= <C:/Bruker/XWIN-NMR>
##$EXPNO= 1
##$NAME= <H-C>
##$PROCNO= 1
##$TYPE= <nmr>
##$USER= <yarkov2>
##$AMP= (0..31)
100 100 100 100 100 100 100 100 100 100 100 100 100 100 100 100 100 100 
100 100 100 100 100 100 100 100 100 100 100 100 100 100 
##$AQSEQ= 0
##$AQ_mod= 1
##$AUNM= <au_zg>
##$AUTOPOS= <>
##$BF1= 200.13
##$BF2= 200.13
##$BF3= 200.13
##$BF4= 200.13
##$BF5= 200.13
##$BF6= 200.13
##$BF7= 200.13
##$BF8= 200.13
##$BYTORDA= 1
##$CFDGTYP= 0
##$CFRGTYP= 5
##$CHEMSTR= <none>
##$CNST= (0..31)
1 1 145 1 1 1 1 1 1 1 1 1 1 1 1 1 1 1 1 1 1 1 1 1 1 1 1 1 1 1 1 1 
##$CPDPRG= <>
##$CPDPRG1= <>
##$CPDPRG2= <>
##$CPDPRG3= <>
##$CPDPRG4= <mlev>
##$CPDPRG5= <mlev>
##$CPDPRG6= <mlev>
##$CPDPRG7= <mlev>
##$CPDPRG8= <mlev>
##$CPDPRGB= <>
##$CPDPRGT= <>
##$D= (0..31)
0 0.7 0 0 0 0 0 0 0 0 0 0.03 0 0 0 0 0 0 0 0 0 0 0 0 0 0 0 0 0 0 0 0 
##$DATE= 1760083175
##$DBL= (0..7)
120 120 120 120 120 120 120 120 
##$DBP= (0..7)
150 150 150 150 150 150 150 150 
##$DBP07= 0
##$DBPNAM0= <>
##$DBPNAM1= <>
##$DBPNAM2= <>
##$DBPNAM3= <>
##$DBPNAM4= <>
##$DBPNAM5= <>
##$DBPNAM6= <>
##$DBPNAM7= <>
##$DBPOAL= (0..7)
0.5 0.5 0.5 0.5 0.5 0.5 0.5 0.5 
##$DBPOFFS= (0..7)
0 0 0 0 0 0 0 0 
##$DE= 6
$$ [...]
##$SUBNAM3= <"">
##$SUBNAM4= <"">
##$SUBNAM5= <"">
##$SUBNAM6= <"">
##$SUBNAM7= <"">
##$SUBNAM8= <"">
##$SUBNAM9= <"">
##$SW= 18.0517328524113
##$SWIBOX= (0..15)
0 0 2 0 0 0 0 0 0 0 0 0 0 0 0 0 
##$SW_h= 3612.71676300578
##$TD= 16384
##$TD0= 1
##$TE= 0
##$TE2= 300
##$TE3= 300
##$TEG= 300
##$TL= (0..7)
0 120 120 120 120 120 120 120 
##$TP= (0..7)
150 150 150 150 150 150 150 150 
##$TP07= 0
##$TPNAME0= <>
##$TPNAME1= <>
##$TPNAME2= <>
##$TPNAME3= <>
##$TPNAME4= <>
##$TPNAME5= <>
##$TPNAME6= <>
##$TPNAME7= <>
##$TPOAL= (0..7)
0.5 0.5 0.5 0.5 0.5 0.5 0.5 0.5 
##$TPOFFS= (0..7)
0 0 0 0 0 0 0 0 
##$TUNHIN= 0
##$TUNHOUT= 0
##$TUNXOUT= 0
##$USERA1= <user>
##$USERA2= <user>
##$USERA3= <user>
##$USERA4= <user>
##$USERA5= <user>
##$V9= 5
##$VALIST= <valist>
##$VCLIST= <CCCCCCCCCCCCCCC>
##$VD= 0
##$VDLIST= <DDDDDDDDDDDDDDD>
##$VPLIST= <PPPPPPPPPPPPPPP>
##$VTLIST= <TTTTTTTTTTTTTTT>
##$WBST= 1024
##$WBSW= 4
##$XGAIN= (0..3)
0 0 0 0 
##$XL= 0
##$YL= 0
##$YMAX_a= 277740
##$YMIN_a= -310397
##$ZGOPTNS= <>
##$ZL1= 120
##$ZL2= 120
##$ZL3= 120
##$ZL4= 120
##$ABSF1= 17.85577
##$ABSF2= -0.1961212
##$ABSG= 5
##$ABSL= 3
##$ALPHA= 0
##$AQORDER= 0
##$ASSFAC= 0
##$ASSFACI= 0
##$ASSFACX= 0
##$ASSWID= 0
##$AUNMP= <proc_1d>
##$AZFE= 0.1
##$AZFW= 0.1
##$BCFW= 0
##$BC_mod= 2
##$BYTORDP= 0
##$COROFFS= 0
##$CY= -3
##$DATMOD= 1
##$DC= 0
##$DFILT= <>
##$DTYPP= 0
##$F1P= 0
##$F2P= 0
##$FCOR= 1
##$FTSIZE= 16384
##$FT_mod= 6
##$GAMMA= 0
##$GB= 0
##$INTBC= 1
##$INTSCL= 3.241238e-09
##$ISEN= 128
##$LB= 0.25
##$LEV0= 0
##$LPBIN= 0
##$MAXI= 10000
##$MC2= 0
##$MEAN= 0
##$ME_mod= 0
##$MI= 1.114404
##$NCOEF= 0
##$NC_proc= -6
##$NLEV= 6
##$NOISF1= 3.799351
##$NOISF2= 2.8
##$NSP= 0
##$NTH_PI= 0
##$NZP= 0
##$OFFSET= 17.85577
##$PC= 1
##$PHC0= -2644.588
##$PHC1= 15.19097
##$PH_mod= 1
##$PKNL= yes
##$PPARMOD= 0
##$PSCAL= 0
##$PSIGN= 0
##$REVERSE= no
##$SF= 200.129532891664
##$SI= 16384
##$SIGF1= 3
##$SIGF2= 2
##$SINO= 0.751879
##$SIOLD= 32768
##$SREGLST= <19F.Aceton>
##$SSB= 0
##$STSI= 16384
##$STSR= 0
##$SW_p= 3612.71676300578
##$SYMM= 0
##$S_DEV= 0
##$TDeff= 16384
##$TDoff= 0
##$TI= <>
##$TILT= no
##$TM1= 0
##$TM2= 0
##$TOPLEV= 0
##$USERP1= <user>
##$USERP2= <user>
##$USERP3= <user>
##$USERP4= <user>
##$USERP5= <user>
##$WDW= 1
##$XDIM= 16384
##$YMAX_p= 444772479
##$YMIN_p= -360444
$$ End of Bruker specific parameters
$$ ---------------------------------
##NTUPLES= NMR SPECTRUM
##VAR_NAME=  FREQUENCY,     SPECTRUM/REAL,   SPECTRUM/IMAG
##SYMBOL=    X,             R,               I
##VAR_TYPE=  INDEPENDENT,   DEPENDENT,       DEPENDENT
##VAR_FORM=  AFFN,          ASDF,            ASDF
##VAR_DIM=   16384,         16384,           16384
##UNITS=     HZ,            ARBITRARY UNITS, ARBITRARY UNITS
##FACTOR=    0.220516191357247, 1,           1
##FIRST=     3573.46693175217, 0,            0
##LAST=      -39.2498312536068, 0,           0
##MIN=       -39.2498312536068, -360444,     0
##MAX=       3573.46693175217, 444772479,    0
$$ Real data points
##PAGE= N=1
##DATA TABLE= (X++(R..R)), XYDATA
$$ [...]
8282I20189p1365q144J7277j40610n7168N6688N0009j16949m8686R3389P8644
8271G73274J62113j22874j07007L3094m9547n5259K393L2416O795J38372m0042
8260G73728j61414l934j298M3846J28272O1825n128j13893J08936j26717L7804
8249G42027O3876j0853m1926j08238L292o8492J01160K0241m734K9148R3512N0648
8237H69661j98376L0331N2432O1369k9072M3904J01214M1838R340r449J73737
8226A146929N2372n7480N5076P453m2250J19522J2240O5789Q0J01334L8407K50046
8214A749518O5399j29061R5480J97280O4533Q3951J64927J30422P184J66811J47437
8203B743881K67380Q5712P3554J79056o7830j19707K41044L5390L0230J28609
$$ plain form
8282 920189 848824 840680 857957 717347 660179 716867 766876 649927 601241 694630 773274
8271 773274 935387 812513 705506 738600 689053 633794 636187 668603 675398 813770 773728
8260 773728 612314 608380 607082 650928 779200 841025 835897 722004 830940 704223 742027
8249 742027 805903 795050 753124 644886 648178 579686 680846 701087 696353 725501 819013 869661
8237 869661 671285 701616 754048 815417 786345 830249 931463 973301 982641 973192 1146929
8226 1146929 1199301 1141821 1196897 1204350 1162100 1281622 1293862 1359651 1359731 1461065 1499472 1749518
8214 1749518 1814917 1685856 1781336 1978616 2043149 2127100 2292027 2422449 2429633 2596444 2743881
8203 2743881 3011261 3096973 3170527 3349583 3281753 3162046 3403090 3438480 3468710 3597319
8193C597319M69227J31085q46012k960J02714k470m989j56718k28657l3700q8100
8182B936739q0131p5512J2686J39993k7928K6441k422O1474J3728n0079M0903
8171B995892J05093J41059M603J89444K41933K22252K99552K45625Q8167J56604
8161D690224L81863K25816J1983N8493j9067O0967O5097J2285L4208L111m1431
8150E483549o0382J24754j41709j67277j26334k3282j04110k70829q9221k53964
8140D371195k81839o5349k23548o4450j94188k42590q2331p6073J2759k1505j42446
8129B989635p5722J19579l7469l2912J07698k7948N2278Q1524K4310J20334L0367
8118C351674l4511l2752M8187K4266o3620p1205j00698N9640j23701j8982P8325
$$ plain form
8193 3597319 4066546 4197631 3351619 3348659 3451373 3448903 3443914 3287196 3058539 3024839 2936739
8182 2936739 2856608 2781096 2793782 2933775 2905847 2932288 2929866 2991340 3005068 2954989 2995892
8171 2995892 3100985 3242044 3246647 3436091 3678024 3900276 4199828 4445453 4533620 4690224
8161 4690224 5072087 5297903 5309886 5368379 5349312 5410279 5475376 5487661 5521869 5524980 5483549
8150 5483549 5423167 5547921 5406212 5238935 5112601 5089319 4985209 4714380 4625159 4371195
8140 4371195 4089356 4024007 3800459 3736009 3541821 3299231 3216900 3140827 3153586 3132081 2989635
8129 2989635 2913913 3033492 2996023 2963111 3070809 3042861 3095139 3176663 3200973 3321307 3351674
8118 3351674 3317163 3284411 3332598 3356864 3293244 3222039 3121341 3180981 3057280 3038298 3116623
8107C116623m2654n2076j13300j91807r0668j23539q8307l6697m1470k31602j34133
8096A970370m0903o9254o6775j12606j98520q5256L1645P712O8123r7486j61493
8085A245557j34661n7990Q4082l5790q6966K9997q5806Q678J39154j39540k43047
8074G23668n6133M6545R1003o6794L4402l5805P1502o2498j33536J09078R8738
8063H20170k18345l3369j6818O2484Q1862k9676q5446J4245J0616p4005p8965
8052D52753k2768P6348p0702o0411q5111J13029J48009l3190j9756k5707m7429
8041D25065j29250J43050k4939k0991m799m7999R5403o3123j68476R9912P7881
8030C81734L0245l4570o357p5568Q186J9317l4428K3265M4349j22331N046k2384
$$ plain form
8107 3116623 3073969 3021893 2908593 2716786 2626118 2502579 2414272 2377575 2336105 2104503 1970370
8096 1970370 1929467 1860213 1793438 1680832 1482312 1397056 1428701 1436413 1504536 1407050 1245557
8085 1245557 1110896 1052906 1136988 1101198 1014232 1044229 958423 967101 1106255 966715 723668
8074 723668 667535 714080 805083 738289 772691 736886 808388 745890 612354 721432 820170
8063 820170 601825 568456 551638 614122 695984 666308 580862 595107 605723 531718 452753
8052 452753 429985 506333 435631 375220 290109 403138 551147 517957 498201 472494 425065
8041 425065 295815 438865 413926 392935 388136 340137 435540 372417 203941 303853 381734
8030 381734 411979 377409 371052 295484 303670 322987 288559 311824 356173 233842 238888 216504
8018B16504M007M9580K8106K5059o9439R641p4319m0265L7280K2080j37717R4632
8006A65149M9520M9879o2193l0624Q4240o3876J6900N6078p0995N4238k8057n9854
7994A60405j32100M0440j1074J90398n0372j14927O1084N3693q4140P1188J27292
7983C11887j6326j30085m3818J46567q6426j30029J298K0322M8623N0617r0319
7972H2311o6371L6326R3286j9987q7843L583j1608m7131N3176R686M627L3530
7960H3585N7201K4654o3578L2561l2239P1216l7812p966K8475o9392j52440J53630
7948H7895J00785j40401j2317p5365P010M8553N7817O0512k1961O4433j97403
7937b0442o0075J0988J3953Q3581o9807k1059M0931P0268J6334J035m9935K2847
$$ plain form
8018 216504 220511 270091 298197 323256 253817 263458 189139 148874 186154 208234 70517 165149
8006 165149 214669 264548 202355 171731 255971 192095 208995 265073 194078 248316 220259 160405
7994 160405 28305 68745 57671 248069 197697 82770 143854 197547 113407 184595 311887
7983 311887 295561 165476 121658 268225 181799 51770 53068 73390 122013 172630 82311
7972 82311 15940 52266 145552 125565 37722 41305 29697 -17434 35742 45428 50055 83585
7960 83585 140786 165440 101862 134423 102184 173400 135588 127622 156097 86705 -65735 87895
7948 87895 188680 48279 35962 -39403 -32393 16160 73977 134489 112528 176961 -20442
7937 -20442 -80517 -69529 -55576 28005 -41802 -62861 -21930 48338 64672 65707 15772 38619
7925C8619j07573m7144j8699L5526L4487J04835N3357r1270l0992J19053L8259
7914A28458j01207j41632K5701J26870n1767j28629n661K9355K8101m7411J55365
7903A7543N691o776k00236M1109l882M7798l4397L5952M6322q1522M1898q611
7891i9111L7253J6790n6100k2709J20978L8334l7546o5733K9432K4787m2096J2678
7879d3043J44035q7622L9950l4417q7572m3258J81470m9428j05840k0106J22563
7868A6732J455o5429J72368j42204j4322l8427j31594J42807O6354j7679M4522
7857C4583j20797J28732L4863m4016Q5106q9816K7320m3745o0385j7437O0174
7846e418J12045K7477j79481o6936P5297J2421o7783N0323j8363k4497N6844l2814
$$ plain form
7925 38619 -68954 -116098 -134797 -99271 -64784 40051 93408 2138 -28854 90199 128458
7914 128458 27251 -114381 -88680 38190 -13577 -142206 -147867 -118512 -90411 -137822 17543
7903 17543 23234 16458 -183778 -142669 -146551 -98753 -133150 -97198 -50876 -132398 -90500 -99111
7891 -99111 -61858 -45068 -101168 -123877 -2899 35435 -2111 -67844 -38412 -13625 -55721 -43043
7879 -43043 100992 13370 53320 18903 -68669 -111927 69543 20115 -85725 -105831 16732
7868 16732 18187 -47242 125126 -17078 -31400 -69827 -201421 -58614 7740 -9939 34583
7857 34583 -86214 42518 77381 33365 118471 28655 55975 12230 -48155 -65592 -5418
7846 -5418 106627 134104 -45377 -112313 -37016 -24595 -92378 -42055 -60418 -84915 -28071 -60885
7834f0885l1884L7413R7793j16903l2338R1049J17517K4750k9353q3819p6913
7823f3573J14336r50p4225K3522J03099O4399n4789M5095K5308o8942j1538J1456
7811A13198p5611l7309o7450J0458O2590L1868m7113j46930j25723K46537Q4117
7800D8632n1521p6768l1718J71911K9216N0374j24772M0933J7199k28180J4455
7789a40239J69169M9423n1354o1849L3468m8807K903k8893K091o0333J60173k2010
7777C742k3291L5457m6185J22635j46418j0146l4674k6239j002j3266l8162J70341
7765g208Q9147j36140J0050J0118O7535k4909J5995p2502L8697l7722l7975J6385
7753f8529N353J8600M3670J35176j28813r3344J20143o5710k0071J10045j22981
$$ plain form
7834 -60885 -92769 -55356 42437 -74466 -106804 -15755 101762 126512 97159 13340 -63573
7823 -63573 50763 49813 -24412 -890 102209 166608 111819 156914 182222 113280 101742 113198
7811 113198 37587 278 -67172 -56714 5876 37744 -9369 -156299 -282022 -35485 48632
7800 48632 -2889 -79657 -111375 60536 89752 140126 15354 56287 73486 -154694 -140239
7789 -140239 28930 78353 26999 -34850 -1382 -50189 -47286 -76179 -74088 -134421 25752 3742
7777 3742 -19549 15908 -30277 92358 -54060 -64206 -98880 -125119 -126121 -139387 -177549 -7208
7765 -7208 81939 -54201 -44151 -34033 33502 8593 24588 -47914 -9217 -46939 -84914 -68529
7753 -68529 -63176 -44576 -906 134270 5457 -87887 32256 -33454 -53525 56520 -66461
7742f6461k237P2388R8016j02985r1417p1470J22666m240l1394r5674l8120R9406
7730a11522L7631m4813L0382P2025j7202o1610J1427R7234q4262k6105J6574J39940
7718E9699k1644r6238j03728J0783J90849r5203p638L9898N423p5628m8236J26376
7706a5287k3959q1133Q8631J6440J5405N2563N041l5594o6674j8926r9692R7909
7694f5276L8332n4615J386M9330n9089P513K0237k4519l582P9456O7527K7953
7682H4653j66461o8445N852M0781j8274j9937P0640J29444j07629K4543R1122
7671F6289k006O0921o9505o5374m2746l1716m959J04285Q6752k9816J5258k16374
7659a28991M9178R5222q0729q6175J1352J51772l8586j5200p9210j01511M7653
$$ plain form
7742 -66461 -68698 3690 101706 -1279 -92696 -164166 -41500 -45740 -77134 -172808 -210928 -111522
7730 -111522 -73891 -118704 -88322 -16297 -33499 -95109 -83682 13552 -70710 -96815 -80241 59699
7718 59699 38055 -58183 -161911 -151128 39721 -55482 -63120 -23222 -17799 -93427 -141663 -15287
7706 -15287 -39246 -120379 -31748 -15308 97 52660 57701 22107 -44567 -63493 -163185 -65276
7694 -65276 -26944 -81559 -80173 -30843 -89932 -82419 -62182 -86701 -90283 -10827 56700 84653
7682 84653 -81808 -150253 -144401 -103620 -121894 -141831 -71191 58253 -49376 -24833 66289
7671 66289 64283 125204 55699 -9675 -52421 -84137 -89096 15189 101941 72125 87383 -128991
7659 -128991 -79813 15409 -65320 -151495 -140143 11629 -26957 -42157 -121367 -222878 -175225
7648a75225J57444O2975j36510q3452P2233K2209Q6619M872o8937q7240O0197
7637h4815k6391p9279R5698m1773J4543K1526j22121J41646R0966l1514m7766
7626f9280J38712k502m5087M0257j75914L783J22195Q6919m7264r9650o793o5934
7614a20558Q7442m530j446M7716J5547j15584J423j0611J41693K0970k440J7173
7602G6795r0652l0776n4448m5467O4235J4036r242R5040M8128m8901q3954k916
7590f8122J43963j29807q0998J23178k7657j27135r644P0891j0070J51385o0177
7579b4193j02819O1300k2664R3285q2621j9755N4029o7317R0372o7169J19058
7568C1506j7184j5802o5610j8547K3857R6236L6642k3013l2952j8282j4936j36102
$$ plain form
7648 -175225 -17781 45194 -91316 -174768 -102535 -80326 6293 11165 -57772 -145012 -84815
7637 -84815 -111206 -190485 -94787 -136560 -122017 -100491 -222612 -80966 10000 -21514 -69280
7626 -69280 69432 66930 21843 62100 -113814 -110031 12164 99083 51819 -47831 -54624 -120558
7614 -120558 -33116 -37646 -39092 8624 24171 -91413 -89990 -100601 41092 62062 59622 76795
7602 76795 -13857 -44633 -99081 -144548 -80313 -66277 -75519 19521 67649 18748 -65206 -68122
7590 -68122 75841 -53966 -134964 -11786 -39443 -166578 -176222 -105331 -115401 35984 -24193
7579 -24193 -127012 -65712 -88376 4909 -77712 -97467 -43438 -110755 -20383 -87552 31506
7568 31506 14322 -1480 -67090 -85637 -61780 34456 71098 48085 15133 -3149 -18085 -154187
7556a54187N2393O9477p812l5759K1864N0730r956o5026l116l001k598N5898L3556
7543B463p4686M0267N4322o5767J80022O207q5942p20n8985k6554M5329J87587
7531B03543J8287n282j46792k823p8596p0380N1778q275o7813j13289J20447N5782
7519d3413O0500J1306R3731j42389k7657j36337M4718K8037o0011P4798N4085
7508d2632K4359P1448m2948r3352k406j5090N0965l3470K8282m1740R0731k8685
7496c4538M8826r4043k3244L2616o3515J3711o2660P2947J09881N5831j0897j37927
7484i3012l2891l1614M3620Q1570n7746R3185N773L0444L1844o434j670n8412
7472D657m8918R078j50805M5265Q8545j14607K1255L373N1731O9651J2876N5726
$$ plain form
7556 -154187 -101794 -32317 -40129 -75888 -54024 -3294 -13250 -78276 -81392 -84393 -86991 -31093 2463
7543 2463 -72223 -31956 22366 -43401 136621 142828 56886 56166 -2819 -29373 15956 203543
7531 203543 221830 216548 69756 66933 -11663 -82043 -30265 -38540 -106353 -219642 -99195 -43413
7519 -43413 17087 28393 122124 -20265 -47922 -184259 -139541 -111504 -171515 -96717 -42632
7508 -42632 -18273 53175 10227 -83125 -85531 -100621 -49656 -83126 -54844 -96584 -5853 -34538
7496 -34538 14288 -79755 -102999 -70383 -133898 -120187 -182847 -109900 -19 55812 44915 -93012
7484 -93012 -125903 -157517 -113897 -32327 -90073 3112 8885 39329 71173 64739 63069 4657
7472 4657 -44261 -35183 -185988 -140723 -52178 -166785 -145530 -142157 -90426 -20775 -7899 47827
7460D7827M0122q7090j47943J3108l443K4291N8066N8327R6137o2079m2645m992
7448a0314J1589K92N086p1680q2445J26231N1216r2980J7692k9429j445J4904
7436f1283o1752R6237L6401l4392M155P3155j6172k6413o8865K6237M5286j19665
7424a07071j07049j4677J15094M7699m6004j51855L5042L5815l1884J52873J9498
7413e2519l0686K1265R1115l1901j62006P3701L3255Q338L2233m5030Q8528J55285
7401A81578j14434j09644j0281N0767q4467J0322j3891m3037o2796J15182R1244
7390A0543j15811k8726K45281j47800k5966j2754M2599P2533l4182n4672l8732
7379h7687N7913Q8230L4186j05248M6234M2177J468m7653p9051k8187J65213j15262
$$ plain form
7460 47827 87949 859 -147084 -133976 -137419 -113128 -55062 3265 99402 37323 -5322 -10314
7448 -10314 1275 1567 6653 -65027 -147472 -21241 29975 -63005 -45313 -74742 -76187 -61283
7436 -61283 -123035 -26798 9603 -24789 -20634 52521 36349 9936 -58929 -32692 12594 -107071
7424 -107071 -214120 -228797 -113703 -66004 -112008 -263863 -228821 -193006 -224890 -72017 -52519
7413 -52519 -83205 -61940 29175 -2726 -164732 -91031 -57776 -49438 -17205 -62235 26293 181578
7401 181578 67144 -42500 -52781 -2014 -86481 -76159 -90050 -133087 -195883 -80701 10543
7390 10543 -105268 -133994 111287 -36513 -62479 -75233 -32634 39899 5717 -48955 -87687
7379 -87687 -29774 58456 92642 -12606 33628 75805 77273 29620 -49431 -77618 87595 -27667
7367b7667M7929M8125j24604L2371m1841k2302N9875p133M2391m0090o2338P5144
7355b0140J01144n2982K397L2072j71984J0277P9950p5078l132n9234R130J98430
7343E0850J09388j37719J0674Q2893l0042l3047j4468q4855j4094n0679R1229
7332a9870l1369j13617P5217M4821J5382k5610Lk810j31620J21358k5161r4084
7320a87360N9581m553K8021J709j9950j5146J16509n6629k9629J31472J7704n3811
7308a2082r2804k9082l6486M8262j2223j5562J6649N5394K32m8977j1789L9217
7296i9251k7308o487K0754Q0064J0549M3862p0725O777N3559j43148J05663R1769
7284F6078k2385r9851J53500J6557j35494p9448J29046J05760j01943l6591L3950
$$ plain form
7367 -27667 20262 68387 -56217 -23846 -65687 -87989 -28114 -35247 7144 -32946 -95284 -20140
7355 -20140 81004 28022 30419 62491 -109493 -99216 -19266 -94344 -97476 -156710 -147580 50850
7343 50850 160238 22519 33193 116086 86044 52997 38529 -46326 -60420 -111099 -19870
7332 -19870 -51239 -164856 -89639 -44818 -29436 -55046 -55043 -57853 -189473 -68115 -93276 -187360
7320 -187360 -127779 -132332 -104311 -102602 -122552 -137698 -21189 -77818 -107447 24025 41729 -12082
7308 -12082 -104886 -133968 -170454 -122192 -134415 -149977 -133328 -77934 -77702 -126679 -138468 -99251
7296 -99251 -126559 -133046 -112292 -32228 -21679 22183 -48542 -41765 11794 -131354 -25691 66078
7284 66078 43693 -56158 97342 113899 -21595 -101043 28003 133763 31820 -4771 29179
7273B9179N2911N6867m5192q1772L7807Q1769m2691p830M2688l1741r333p5414
7261G248R2119j1831m6644j8275q6161k4193J03049L3477l4479N0262m7494j40531
7249a23453j4828M8810q3565O9604P9289O7261J5939n82j18098K3889J12302N053
7237H1621j6051r9494p4980L6683M893n9804k5284R4706J5783K7427J33475K718
7225A21693q984j35145p1702J33921J2347j7995q1585p7458Q0702J6852K8699
7214A345L369K7581O9900j0967J09566j48845o9635r050Q9376K3681p4634k8982
7202a7295r9157o0076J27202J64416o4813j2242L8302p6949L4083L7631r6711
7191b5609p0123L5881Q4420n227m3570r7318J01635k5163q2598m646O9385J80113
$$ plain form
7273 29179 82090 138957 93765 11993 49800 131569 88878 81048 123736 91995 82662 7248
7261 7248 99367 87536 40892 22617 -63544 -87737 15312 48789 14310 64572 17078 -123453
7249 -123453 -138281 -89471 -173036 -103432 -24143 43118 59057 58475 -59623 -35734 76568 81621
7237 81621 65570 -33924 -108904 -72221 -67328 -127132 -152416 -57710 -41927 -14500 118975 121693
7225 121693 112709 -22436 -94138 39783 52130 34135 -47450 -124908 -44206 -27354 1345
7214 1345 4714 32295 102195 91228 200794 51949 -17686 -26736 62640 86321 11687 -17295
7202 -17295 -116452 -176528 -49326 115090 50277 38035 76337 -612 33471 71102 -25609
7191 -25609 -95732 -59851 24569 19342 -24228 -121546 -19911 -45074 -127672 -132318 -62933 117180
7179A17180j1698j21993J1115M2872N3307J1967P1379m8010j4698k1989n4737
7168C4695J6009P4815j43506j66241M1226J98030Q6908q590J12986o9265j5998
7157A61069q4624N9775j7820j2387P222N0769r9601m9664P7139J31302n6616k0362
7145A46202J58183m3062j7061O6562J00136r5354J9389K2685l3662J52920l5802
7134D41136k0321K46888J18805m4755Q1923L6314m7363j46919j38063j0689n7061
7123D59895L1513j02209l0674R1141o8733j33555m452J15471M1241j70426m7137
7112A82075l9652Q9929M8339j76029O9538O7726k22911L8154k9181m5850n3647
7101g1509L028J37418L527l7399K0948o2956l0232P0232L4287o561P5820O5545
$$ plain form
7179 117180 105482 -16511 -5396 37476 90783 102750 174129 126119 111421 89432 34695
7168 34695 50704 125519 -17987 -184228 -143002 55028 141936 133346 246332 177067 161069
7157 161069 76445 136220 118400 106013 113235 164004 64403 14739 91878 223180 166564 146202
7145 146202 304385 261323 244262 310824 410960 315606 334995 357680 324018 476938 441136
7134 441136 420815 667703 786508 741753 823676 859990 812627 665708 527645 516956 459895
7123 459895 491408 389199 358525 449666 380933 247378 242926 358397 399638 229212 182075
7112 182075 142423 232352 280691 104662 174200 241926 19015 57169 27988 -17862 -71509
7101 -71509 -68481 68937 72464 35065 56013 -6943 -37175 33057 67344 60783 136603 202148
7089B02148o6984n6277k6961N8731P8833j23019Q2805j8109q5908L7958L758J9491
7077A06466N6897M7874r6780n6270M4474n8611k0158p7539J5520k4417r336M529
7065f7351l9614j9260j1208o3913P4652P2683j07394R3006J76111N376j67390
7054e4302N1695l8719J40324p8387p785J18206j7458l8944K6558m4525Q6054n271
7042A37446j33870M2131P2990j46112k5541m4771o3993P9206J8957N3005K8465
7031A7913n2854N219M3593R7229m0525j22174q736P4605Q9502J1389n3274k9503
7019C2384k8027K31P3084J06132r3081q9453m2903p6252o4284K32059n9389j08097
7007a17596J01508Q3731J1683m6979N2321r9351p9n406P6774j333M3656L9359
$$ plain form
7089 202148 135164 78887 51926 110657 189490 66471 149276 131167 45259 83217 86975 106466
7077 106466 163363 211237 114457 58187 102661 44050 23892 -53647 -38127 -62544 -71880 -67351
7065 -67351 -106965 -126225 -137433 -201346 -126694 -54011 -161405 -68399 107712 113088 -54302
7054 -54302 -2607 -41326 98998 20611 12826 131032 113574 74630 101188 56663 142717 137446
7042 137446 3576 45707 118697 -27415 -52956 -97727 -161720 -82514 -63557 -10552 17913
7031 17913 -34941 -29722 13871 111100 70575 -51599 -60335 14270 103772 115161 61887 32384
7019 32384 4357 4588 77672 183804 90723 1270 -41633 -117885 -182169 49890 -9499 -117596
7007 -117596 -16088 67643 79326 32347 84668 -14683 -14762 -20168 56606 55273 98929 138288
6995A38288p1822p6976l7956Q9269K1770j15928J18576M6070K9280M6010n3099
6984A33482n8313o2709l3595m3210J39436r7354j4815Q2001q1077l7096j3736
6973h6986J74744p7283p0642Q620k7995j28713j46550Q4733J48320j7694L8293
6962a01153P1196N1631O1598Q3821p6743j23133m0354K7038J23933N1081J4420
6951A43335j7004m1199r4325l0035M4483r1623J11095K8729p8330k3390J1182
6940c7082R734n9293J21523n7479o1138j5993K2580L6111Q5773k4138j20071L7489
6928f1984m790J65576M0285j17406j31542J21399M0704J6039O2971O785M3522
6917A81559j1865q3321r9325M1909l7916L1253P794k8171J9661J1881L9946l4986
$$ plain form
6995 138288 66466 -10510 -48466 40803 62573 -53355 65221 111291 140571 186581 133482
6984 133482 75169 12460 -21135 -64345 75091 -22263 -37078 44923 -36154 -73250 -86986
6973 -86986 87758 10475 -60167 -51547 -79542 -208255 -354805 -270072 -121752 -139446 -101153
6962 -101153 -29957 21674 83272 167093 90350 -32783 -73137 -46099 77834 128915 143335
6951 143335 126331 85132 -9193 -39228 5255 -86368 24727 53456 -24874 -48264 -37082
6940 -37082 -27348 -86641 34882 -22597 -83735 -99728 -77148 -41037 44736 20598 -99473 -61984
6928 -61984 -66774 98802 139087 21681 -109861 11538 52242 68281 131252 138037 181559
6917 181559 169694 86373 -12952 28957 -8959 22294 30088 1917 21578 33459 73405 38419
6905C8419j3396l8829M1918O9271n0615L8145q577m1110m7042J4348M6162J664
6893E0358n7904J34900k1880j16880M648k5986o8578J4801J09954K098Q1217j0019
6881I6729j30097k3021J3338n6404K7007L1520n3526j31415J47199J59115q0353
6870I2M3918N0663j932N96j0688l4355o5908k6862P7981j5771o3494J2849J9758
6857a3153l5789p0745M3287J23226M7673n0619j1197J92601k7211o7444L5834
6846A66463r3121k154q9673r6270M7058J30188j8118q7500l5587m4328R8421J14046
6834H9425j9069k6886M7952p8037K9740K8639L8680r1380J05319k2613k8521l048
6822G0201k8760O7023n4302j4238r6033N6743L1624K8893m2690J03274k7313j18203
$$ plain form
6905 38419 25023 -13806 28112 97383 46768 84913 76336 35226 -11816 2532 48694 50358
6893 50358 -7546 127354 105474 -11406 -6758 -32744 -101322 -86521 23433 25531 106748 96729
6881 96729 -33368 -56389 -43051 -99455 -72448 -40928 -94454 -225869 -78670 80445 92
6870 92 44010 94673 92741 93337 82649 48294 -17614 -44476 33505 17734 -45760 -32911 -13153
6857 -13153 -48942 -119687 -76400 46826 94499 43880 32683 225284 198073 130629 166463
6846 166463 73342 71188 -18485 -114755 -67697 62491 44373 -43127 -78714 -123042 -24621 89425
6834 89425 70356 43470 91422 13385 43125 71764 110444 19064 124383 101770 73249 70201
6822 70201 41441 108464 54162 39924 -56109 634 32258 61151 18461 121735 94422 -23781
6810b3781k8908K4860P3183j0680j04567J06596N2280N205k4361k4035n3923L7001
6798B8870O8162l1026N1623j43312N2472j426m4927l105M4260N5318N2325K4712
6786A53946K9203k03649j11906R7326J08976p9253n4173j45947l1046J9846J06551
6775a10126J34759n2282k0686L394n1339L9648Q3109l4893M2551j5337J3666q999
6763B3465l7061o6900P9669M7950k778r421j8860J85116K492j58642n2719L2833
6751B5144J5544o6835o0017J08872m2129n5705J24494M9365J04188p6537o2877
6740F3507k8600N0692r6916j32246P8068J12274j43603l9549J51106j6041j29173
6729a30481Q8550l428K1890l0396R5492j71932O4369l1932m8607O9344K2559l7235
$$ plain form
6810 -23781 -52689 -27829 45354 34674 -69893 36703 88983 94188 69827 45792 -8131 28870
6798 28870 97032 66006 117629 -25683 26789 25363 -19564 -22669 21591 76909 129234 153946
6786 153946 183149 -20500 -132406 -35080 73896 -5357 -59530 -205477 -236523 -216677 -110126
6775 -110126 24633 -27649 -48335 -44941 -96280 -56632 26477 -8416 34135 18798 32464 23465
6763 23465 -13596 -80496 -827 47123 44345 34924 16064 201180 203672 45030 -7689 25144
6751 25144 40688 -26147 -86164 22708 -19421 -75126 49368 98733 202921 126384 63507
6740 63507 34907 85599 -11317 -143563 -65495 46779 -96824 -136373 14733 -1308 -130481
6729 -130481 -41931 -45359 -23469 -53865 41627 -130305 -65936 -97868 -146475 -77131 -54572 -91807
6717i1807m3405J3909K4143J28019k5772M5527n51r8242P6991L4311q9847L0561
6705C837J4130o4548k1249N6823q0411J02614o0096J268k0871j3656M0418O606
6693c5135Q5144J3601r0507p3321Q2630J3823n5595j3443J0794L8624o0658j2425
6681i6468K486j03852N405P0526o407R3575n4273R6520l3335N8375K5672O3469
6669A21693M4143j11619N768j7934j12611K8260J5796O605k2164n225m14o5139
6657a12841Q6238k0031l9706M448M160j1416k9221O5427K3861Q3179J3637m9301
6645A8434q3086K6663J1254j5531o665n3403J9986J50926l9604j33784R1581O4624
6633E1395j5314q0129l2723L6985j3220n0443M6872J4777J04177l8866o8676j35723
$$ plain form
6717 -91807 -135212 -121303 -97160 30859 5087 50614 50063 -48179 28812 63123 -26724 3837
6705 3837 17967 -46581 -67830 -11007 -91418 11196 -48900 -47632 -68503 -82159 -41741 -35135
6693 -35135 50009 63610 -26897 -100218 -17588 -3765 -59360 -72803 -62009 -23385 -84043 -96468
6681 -96468 -93982 -197834 -192429 -121903 -128310 -34735 -89008 7512 -25823 32552 58224 121693
6669 121693 165836 54217 59985 42051 -70560 -42300 -26504 -19899 -42063 -47288 -47702 -112841
6657 -112841 -26603 -46634 -86340 -81892 -77732 -89148 -118369 -52942 -29081 54098 67735 18434
6645 18434 -64652 -37989 -26735 -42266 -48931 -102334 -82348 68578 28974 -104810 -13229 51395
6633 51395 36081 -44048 -76771 -39786 -53006 -103449 -56577 -41800 62377 23511 -45165 -180888
6621a80888L6384J41466m8831L5560N4393q1194J49089K489q605p2446r7957k9696
6609a00236K86P0265j1320R7595m2397O9101N8187J5401j2917j29144j3406N7732
6597E9147j61667k1661J36221K7423o9801P5059L7043p9345Q2966m8938m7684
6586a1237N552m7229j09056J61591O9252N6739m6314q205j6138n7656j08698l9096
6574a50495Q0247J39129j3636k3921N1347j63918P8773J45918j5058k2738p8921
6563B6727J07497j11577p4756n3626M0363Q4725O3936j15433j1508J86726n9164
6552H3910m5940p7374M6484j2820K9494Q646K9681o453Q4107O516K1645r4702
6540G3194m7645n1670O6763l5104p9876K6270O1082J512O7301J6926n1762L3672
$$ plain form
6621 -180888 -144504 -3038 -51869 -16309 38084 -43110 105979 108468 99863 27417 -70540 -100236
6609 -100236 -99950 -29685 -41005 56590 14193 83294 141481 156882 143965 14821 1415 59147
6597 59147 -102520 -124181 12040 39463 -30338 44721 81764 2419 85385 36447 -11237
6586 -11237 -5685 -52914 -161970 -379 68873 125612 79298 71093 54955 -2701 -111399 -150495
6574 -150495 -70248 68881 55245 31324 82671 -81247 -2474 143444 128386 105648 26727
6563 26727 134224 22647 -52109 -105735 -65372 19353 83289 -32144 -43652 143074 83910
6552 83910 37970 -39404 7080 -5740 23754 32400 62081 55628 139735 146251 167896 73194
6540 73194 25549 -26121 40642 5538 -74338 -48068 13014 14526 81827 98753 46991 80663
6528H0663N3522j7159r3936k0848J4945l612k4149j02646J61501o857M3472n8748
6516B6148n8304R0981j81529K2174L1469P0321J06966o6072p1414j86574k2429
6505b38263N6361K7459R0884R4418L3055o221O6847J9203p0998O2883k2087m4084
6493F9457l6304p2519O7294L9133Q0694o7266k6936J9846L0538p4131k0197m9344
6481c9735O5367m9243j5623P2J31021J99769r2376j38693J14303r6388o6638M9582
6469F1418o4605q2057j68149k6896J7364J09335K07808m0947j9897P8172N0808
6458A22354j13923n6421P4255J11925n7255J4924J7282k06243L720p701J78453
6447H1370R6831k03422l9567K5482R6653L924o0234L1318p0619l9178Q4245p0831
$$ plain form
6528 80663 134185 117026 23090 2242 17187 13575 -10574 -113220 48281 41424 84896 26148
6516 26148 -32156 58825 -122704 -100530 -69061 1260 108226 42154 -29260 -215834 -238263
6505 -238263 -181902 -154443 -63559 30859 63914 57693 124540 143743 72745 135628 113541 69457
6493 69457 33153 -39366 27928 67061 147755 80489 53553 73399 103937 29806 9609 -39735
6481 -39735 25632 -23611 -39234 -39162 91859 291628 199252 60559 174862 78474 11836 61418
6469 61418 -3187 -85244 -253393 -280289 -262925 -153590 54218 13271 -6626 71546 122354
6458 122354 8431 -47990 26265 138190 80935 95859 113141 -93102 -89382 -97083 81370
6447 81370 178201 -25221 -64788 -39306 57347 61271 1037 32355 -38264 -77442 6803 -64028
6435f4028o2341M5515m6552N8090L8895p6148P3732R7193j3117L0289J25925o7891
6423A39562m2048O206l1314l9265K4528J7343r8298J1082L3028J2186j9663Q648
6411B1995m3345P3570Q8203n4298j01985K478L0465L6421r7938K5300j27602Q7754
6399e8982Q5151j07515k6669J22535J41783p4818m756J1843j22030M7513j45849
6388a31794n6831K17834K9436j11013k2389K7064m5460J59342J0957l6737m8548
6377h139m22Q229k0885J29986J5392p4151J1002k6328O62Q4877m3146j32060L5351
6364a9632K254J57478M6358n2081j10508J69922J458n6843k8197p3658j5777l1241
6352a0467N1331O894O7503N2767j4161k02841O0979j6799K8811P9488J26211o6238
$$ plain form
6435 -64028 -126369 -80854 -127406 -69316 -30421 -106569 -32837 64356 51239 81528 207453 139562
6423 139562 97514 103720 72406 33141 57669 75012 -23286 -12204 20824 33010 13347 21995
6411 21995 -21350 52220 140423 86125 -15860 -13382 17083 53504 -44434 -19134 -146736 -58982
6399 -58982 26169 -81346 -108015 14520 156303 81485 76729 88572 -33458 14055 -131794
6388 -131794 -188625 29209 58645 -52368 -74757 -47693 -93153 66189 77146 40409 -8139
6377 -8139 -8561 -332 -21217 108769 124161 50010 61012 34684 35346 120223 77077 -54983 -19632
6364 -19632 -17378 140100 186458 134377 23869 193791 195249 138406 110209 36551 20774 -10467
6352 -10467 40864 47758 115261 168028 153867 -48974 12005 -4794 24017 103505 229716 163478
6340A63478n732K7134K6735l2480j10174j4672J17638J2424k2609r145L132n7988
6328I7741j2710j09077p611m5607J02457N7474n4546J81314l741M1643o7168N2448
6316B32617n9487k34064o6652L6354J91014K48m5278k4183j1450n1396n7920J03253
6304A3056p0496m4698J4245R7513N5399r8967l6726Q0492M0759J21921l0776J9900
6292A61622j64329J62248p598j09844R2047q8425N919j405K057N1102n6019m7231
6280A44O8685O8984m5716Q003j13577O1765J60817m0017n3092l7186j42695J9276
6268d4609N3648p5057J8521L8119Q0947J2403o6047J34262k3073L9336l5170j9811
6256A13469J03975N4160m5202K8288r2221j19857O0367K68K2901q8865J5454n3541
$$ plain form
6340 163478 157746 184880 211615 179135 68961 54289 171927 184351 161742 152597 155729 97741
6328 97741 85031 -24046 -31657 -77264 25193 82667 28121 209435 205694 247337 180169 232617
6316 232617 173130 -60934 -127586 -91232 99782 100030 54752 30569 19119 -32277 -90197 13056
6304 13056 -57440 -102138 -87893 9620 65019 -33948 -70674 9818 50577 172498 141722 161622
6292 161622 -2707 159541 151943 42099 134146 45721 51640 50235 52292 103394 47375 144
6280 144 68829 137813 92097 100100 -13477 48288 209105 169088 115996 78810 -63885 -44609
6268 -44609 9039 -66018 -47497 -9378 71569 83972 17925 152187 129114 168450 133280 113469
6256 113469 217444 271604 226402 254690 162469 42612 102979 103247 126148 37283 52737 -804
6244h04m8330j19807K90774J6832j22301M7196R3570q8851q6897O3313j13178
6233f8483o0653l2994R4027Q9655P4012P0579j51447n9035O3321M1741q771o2637
6221a0685O3372o0245n7248J3213M5586J16228J3224r315l2763j37502M1274N8777
6209D3916M4315q6389j23138K21546K2475r3804K1877n1215N4195Q5356j37976
6198A158L4635Q5858l670L2111l1127j16154l5757J9588L9195N4599n4272k6486
6186c22K48876j20786K2332k9810j8995l0094q9908K00501k04389k2608Q6689
6175D1486R3558P0381R0410r9600o8464N4275r0657q518n7370o7158R089K39384
6163B06816K0096k0105L4941p8199L0043q0936k5596J7712o8182j5203N0338J16624
$$ plain form
6244 -804 -49134 -168941 121833 138665 16364 63560 157130 68279 -18618 44695 -68483
6233 -68483 -129136 -162130 -68103 21552 95564 166143 14696 -44339 18982 60723 51952 -10685
6221 -10685 52687 -7558 -64806 -51593 -6007 110221 123445 114130 81367 -56135 -14861 43916
6209 43916 88231 1842 -121296 100250 122725 28921 50798 -417 53778 139134 1158
6198 1158 35793 121651 117981 150092 118965 2811 -32946 -13358 25837 80436 26164 -322
6186 -322 248554 127768 150100 120290 101295 71201 -18707 181794 -22595 -45203 41486
6175 41486 135044 205425 295835 196235 127771 182046 91389 82871 25501 -41657 -32568 206816
6163 206816 226912 206807 241748 163549 193592 112656 87060 104772 36590 21387 71725 188349
6151A88349J00634k604j07004l2887l3635Q3917M6619n621L0586k8939J0964J40813
6139C91192m2137j62741Q2038K9636j5797R4414m8228j134K1816p0046j5236n7747
6127B06030j2199J8132m4837M1690m1327Q5018P3082l3728m297J076q8611k846
6115A97183N3894j1693L340J18343l8862j47176l923l8180R2368m4949J28788
6104C09133n818K3688L5512q1552m4235P9291k14972R0944L3722J9583L7059p6553
6092B05802m3714j11634P8094N4850O9203j1724n5998Q2735J2089k2349Q1430
6081C38784k3024m2675L5629m7627k0266N34l669l0745l0318o7488m5843J14588
6069A77880k1486m2479n1164N4466R6966k0546L0294j88455L1979M0344j23070
$$ plain form
6151 188349 288983 286379 179375 146488 112853 196770 243389 237768 268354 239415 250379 391192
6139 391192 349055 186314 268352 297988 282191 376605 328377 327243 349059 279013 263777 206030
6127 206030 193831 211963 167126 208816 167489 252507 325589 291861 287564 288640 200029 197183
6115 197183 251077 239384 242724 361067 322205 175029 171106 132926 225294 180345 309133
6104 309133 303315 327003 362515 280963 236728 316019 101047 191991 225713 245296 282355 205802
6092 205802 162088 50454 128548 183398 252601 240877 184879 267614 279703 257354 338784
6081 338784 315760 273085 308714 261087 240821 241355 237686 206941 176623 109135 63292 177880
6069 177880 156394 113915 62751 117217 214183 193637 223931 35476 67455 107799 -15271
6058a5271j8663J06964n5524L9309K3489P4817k242j54831N5703m7554K1860R3081
6046A21138K160K0410Q0331n4074N4770o052J5883j44706R6738l6108n6755o3090
6034C0645j8394j4343J16170Q0308J01523R092p5079j23811j23218J24033J17647
6023B24573j10898N4324L1061n0338P6052j23759M6419J6432N6441M4763q514
6012B56556N405K8243j5770N7134j8692j11634k2445K5705O0543j42852J52552
6001B74745j9142j69024O5312K3141K7806l5130Q2962k3471j71416j32025K9679
5990d6563l5936J58488P5230l5122R2911L526M2594k6082l0314K5456K9034J50125
5978D03347p0994k8731J02672k54222p7576J20829l2844N636p0147Q9630K5835
$$ plain form
6058 -15271 -33934 73030 17506 56815 80304 155121 152879 -1952 53751 6197 28057 121138
6046 121138 123298 143708 224039 169965 224735 218683 234566 89860 186598 150490 93735 30645
6034 30645 12251 -2092 114078 194386 295909 305001 229922 106111 -17107 106926 224573
6023 224573 113675 167999 199060 148722 224774 101015 147434 163866 220307 265070 256556
6012 256556 261961 290204 274434 331568 312876 201242 178797 204502 265045 122193 274745
6001 274745 255603 86579 151891 175032 202838 167708 250670 227199 55783 -76242 -46563
5990 -46563 -82499 75989 151219 116097 209008 212534 255128 229046 198732 224188 253222 403347
5978 403347 332353 303622 406294 152072 74496 195325 162481 168117 97970 187600 213435
5967B13435L3194R619m311p3732k2714j9817N4589n5229l3228L8747n7881K15079
5955B97751J1638q7001l4757o4169o234Q2890L9817r460O3293K49r1733n1795
5943A50489l789J0279O9916J11910m8038J5933L1690j18073k1457M3952o008o1093
5931A75711L8950J08072Q5725m6281j52194o7316q343K6521J390K9709p0322J18514
5919B40136L010N057J41105l1747l9809R6983j13004N9925j9408K0072O1991l7899
5907C86412P105Q576j3886M6334j91829j01572n7825P7887m0972m5827J72010
5896B46413K3159J56140L2144j24156j612K24j17116k1963p795O0815R3551J6714
5884C56518k5312k1699q0498J6980q2503M1352Q5909J25803n4407n8476m5995
$$ plain form
5967 213435 246629 256248 251937 178205 155491 135674 190263 135034 101806 140553 82672 297751
5955 297751 309389 222388 187631 123462 117228 200118 239935 230475 293768 294017 202284 150489
5943 150489 146700 156979 226895 338805 290767 306700 338390 220317 198860 242812 236804 175711
5931 175711 214661 322733 408458 362177 209983 142667 134324 160845 162235 191944 121622 240136
5919 240136 243146 248203 389308 357561 317752 414735 301731 361656 342248 362320 424311 386412
5907 386412 393517 402093 388207 434541 242712 141140 83315 161202 120230 74403 246413
5896 246413 269572 425712 457856 333700 332088 332312 215196 193233 185438 246253 339804 356518
5884 356518 331206 309507 229009 245989 163486 204838 290747 416550 362143 303667 257672
5873B57672J0555m150K5003p753j9391M0596n9401j13620L1422N0070M8438M5010
5861C04451J17437O6j30323n924J01496l3294J9976j28477K8557O9567N1926j0343
5849C85115L4008p9915L5157M6142q2515n1574P0251r193j1239l0943o0420J58127
5837D03001M6663l5041q1460O1777q7959L1184O8551k8746q5090N4224J1176j0760
5825C47520Q0002L1518n3122k9224j00869O8177o167J6657J8661M6630K0792K2666
5813D63241k7286J2370q4146O472K7577R5441j804J05039J32943q0090m2760n6291
5801E50706M5467o3720m4266j7773p8518P918J5668M2432J94936j00972j9172
5790E32706Q435q4390J37675k0975o5451L9802M440j4255R1051J15011o3983p0769
$$ plain form
5873 257672 268227 264077 289080 281327 261936 302532 243131 129511 160933 211003 259441 304451
5861 304451 421888 421954 291631 285707 387203 353909 373885 245408 273965 343532 395458 385115
5849 385115 419123 339208 374365 420507 337992 286418 356669 347476 336237 305294 244874 403001
5837 403001 449664 414623 333163 394940 306981 338165 406716 377970 292880 347104 358280 347520
5825 347520 427522 459040 405918 376694 275825 344002 337835 354492 373153 419783 440575 463241
5813 463241 435955 448325 364179 370651 398228 493669 491865 596904 729847 649757 606997 550706
5801 550706 596173 532453 488187 470414 391896 399814 415482 457914 652850 551878 532706
5790 532706 541141 456751 594426 573451 508000 547802 552242 537987 629038 744049 680066 609297
5778F09297q7689J6283j38825L4603J49624O3522m9959n0969o139o185L7820N9276
5766F30659R0415L0675j75631p9652Q6805j15337M5192R1999K8199q9960r7585
5755D45779n750l626j0223J23624j182R0860J12381j7259q895k7993P1198K7328
5743G96242o1440p3754p9717o8259P5064k2858L0994P1970O6247o1244J67J24212
5731G97624p7957j22734J28739J24811j63673m9592M7633Q8377k2234K5275o2422
5720G13847k133j2753K8756M9043q478q3813k4484P9887J13326J18507P0857J7437
5708A059999r2476K5809j07187J4288j209k2295O3716J14415M8347Q013m3011
5697A068409M7951P191N9387l6557m3352o5917O7318J3269M4863N2619m5755N358
$$ plain form
5778 609297 521608 537891 399066 433669 583293 646815 596856 545887 539748 533563 571383 630659
5766 630659 721074 751749 576118 496466 583271 467934 513126 605125 633324 543364 445779
5755 445779 440029 436403 426180 549804 548622 639482 751863 734604 725709 697716 768914 796242
5743 796242 734802 661048 581331 513072 588136 565278 596272 668242 734489 673245 673412 797624
5731 797624 719667 596933 725672 850483 686810 637218 684851 773228 750994 776269 713847
5720 713847 711714 698961 727717 776760 768282 684469 659985 739872 853198 971705 1042562 1059999
5708 1059999 967523 993332 886145 900433 899224 876929 940645 1055060 1103407 1111420 1068409
5697 1068409 1116360 1123551 1182938 1146381 1103029 1037112 1104430 1117699 1162562 1215181 1169426 1174784
5685A174784J5819r2617n8959J97552q5834K3753l4078J13561j1245o5763P6348
5674A253321Q9023O7959m2445J8472M7228j06881R3343J71923j61010r6823p3610
5663A260500N0760J43830k6899K6271K9650M5754l0162L2676j2659J13053M3755
5652A676529j0389K3749J4147P3451L1119K7691L0216M8106o3060j4384J04555
5641A941730O7509P787J07021J13389M8473n99N2390J36541L1559J61837J74212
5630B841849N9903L3673L3527J69592K78853J16973P2530J87836R7808K44311
5620D136855O9503J53233K04846J92655K99218K82853Q0984K94096K53079P7698
5610F045020J32743P1086J49012J15961P9364K9974l2798J08397J7550J9901j31785
$$ plain form
5685 1174784 1190603 1097986 1039027 1236579 1150745 1174498 1140420 1253981 1242736 1176973 1253321
5674 1253321 1342344 1410303 1367858 1386330 1433558 1326677 1420020 1591943 1430933 1334110 1260500
5663 1260500 1311260 1455090 1428191 1454462 1484112 1529866 1499704 1532380 1519721 1632774 1676529
5652 1676529 1666140 1689889 1704036 1777487 1808606 1836297 1866513 1914619 1851559 1837175 1941730
5641 1941730 2009239 2017026 2124047 2237436 2285909 2285310 2337700 2474241 2505800 2667637 2841849
5630 2841849 2901752 2935425 2968952 3138544 3417397 3534370 3606900 3794736 3892544 4136855
5620 4136855 4206358 4359591 4564437 4757092 5056310 5339163 5420147 5714243 5967322 6045020
5610 6045020 6177763 6248849 6397861 6513822 6593186 6623160 6590362 6698759 6716309 6736210 6604425
5599F604425N5102O6178R4481J15408K33571J48031R1189J17857P9723J96596
5589G802561J17960J21876K95735L78987K61534J71385J94601K08059K70542L19744
5579A0142984O156J20185K36962M7757q6390K2777n983j41858l10923k67787k49315
5568I514565k30002k42805j68313l11104j01731j81562o1605j24146j60741j28410
5558G804146o0744L9946k26334j38646J4773K723r4487k9361m2586J01974L1342
5547G402746r6363j33449j0668j72749n5907r5944k74474k08113j84221k05361
5537E965497j59770j46178k70032k61617j04009j78626k16582k92147k71601k1691
5527D043244j68657j14728j84944j52713j13855p9435o4700j8532Q2738o5756
$$ plain form
5599 6604425 6659527 6725705 6820186 6935594 7169165 7317196 7408385 7526242 7605965 7802561
5589 7802561 7920521 8042397 8338132 8717119 8978653 9150038 9344639 9552698 9823240 10142984
5579 10142984 10149140 10269325 10506287 10554044 10467654 10490431 10484448 10342590 10031667 9763880 9514565
5568 9514565 9284563 9041758 8873445 8562341 8460610 8279048 8217443 8093297 7932556 7804146
5558 7804146 7743402 7783348 7557014 7418368 7433141 7435864 7341377 7312016 7269430 7371404 7402746
5547 7402746 7306383 7172934 7162266 6989517 6933610 6837666 6563192 6355079 6170858 5965497
5537 5965497 5805727 5659549 5389517 5127900 5023891 4845265 4628683 4336536 4064935 4043244
5527 4043244 3874587 3759859 3574915 3422202 3308347 3228912 3164212 3145680 3228418 3162662
5517C162662k19496r3599r2334j41125n2152m9174J263K9837j51722J8373R292
5506B421825n9548j8494L0343O0792K8384j23928j77096m6439L6670m0588j35804
5495A976117l859m0531k10075j192N8012r121m8455j4602P3995L044l6434J9927
5483A766826n0630q2507r9682J50516P635k8882j9455j38781n762K9556L6876
5472A565710K7039o2392Q4413o2595m4825J01174l8647P640p8979n1182o9274
5461A378082o3744Q3348N0316j05776K2900N0532J1314j3485M1086q8217j2083
5450A354273K2566R3472m3565K6553j26309n1556M5180P6278r7241O2587l1574
5439A330664r2658K5447N6646N1969J4547N2749m9336n2071L6466L9166q7541
$$ plain form
5517 3162662 2943166 2849567 2757233 2616108 2563956 2514782 2516045 2545882 2394160 2412533 2421825
5506 2421825 2362277 2343783 2374126 2434918 2463302 2339374 2162278 2115839 2152509 2111921 1976117
5495 1976117 1972258 1931727 1721652 1720460 1778472 1769351 1720896 1706294 1780289 1783333 1746899 1766826
5483 1766826 1716196 1633689 1534007 1684523 1692158 1663276 1643821 1505040 1499278 1528834 1565710
5472 1565710 1592749 1530357 1614770 1552175 1507350 1608524 1569877 1577517 1498538 1447356 1378082
5461 1378082 1314338 1397686 1448002 1342226 1365126 1415658 1426972 1413487 1454573 1366356 1354273
5450 1354273 1376839 1470311 1426746 1453299 1326990 1275434 1320614 1396892 1299651 1362238 1330664
5439 1330664 1238006 1263453 1320099 1372068 1386615 1439364 1390028 1337957 1374423 1413589 1326048
5428A326048j32755J2723o6548J32030J35414n0165k0261n5761M7152K9568J07403
5417A464848j22367K344m3842J8372j2823l5428O4912j5419k1175L2901K6238
5406A358561r6043N7726Q925m5485J59584j19223r4795J23340j4123j9321m1274
5395A277872N4310K2340n9629l2529R5428j21919r061j9889N6501j7079O9548
5384A315893l1823o0126M6527l0563N3755k1787J62312j03501k308O3448l2072
5373A359755Q3544L1173O1436m907q2061L3687j37551M0362J32250n947k5197
5362A486544o2440L2285R4575Q1583K8743q65M1045j29156k399K3376J73583m7917
5350A718957o4577R0248l4903m4364L2160l9219M4853n5378J14577k7748q945
$$ plain form
5428 1326048 1193293 1206016 1139468 1271498 1406912 1356747 1336486 1280725 1327877 1357445 1464848
5417 1464848 1342481 1344825 1300983 1319355 1306532 1271104 1336016 1320597 1299422 1332323 1358561
5406 1358561 1262518 1320244 1329169 1283684 1443268 1324045 1229250 1352590 1338467 1319146 1277872
5395 1277872 1332182 1354522 1294893 1262364 1357792 1235873 1226812 1206923 1263424 1246345 1315893
5384 1315893 1284070 1223944 1270471 1239908 1293663 1271876 1434188 1330687 1328379 1391827 1359755
5373 1359755 1443299 1474472 1535908 1531001 1448940 1482627 1345076 1385438 1517688 1511741 1486544
5362 1486544 1424104 1456389 1550964 1632547 1661290 1660425 1701470 1572314 1569915 1593291 1766874 1718957
5350 1718957 1654380 1744628 1709725 1665361 1697521 1658302 1703155 1647777 1762354 1734606 1725661
5339A725661n1713j11493K6213o85R5528J23802R480r8525P177J9717J54375L5216
5327A934753N6469Q4923m9549r5609K3738O5103L728j4729J7749M6404P0379j03405
5315B039954L9635n0149Q4019J2814L5857P1416j24354M0180j1402O8843L7333
5304B244146k5335L5940K1239k3204j11234K8606K03071O5743j4734O4117n8446
5293B429909J10297Q0275R316p8003M8772J16353L3756J8706Q7301L5379m2888
5282B849173m1683l9322J33883K6162M2719k31L4470j41873P7848P4754k126R4767
5270C108541O7240N1952q3807J5092J62582n7630M1017J08305n086L6370j3798
5259C430778j28898j4445J31568n168J7272m7421Q7858K7100k1332q226n3348
$$ plain form
5339 1725661 1673948 1562455 1588668 1587983 1683511 1807313 1816793 1718268 1725445 1745162 1899537 1934753
5327 1934753 1991222 2076145 2026596 1930987 1954725 2019828 2023556 2008827 2026576 2072980 2143359 2039954
5315 2039954 2079589 2029440 2113459 2126273 2162130 2233546 2109192 2149372 2137970 2206813 2244146
5304 2244146 2218811 2254751 2275990 2252786 2141552 2170158 2373229 2438972 2424238 2488355 2429909
5293 2429909 2540206 2620481 2629797 2551794 2600566 2716919 2750675 2769381 2856682 2892061 2849173
5282 2849173 2807490 2768168 2902051 2928213 2970932 2970701 3005171 2863298 2941146 3015900 3013774 3108541
5270 3108541 3175781 3227733 3143926 3159018 3321600 3263970 3304987 3413292 3408206 3444576 3430778
5259 3430778 3301880 3287435 3419003 3413835 3431107 3383686 3471544 3498644 3477312 3469086 3415738
5248C415738J31367P1430J54421J09882n9273p0434M6043k1846J1104M9691N157
5237C843280k88o6570J59289J8949k6595J3735J17197P8636j8289R7016K8814
5226D245174J02685J53217j25701P3821j01809O2434J56274p397l4892J02699
5216D626505J38068K7235M8200R5784J40402K0390J14302M6413l2045J27714J28839
5205E481807P0125P1674J2309n7940L9578K12784J37000L2142Q0850O0627O5538
5194F206494O0052P2610M8435J9243J25743J45029Q0825J76602j5863P8091K33744
5183G231005J07048P8045r982K75731O1214K1281J7033J03691J76141N4616k6426
5172H089397J58008J01313J29174J14353J30838J16636J22359K51976J17634k961
$$ plain form
5248 3415738 3547105 3618535 3772956 3882838 3823565 3753131 3799174 3777328 3788432 3838123 3843280
5237 3843280 3842992 3776422 3935711 3954660 3928065 3941800 4058997 4137633 4119344 4216360 4245174
5226 4245174 4347859 4501076 4375375 4449196 4347387 4409821 4566095 4558698 4523806 4626505
5216 4626505 4764573 4791808 4840008 4935792 5076194 5096584 5210886 5257299 5225254 5352968 5481807
5205 5481807 5551932 5623606 5635915 5577975 5617553 5830337 5967337 5999479 6080329 6140956 6206494
5194 6206494 6266546 6339156 6387591 6406834 6532577 6677606 6758431 6935033 6919170 6997261 7231005
5183 7231005 7338053 7416098 7406116 7681847 7743061 7764342 7781375 7885066 8061207 8115823 8089397
5172 8089397 8247405 8348718 8477892 8592245 8723083 8839719 8962078 9214054 9331688 9328727
5162I328727K2311K32094K01751J88659J06872J12088J53308K43279J32165K41290
5152A0962544J75399J15395K18632J26111N7207K44956L04293Q6109J90842K47437
5142A2728925K40173K62425K72173K08664L15613K02408L43354K45268K00380
5133A5019383K25049M19025K95464L30498K49279K68099L89643L90592L26215
5124A7913247L14263L21135M32275M99243N13150O77211L85636M41405N60970
5115B2058535N21865O31270O90813N15351O62535O81195O55886O88908Q65417
5106B7971775P90158O67119R49953J102884R65149R33288J038626J181968J075973
5097C6676893J403564J207316J364887J406188J628167J534584J851932J710697
$$ plain form
5162 9328727 9351038 9583132 9784883 9973542 10080414 10192502 10345810 10589089 10721254 10962544
5152 10962544 11137943 11253338 11471970 11598081 11655288 11900244 12204537 12290646 12481488 12728925
5142 12728925 12969098 13231523 13503696 13712360 14027973 14230381 14573735 14819003 15019383
5133 15019383 15244432 15663457 15958921 16289419 16538698 16806797 17196440 17587032 17913247
5124 17913247 18227510 18548645 18980920 19480163 19993313 20670524 21056160 21497565 22058535
5115 22058535 22580400 23211670 23902483 24417834 25080369 25761564 26417450 27106358 27971775
5106 27971775 28761933 29429052 30379005 31481889 32447038 33380326 34418952 35600920 36676893
5097 36676893 38080457 39287773 40652660 42058848 43687015 45221599 47073531 48784228
5089D8784228J801315K060298J991935K237209K370286K471166K603548K811017
5081F7131002K870323L273523L303148L634251L843270M069655M435605M828687
5073I7389464M942052N403492N689462O088169O431085O903715P316810P935047
5065A48099296Q521575R033064R613169J0068247J0626846J1190322J1600806
5058B18753325J2285672J3016809J3695298J4367145J5036034J5828369J6572387
5051C19555039J7076418J7357106J7563263J7029574J6010431J4374289J1740398
5044D30706518Q506243M766724P92994l222554p281556j0293758j3279505j5303398
5036C95391708j6404722j7204220j7284152j7411462j6967297j6297045j5612719
$$ plain form
5089 48784228 50585543 52645841 54637776 56874985 59245271 61716437 64319985 67131002
5081 67131002 70001325 73274848 76577996 80212247 84055517 88125172 92560777 97389464
5073 97389464 102331516 107735008 113424470 119512639 125943724 132847439 140164249 148099296
5065 148099296 156620871 165653935 175267104 185335351 195962197 207152519 218753325
5058 218753325 231038997 244055806 257751104 272118249 287154283 302982652 319555039
5051 319555039 336631457 353988563 371551826 388581400 404591831 418966120 430706518
5044 430706518 439212761 443979485 444772479 441549925 434268369 423974611 410695106 395391708
5036 395391708 378986986 361782766 344498614 327087152 310119855 293822810 278210091
5029B78210091j5041780j4361580j3404564j2607478j1700979j1020923j0431458
5022A89641329r501664q916178q544437q024647p229477o969106o541585o128645
5014A27785590n674560n346484m956770m707679m509796m107021m018570l726629
5006I0738081l567487l228042l054523l089201k849142k656764k656378k541710
4998F7094834k279087k203528k124212j991009j912764j701408j815626j739773
4990E1327427j666092j508944j391210j453446j286618j209451j163669j151954
4982D0496043j096173r81476r62083r04791q95425q39748r23670r60852o01484
4973C2330341p70831q22081o60004n75333o27058p74668n67784n69310o34821
$$ plain form
5029 278210091 263168311 248806731 235402167 222794689 211093710 200072787 189641329
5022 189641329 180139665 171223487 162679050 154654403 147424926 140455820 133914235 127785590
5014 127785590 122111030 116764546 111807776 107100097 102590301 98483280 94464710 90738081
5006 90738081 87170594 83942552 80888029 77798828 74949686 72292922 69636544 67094834
4998 67094834 64815747 62612219 60488007 58496998 56584234 54882826 53067200 51327427
4990 51327427 49661335 48152391 46761181 45307735 44021117 42811666 41647997 40496043
4982 40496043 39399870 38418394 37456311 36551520 35656095 34816347 33892677 32931825 32330341
4973 32330341 31559510 30737429 30077425 29502092 28875034 28100366 27532582 26963272 26328451
4964B6328451n78510n64425m79847n71543n11063m64990m83151l94446m88351
4955B1792125m08541m49796m04511m28998k95362l35214k29492n05109l30607
4946A8404495k43190l62931l63476m05299j93718j55078l05355k79591j85569
4937A5910288l04707l02736k60776q4020j12087m64603k86476j08715k02936q0381
4927A3702851j69043j35406k68348k47537j95013k14104q2643k35920j82126j10984
4917A1861727k03242l02008k35028m1267j38609j33262j76991r7901k50064j77494
4907A0105861j32054k42084j11700j91788j86317l8317n8862j41472k74153j45608
4897H583506m1669j20145j01493j56049l1310j94925j58450N0442j04707j82555
$$ plain form
4964 26328451 25749941 25185516 24705669 24134126 23623063 23158073 22674922 22280476 21792125
4955 21792125 21383584 20933788 20529277 20100279 19804917 19469703 19240211 18735102 18404495
4946 18404495 18161305 17798374 17434898 17029599 16835881 16680803 16375448 16095857 15910288
4937 15910288 15605581 15302845 15042069 14958049 14845962 14381359 14094883 13986168 13783232 13702851
4927 13702851 13533808 13398402 13130054 12882517 12687504 12473400 12390757 12154837 11972711 11861727
4917 11861727 11658485 11356477 11121449 11080182 10941573 10808311 10631320 10533419 10283355 10105861
4907 10105861 9973807 9731723 9620023 9428235 9241918 9203601 9144739 9003267 8729114 8583506
4897 8583506 8541837 8421692 8320199 8164150 8132840 7937915 7779465 7829907 7725200 7542645
4887G542645j53932n1215n5708j04779q881p9724m9509r1027q3136j87077r0782
4876F586875P5480k00096j36167N1211M8348q8320p2645q6607P9119l9934r8185
4865F119079k71l0022j37945j76967n8402J37177j85612j17933j01442n0902j61200
4854E235560p9643o606n7790J12738p2547o0004k28104j13181J0534j26557M0805
4843D655205m4942j4815J436j64896j11412O902L8182j05988k4987J1801j02040
4832D144446j21022j00230m9585P9507O3116j20395j15488j81732o7195k9069
4822C502353O7219Q9699j37192j5693m7246q5810J06276J2650j75082q9034l9717
4811C188423k185L2592l5556j09699r3272j55231P2629Q9784k4163K2027J7487
$$ plain form
4887 7542645 7388713 7337498 7281790 7177011 7168130 7088406 7038897 6947870 6864734 6677657 6586875
4876 6586875 6662355 6462259 6326092 6377303 6425651 6337331 6264686 6178079 6257198 6217264 6119079
4865 6119079 6118808 6088786 5950841 5773874 5715472 5852649 5667037 5549104 5447662 5396760 5235560
4854 5235560 5155917 5149311 5091521 5204259 5131712 5071708 4843604 4730423 4740957 4614400 4655205
4843 4655205 4610263 4595448 4596884 4431988 4320576 4327478 4365660 4259672 4234685 4246486 4144446
4832 4144446 4023424 3923194 3873609 3953116 4016232 3895837 3780349 3598617 3531422 3502353
4822 3502353 3569572 3659271 3522079 3506386 3459140 3373330 3479606 3492256 3317174 3228140 3188423
4811 3188423 3186238 3218830 3183274 3073575 2980303 2825072 2897701 2987485 2963322 2985349 3002836
4800C002836p2958R6720j24713r4113J1716m3869m0858n2244M497M4617O9130
4789B800761O7073k6851m7225j64653j11498J8802K8466l6871M5492O6099M0870
4778B680465o0192K9937O958j31866Q4083k6478o4013M4025j71373J35311m291
4767B522566j9594r3310q350q044m6975j33608p6209J85327L7336K3858j5427
4756B367570N775q6591L5411o596o7187L3903J28401j97093L9813J2197J2637
4745B278240j03841p7108R3239p0683q4985O3758n2552N0397p9845l2874o5656
4734A918090o6326J68478j9747J17897j9049m2209n405r0446q0076J2945P0089
4723A964241r1214k3050k5863K3788K9325j55581M0818K9580k0773L1293j49135
$$ plain form
4800 3002836 2929878 3026598 2901885 2807772 2819488 2775619 2734761 2682517 2687014 2731631 2800761
4789 2800761 2867834 2840983 2793758 2629105 2517607 2536409 2564875 2528004 2573496 2639595 2680465
4778 2680465 2620273 2650210 2657168 2525302 2609385 2582907 2518894 2562919 2391546 2526857 2522566
4767 2522566 2502972 2409662 2401312 2393268 2346293 2212685 2136476 2321803 2359139 2382997 2367570
4756 2367570 2373345 2286754 2322165 2315569 2248382 2282285 2410686 2213593 2253406 2265603 2278240
4745 2278240 2174399 2097291 2190530 2119847 2034862 2098620 2046068 2096465 2016620 1983746 1918090
4734 1918090 1851764 2020242 2000495 2118392 2099343 2057134 2051729 1961283 1881207 1894152 1964241
4723 1964241 1873027 1849977 1824114 1847902 1877227 1721646 1762464 1792044 1771271 1802564 1653429
4712A653429q0467R5221J50517J5638n9812q0989J6186n3790m404J46562j8399
4701A779692L0732J6007j57014L6654M2687p2852J0944K7666p07R8210o0335j6130
4689A735554l7021j14800k6569P9323M6631q0358L2677p916J6638J6969P4446
4678A735574k5148l6906J824l0619j25426l713O1195l0744L8815N0944K5999K4648
4666A686443K9425m1915n6448K6191J06256o8431q3568l866L1034J44750j63601
4655A606270O97k6764O948K8230j3518M2233L5841j8518j30017J5542N4069m3588
4643A557425m0064P7220P5039o8723n8441K4521L1816j4235l4793M1946j29462
4632A462249K3404M0897M1862l0075j7833j30753J52893J21627q2079J10369l7898
$$ plain form
4712 1653429 1572962 1668183 1818700 1834338 1774526 1693537 1709723 1655933 1651529 1798091 1779692
4701 1779692 1810424 1826431 1669417 1706071 1748758 1675906 1686850 1714516 1713809 1812019 1751684 1735554
4689 1735554 1698533 1583733 1557164 1636487 1683118 1602760 1635437 1627521 1644159 1661128 1735574
4678 1735574 1710426 1673520 1675344 1644725 1519299 1515586 1576781 1546037 1584852 1635796 1661795 1686443
4666 1686443 1715868 1673953 1617505 1643696 1749952 1681521 1597953 1594087 1625121 1769871 1606270
4655 1606270 1606967 1580203 1587151 1615381 1601863 1644096 1679937 1661419 1531402 1546944 1601013 1557425
4643 1557425 1517361 1594581 1669620 1600897 1542456 1566977 1598793 1584558 1549765 1591711 1462249
4632 1462249 1485653 1526550 1568412 1538337 1520504 1389751 1542644 1664271 1582192 1692561 1654663
4621A654663N404p0271j19185M7603J26190J7431l4667k341j09410J30598K304
4610A648319p28K7602p078O1262K5216L329j17595l1815n8275J14999J22997L5272
4598A823505n2258j32946L1172R9641n6906L4520q5947R0148l0915N2597m1104
4587A731507M8770Q4970j40483l4163L7615J833J05112k6555o0171o2421O5875
4576A751889N2324K5840J30935m4821k94o3322n8518J67877o3440j33856j3603
4565A751011P5160J09156P7299n2169n1262M2174L0927m4354M7231J39059p9836
4554B044396P7987L4557J1714J1299L6687P2914M0525k7927J19489J23718M3765
4543B589124M1647J28948N1194J90328q320J68500M9713R4779L946J16058J15852
$$ plain form
4621 1654663 1660067 1589796 1470611 1518214 1644404 1661835 1627168 1624827 1515417 1646015 1648319
4610 1648319 1647591 1675193 1668115 1729377 1754593 1757922 1640327 1608512 1550237 1665236 1788233 1823505
4598 1823505 1771247 1638301 1669473 1769114 1712208 1746728 1660781 1750929 1720014 1772611 1731507
4587 1731507 1780277 1865247 1724764 1690601 1728216 1730049 1835161 1808606 1748435 1686014 1751889
4576 1751889 1804213 1830053 1960988 1916167 1915873 1852551 1794033 1961910 1898470 1764614 1751011
4565 1751011 1826171 1935327 2012626 1960457 1909195 1951369 1982296 1937942 1985173 2124232 2044396
4554 2044396 2122383 2156940 2168654 2179953 2216640 2289554 2330079 2302152 2421641 2545359 2589124
4543 2589124 2630771 2759719 2810913 3001241 2992921 3161421 3211134 3305913 3309859 3425917 3541769
4532C541769R1479L09363K73291M3314J38220K95277K59473J90898M1031k7666
4522E156449L7523k0522r9759k5331m9374m8531p8115J25474J59381N8981J01609
4511E317785N8622J37164R3679J16965Q7429J48211L25989P1763J46645J57221
4501F661473K21460K21317J51343O1576K19728J95657J39727K43080N1991K51160
4491H418512K04486J38325K64220J57496J29925J87328L24552K78069K43073L15753
4481A0661739L85557J92820K22040K73120K80303J54315J75871K44522J75024
4472A2765311O6652L37712J94060R3916J7616J73219L3230j66576L2998J92904
4462A3741042L1771j38699l6258P0399K6087J18976J24238J19457N299L1547J46564
$$ plain form
4532 3541769 3633248 3942611 4215902 4259216 4397436 4692713 4952186 5143084 5184115 5156449
4522 5156449 5193972 5173450 5073691 5048360 4998986 4950455 4872340 4997814 5157195 5216176 5317785
4511 5317785 5376407 5513571 5607250 5724215 5811644 5959855 6285844 6357607 6504252 6661473
4501 6661473 6882933 7104250 7255593 7317169 7536897 7732554 7872281 8115361 8167352 8418512
4491 8418512 8622998 8761323 9025543 9183039 9312964 9500292 9824844 10102913 10345986 10661739
4481 10661739 11047296 11240116 11462156 11735276 12015579 12169894 12345765 12590287 12765311
4472 12765311 12831963 13169675 13363735 13457651 13475267 13648486 13681716 13515140 13548138 13741042
4462 13741042 13772813 13634114 13597856 13668255 13694342 13813318 13937556 14057013 14062312 14093859 14240423
4451A4240423M1749J4586R1087J91456N9080J25157M7539n7591j9993q939O9843
4440A4794397P4473L1781L7134r2734n242l4220l7016L3652k9020j03961k31839
4429A4437405j18592r6177j70663j35728l2451k7070J9326J10627m9644K8283
4419A3965316N2327K95012J70131J63732J70586K94070L13288K09304M01966M76442
4409A6512174M79505M04224O07784O64006M77704L80222M24250N36480M68233
4400B0954582L06691Q8454J45585J00839J29349j22020l8720n1434k27777P722
4390B1293271k06314n6199j36025k8767p081O151p3969M3704J44814J21522J69916
4379B1271023P525P5720L8922p6056k06605L2273o7449l30165k12162j72289l49906
$$ plain form
4451 14240423 14282172 14296758 14387845 14579301 14638381 14763538 14811077 14753486 14733493 14724554 14794397
4440 14794397 14868870 14900651 14937785 14845051 14839809 14805589 14768573 14802225 14773205 14669244 14437405
4429 14437405 14318813 14222636 14051973 13916245 13883794 13856724 13876050 13986677 13937033 13965316
4419 13965316 14017643 14312655 14482786 14646518 14817104 15111174 15424462 15633766 16035732 16512174
4409 16512174 16991679 17395903 18003687 18667693 19145397 19525619 19949869 20486349 20954582
4400 20954582 21261273 21349727 21495312 21596151 21725500 21603480 21564760 21513326 21285549 21293271
4390 21293271 21086957 21030758 20894733 20865966 20858885 20865036 20791067 20834771 20979585 21101107 21271023
4379 21271023 21278548 21354268 21393190 21317134 21110529 21142802 21075353 20745188 20533026 20360737 20010831
4368B0010831m56138l85388m96216n58116m63975n39197m28959m92372n83781
4359A5606689m32656m72420m51624l35562m70499k73882l85659l71444k78141
4350A2134802l48305m15110l65911j72155j00127l47559k53337j90613l25891
4341I615794l67751k26901l69660j52148k53863k12283j44615k53697j90860l63945
4331G080071k10825k33049o4391j02425j24907j49331j15237k52467j10849k13351
4321E503239k35464o0962j03552m2148m2857k09493j36400j60137o6498r3421
4311D352307o3806k4356L0286j6315j45035j02948N2669j9227q9242M2043q5674
4300C930702k04211m0051j7153M8587L1615p1787K1761J189q370n9434n6153J2363
$$ plain form
4368 20010831 19554693 19169305 18673089 18114973 17650998 17111801 16682842 16190470 15606689
4359 15606689 15174033 14701613 14249989 13914427 13443928 13170046 12784387 12412943 12134802
4350 12134802 11786497 11371387 11005476 10833321 10733194 10385635 10132298 9941685 9615794
4341 9615794 9248043 9021142 8651482 8499334 8245471 8033188 7888573 7634876 7444016 7080071
4331 7080071 6869246 6636197 6571806 6469381 6344474 6195143 6079906 5827439 5716590 5503239
4321 5503239 5267775 5206813 5103261 5061113 5018256 4808763 4672363 4512226 4445728 4352307
4311 4352307 4288501 4264145 4294431 4278116 4133081 4030133 4082802 4063575 3974333 4016376 3930702
4300 3930702 3726491 3686440 3669287 3717874 3749489 3677702 3699463 3700652 3692282 3632848 3576695 3589058
4288C589058q1713l336O7799J5807j40131n527L9480l4878n6645j0587J2881N1769
4276C443977j8830q3366L3282J18069R7944j42654O5194J69394j5961O1100k8338
4265C699811k7900Q603N8631J48289n0652P969k0778N2916M6570N4881J07716
4254D086056J43693N5534P322N6050J57087J21576n3537J25640J13928O3120J35534
4243E012003J73795J45317J26044R9131J71037L61349O9022J78621K85122K19811
4233F841252L54633L51588K32429K82630L92026M80501M37118M21130M51292M60741
4223A0705340N28540N60890Q77102J003161J189105J268814J399504J447803J449097
4214B0429356J248958J160590O98497J18780k93493o25383m65913l87865l2324
$$ plain form
4288 3589058 3507345 3504009 3571808 3587615 3447484 3441957 3481437 3446559 3389914 3379327 3392208 3443977
4276 3443977 3425147 3341781 3375063 3493132 3591076 3448422 3513616 3683010 3667049 3728149 3699811
4265 3699811 3671911 3680514 3739145 3887434 3836782 3844751 3823973 3876889 3923459 3978340 4086056
4254 4086056 4229749 4285283 4292605 4348655 4505742 4627318 4573781 4699421 4813349 4876469 5012003
4243 5012003 5185798 5331115 5457159 5556290 5727327 6088676 6157698 6336319 6621441 6841252
4233 6841252 7195885 7547473 7779902 8062532 8454558 8935059 9372177 9793307 10244599 10705340
4223 10705340 11233880 11794770 12671872 13675033 14864138 16132952 17532456 18980259 20429356
4214 20429356 21678314 22838904 23537401 23656181 23362688 22737305 22271392 21883527 21851203
4205B1851203J36292K79380K82156M85800P34887R77509R84904J184835J273297
4196B8190263J290091J611557J579825J758774J621985J534585J738773J638411
4188D0964264J705951J771309J708576J601787J395414J023615R27645J002870
4180E2101431R90833R30672P10125N43311k9675m93719q75892j110923j018009
4171E1748154j071382j006188j057887j246062j555802j882053j865925k120771
4163C9942084j961662j707503j577641j715118j784285j711119j924811j715489
4155B5844456j431476j449339j425165j075558j110411r99611r20014r03965p70727
4146A5758190o20317p02182n26932l47326n24012n50048m04029l07118l04437
$$ plain form
4205 21851203 21987495 22266875 22549031 23034831 23769718 24747227 25732131 26916966 28190263
4196 28190263 29480354 31091911 32671736 34430510 36052495 37587080 39325853 40964264
4188 40964264 42670215 44441524 46150100 47751887 49147301 50170916 51098561 52101431
4180 52101431 53092264 54022936 54733061 55276372 55246697 54752978 53877086 52766163 51748154
4171 51748154 50676772 49670584 48612697 47366635 45810833 43928780 42062855 39942084
4163 39942084 37980422 36272919 34695278 32980160 31195875 29484756 27559945 25844456
4155 25844456 24412980 22963641 21538476 20462918 19352507 18352896 17432882 16528917 15758190
4146 15758190 15137873 14435691 13908759 13561433 13037421 12487373 12083344 11776226 11471789
4137A1471789k25001k80511k51474j59965r9968j88337k13098K184k4691j7124
4127A0013804k0547m5240q5401p4335K06030Q8876J57572J24200K17584K43557
4117A0826100J74072J89020L87310L87580K92381M26426N10497M22518N23014
4108A4138918P44095N95753Q22322P74418Q05596Q27941J038580J199895J149065
4099B2096583J420972J615709J542821J623259J686129J656245J340643J133511
4091C4115872P69631L55377k62900p76410j072717j411901j488894j534686j501783
4082B7191589j552988j504189j377594j341093j235575j099731j024414r84092
4074A7071913r91840o91032p66387o67466p08681o52130m96615n04392m02866
$$ plain form
4137 11471789 11246788 10966277 10714803 10554838 10454870 10266533 10053435 10055619 10030928 10013804
4127 10013804 9993257 9948017 9862616 9788281 9994311 10083187 10240759 10364959 10582543 10826100
4117 10826100 11000172 11189192 11576502 11964082 12256463 12682889 13193386 13615904 14138918
4108 14138918 14883013 15478766 16301088 17075506 17881102 18709043 19747623 20947518 22096583
4099 22096583 23517555 25133264 26676085 28299344 29985473 31641718 32982361 34115872
4091 34115872 34885503 35240880 34977980 34201570 33128853 31716952 30228058 28693372 27191589
4082 27191589 25638601 24134412 22756818 21415725 20180150 19080419 18056005 17071913
4074 17071913 16080073 15389041 14622654 13955188 13246507 12594377 12097762 11593370 11190504
4065A1190504m58086n25027l23255k43815l08589k32799l81527l24518k90430
4056H102458k13726k67290l28049j58051k15475k28284j43558k25902j78965l01833
4046E841325k71309p276j83124j92553j22579K6748j96983j21236k4145j88803
4036D560065m4861j36441o6322L6953j73059j88271k4303J32262m8900j42975
4026C904148j04425j676n4915r8149r4579P4164O7783R18q0232M2408L8839j19283
4014C575001n0008J831j97292o4092m7953J6502k14395j19934Q8329M8871Q4966
4003C121826j53966n3287r1471R32J1318m7630L4204o257r4574M790R913k07014
3991B528784j73505Q6586j73506O8181J50464l7995j05832p1611R384J910Q711
$$ plain form
4065 11190504 10732418 10207391 9884136 9640321 9331732 9098933 8717406 8392888 8102458
4056 8102458 7888732 7621442 7293393 7135342 6919867 6691583 6548025 6322123 6143158 5841325
4046 5841325 5570016 5562740 5379616 5187063 5064484 5091232 4894249 4773013 4748868 4560065
4036 4560065 4515204 4378763 4312441 4349394 4176335 3988064 3963761 4096023 4047123 3904148
4026 3904148 3799723 3798047 3743132 3644983 3550404 3624568 3692351 3693269 3613037 3655445 3694284 3575001
4014 3575001 3524993 3526824 3329532 3265440 3217487 3233989 3019594 2899660 2987989 3036860 3121826
4003 3121826 2967860 2914573 2823102 2824034 2835352 2787722 2821926 2815669 2721095 2725885 2735798 2528784
3991 2528784 2355279 2441865 2268359 2336540 2487004 2449009 2343177 2271566 2280950 2282860 2291571
3980B291571j40553M1114K1707j47112M4159K0118L6387r3584p9037P3145L5794
3969B103709j98608j03404N930N3378j391O700p7764l4944j1356j5891o2635O3064
3957A726788j2303m3961j20163J9182N1651n9827J7154N7213M492j46662l4964
3946A458600O7816k5255j1611j8326N7850n0347o2561k6936K5013N8872K3141
3935A496256p6729j05602R6288j24460L5050K5570J5729J0829M1137n9907j06192
3924A247969k4556J0315p9237Q8380J57137q4364M78N1295j18523j75982J18793
3913A191705n930l0917N5851J13830j0091m8343r9239l1046O4005j4953J1269
3902A196141J05183N701q4421J85234J8819q3431l2493K8046J23837m2765l4410
$$ plain form
3980 2291571 2151018 2192132 2213839 2066727 2110886 2131004 2167391 2073807 1994770 2067915 2103709
3969 2103709 1905101 1801697 1807627 1861005 1859614 1866314 1788550 1753606 1742250 1726359 1663724 1726788
3957 1726788 1714485 1670524 1550361 1569543 1621194 1561367 1578521 1635734 1640226 1493564 1458600
3946 1458600 1526416 1501161 1489550 1471224 1529074 1478727 1416166 1389230 1414243 1473115 1496256
3935 1496256 1419527 1313925 1410213 1285753 1320803 1346373 1362102 1372931 1414068 1354161 1247969
3924 1247969 1223413 1233728 1154491 1242871 1400008 1315644 1316122 1367417 1248894 1072912 1191705
3913 1191705 1185775 1154858 1210709 1324539 1314448 1266105 1166866 1135820 1199825 1184872 1196141
3902 1196141 1301324 1307025 1222604 1407838 1426657 1343226 1310733 1338779 1462616 1419851 1385441
3891A385441m1565p2553J0032M0522j5231k9031K6377j04174O9381P927J9429
3880A296555J0160P906N5688M2602j35577J18384m9782P453j13113p6541J33780
3869A297515J71561L3542O2416j22770j21094P8767N2472j3550P3983o7950m0009
3858A404883K0296K3511p7994j13981J01259n945o4190p1655M6118L7793l4414
3847A265681j7928J31732q8867l4348o213P0751L4907P330M2929n692k9152o4253
3835A306877j5351j6808o9382L0662R6494Q2740k7235n2046q0603k738L0816J64971
3823A448397j6135j8578P4227K0540n4147k1934o2495M6642K784o6522J19966
3812A472745Q7964j47830K5453Q1014J7469m7157R5696K8075O2918O9738J01363
$$ plain form
3891 1385441 1343876 1271323 1281355 1321877 1306646 1277615 1303992 1199818 1269199 1277126 1296555
3880 1296555 1306715 1314621 1370309 1412911 1277334 1395718 1345936 1353389 1240276 1163735 1297515
3869 1297515 1469076 1502618 1565034 1442264 1321170 1399937 1452409 1438859 1512842 1444892 1404883
3858 1404883 1425179 1448690 1370696 1256715 1357974 1352029 1287839 1216184 1262302 1300095 1265681
3847 1265681 1247753 1379485 1290618 1256270 1250057 1320808 1355715 1363045 1405974 1400282 1371130 1306877
3835 1306877 1291526 1274718 1205336 1235998 1332492 1415232 1387997 1335951 1255348 1252610 1283426 1448397
3823 1448397 1432262 1413684 1487911 1508451 1454304 1432370 1369875 1416517 1419301 1352779 1472745
3812 1472745 1560709 1412879 1438332 1519346 1536815 1489658 1585354 1613429 1676347 1746085 1847448
3801A847448J46935J26290K04307O3255J22748l1192P6608q4564r4662J03140
3791B480313j07623j24465j14189j37064P3423J4471o1541j05726J5428J0005
3781A943032q4474N9552n4420n0881P0899J11345j39954k5194N7003j17050J7029
3770A786887N1804N1828n7856N1811M590P2346Q2266q7528J41357N4054j668j48106
3758B001785J3146J32817P7584O7514M2665j3449m6248J31304J01146J41590l5543
3747B614311J13217J40547J03807q0540K13818J55457O0954O0897L5825J29375
3737C547668L1875J82737K89577J99636J56381J59939J87050K39091J80472J86998
3727E361424L25423J84874K94299M08253K87514K81686L07367K31212L70247M48418
$$ plain form
3801 1847448 1994383 2120673 2324980 2388235 2510983 2479791 2556399 2471835 2377173 2480313
3791 2480313 2372690 2248225 2134036 1996972 2070395 2084866 2023325 1917599 1933027 1943032
3781 1943032 1858558 1918110 1863690 1812809 1883708 1995053 1855099 1829905 1886908 1769858 1786887
3770 1786887 1838691 1890519 1832663 1884474 1889064 1961410 2043676 1956148 2097505 2151559 2149891 2001785
3758 2001785 2014931 2147748 2225332 2292846 2335511 2322062 2275814 2407118 2508264 2649854 2614311
3747 2614311 2727528 2868075 2971882 2891342 3105160 3260617 3321571 3382468 3418293 3547668
3737 3547668 3579543 3762280 4051857 4251493 4407874 4567813 4754863 4993954 5174426 5361424
3727 5361424 5686847 5871721 6166020 6574273 6861787 7143473 7450840 7682052 8052299 8500717
3717H500717L05823L74365M18325N09729M10860L69048N23897M22722L82898M71100
3707A2689484M55845M13080M59932M89304M40878N62723L31507M11289M33621
3698A6687663L04434K06395L86556L00059K45868J62259L57306J97102P0193J43844
3688A9061679J17062k2391J36107q015j68829j04677j12773j52319j66409j09624
3678A8469811k39842k64010j40928l29965m51116l02672l67523k91757m53634
3669A5628364l66514l95111l78172l87492n42240k95808k91882m33772k79812
3660A2257561m63991l60899l60658j64923l30549m37271k39463k16569k71844
3651I411394m03307j99487j90207q0774j78734l30799j57220j12845j18438p2193
$$ plain form
3717 8500717 8806540 9180905 9599230 10108959 10519819 10888867 11412764 11835486 12218384 12689484
3707 12689484 13145329 13558409 14018341 14507645 14948523 15511246 15842753 16254042 16687663
3698 16687663 16992097 17198492 17585048 17885107 18130975 18293234 18650540 18847642 18917835 19061679
3688 19061679 19178741 19156350 19292457 19284442 19115613 19010936 18898163 18745844 18579435 18469811
3678 18469811 18229969 17965959 17825031 17495066 17043950 16741278 16373755 16081998 15628364
3669 15628364 15261850 14866739 14488567 14101075 13558835 13263027 12971145 12537373 12257561
3660 12257561 11793570 11432671 11072013 10907090 10576541 10139270 9899807 9683238 9411394
3651 9411394 9008087 8808600 8618393 8537619 8358885 8028086 7870866 7758021 7639583 7567390
3641G567390j66344j34049j24492j92603j76582p6931o5121q6421k6981N0684
3631F568550j24390q9778m2131K6745J8354j26028n8039j01986q576L7114j08722
3620E991113j22922j3823j53926j79954j82693L2253j14414j4230p6198m8355
3610E116851m6002j73430n5394l2738o1278j9098k2348m1082k53383j55062J4023
3599D271059n7100j43110k62797n9119J31033l5226m7437j72951M172L0319k16216
3588C442627j55585M5561l8660j53067J06664j35450j95321m6328K9054N542k7123
3577B877914q3165J0355j6738M639Nj95135o5518N2893Q0012j34449j6537m2387
3565B471889q3160k453p7181r1743J0471J68089p3006j1214m0044M0461M7835
$$ plain form
3641 7567390 7401046 7266997 7142505 6949902 6773320 6696389 6631268 6544847 6517866 6568550
3631 6568550 6444160 6354382 6312251 6338996 6357350 6231322 6173283 6071297 6062721 6099835 5991113
3620 5991113 5868191 5854368 5700442 5520488 5337795 5370048 5255634 5241404 5165206 5116851
3610 5116851 5070849 4897419 4842025 4809287 4748009 4728911 4706563 4665481 4412098 4257036 4271059
3599 4271059 4213959 4070849 3808052 3748933 3879966 3844740 3797303 3624352 3628524 3658843 3442627
3588 3442627 3287042 3332603 3293943 3140876 3247540 3112090 2916769 2870441 2899495 2905037 2877914
3577 2877914 2794749 2805104 2788366 2793005 2793010 2597875 2532357 2585250 2665262 2530813 2514276 2471889
3565 2471889 2388729 2386276 2309095 2217352 2227823 2395912 2322906 2311692 2271648 2312109 2359944
3554B359944q2479j29875N958n6098P0548l8851o6021n3044p4029M5012N5689
3543B036754O7459j53168m9411m3516l2976L5476k7219L0161j16950j1391j2097
3532A723122J42O8647o2429m2507O6553L7261j56793j6335Q0493P323k4165O2479
3520A743791R8098j01304m1802J3696J09585l1695j2051k4048m2345J8909N644
3509A736478J5536L1583R5842K6598r2839j48761n3629M5216Q1740k926n0347
3498A684491L7911L9645n2184R7999J24900p3404j11465j50044j5732N8696K0280
3487A661093n440Q024r987O5598Q666k2170j8382q11m7351L5026p3319M9175l1716
3474A618406n6214J67152n7011k0102K7332J0922j31590k5750P0874Q6168J7983
$$ plain form
3554 2359944 2277465 2147590 2153548 2097450 2167998 2129147 2063126 2010082 1936053 1981065 2036754
3543 2036754 2104213 1951045 1901634 1858118 1825142 1860618 1833399 1863560 1746610 1735219 1723122
3532 1723122 1723264 1791911 1729482 1686975 1753528 1790789 1633996 1617661 1698154 1705477 1681312 1743791
3520 1743791 1841889 1740585 1698783 1712479 1822064 1790369 1778318 1754270 1711925 1730834 1736478
3509 1736478 1752014 1783597 1879439 1906037 1813198 1664437 1610808 1656024 1737764 1734838 1684491
3498 1684491 1722402 1762047 1709863 1807862 1932762 1859358 1747893 1597849 1582117 1640813 1661093
3487 1661093 1655653 1663677 1653690 1719288 1727954 1705784 1687402 1686591 1639240 1674266 1600947 1650122 1618406
3474 1618406 1562192 1729344 1672333 1652231 1679563 1690485 1558895 1533145 1604019 1690187 1708170
3463A708170m738P902q6787j870J12673K3815m0300j6248m5010L6010N2991j0383
3451A736225L2501q1919J06883O9839R2282J62551L262j04924Q9160j02077j13895
3440A889888J20550m2626O6595N525O4032R4140K7153O5520p005Q9290k8650m7662
3428B296750m1496J82040O7778N0406j03319m9168J53501K9248n783J02264n184
3417B677037q783J7269j7766k08N0008Q1445K18223j11377J22208J21349q2416
3406C066989J98930J50657q8023R2008J17417L5504K19010Q7948K08423K8068
3396D116931P4212J89504J99814J34773J47712J95850J40507J29344J16691J59616
3386E604954J71389O0541J36017K04388J05454R1888L17031K31740J02925J97567
$$ plain form
3463 1708170 1703432 1711334 1624547 1622677 1735350 1759165 1718865 1702617 1657607 1693617 1746608 1736225
3451 1736225 1768726 1686807 1793690 1863529 1955811 2118362 2121624 2016700 2105860 2003783 1889888
3440 1889888 2010438 1967812 2034407 2039932 2103964 2198104 2225257 2290777 2283772 2373062 2344412 2296750
3428 2296750 2255254 2437294 2505072 2555478 2452159 2402991 2556492 2585740 2579957 2682221 2677037
3417 2677037 2668254 2685523 2667757 2667549 2717557 2799002 3017225 2905848 3028056 3149405 3066989
3406 3066989 3265919 3416576 3328553 3420561 3537978 3573482 3792492 3880440 4088863 4116931
3396 4116931 4191143 4380647 4580461 4715234 4862946 5058796 5199303 5328647 5445338 5604954
3386 5604954 5776343 5836884 5972901 6177289 6282743 6374631 6691662 6923402 7026327 7223894
3376G223894K21779R211J50653Q2934J969J11884M7623K8463J29382P1820K22633
3365H302245m4312k2120J03759J06624J52405Q1598J04689P9546P2177J55014
3355I091625J43363J27690J69517J34575K35397K68453J60089K43528L29011L54937
3345A1258185L30986L55218L64612M64566L23761N62856N65488O38905O89222
3336A5553799O91488P03916O71507P29290P23281P12738P27468Q79855P48545
3327B2141887R31854P95895Q15399O97437Q42143Q12170P26121P85834P72048
3318B9320788P79503P38159P63221P27595O98272P22779N33793O87829O95083
3309C5667022O34419N99370N50112O18030N31663M72543O10399N72525M77409
$$ plain form
3376 7223894 7445673 7454884 7605537 7688471 7690440 7802324 7849947 7878410 8007792 8079612 8302245
3365 8302245 8257933 8235813 8339572 8446196 8598601 8680199 8784888 8864434 8936611 9091625
3355 9091625 9234988 9362678 9532195 9666770 9902167 10170620 10330709 10574237 10903248 11258185
3345 11258185 11589171 11944389 12309001 12773567 13097328 13660184 14225672 14864577 15553799
3336 15553799 16245287 16949203 17620710 18350000 19073281 19786019 20513487 21393342 22141887
3327 22141887 23073741 23869636 24685035 25382472 26224615 27036785 27762906 28548740 29320788
3318 29320788 30100291 30838450 31601671 32329266 33027538 33750317 34284110 34971939 35667022
3309 35667022 36301441 36900811 37450923 38068953 38600616 39073159 39683558 40256083 40733492
3300D0733492O44615M75104O28249O67025O38163P14595O70352P21449Q78374
3291D6771418P63472P37137Q08041R58007J180856R93944J106236J183322J244411
3282E5746844J185208R59372Q45359Q32444P50815N60548K55737R8319m0099k66244
3272F0928303l29071l46320n02257p69167p10185p92877j059854j169270j339853
3263E3909449j453247j506093j800916j718815j881822j955900j877093j755002
3255C9960561j689869j748798j748872j584244j440770j534944j317756j130958
3247B7764350j214936j050745r34747j047871q73803p03220o57689q87224p35925
3238A9658190n16711m96135m79000n91924o45546n75602n37967l87117m35357
$$ plain form
3300 40733492 41378107 41853211 42481460 43148485 43786648 44501243 45171595 45893044 46771418
3291 46771418 47534890 48272027 49080068 50038075 51218931 52212875 53319111 54502433 55746844
3282 55746844 56932052 57891424 58736783 59569227 60320042 60880590 61136327 61234646 61194547 60928303
3272 60928303 60599232 60252912 59750655 58981488 58271303 57478426 56418572 55249302 53909449
3263 53909449 52456202 50950109 49149193 47430378 45548556 43592656 41715563 39960561
3255 39960561 38270692 36521894 34773022 33188778 31748008 30213064 28895308 27764350
3247 27764350 26549414 25498669 24563922 23516051 22642248 21939028 21281339 20394115 19658190
3238 19658190 19141479 18645344 18166344 17574420 16928874 16353272 15815305 15428188 14992831
3229A4992831m71581l76900l96810m85454n09147l77216k64443l68057l48021
3220A1395202k93447m25140l02524j17158m01965k72883j87786l48265k74680
3211H771354j82445j82198k84305k25369j67790k66222j35124j20019j53463k47278
3201F807141j38371r6606j07950r6378k89894k42987j29594l3753o0842l3059
3191E577707k11162j14993j07649o9664j35642r5332j54926j73912p2377j05648
3181D336402q7002j40762j67944M7368k0873j62913L3876M2487k7943L6473j86475
3170C702694j90285r696l6052o1829l9511p8392j24432r818L8581n6479J1166
3159C145947q9828o5662j4203j25563k7597m7026p6781k2660j06065q8755j5804
$$ plain form
3229 14992831 14521250 14144350 13747540 13262086 12752939 12375723 12111280 11743223 11395202
3220 11395202 11101755 10676615 10374091 10256933 9854968 9582085 9394299 9046034 8771354
3211 8771354 8588909 8406711 8122406 7897037 7729247 7463025 7327901 7207882 7054419 6807141
3201 6807141 6668770 6572164 6464214 6367836 6077942 5834955 5705361 5671608 5610766 5577707
3191 5577707 5366545 5251552 5143903 5074239 4938597 4843265 4688339 4514427 4442050 4336402
3181 4336402 4249400 4108638 3940694 3988062 3967189 3804276 3838152 3880639 3852696 3889169 3702694
3170 3702694 3512409 3502713 3466661 3404832 3365321 3286929 3162497 3152679 3191260 3134781 3145947
3159 3145947 3056119 2990457 2976254 2850691 2823094 2776068 2699287 2676627 2570562 2481807 2466003
3148B466003q8109J30003J7293n8189J02066L0819j34449j11161q4950M4209Q6136
3137B399671K4264m110p6178j8198N9987o887j23840m5492r7707q1618R5715q4467
3125B041140q1095j0288R946j0235Q0730o1114m3536Q4583j91449Q9524J6780
3114A924986q5829J79627m5640M9810p3119k21540n8184K6370J50944K4185j66621
3103A704989k2910R4991J0639l2474p1720l2206m8739l3818L1997L5646N8443
3092A694838r759j8278O2285p9694p2820O4623m4489r8575m231k4696O1096N7486
3080A587786L5492o8235n4136r1219o9527J27886m6930J1986m6030j07476l1860
3069A247737J48383J5468L7771P845N4394N5089j1110J8857j42748L108J1253
$$ plain form
3148 2466003 2377894 2507897 2525190 2467001 2569067 2599886 2465437 2354276 2269326 2313535 2399671
3137 2399671 2423935 2419825 2343647 2325449 2385436 2378549 2254709 2209217 2111510 2029892 2125607 2041140
3125 2041140 1960045 1949757 1959703 1949468 2030198 1969084 1925548 2010131 1818682 1908206 1924986
3114 1924986 1839157 2018784 1973144 2022954 1949835 1728295 1670111 1696481 1847425 1871610 1704989
3103 1704989 1682079 1777070 1787709 1755235 1683515 1651309 1602570 1568752 1600749 1636395 1694838
3092 1694838 1685079 1666801 1729086 1649392 1576572 1641195 1596706 1498131 1493900 1469204 1530300 1587786
3080 1587786 1623278 1555043 1500907 1409688 1340161 1468047 1421117 1433103 1387073 1279597 1247737
3069 1247737 1396120 1411588 1449359 1457204 1511598 1566687 1555577 1574434 1431686 1434794 1446047
3058A446047L3946J8939j18475j5571M9844N4803L5283j211n1067n3492R1424
3047A490470r2099k5069J1688R2731m0343Q0998M4296n3754o0674J6403J49198
3036A613845N807l193p6220o6129J18224m7345J8406J50466J57636J1592J12445
3025A995534J0372n4419N0442n3572m0828J31411L1085r5898R6167O1732l9078
3014B092948p3055K0401O9755L1391n2224O7938j47702k62339L9812K7803R3258
3003A907986P13j84643J21467L7345p6364p834n9036j9333J26115q2524r5320
2992A668572P8021R7648j6851q53J1244j45443p6230R2951j14621L3556j2829
2981A615165j29303P3020k1879Q3833j1492q4405o0648n8824P0026J7841p2130
$$ plain form
3058 1446047 1479993 1498932 1380457 1364886 1414730 1469533 1504816 1503605 1452538 1399046 1490470
3047 1490470 1398371 1373302 1384990 1477721 1437378 1518376 1562672 1508918 1448244 1464647 1613845
3036 1613845 1619652 1616459 1540239 1474110 1592334 1544989 1563395 1713861 1871497 1883089 1995534
3025 1995534 2005906 1951487 2001929 1948357 1907529 2038940 2070025 1974127 2070294 2132026 2092948
3014 2092948 2019893 2040294 2110049 2141440 2089216 2157154 2009452 1747113 1786925 1814728 1907986
3003 1907986 1908699 1724056 1845523 1882868 1806504 1798670 1739634 1720301 1846416 1763892 1668572
2992 1668572 1746593 1844241 1827390 1826537 1837781 1692338 1616108 1709059 1594438 1627994 1615165
2981 1615165 1485862 1558882 1537003 1620836 1609344 1524939 1464291 1405467 1475493 1493334 1421204
2970A421204m4731l7434N1140J27247n9666L2899p8281m2894N8449p9710o5858
2959A282365k3212Q9831J8679k5606o3984P588J2140O0811o3155m2450m6700J05997
2947A312304J94774L0896r2061j25640J83325M4966O569j45508k4067J36014J163
2936A522735m0p4350p6240L0668L9137j50575q8418J00565j5963j1020J352j2586
2924A265265J0000j22852O3165o8767j084l0566n7701J78275n262o1261m0238
2913A128974k0875J23826J85807r1930N224n7540L4209k11510m5976P640m8460
2902A009389k3285O0376N5319M420O1256j00241r2685L1890M4188p989l8400m2654
2890I61584J235o56R3449k9934J1589m3800m8154J6866o5864j46714L8769J46606
$$ plain form
2970 1421204 1376473 1339039 1390179 1517426 1457760 1490659 1412378 1369484 1427933 1348223 1282365
2959 1282365 1259153 1348984 1367663 1342057 1278073 1285661 1297801 1358612 1295457 1253007 1206307 1312304
2947 1312304 1507078 1537974 1445913 1320273 1503598 1548564 1555133 1409625 1385558 1521572 1522735
2936 1522735 1522695 1448345 1372105 1402773 1441910 1291335 1202917 1303482 1287519 1276499 1277851 1265265
2924 1265265 1275265 1152413 1215578 1146811 1145727 1115161 1057460 1235735 1230473 1169212 1128974
2913 1128974 1108099 1231925 1417732 1325802 1331026 1273486 1307695 1096185 1050209 1057849 1009389
2902 1009389 986104 1046480 1101799 1106219 1167475 1067234 974549 1006439 1050627 1042638 1004238 961584
2890 961584 962819 962163 1055612 1025678 1037267 993467 945313 962179 896315 749601 788370 934976
2878I34976N7339j64577O3227p618j47618j9725J19306L203p0478L8278p19j06193
2866F99401J40843j9454n2860J43084n7664l690O3913l5565N573L0311j6062m6590
2854H51240n0827m8594k3359p8182m4373K2171j00755J2551J55378R3525P6562
2843H65337m2303k13510j0008j9412P3647k5245l1781l1559j08315O5200J77433
2832F99484J04924j45342n0382j02863R1486j8924j04127J13306P1435p5738P5323
2821F58582j08913j25533K0832J53061M804p3088R5094p6004K5463J5570n2124
2810E37744J47907J23697p9332l0656l4644n477J7239l4561N95R3700R4580n1527
2798G79265M3177j8122m1774o6831K4043K1440J06975J11056M5055O744j2552
$$ plain form
2878 934976 992315 827738 890965 883347 735729 716004 835310 838513 768035 806313 805594 699401
2866 699401 840244 820790 767930 911014 853350 849660 913573 878008 883581 913892 897830 851240
2854 851240 800413 751819 728460 650278 605905 628076 527321 539872 695250 788775 865337
2843 865337 823034 609524 599516 580104 653751 628506 596725 565166 456851 522051 699484
2832 699484 804408 659066 608684 505821 597307 578383 474256 587562 658997 583259 658582
2821 658582 549669 424136 444968 598029 602833 529745 624839 548835 574298 589868 537744
2810 537744 685651 809348 730016 699360 664716 659239 676478 641917 642512 736212 830792 779265
2798 779265 822442 804320 762546 695715 719758 741198 848173 959229 1004284 1011028 998476
2787I98476M1990M8067J28846O3122J71811K94434R5884k35857k7771K95611M3841
2776A918454j11507p6224o1433o870j18178n6032J2871o6370n4057R3679r5246
2765A379087P702J034k0589j27401n2101J2689Q1754J42875J94271O6498p8415
2754A607404J04603J37567P0753J26286r6807j80803j42420m3561j31203j40946
2744A310873n8649J0424j34689q7300k4997r9166j2564M3115n0587P8959n3872
2733I21547j07503L7673l3600l3565q1596J8563p7305K2831J98665j55486l6933
2722F73291R6585k8958m7411m2424n5981J704J18002J10885l3915o1871O3970
2711G93877l6448J4201M9588N2297j05004m9594m1912m881j3397r1693M8280J3308
$$ plain form
2787 998476 1040466 1088533 1217379 1280501 1452312 1746746 1842630 1606773 1579002 1874613 1918454
2776 1918454 1806947 1730723 1669290 1662420 1544242 1488210 1501081 1434711 1380654 1474333 1379087
2765 1379087 1386789 1387823 1367234 1239833 1187732 1200421 1282175 1425050 1619321 1685819 1607404
2754 1607404 1712007 1849574 1920327 2046613 1949806 1769003 1626583 1583022 1451819 1310873
2744 1310873 1252224 1262648 1127959 1040659 1015662 916496 903932 947047 896460 975419 921547
2733 921547 814044 851717 818117 784552 702956 721519 644214 667045 865710 710224 673291
2722 673291 769876 740918 693507 651083 595102 596806 714808 825693 791778 729907 793877
2711 793877 757429 771630 821218 873515 768511 718917 677005 672124 658727 567034 615314 628622
2699F28622O5161J94449l2547L0419P2053p9985m356o6049J46126Q0526q7176
2688I47243m9023j10005J18338L7695J6891l3808q3620O2031M6238J8827j47827
2677H22980j04848J67240j9969q8782R9914N1107N4842K5220K5670P9067M858
2666A117299j01782k0736M9520n2319j65475N7082O2998j24501q8426o9083P3732
2655G38309j7212J56504p8623K06N4526k75J24583J8371j58316n9323n7970J4969
2643G35749j6327J02844q6733r044n86O144o1192l2033O481j30832O1654R0174
2631F66299j42540J5027K8229Q3780J12620o7316m3967L2295J7370j56432j8883
2620E26482k2894N317L7336o6582O9896J04244l154M9092o7476M1139j27900p9699
$$ plain form
2699 628622 693783 888232 855685 886104 958157 878172 873816 807767 953893 1034419 947243
2688 947243 898220 788215 906553 944248 961139 927331 843711 905742 951980 970807 822980
2677 822980 718132 885372 865403 776621 876535 927642 982484 1007704 1033374 1112441 1117299
2666 1117299 1015517 994781 1044301 991982 826507 883589 946587 822086 733660 664577 738309
2655 738309 721097 877601 798978 799184 853710 853435 978018 996389 838073 778750 720780 735749
2643 735749 719422 822266 735533 726489 725903 732047 670855 638822 645303 514471 576125 666299
2631 666299 523759 538786 567015 650795 763415 696099 652132 684427 701797 545365 526482
2620 526482 503588 508905 546241 479659 549555 653799 650645 699737 632261 673400 545500 465801
2608D65801k4728m148M4993J20612J6296k5041L2040m3461o0123l9946m7361R0498
2596E25432r2087j34273m9355J16714l7710j48446J95529J73603k11765j05303
2586B32339J35133N6869l2474q5603k2274J15665l2352o2376l5881n3267o9083
2575A46696P5271Q8416j22321m6179l4708Q988J03833R6718K0019m0260m784o3765
2563B27924P7259P3753o6738Q0681K8053k21309j8648P6782m2397l9555P639P6867
2551B60311J24723j34506O0100J3111j25868M0605l2776J1662N9918M8778K3175
2540C49233j62256j00017N9674L6294n695r0997q230m778O7964L5687j08051m5169
2528B3659Q1020J00776Q137j1762L3136K314j8179r18j43785p8105K6024O4435
$$ plain form
2608 465801 441073 436925 481918 602530 618826 593785 625825 582364 522241 482295 434934 525432
2596 525432 433345 299072 249717 366431 328721 180275 375804 549407 337642 232339
2586 232339 367472 424341 391867 306264 283990 399655 367303 304927 269046 215779 146696
2575 146696 221967 310383 188062 141883 107175 116163 219996 316714 336733 296473 291689 227924
2563 227924 305183 378936 312198 392879 420932 199623 180975 257757 215360 175805 183444 260311
2551 260311 385034 250528 310628 323739 197871 238476 205700 217362 277280 326058 349233
2540 349233 186977 86960 146634 182928 177233 86236 78006 73228 141192 176879 68828 23659
2528 23659 104679 205455 213592 201830 234966 237280 219101 218183 74398 -3707 22317 86752
2516H6752J04815m4146K3948r3946L5804M8636N1365j43539P5145p837j9871K9006
2504A46132j2706q1866J05684J94252q0165k03135P200Q891o100M9912j4130J15811
2492B29780N9050j01377j4849l1776k5612o7026K8419Q7531j74349P758r7023
2481i9474L9049J12563J77051Q3667r1463l2841J9049r8351j1199L6413l03n9752
2469G4409j8880O5288O4313K8985p8589n9495J46251q1348n4784O0329j1144n5838
2457G9497R21j4396J8836k92l8033N7687P0734j09155j11014P1418N2737k0861
2445E8079M6356l6233K300N8320o0225P1081j62898J3069R8954L4893O516j89528
2433e9316M7407N7208J08045O28q6204J4518Q8513J22990m0197J0624q1120J949
$$ plain form
2516 86752 191567 147421 171369 77423 113227 161863 213228 69689 144834 136997 117126 146132
2504 146132 133426 51560 157244 351496 271331 68196 75396 84287 78187 128099 113969 229780
2492 229780 288830 187453 172604 140828 115216 48190 76609 164140 -10209 -2451 -99474
2481 -99474 -60425 52138 229189 312856 221393 188552 207601 109250 98051 134464 134161 74409
2469 74409 55529 120817 185130 214115 135526 76031 222282 140934 86150 146479 135335 79497
2457 79497 80418 66022 84858 84566 46533 104220 174954 65799 -45215 26203 78940 58079
2445 58079 104435 68202 70502 128822 68597 139678 -23220 -10151 88803 123696 130212 -59316
2433 -59316 -11909 45299 153344 153972 67768 82286 170799 293789 253592 264216 183096 185045
2421A85045j7041o543p8668N8087j0931n7780K0715m540M4161K3845o1267J1979
2409A07062N3234P3523l8596j5139l3906L0797m5181o2822m115O9441j2016o3255
2397E9027L6794L3703M1579K9409o8116q0229J7763K0145L7896k4164N0182m3798
2385A10191M0043q6409P957l8490j21701J04661J2603n4330Q1591O0968k8740
2374H8344j33971K1675R1323K717m4450L3277L3801j6154m6536l0761l5953j42292
2362a78980N3745J44176J7045J20543q9970L1147j5359O7435N487r9002m6938
2351I329N3750j26363O53J18240j21909L6914l0486P0973n2265m308R0413q882
2339C6059m1662J02687l7867j69152K1659K03308k0526O225j25835R6795O7663
$$ plain form
2421 185045 168004 161461 82793 140880 129949 72169 92884 88344 132505 156350 95083 107062
2409 107062 160296 233819 195223 180084 146178 176975 131794 68972 64857 134298 122282 59027
2397 59027 95821 129524 171103 200512 132396 52167 69930 90075 127971 103807 153989 110191
2385 110191 150234 63825 71782 33292 -88409 16252 28855 -25475 56116 117084 88344
2374 88344 -45627 -23952 67371 70088 25638 58915 92716 76562 30026 -735 -36688 -178980
2362 -178980 -125235 18941 35986 156529 66559 97706 82347 149782 155269 56267 9329
2351 9329 63079 -63284 -62631 55609 -66300 -29386 -59872 11101 -41164 -45472 44941 36059
2339 36059 -5603 97084 59217 -109935 -88276 115032 94506 100731 -25104 71691 139354
2328A39354M8008j43972R1747N220q4832L5989J8346L0949k8033L5770M1369k1339
2316A68576j01960j5365Q4088L7275p3296J0501k03333K6988J0574M3991J7789
2305E828q9527J9764o3549J18656J57485j04865L8457Q04k0861j14061K0302l7420
2293f8987q3197J48857N5120P262R8030L193l0740j03582M1105Q0096j06789N518
2281D5886J13691J5666j27078j9042m7981Q0930Q8906j06690n2057j20389O8430
2270e9728n2p993l6424J7242Q1059p2575J2903k5476J163Q3957n3176M809P4382
2257B0091O0930p7488O5583M1213p0063k8131J1600N9924Q1712q5854o3442j53698
2245a37623O5000L4589J89576j29335q6820k1454o7917M7811m3387K9667J09455
$$ plain form
2328 139354 187362 43390 135137 140357 55525 91514 109860 140809 112776 148546 189915 168576
2316 168576 66616 51251 135339 172614 99318 109819 -93514 -66526 -55952 -11961 5828
2305 5828 -83699 -63935 -127484 -8828 148657 43792 82249 83053 62192 -51869 -31567 -68987
2293 -68987 -152184 -3327 51793 59055 157085 160278 129538 25956 67061 147157 40368 45886
2281 45886 159577 175243 48165 29123 -18858 62072 150978 44288 -7769 -128158 -59728
2270 -59728 -59780 -67773 -104197 -86955 -5896 -78471 -65568 -91044 -89881 -5924 -59100 -54291 20091
2257 20091 81021 3533 69116 110329 40266 12135 23735 83659 165371 79517 16075 -137623
2245 -137623 -72623 -38034 151542 22207 -64613 -86067 -153984 -106173 -149560 -119893 -10438
2234a0438J35857j48358M9354J5214q5042Q3254R7843k27410M4419q617J5549
2223c8375P1492J78766q7566m2905m2334r4625l1784Q5575l5904N8193l3047q2430
2211i4944l102M2468N1841m1737O3303p8555N4575J01908r0247k5161O5869k2514
2199B3704K7232O6800l0352M5559R395j5583j15634j4604nm2971o0651k5317K3025
2186a09402J06800P749l8777J08429K6058k7550N8485k9099r1856o261k8261p1873
2174i5558N515J00588J01191n8900K1878p46P4556n0060l4070j6293o8494K0186
2162b07p9133O0904K0833p028q2250P5977Q196J5005J72508j40855j07121P7265
2150A4094P2274k1360j8302J27213p3201m5442J6234m5739k995K6596l1109m5118
$$ plain form
2234 -10438 125419 -22939 26415 41629 -43413 39841 137684 -89726 -45307 -53924 -38375
2223 -38375 33117 211883 124317 81412 39078 -55547 -87331 -1756 -37660 20533 -12514 -94944
2211 -94944 -98046 -55578 -3737 -45474 17829 -60726 -6151 95757 5510 -19651 46218 23704
2199 23704 50936 117736 87384 132943 142338 126755 11121 -3483 -3488 -46459 -107110 -132427 -109402
2186 -109402 -2602 5147 -33630 74799 100857 73307 131792 102693 10837 4576 -23685 -95558
2174 -95558 -90043 10545 111736 52836 74714 73968 148524 98464 64394 48101 -20393 -207
2162 -207 -79340 -18436 2397 -4631 -86881 -10904 -2708 12297 184805 43950 -63171 14094
2150 14094 86368 65008 46706 173919 100718 55276 71510 25771 22776 49372 18263 -26855
2138b6855K1071j54m1133J0058O8152o3628J663L5424M3526M0702m5395Q2916
2126A26347o3284K8412J2305q4912M1881m423j6502l2407j00680O7081P2368R5082
2114A41268o4465O6816n2028K3405j76416m6588L9673K3689L8752N4888M9696
2103I8690m9779o9884M4840K3336p3688o0686l646K0603j6067P9739M0408l7229
2091c363j07811P2908P1217r9770K6822J16777l396j42339q4741M8636J58068
2080E3008J3872j05963J41251k2579j41846k8083L1701q8311l626J00362J6961
2069c3253k7615O7608p7257j1031J95360k6373J9495R5019j03999N1794K6155
2058A75903j26784J5655j0474K9142M6072j01501O4873q7450L8956j17736r2512
$$ plain form
2138 -26855 -5784 -5938 -47071 -37013 31139 -32489 -30826 4598 48124 88826 43431 126347
2126 126347 63063 91475 103780 18868 60749 56326 39824 7417 -93263 -26182 46186 141268
2114 141268 76803 143619 91591 114996 -61420 -108008 -68335 -44646 -5894 48994 98690
2103 98690 48911 -20973 23867 47203 -26485 -87171 -90817 -70214 -86281 -6542 33866 -3363
2091 -3363 -111174 -38266 32951 -66819 -39997 76780 73384 -68955 -153696 -105060 53008
2080 53008 66880 -39083 102168 79589 -62257 -90340 -58639 -146950 -150576 -50214 -33253
2069 -33253 -60868 6740 -70517 -81548 113812 87439 106934 201953 97954 149748 175903
2058 175903 49119 64774 54300 83442 129514 28013 92886 5436 44392 -73344 -165856
2047a65856p3063M8650J58609k8634N4231j37j1424m6533N168J60073r9069o9317
2035f7302M8242j01971J30573J8141k674L7242j09726o488P8015k2516j4228N3608
2023D0916K6466q0817k0639R1484j4217P1345q6434n4432R8487j2049j31028P7240
2011F322O9656n3344N0233k3073J28951l9818k64843o2466J13176P4577q2976
2000h3605m2570P8193N072l5588M4218Q4792R30j735l7096l1658J5365J7009m5131
1987c1804N6871J7591N8459m4341r3932j05753J0530P6778Q7739l3648j41823
$$ plain form
2047 -165856 -238919 -190269 -31660 -60294 -6063 -6200 -17624 -64157 -58989 101084 2015 -67302
2035 -67302 -19060 -121031 9542 27683 25009 62251 -47475 -53963 24052 1536 -12692 40916
2023 40916 67382 -13435 -34074 57410 43193 114538 28104 -26328 72159 60110 -70918 6322
2011 6322 75978 22634 72867 49794 178745 138927 -125916 -188382 -75206 -629 -83605
2000 -83605 -126175 -47982 -42910 -78498 -34280 50512 51442 49707 12611 -19047 -3682 13327 -31804
1987 -31804 25067 42658 101117 56776 -37156 -142909 -132379 -55601 32138 -1510 -143333
$$ [...]
##END NTUPLES=NMR SPECTRUM
##END=
