##TITLE=1H_DE-80H_X3
 200.13MHz, d2o
 8 sc
 
 19ns.26.2.2025
##JCAMPDX= 6.0         $$ Bruker NMR JCAMP-DX V2.0
##DATA TYPE= NMR SPECTRUM
##DATA CLASS= NTUPLES
##ORIGIN= UXNMR, Bruker Analytische Messtechnik GmbH
##OWNER= pz
$$ XWIN-NMR		Version 3.5
$$ Thu Oct  9 12:06:15 2025 Russian Standard Time (UT+4h)  Yarkov@DPX200
##.OBSERVE FREQUENCY= 200.1313
##.OBSERVE NUCLEUS= ^1H
##.ACQUISITION MODE= SIMULTANEOUS
##.ACQUISITION SCHEME= undefined
##.AVERAGES= 8
##.DIGITISER RES= 18
##SPECTROMETER/DATA SYSTEM= spect
##.PULSE SEQUENCE= zg30
##.SOLVENT NAME= CDCl3
##.SHIFT REFERENCE= (INTERNAL, CDCl3, 0, 15.6213)
##AUDIT TRAIL= $$ (NUMBER, WHEN, WHO, WHERE, WHAT)
$$ ##TITLE= Audit trail, XWIN-NMR		Version 3.5
$$ ##JCAMPDX= 5.01
$$ ##ORIGIN= Bruker BioSpin GmbH
$$ ##OWNER= Yarkov
$$ C:/Bruker/XWIN-NMR/data/yarkov2/nmr/H-C/1/pdata/1/auditp.txt
$$ ##AUDIT TRAIL=  $$ (NUMBER, WHEN, WHO, WHERE, WHAT)
(   1,<2025-10-09 12:05:08.65 +0400>,<Yarkov>,<DPX200>,
      <created by zg, POWCHK disabled, PULCHK disabled
       configuration hash MD5:
       00 E9 B6 7A A2 85 ED C7 34 08 36 98 17 FE 4E 26
       data hash MD5: 16K
       2A 2D 00 5E 91 9D 18 49 30 0C 1D 0B FF 2C A7 1B>)
(   2,<2025-10-09 12:05:21.65 +0400>,<Yarkov>,<DPX200>,
      <Start of raw data processing
       efp BC_mod = 2 LB = 0.25 FT_mod = 6 PKNL = 1 PHC0 = -2281.05 PHC1 = 12.99097 SI = 16K 
       data hash MD5: 16K
       E4 98 A3 CF 18 DC 9D 82 32 E7 F9 C7 5D 98 A2 70>)
(   3,<2025-10-09 12:05:39.34 +0400>,<Yarkov>,<DPX200>,
      <pk PHC0 = -151.9131 PHC1 = -4.2 
       data hash MD5: 16K
       90 98 0C 9B 05 88 CE 5C 03 98 FF BA 54 33 CC C0>)
(   4,<2025-10-09 12:05:43.14 +0400>,<Yarkov>,<DPX200>,
      <abs ABSG = 5 
       data hash MD5: 16K
       6B AB DD 67 77 19 65 B0 C9 46 7A 4D E7 A5 E5 8C>)
$$ ##END=
$$ 
$$ hash MD5
$$ DF 53 1D 22 DE A1 20 37 85 AB 7D DF FD FF 87 0E
##$RELAX= 
##$RELAX= 
##$RELAX= 
##$RELAX= 
##$RELAX= 
##$RELAX= 
$$ Bruker specific parameters
$$ --------------------------
##$DU= <C:/Bruker/XWIN-NMR>
##$EXPNO= 1
##$NAME= <H-C>
##$PROCNO= 1
##$TYPE= <nmr>
##$USER= <yarkov2>
##$AMP= (0..31)
100 100 100 100 100 100 100 100 100 100 100 100 100 100 100 100 100 100 
100 100 100 100 100 100 100 100 100 100 100 100 100 100 
##$AQSEQ= 0
##$AQ_mod= 1
##$AUNM= <au_zg>
##$AUTOPOS= <>
##$BF1= 200.13
##$BF2= 200.13
##$BF3= 200.13
##$BF4= 200.13
##$BF5= 200.13
##$BF6= 200.13
##$BF7= 200.13
##$BF8= 200.13
##$BYTORDA= 1
##$CFDGTYP= 0
##$CFRGTYP= 5
##$CHEMSTR= <none>
##$CNST= (0..31)
1 1 145 1 1 1 1 1 1 1 1 1 1 1 1 1 1 1 1 1 1 1 1 1 1 1 1 1 1 1 1 1 
##$CPDPRG= <>
##$CPDPRG1= <>
##$CPDPRG2= <>
##$CPDPRG3= <>
##$CPDPRG4= <mlev>
##$CPDPRG5= <mlev>
##$CPDPRG6= <mlev>
##$CPDPRG7= <mlev>
##$CPDPRG8= <mlev>
##$CPDPRGB= <>
##$CPDPRGT= <>
##$D= (0..31)
0 0.7 0 0 0 0 0 0 0 0 0 0.03 0 0 0 0 0 0 0 0 0 0 0 0 0 0 0 0 0 0 0 0 
##$DATE= 1759997108
##$DBL= (0..7)
120 120 120 120 120 120 120 120 
##$DBP= (0..7)
150 150 150 150 150 150 150 150 
##$DBP07= 0
##$DBPNAM0= <>
##$DBPNAM1= <>
$$ [...]
##$SUBNAM3= <"">
##$SUBNAM4= <"">
##$SUBNAM5= <"">
##$SUBNAM6= <"">
##$SUBNAM7= <"">
##$SUBNAM8= <"">
##$SUBNAM9= <"">
##$SW= 18.0517328524113
##$SWIBOX= (0..15)
0 0 2 0 0 0 0 0 0 0 0 0 0 0 0 0 
##$SW_h= 3612.71676300578
##$TD= 16384
##$TD0= 1
##$TE= 0
##$TE2= 300
##$TE3= 300
##$TEG= 300
##$TL= (0..7)
0 120 120 120 120 120 120 120 
##$TP= (0..7)
150 150 150 150 150 150 150 150 
##$TP07= 0
##$TPNAME0= <>
##$TPNAME1= <>
##$TPNAME2= <>
##$TPNAME3= <>
##$TPNAME4= <>
##$TPNAME5= <>
##$TPNAME6= <>
##$TPNAME7= <>
##$TPOAL= (0..7)
0.5 0.5 0.5 0.5 0.5 0.5 0.5 0.5 
##$TPOFFS= (0..7)
0 0 0 0 0 0 0 0 
##$TUNHIN= 0
##$TUNHOUT= 0
##$TUNXOUT= 0
##$USERA1= <user>
##$USERA2= <user>
##$USERA3= <user>
##$USERA4= <user>
##$USERA5= <user>
##$V9= 5
##$VALIST= <valist>
##$VCLIST= <CCCCCCCCCCCCCCC>
##$VD= 0
##$VDLIST= <DDDDDDDDDDDDDDD>
##$VPLIST= <PPPPPPPPPPPPPPP>
##$VTLIST= <TTTTTTTTTTTTTTT>
##$WBST= 1024
##$WBSW= 4
##$XGAIN= (0..3)
0 0 0 0 
##$XL= 0
##$YL= 0
##$YMAX_a= 1091526
##$YMIN_a= -1001124
##$ZGOPTNS= <>
##$ZL1= 120
##$ZL2= 120
##$ZL3= 120
##$ZL4= 120
##$ABSF1= 15.48686
##$ABSF2= -2.564989
##$ABSG= 5
##$ABSL= 3
##$ALPHA= 0
##$AQORDER= 0
##$ASSFAC= 0
##$ASSFACI= 0
##$ASSFACX= 0
##$ASSWID= 0
##$AUNMP= <proc_1d>
##$AZFE= 0.1
##$AZFW= 0.1
##$BCFW= 0
##$BC_mod= 2
##$BYTORDP= 0
##$COROFFS= 0
##$CY= -3
##$DATMOD= 1
##$DC= 0
##$DFILT= <>
##$DTYPP= 0
##$F1P= 0
##$F2P= 0
##$FCOR= 1
##$FTSIZE= 16384
##$FT_mod= 6
##$GAMMA= 0
##$GB= 0
##$INTBC= 1
##$INTSCL= 3.241238e-09
##$ISEN= 128
##$LB= 0.25
##$LEV0= 0
##$LPBIN= 0
##$MAXI= 10000
##$MC2= 0
##$MEAN= 0
##$ME_mod= 0
##$MI= 1.114404
##$NCOEF= 0
##$NC_proc= -6
##$NLEV= 6
##$NOISF1= 3.799351
##$NOISF2= 2.8
##$NSP= 0
##$NTH_PI= 0
##$NZP= 0
##$OFFSET= 15.62129
##$PC= 1
##$PHC0= -2432.963
##$PHC1= 8.79097
##$PH_mod= 1
##$PKNL= yes
##$PPARMOD= 0
##$PSCAL= 0
##$PSIGN= 0
##$REVERSE= no
##$SF= 200.129980070576
##$SI= 16384
##$SIGF1= 3
##$SIGF2= 2
##$SINO= 0.751879
##$SIOLD= 32768
##$SREGLST= <19F.Aceton>
##$SSB= 0
##$STSI= 16384
##$STSR= 0
##$SW_p= 3612.71676300578
##$SYMM= 0
##$S_DEV= 0
##$TDeff= 16384
##$TDoff= 0
##$TI= <>
##$TILT= no
##$TM1= 0
##$TM2= 0
##$TOPLEV= 0
##$USERP1= <user>
##$USERP2= <user>
##$USERP3= <user>
##$USERP4= <user>
##$USERP5= <user>
##$WDW= 1
##$XDIM= 16384
##$YMAX_p= 548940420
##$YMIN_p= -2085047
$$ End of Bruker specific parameters
$$ ---------------------------------
##NTUPLES= NMR SPECTRUM
##VAR_NAME=  FREQUENCY,     SPECTRUM/REAL,   SPECTRUM/IMAG
##SYMBOL=    X,             R,               I
##VAR_TYPE=  INDEPENDENT,   DEPENDENT,       DEPENDENT
##VAR_FORM=  AFFN,          ASDF,            ASDF
##VAR_DIM=   16384,         16384,           16384
##UNITS=     HZ,            ARBITRARY UNITS, ARBITRARY UNITS
##FACTOR=    0.220516191357247, 1,           1
##FIRST=     3126.28849778542, 0,            0
##LAST=      -486.428265220362, 0,           0
##MIN=       -486.428265220362, -2085047,    0
##MAX=       3126.28849778542, 548940420,    0
$$ Real data points
##PAGE= N=1
##DATA TABLE= (X++(R..R)), XYDATA
$$ [...]
8363 35249853 35120741 34828779 34360506 33816499 33180315 32483318 31927351 31267443 30659324
8354 30659324 30023173 29253236 28428041 27525470 26475535 25534766 24732163 24020607 23336949
8345 23336949 22773508 22235238 21681851 21005065 20416402 19821726 19302530 18733012 18175539
8336 18175539 17695323 17230353 16819926 16427546 16127047 15730628 15424639 15165185 14884503
8327 14884503 14666282 14506332 14232181 14042165 13809815 13654405 13488446 13293056 13210115 13012894
8317 13012894 12871094 12785652 12715996 12633678 12518831 12410814 12361945 12288762 12176824 11971386
8307 11971386 11856355 11817574 11629728 11519535 11369660 11346866 11196896 11101907 10946645 10800291
8297 10800291 10581972 10457811 10298629 10089818 10006762 9951314 9826044 9741068 9550251 9314332
8287 9314332 9191973 9054824 8880742 8765485 8713134 8658715 8531627 8459075 8390607 8221823
8277 8221823 8207660 8241038 8237658 8232235 8193390 8230648 8198904 8222877 8311090 8244706 8189473 8059001
8265 8059001 7997112 7950810 7930846 7943613 7924171 7839696 7807683 7730237 7641240 7529050 7398765
8254 7398765 7279564 7144089 7077040 6953113 6816091 6665063 6481315 6330900 6179257 5922861
8244 5922861 5792819 5734185 5650926 5594753 5521606 5348730 5238386 5154034 5054769 4917586 4881263
8233 4881263 4817280 4750502 4690496 4639414 4659652 4611898 4557843 4503417 4487548 4485938 4365570
8222 4365570 4306652 4317175 4278518 4286550 4233369 4200816 4102422 3984397 3905965 3892113 3812999
8211 3812999 3739808 3685809 3662618 3524918 3439648 3343733 3337754 3205829 3184370 3068977 2954038
8200 2954038 2877425 2771110 2767317 2739435 2678476 2604496 2532613 2636778 2685433 2255401 2218483
8189 2218483 2146835 2054125 2083371 2040941 2048335 2029417 1973866 1957771 1904370 1885999 1856974 1842057
8177 1842057 1802999 1769805 1776023 1755734 1723629 1648980 1675668 1693018 1655318 1583840 1573017 1598644
8165 1598644 1535102 1534773 1520879 1519079 1454977 1468426 1492335 1490440 1459230 1409022 1359376 1314305
8153 1314305 1312770 1308129 1282106 1273343 1232722 1216025 1255370 1200998 1162345 1143689 1209556 1120223
8141 1120223 1076807 1122777 1101364 1057931 1069246 1077660 1032008 1036156 990615 929116 958290 910272
8129 910272 858560 892918 1020684 1001712 881892 892889 933095 889645 879183 838211 790612
8118 790612 761186 795874 838364 837220 828074 809784 761832 749640 744342 732510 736740 758981
8106 758981 749531 778584 706688 807910 786018 776243 783224 781920 768024 707073 760457 757188
8094 757188 663796 662794 683405 652575 637227 640377 643501 618762 644083 615493 643725 641174
8082 641174 623757 584243 656035 626215 584399 537315 556562 552442 577021 590772 594907 556440
8070 556440 514599 450900 464385 545416 562794 475614 414844 430714 437882 453323 413684 411447
8058 411447 432757 434918 476751 439991 406211 392831 533159 508730 450929 414036 416023 471170
8046 471170 458708 433590 433944 453746 385850 321841 270714 318137 377524 384728 369970 361203
8034 361203 416876 384252 366999 388122 264135 268714 255648 229036 264949 275160 228198 210547
8022 210547 228239 179294 195368 207211 186615 267476 244064 142453 108164 175499 212160
8011 212160 218401 214845 129813 165075 113881 142884 131911 106137 86573 80098 105279 106403
7999 106403 88655 101621 49332 14036 80230 65927 21513 -14785 8439 7558 39712 4905
7987 4905 -66023 -38775 -46083 -112207 -22056 -52950 -93352 -60932 -104790 -161875 -161225 -155002 -165562
7974 -165562 -170158 -288601 -346751 -287957 -254765 -240315 -264878 -290550 -257850 -276089 -295762 -325779
7962 -325779 -358572 -285393 -355591 -422437 -429404 -373500 -381040 -432003 -429136 -431845 -404936 -340918
7950 -340918 -387296 -412373 -397193 -373354 -421900 -449241 -396577 -420387 -425289 -464976 -453102 -418041
7938 -418041 -420666 -438189 -516176 -513943 -552109 -534927 -566870 -541678 -480448 -486311 -521578 -512997
7926 -512997 -530425 -503086 -464860 -493482 -563377 -501158 -489809 -537252 -545770 -564659 -528194 -547577
7914 -547577 -515681 -541799 -567466 -587294 -520657 -565378 -626226 -569175 -520391 -531241 -548375 -553557
7902 -553557 -596330 -623519 -630544 -582795 -585892 -570085 -525570 -569932 -630448 -672958 -673369 -718773
7890 -718773 -638892 -620203 -659186 -626306 -614944 -633791 -610969 -589341 -586569 -617122 -599982 -581711
7878 -581711 -581985 -599495 -618118 -617637 -648605 -590228 -619165 -654142 -579296 -634806 -697690 -706697 -687872
7865 -687872 -708301 -720476 -736367 -777342 -730192 -665913 -627572 -674515 -666179 -628490 -593901 -597864
7853 -597864 -675842 -722568 -710424 -693172 -663078 -684801 -701515 -660016 -593835 -615638 -675983 -692560
7841 -692560 -688588 -730292 -729247 -706047 -707845 -684706 -688864 -641627 -647902 -619276 -621180 -658567 -632008
7828 -632008 -697838 -746028 -737723 -694872 -686270 -660537 -678949 -767226 -779027 -739900 -652372 -715338
7816 -715338 -726174 -790523 -745393 -725886 -834608 -814034 -652158 -722525 -694616 -712711 -698615
7805 -698615 -704946 -697598 -1003232 -1070855 -798442 -802073 -755114 -804269 -772077 -800568 -796958 -761612
7793 -761612 -750874 -754508 -676811 -752688 -763557 -708910 -660997 -633680 -672306 -633501 -668454 -664948
7781 -664948 -582649 -549753 -571483 -545834 -560794 -505740 -450092 -426830 -369511 -398918 -438087 -466475
7769 -466475 -415034 -409046 -328382 -333436 -292811 -259502 -246468 -253528 -174848 -149970 -149843 -50956 45324
7756 45324 94417 209127 345557 376964 262873 185868 194351 234963 216031 50309 41578
7745 41578 114275 95668 75963 40090 13412 -11119 -69961 -168207 -155892 -204374 -269939 -236908
7733 -236908 -304747 -363011 -389130 -423614 -427072 -500652 -580785 -559742 -595810 -597130 -644363 -649593
7721 -649593 -630246 -604648 -620932 -647801 -666930 -700245 -685447 -699508 -641878 -657641 -661355 -651335
7709 -651335 -686384 -748357 -727425 -718630 -782070 -755466 -716249 -674263 -675024 -710775 -656759 -611634
7697 -611634 -641982 -608311 -636133 -568360 -478925 -439111 -527871 -670551 -650595 -618426 -595288
7686 -595288 -570429 -566340 -609988 -593493 -555544 -580225 -624988 -562398 -604624 -629287 -527163 -562588
7674 -562588 -547417 -567820 -590167 -614432 -558457 -546046 -585133 -588377 -642329 -641144 -571321 -545992
7662 -545992 -544860 -574907 -659297 -696636 -730229 -727693 -742694 -682621 -666685 -726839 -743961 -728139
7650 -728139 -687595 -743789 -769939 -781434 -749058 -753713 -807926 -802140 -828799 -819177 -793485 -804627
7638 -804627 -863712 -919399 -915958 -907563 -841651 -863080 -908867 -928757 -995090 -983401 -965519 -923110
7626 -923110 -988599 -919161 -913059 -937251 -971669 -947325 -1010294 -999557 -934458 -966966 -962709 -1002521
7614 -1002521 -957233 -933364 -891835 -945332 -952460 -979618 -988396 -986694 -967280 -956234 -939368 -964037
7602 -964037 -993942 -1052444 -1018958 -998060 -974891 -952016 -920027 -951929 -993478 -1014747 -1035813 -1008478
7590 -1008478 -1080834 -1097778 -1005395 -998297 -977825 -990820 -1039235 -1062433 -1060047 -1032222 -1023106 -1071916
7578 -1071916 -1082259 -1034860 -1046675 -1097878 -1094856 -1121604 -1091847 -1071101 -1071737 -1074146 -1062007 -1105120
7566 -1105120 -1099031 -1137267 -1180007 -1104195 -1086169 -1114486 -1178306 -1189953 -1167314 -1125122 -1084570 -1132256
7554 -1132256 -1241622 -1218535 -1205370 -1161136 -1072117 -1052067 -1072126 -1122519 -1103027 -1077680 -1125716
7543 -1125716 -1148086 -1147401 -1166686 -1217178 -1164810 -1197911 -1203879 -1171097 -1140323 -1152938 -1163426 -1184683
7531 -1184683 -1106829 -1112652 -1149246 -1179212 -1179238 -1149252 -1182903 -1199079 -1182502 -1217122 -1222038 -1184244
7519 -1184244 -1219413 -1245933 -1193564 -1166466 -1143445 -1205972 -1241372 -1190437 -1190327 -1211685 -1162255 -1149818
7507 -1149818 -1117048 -1128652 -1159908 -1211378 -1161296 -1150467 -1194625 -1128601 -1118198 -1106794 -1109271 -1094122
7495 -1094122 -1137966 -1157247 -1120789 -1086896 -1074956 -1002894 -1042059 -1087472 -1098218 -1116094 -1175787
7484 -1175787 -1157129 -1077652 -1132323 -1118898 -1083816 -1090763 -1074073 -1039885 -1066608 -1065397 -1030928 -1026772
7472 -1026772 -1081823 -1082026 -1084214 -1056737 -1071527 -1076536 -1055848 -1114900 -1148948 -1124733 -1071271 -1070511 -1027246
7459 -1027246 -1078425 -1092070 -1115027 -1154990 -1106404 -1075150 -1078873 -1131310 -1180578 -1144417 -1130586 -1136805
7447 -1136805 -1144457 -1163535 -1103014 -1109559 -1107674 -1032953 -1081287 -1032775 -1024291 -1046988 -1045743 -1085149
7435 -1085149 -1098058 -1024091 -1067150 -1162331 -1142873 -1134458 -1131522 -1088893 -1130173 -1091579 -1136800 -1111768
7423 -1111768 -1106335 -1141771 -1148327 -1157810 -1102288 -1136757 -1110463 -1138688 -1137747 -1154654 -1126659 -1127230 -1098190
7410 -1098190 -1085757 -1170480 -1164960 -1128844 -1161120 -1167981 -1199820 -1253798 -1217819 -1181999 -1174399 -1203570
7398 -1203570 -1158371 -1193042 -1230271 -1214960 -1224754 -1227936 -1184451 -1159674 -1186020 -1212504 -1179894 -1228197
7386 -1228197 -1334091 -1317458 -1259225 -1293679 -1246672 -1215257 -1240202 -1209694 -1186029 -1196418 -1202269
7375 -1202269 -1131034 -1185652 -1179101 -1172828 -1176498 -1223313 -1276165 -1288078 -1331182 -1311023 -1267281 -1202344
7363 -1202344 -1215429 -1216765 -1225873 -1229137 -1197875 -1173121 -1178478 -1181644 -1161208 -1208263 -1285544 -1248438
7351 -1248438 -1173102 -1168647 -1130562 -1157757 -1182318 -1175995 -1146344 -1116254 -1164410 -1227775 -1196725 -1124153
7339 -1124153 -1113641 -1153989 -1119932 -1113782 -1074515 -1081072 -1083122 -1117001 -1120909 -1100304 -1133102 -1122955
7327 -1122955 -1151216 -1139854 -1126908 -1180810 -1224083 -1217432 -1202525 -1165698 -1139114 -1127370 -1142210 -1148723
7315 -1148723 -1147828 -1100520 -1089413 -1130268 -1223773 -1213497 -1238515 -1220715 -1152994 -1154645 -1154385 -1161705 -1083486
7302 -1083486 -1126355 -1130732 -1113783 -1049542 -1105070 -1098210 -1115097 -1082288 -1026158 -1042462 -1034947 -1045913
7290 -1045913 -1031567 -1047824 -1026543 -1008385 -1057070 -995794 -878268 -885177 -942122 -1020795 -953982
7279 -953982 -1001889 -1006044 -996546 -956766 -854697 -918771 -949701 -1015307 -1005347 -953974 -957021 -961795
7267 -961795 -986423 -911504 -934290 -943617 -888558 -947649 -958199 -913023 -895065 -929112 -966748 -946171
7255 -946171 -890985 -840563 -794044 -857693 -893344 -890487 -885679 -898426 -916878 -883640 -910963 -887782
7243 -887782 -909844 -891828 -828718 -768810 -783536 -784630 -814368 -874083 -916497 -917781 -878110 -848488
7231 -848488 -862191 -907548 -875660 -868487 -835778 -899145 -924905 -907255 -923418 -838679 -927612 -914252
7219 -914252 -927837 -931946 -896695 -871214 -836833 -874471 -849423 -846536 -899408 -929578 -887301 -870893
7207 -870893 -854531 -870615 -826103 -808734 -868369 -816018 -749453 -785297 -816555 -869624 -917392 -855868
7195 -855868 -893341 -901628 -870741 -829914 -823817 -853462 -815329 -805206 -750437 -775138 -830189 -854218
7183 -854218 -866412 -890258 -869102 -887499 -937119 -968570 -959733 -903440 -888131 -876039 -812230 -844924
7171 -844924 -813966 -782704 -746838 -801602 -883455 -862723 -879572 -922995 -914196 -873808 -832050 -895210
7159 -895210 -928198 -910689 -906549 -872342 -889431 -878894 -857060 -893291 -985836 -1052732 -1050345 -999507
7147 -999507 -1039504 -1086058 -1147785 -1151985 -1094833 -1119540 -1199892 -1166615 -1086172 -1146222 -1212269 -1165654
7135 -1165654 -1235017 -1264156 -1229408 -1240411 -1200872 -1237563 -1283719 -1341648 -1317548 -1353925 -1382976
7124 -1382976 -1384590 -1396799 -1379289 -1429561 -1407589 -1391854 -1405482 -1401363 -1410751 -1497516 -1516784 -1497576
7112 -1497576 -1467724 -1473548 -1454562 -1453770 -1396686 -1452370 -1455829 -1495235 -1529384 -1450608 -1416469 -1465486
7100 -1465486 -1498469 -1443063 -1484819 -1483617 -1464335 -1513602 -1504030 -1544243 -1548691 -1479428 -1482641 -1526267
7088 -1526267 -1492943 -1475473 -1494717 -1530736 -1570912 -1596778 -1575782 -1464824 -1432390 -1460534 -1486567
7077 -1486567 -1508550 -1510428 -1498368 -1500664 -1558343 -1584088 -1554176 -1447117 -1487909 -1512384 -1516119 -1565930
7065 -1565930 -1484126 -1516756 -1553606 -1539953 -1582066 -1518118 -1414221 -1495810 -1520384 -1558790 -1470035
7054 -1470035 -1447538 -1431954 -1477617 -1460748 -1475318 -1513921 -1531867 -1547352 -1531699 -1541987 -1575394
7043 -1575394 -1555580 -1550436 -1570107 -1579494 -1448162 -1466211 -1557695 -1577146 -1575631 -1586220 -1538544 -1541839
7031 -1541839 -1526966 -1528895 -1561225 -1542180 -1592014 -1553298 -1524482 -1480373 -1502670 -1483368 -1490047 -1540975
7019 -1540975 -1580578 -1580086 -1560630 -1542503 -1557339 -1490277 -1480020 -1459808 -1461621 -1508324 -1517644 -1501812
7007 -1501812 -1525727 -1486322 -1529830 -1490755 -1481625 -1535094 -1535692 -1490464 -1453145 -1493355 -1450166 -1524533
6995 -1524533 -1527029 -1448907 -1428039 -1456311 -1453473 -1473960 -1524620 -1481578 -1465539 -1471109 -1440583 -1505297
6983 -1505297 -1588360 -1548774 -1538756 -1529011 -1458147 -1452602 -1439822 -1442049 -1458069 -1405176 -1395242 -1427678
6971 -1427678 -1397077 -1434473 -1400917 -1450825 -1469446 -1397387 -1395700 -1391236 -1374679 -1426224 -1398424 -1357895
6959 -1357895 -1337103 -1313315 -1396167 -1424675 -1446896 -1438330 -1484122 -1489900 -1510854 -1447049 -1463791 -1437895
6947 -1437895 -1394601 -1388048 -1402260 -1425296 -1432202 -1431181 -1480498 -1452375 -1397462 -1402964 -1368686 -1298862
6935 -1298862 -1294413 -1318290 -1272689 -1309178 -1379698 -1446479 -1437568 -1411957 -1391575 -1366130 -1399855 -1348201
6923 -1348201 -1366497 -1387144 -1328578 -1381515 -1377270 -1333595 -1280300 -1299927 -1316011 -1300339 -1249416 -1294956
6911 -1294956 -1299745 -1256038 -1258477 -1234607 -1258262 -1245162 -1230455 -1158444 -1154528 -1143426 -1182026 -1219431
6899 -1219431 -1193840 -1155993 -1213933 -1143154 -1052955 -1001559 -1003564 -1019489 -900476 -920714 -970336
6888 -970336 -966880 -990019 -938303 -897861 -998507 -1015380 -910962 -970722 -940262 -916533 -898265
6877 -898265 -874014 -957053 -925824 -915641 -846064 -948541 -1008559 -1011864 -1034427 -1051301 -1086449 -1088905
6865 -1088905 -1076201 -1119869 -1119121 -1088508 -1213555 -1347644 -1333389 -1339067 -1267969 -1197445 -1267820 -1393814
6853 -1393814 -1425542 -1430717 -1414931 -1444251 -1534438 -1545842 -1462093 -1498973 -1543331 -1568558 -1600498 -1573688
6841 -1573688 -1502472 -1512939 -1546239 -1556502 -1549490 -1567408 -1601537 -1600861 -1662609 -1690386 -1651472 -1631182
6829 -1631182 -1605490 -1628790 -1679731 -1649044 -1663933 -1733276 -1728651 -1592268 -1677961 -1802162 -1686860
6818 -1686860 -1698916 -1690188 -1658904 -1710781 -1723299 -1725106 -1709722 -1727607 -1788458 -1808029 -1741036 -1738583
6806 -1738583 -1711855 -1724690 -1752327 -1779977 -1808341 -1771141 -1770194 -1776250 -1774754 -1748038 -1830068 -1850788
6794 -1850788 -1833028 -1821475 -1810635 -1748863 -1791073 -1804958 -1802879 -1846314 -1813507 -1793448 -1799247 -1868821
6782 -1868821 -1797718 -1816378 -1803882 -1792439 -1819814 -1811850 -1823059 -1808377 -1809974 -1800211 -1772675 -1733628
6770 -1733628 -1802106 -1832356 -1739898 -1735818 -1820660 -1818336 -1794190 -1885586 -1878731 -1877845 -1876819 -1897132 -1843914
6757 -1843914 -1854180 -1801238 -1796487 -1770469 -1849132 -1828159 -1780340 -1867699 -1872415 -1919626 -1892170 -1876733
6745 -1876733 -1864699 -1835109 -1867804 -1822737 -1796169 -1858419 -1847804 -1856690 -1887861 -1902312 -1876063 -1876012
6733 -1876012 -1961302 -1905561 -1886995 -1904742 -1917411 -1870774 -1875922 -1908651 -1887964 -1970154 -1998193 -1951287
6721 -1951287 -1891770 -1933189 -1919241 -1929785 -1968363 -1973757 -1935179 -1971564 -1970285 -1943518 -1959890 -1958671
6709 -1958671 -1946514 -1938383 -1888190 -1928484 -1958003 -1932569 -1875025 -1904656 -1969760 -1934241 -1952180 -1997369
6697 -1997369 -2004878 -1988062 -1940980 -1944823 -1953874 -1968160 -1932310 -1907869 -1929853 -1965979 -1936863 -1957557
6685 -1957557 -1937779 -1863374 -1930553 -2008432 -1990249 -1948924 -1892034 -1872107 -1931737 -1879002 -1935837
6674 -1935837 -1947772 -1995277 -1994855 -1935731 -1915327 -1948148 -1950345 -1946542 -1927354 -1917353 -1940556 -1918988
6662 -1918988 -1974796 -1971560 -1954104 -1862651 -1852046 -1939249 -1941713 -1902854 -1922421 -1939995 -1939086 -1908503
6650 -1908503 -1847689 -1854179 -1904620 -1932778 -1891003 -1908241 -1907003 -1930374 -1975221 -1949012 -1844091 -1813928
6638 -1813928 -1871900 -1877006 -1913021 -1940072 -1974702 -1945795 -1910250 -1963872 -1954305 -1918383 -1944999 -1964667
6626 -1964667 -1988460 -1950989 -1993560 -2013532 -1967851 -1998199 -2000833 -1941595 -1891947 -1886448 -1906401 -1883895
6614 -1883895 -1947654 -1975308 -1981193 -1990492 -1950448 -1975929 -2018027 -1985623 -1991452 -1976697 -1946770 -1925895
6602 -1925895 -1916896 -1979738 -2035176 -2072648 -1991219 -1969576 -1992274 -1934214 -1945694 -2028463 -1962449 -1946084
6590 -1946084 -1962965 -2002948 -2063206 -2085047 -2084114 -1996867 -2022698 -1994165 -2001046 -2011569 -2003917 -2005516
6578 -2005516 -2068204 -2018539 -1982179 -1929535 -1921327 -2018313 -2015407 -2009831 -1996433 -1989857 -2015654 -2015512 -1964628
6565 -1964628 -1969212 -2021850 -2030644 -1960958 -1933721 -1972832 -1948555 -1917839 -1935221 -1952082 -2001023 -1995143
6553 -1995143 -2039228 -2042281 -2022168 -1971457 -1990055 -1979252 -1977002 -1955637 -1991932 -2042051 -1988195 -1939671
6541 -1939671 -1897698 -1840988 -1922543 -1968755 -1939723 -1941658 -1951154 -1936223 -1888008 -1910030 -1947273 -1995401
6529 -1995401 -1991186 -1978856 -1971874 -1943318 -2017610 -2024275 -2051862 -2001491 -1995982 -1957924 -1973351 -1975571
6517 -1975571 -1969481 -1963654 -1974476 -1978569 -1942625 -1926056 -1893404 -1889606 -1913895 -1933694 -1958302 -1948648
6505 -1948648 -1853951 -1877274 -1864393 -1913633 -1861628 -1831066 -1793131 -1803747 -1848566 -1847132 -1857912 -1799168
6493 -1799168 -1797947 -1818810 -1817997 -1871025 -1865134 -1854191 -1859967 -1871317 -1806422 -1804649 -1891092 -1890490 -1854324
6480 -1854324 -1837520 -1794834 -1782314 -1786511 -1843295 -1895443 -1858123 -1796342 -1880889 -1831788 -1838628 -1838279
6468 -1838279 -1819864 -1855351 -1844500 -1785992 -1778324 -1845938 -1791418 -1831689 -1769771 -1747357 -1714564 -1795121
6456 -1795121 -1796505 -1736375 -1718415 -1770568 -1800964 -1744796 -1782730 -1784226 -1785629 -1760274 -1718242 -1786849
6444 -1786849 -1774689 -1710841 -1664622 -1672897 -1719551 -1665711 -1680879 -1732779 -1738593 -1713546 -1784726 -1781080
6432 -1781080 -1736991 -1643117 -1736189 -1755203 -1744221 -1742502 -1689664 -1725494 -1794975 -1735927 -1663417 -1667878
6420 -1667878 -1632827 -1612342 -1603205 -1589349 -1558374 -1537517 -1515286 -1549367 -1566730 -1530936 -1563077 -1542099
6408 -1542099 -1544869 -1559374 -1562690 -1535576 -1503618 -1495984 -1454457 -1406204 -1371000 -1366232 -1361188 -1330204
6396 -1330204 -1224720 -1164223 -1186767 -1197796 -1175084 -1171326 -1150565 -1132656 -1063314 -1062446 -1029494 -982246
6384 -982246 -927277 -899293 -848738 -824458 -774352 -770229 -711685 -678343 -576042 -537502 -529835 -425201
6372 -425201 -405802 -346080 -343209 -337702 -268452 -224991 -144607 -54815 22194 114292 190061 261436
6360 261436 373592 505589 581099 638148 636846 633244 683301 700189 660780 648692 794083
6349 794083 949105 971940 972967 988953 1047884 1080673 1089691 1112162 1084307 1089296 1057133 1156809
6337 1156809 1155828 1132148 1145851 1138486 1143289 1154351 1218732 1246774 1217185 1272108 1379050 1431285
6325 1431285 1538841 1536243 1614381 1649847 1686143 1765062 1781031 1803594 1806438 1899829 1906072 1928517
6313 1928517 1951755 1928981 1971116 2013493 2033023 2056129 2084982 2079164 2057334 2112206 2210630 2188519
6301 2188519 2202335 2233310 2297877 2299868 2286786 2240185 2190032 2122276 2062482 2003458 1921686 1793660
6289 1793660 1732603 1634182 1513798 1471401 1472335 1402892 1224999 1128475 1073708 987476 919956
6278 919956 794765 707101 618466 529907 403107 313217 245053 130858 19543 -33960 -65652
6267 -65652 -136734 -168799 -226170 -299324 -274877 -289741 -365221 -458344 -461584 -548158 -612406 -539749
6255 -539749 -580509 -606873 -638453 -712360 -768479 -783349 -870873 -889453 -929406 -887579 -893183 -936942
6243 -936942 -944815 -947446 -878362 -923115 -948691 -1062912 -1115017 -1123497 -1117123 -1032294 -1059661 -1110860
6231 -1110860 -1160218 -1152471 -1095596 -1114822 -1182297 -1179639 -1238053 -1214376 -1166726 -1123336 -1181443 -1168857
6219 -1168857 -1131323 -1179300 -1177705 -1174039 -1164097 -1179966 -1254323 -1255533 -1209871 -1218213 -1170461 -1203283
6207 -1203283 -1195176 -1240335 -1273444 -1230445 -1228334 -1174614 -1167429 -1138569 -1180763 -1194949 -1166419 -1107561
6195 -1107561 -1050140 -1020511 -1006711 -988452 -996128 -1009468 -1068752 -1070845 -1029409 -982515 -1014719 -1017128
6183 -1017128 -988523 -930494 -906738 -857594 -843004 -788892 -799355 -843311 -792590 -786763 -715977 -755138
6171 -755138 -746562 -726392 -648911 -650728 -659212 -647461 -640723 -654548 -609286 -518418 -518278 -486030 -400471
6158 -400471 -347249 -353743 -376065 -364255 -333869 -281111 -259780 -268850 -289665 -226256 -212481 -200430
6146 -200430 -131564 -59644 -51208 -81466 -38496 -49050 -39219 -26718 -36684 61700 118972 159039
6134 159039 200547 232603 282986 306868 365590 418272 406881 420576 482959 491873 449378 512417
6122 512417 588371 556188 490766 473909 507638 498018 442848 347901 318500 353882 413881 433898
6110 433898 411847 385101 433673 512131 468122 530231 547217 523994 476899 400612 389548 351761
6098 351761 309502 351474 384538 354299 250163 167682 194376 215348 278517 224519 245824
6087 245824 243080 151959 149871 184694 128795 155683 200286 214771 269918 241142 255786 292926
6075 292926 343677 320376 322319 386509 367624 381734 417670 509676 564471 547982 633780 724221
6063 724221 827647 897246 897165 935112 1035170 1161597 1197751 1246892 1367074 1430395 1470477
6052 1470477 1505621 1643670 1682276 1706969 1677240 1711938 1802380 1837378 1903910 1963626 2038847
6041 2038847 2137739 2255283 2327873 2396553 2499831 2651827 2721046 2815843 2978739 3032594 3110289
6030 3110289 3164726 3145776 3181487 3304127 3372529 3455326 3608328 3594004 3553789 3602599 3733426
6019 3733426 3808508 3803762 3833451 3909484 4007644 4061092 4153282 4343452 4373681 4409928 4502290
6008 4502290 4536640 4632396 4720167 4769762 4843163 4898323 4959444 4928722 4982370 5112364 5202944
5997 5202944 5222177 5300463 5382076 5375200 5478166 5530140 5590280 5680288 5725564 5843701 5911104
5986 5911104 5994130 6109116 6198115 6269796 6328993 6346314 6348808 6411453 6506172 6555521 6586094
5975 6586094 6600865 6677493 6727131 6735052 6757840 6812341 6805590 6819212 6853029 6936577 6950493 6886772
5963 6886772 6955132 6901640 6914221 6961271 6915317 6971680 7085687 7057931 7094485 7115077 7166344
5952 7166344 7230571 7194779 7242438 7339381 7395897 7456176 7530861 7606138 7699754 7838142 7946466
5941 7946466 8057297 8179724 8238353 8385843 8567858 8706456 8898509 9110843 9368642 9507206
5931 9507206 9725809 10020792 10336321 10657130 10939454 11282950 11691446 12135098 12655086 13108319
5921 13108319 13568760 14091056 14655901 15306487 15947494 16720199 17388521 18143326 18953199
5912 18953199 19662097 20519373 21380252 22224524 23085624 23883290 24709386 25487178 26337572
5903 26337572 27255150 28222586 29287502 30418376 31514747 32797796 34238414 35841213
5895 35841213 37534911 39342149 41352265 43363879 45363700 47310537 49254109 50973617
5887 50973617 52524604 53953506 55392584 56675847 57771816 58869324 59999791 61071533
5879 61071533 61966986 62684190 63404495 64099977 64683383 65230177 65699047 66234810 66751501
5870 66751501 67332722 68073063 68853682 69778276 70855997 72200373 73763141 75566137 77572993
5861 77572993 79697023 81936959 84130029 86147561 87765145 88960444 89732080 90204192
5853 90204192 90176799 89908983 89531301 88994070 88259963 87406883 86463193 85255990 83898855
5844 83898855 82437284 80954464 79511810 78111831 76730381 75399249 74119608 72833250
5836 72833250 71548321 70406642 69238071 68231173 67282714 66610447 65953106 65375337 64902693
5827 64902693 64421821 63927140 63297128 62482209 61591481 60536216 59338058 58139100 56830246
5818 56830246 55475130 54117219 52642455 51128349 49659658 48176352 46652318 45077203
5810 45077203 43660014 42278786 40984600 39623536 38322772 36982344 35683681 34487280
5802 34487280 33266873 32055662 30937679 29777865 28704600 27640847 26655576 25803051
5794 25803051 24946961 24134545 23355151 22623813 21939932 21285803 20719790 20168925 19633702
5785 19633702 19149740 18643959 18291193 17997846 17681899 17308373 17006978 16732456 16382741
5776 16382741 16135211 15842600 15607547 15304011 15013801 14722015 14407458 14172743 13921154
5767 13921154 13604847 13377982 13229447 13028521 12738441 12574454 12384941 12166262 11976312
5758 11976312 11818528 11669622 11484876 11295220 11098786 11057176 10970053 10871347 10681433 10474485
5748 10474485 10331201 10245315 10127111 9998459 9823626 9738485 9686538 9653230 9533752 9462436
5738 9462436 9387588 9339019 9307560 9177098 9117302 9074356 9026429 8934153 8847973 8703078 8635459
5727 8635459 8583068 8486129 8347590 8258444 8179219 8119996 8069376 7945010 7861830 7752592 7696416
5716 7696416 7641392 7588871 7506788 7377049 7312584 7177248 7019077 6910323 6818455 6728471 6627819
5705 6627819 6562091 6495455 6449702 6359871 6275495 6187015 6083725 5931483 5909203 5879395 5817957
5694 5817957 5725296 5644111 5600139 5516848 5478935 5406365 5360911 5313264 5286890 5266169 5211222
5683 5211222 5143975 5061683 5014009 4947666 4846394 4853190 4718536 4714309 4711620 4616564 4570619 4547882
5671 4547882 4505724 4471329 4411290 4445054 4378307 4243570 4227384 4208823 4224808 4199280 4175191
5660 4175191 4152879 4129693 4113790 4111064 4081510 3967962 3911574 3894988 3883662 3817512 3813524 3762404
5648 3762404 3688076 3654613 3559334 3548482 3415778 3394390 3371015 3324487 3218975 3121736 3101275
5637 3101275 3051220 2990529 3018732 3030247 2941287 2869092 2879859 2807291 2756647 2651483 2646562
5626 2646562 2686129 2668247 2628791 2573278 2566032 2611392 2497649 2480836 2489916 2483460 2421619 2421148
5614 2421148 2476580 2446357 2485637 2407683 2426509 2417358 2390718 2475853 2473741 2472939 2428667 2349445
5602 2349445 2398224 2492991 2555956 2501364 2506174 2520200 2512641 2489829 2467946 2482052 2508428 2576538
5590 2576538 2641925 2633694 2650281 2701613 2713862 2734044 2789412 2876804 2890678 2942952 2984516 2976667
5578 2976667 3031173 3124004 3260455 3281575 3318868 3381986 3460088 3538399 3563189 3619004 3791592
5567 3791592 3808335 3813832 3920120 3931142 3987002 4074544 4130668 4248685 4276319 4361197 4391385
5556 4391385 4400518 4463568 4590203 4598114 4619105 4676599 4786725 4835096 4856409 4906776 4947126
5545 4947126 5025703 5074901 5116473 5237281 5195952 5276056 5376982 5354391 5419790 5422086 5437815
5534 5437815 5506007 5539006 5647812 5749657 5751441 5796361 5896251 5997715 6087100 6144972 6139993
5523 6139993 6262330 6426868 6480816 6600930 6796076 6920528 7068690 7218571 7373247 7537460
5513 7537460 7683026 7855470 8062918 8301407 8565516 8764099 9031653 9258408 9627136 10019145
5503 10019145 10411938 10820035 11250524 11668387 12143208 12626223 13106211 13661840 14294637
5494 14294637 14859856 15537962 16337219 17103857 17888358 18772480 19733409 20709050 21810641
5485 21810641 22968948 24240372 25727714 27255062 28754913 30460935 32263934 34154012
5477 34154012 36220773 38411180 40773144 43229321 45809232 48500931 51231718 54028711
5469 54028711 56799749 59492620 62139640 64626854 67009622 69527523 72113397 74849152
5461 74849152 77735039 80816922 84021166 87407890 91167725 95229065 99647734 104398339
5453 104398339 109372986 114539887 119714714 124743103 129581577 133853549 137562541 140510730
5445 140510730 142753351 144276785 145111977 145361096 145048646 144224099 143064357 141321952 139005147
5436 139005147 136213989 133150385 129796310 126275018 122775607 119351710 115924082 112370550
5428 112370550 108883550 105271265 101670813 98130851 94716677 91425815 88204334 85200129
5420 85200129 82319406 79474359 76756487 74105196 71534608 69056211 66619518 64291577
5412 64291577 62058182 59933665 57846405 55791043 53911378 52038581 50155421 48313585
5404 48313585 46567067 44868395 43201038 41548277 40052516 38594739 37087037 35630054
5396 35630054 34352307 33070328 31762286 30600363 29412483 28213294 27131221 25982840
5388 25982840 25090366 24170871 23202497 22329377 21499334 20824929 20101431 19383169 18667287
5379 18667287 17928253 17340427 16832104 16251512 15709008 15206049 14814370 14439823 14001314
5370 14001314 13529901 13118152 12840592 12416098 12037150 11719859 11360361 11037141 10754449
5361 10754449 10514202 10186871 9921050 9734026 9496954 9253951 9022421 8832107 8587605
5352 8587605 8398926 8235506 8068942 7923483 7763132 7606989 7452571 7290899 7114920 6927941
5342 6927941 6771628 6647585 6479142 6393405 6320078 6219493 6091323 6022423 5925343 5744896
5332 5744896 5648472 5559387 5447985 5376427 5286592 5128642 5031017 4968354 4814731 4752189 4667233
5321 4667233 4555585 4495683 4348184 4329661 4260424 4155168 4123910 4105113 4010859 3924024 3864925
5310 3864925 3835997 3816482 3770085 3689370 3551731 3512308 3498572 3432055 3362952 3333275 3304363
5299 3304363 3262175 3180363 3106915 3022223 2950589 2947907 2855142 2796664 2717955 2659682 2685173 2679723
5287 2679723 2669882 2623087 2571884 2494042 2467061 2406226 2385126 2350698 2296726 2308450 2344672 2332868
5275 2332868 2249958 2184796 2136115 2087312 2081882 1999406 1966996 1901288 1915919 1929547 1860124 1778552
5263 1778552 1762102 1744663 1696279 1684859 1635737 1643108 1646178 1618781 1567777 1569566 1553055 1540985
5251 1540985 1525755 1526775 1471559 1469850 1343052 1281445 1341407 1352801 1342883 1262202 1264140 1210698
5239 1210698 1246877 1172693 1169702 1163771 1220573 1181384 1249494 1236114 1219746 1221386 1128468 1088182
5227 1088182 1082283 1114841 1083456 1105344 1160368 1195756 1234909 1340440 1411077 1402630 1440646 1431174
5215 1431174 1377106 1374337 1355103 1304875 1312115 1275681 1201910 1234204 1204438 1143394 1087981 1064964
5203 1064964 1020377 985033 962957 949161 928808 893327 802441 808094 806048 786877 737686 622702
5191 622702 565279 586392 576474 585712 521944 547263 549723 584493 510343 454720 418556 499639
5179 499639 592692 500877 490399 508288 492588 498094 483467 507201 537577 534979 549665 549911
5167 549911 608958 574256 573219 553576 582410 543929 536280 639780 584836 498753 474640 559674
5155 559674 595505 645916 617075 635389 665594 708410 701926 716099 765758 782335 772860 811858
5143 811858 862463 859548 884081 927987 905001 967516 1014406 998182 969667 926818 900507 1000778
5131 1000778 1035924 1007385 1042846 949669 928606 907287 954360 1015483 1018210 974182 1024905 1067384
5119 1067384 1168069 1134603 1099810 1127816 1158107 1130343 1099901 1115558 1154220 1138849 1168210
5108 1168210 1198967 1285919 1316915 1276270 1273845 1344986 1347931 1293950 1290661 1269212 1296715 1363044
5096 1363044 1382674 1421537 1470651 1468700 1546844 1588086 1599924 1565134 1637600 1676162 1747672 1754439
5084 1754439 1803696 1845557 1881354 1990869 2020322 2099849 2099101 2077871 2061288 2156757 2236535 2244604
5072 2244604 2356895 2275934 2277632 2398347 2338005 2315235 2370739 2410854 2432714 2438195 2440451 2447247
5060 2447247 2502643 2556644 2658313 2774606 2829290 2855907 2923702 2990999 3009006 2974537 2976189
5049 2976189 2957555 2929033 2978171 2987641 2985753 2935498 2855481 2763004 2681156 2680280 2707328 2668337
5037 2668337 2682033 2678749 2623510 2627254 2669183 2548191 2517315 2448039 2480087 2477126 2406919 2396863
5025 2396863 2445265 2401026 2408967 2439674 2457639 2474159 2459067 2482462 2502375 2554031 2561750 2572842
5013 2572842 2553726 2619465 2585092 2570760 2604338 2585430 2622435 2615617 2668142 2685032 2649553 2669576
5001 2669576 2671667 2746929 2704214 2767096 2885652 2910070 3016767 3023466 3063076 3196727 3167533
4990 3167533 3109871 3127435 3316239 3392982 3443552 3480512 3586334 3659682 3693420 3739262 3827133
4979 3827133 3932097 4001393 4062296 4063191 4202779 4342172 4486990 4615456 4678541 4673285 4754514
4968 4754514 4958084 5061367 5137458 5238438 5321822 5419165 5589174 5721847 5901916 6021963
4958 6021963 6083002 6219352 6386774 6626415 6740774 6851971 6972930 7034353 7028034 7065069
4948 7065069 7174724 7277928 7409608 7480626 7572045 7669177 7757189 7905435 8097848 8179877
4938 8179877 8265202 8320270 8366692 8393638 8404462 8429828 8405655 8432284 8484294 8472348 8418298
4927 8418298 8310103 8260405 8329023 8390985 8383164 8408886 8535133 8644863 8657594 8556994 8588042
4916 8588042 8571829 8587312 8666468 8717496 8703056 8750893 8814760 8787413 8918811 9045941 9058289
4905 9058289 9146108 9254893 9302391 9425710 9597483 9775342 9898490 9976893 10066415 10266239
4895 10266239 10285015 10440438 10592585 10684174 10842499 10902506 10920764 11081657 11256993 11421777
4885 11421777 11612384 11809018 11967490 12093579 12314872 12485034 12689982 12853946 13059844
4876 13059844 13266013 13494312 13759218 14062190 14246482 14591457 14835681 15097030 15439163
4867 15439163 15785746 16110144 16452374 16915764 17372311 17768679 18177243 18651566 19168742
4858 19168742 19753197 20311793 20880016 21506660 22237141 22972781 23777125 24544815 25404245
4849 25404245 26259339 27178261 28200205 29207844 30379658 31511538 32748961 34049740
4841 34049740 35451775 36889506 38388570 39943964 41670445 43394262 45147817 46982268
4833 46982268 48812695 50783514 52792391 54836532 56837039 58928464 61115882 63405877
4825 63405877 65749206 68185125 70834028 73680168 76587418 79789271 83173854 86718368
4817 86718368 90457404 94314927 98263706 102108687 105928822 109614704 113205913 116614195
4809 116614195 119921974 123123997 126257261 129462351 132736332 135976079 139237687 142452604
4801 142452604 145668791 148977838 152181961 155315987 158416018 161589315 164634158 167688903
4793 167688903 170650507 173595927 176676167 179735277 182995772 186571328 190345339 194408039
4785 194408039 198678473 203130973 207645527 212003349 216095354 219658106 222788408 225449726
4777 225449726 227489048 229056023 230172142 230920651 231261787 231294211 230980108 230425682 229727714
4768 229727714 228894090 227996609 227227555 226553540 225979037 225489563 224998380 224342919 223687297
4759 223687297 222825010 221682715 220204037 218458226 216675614 214595303 212425539 210201104
4751 210201104 208001794 205818140 203702616 201463450 199326166 197255336 195288436 193397342
4743 193397342 191485079 189579680 187415840 185030918 182238418 179149646 175790503 172156344
4735 172156344 168434521 164590833 160777193 156927475 152961213 149121594 145256205 141434840
4727 141434840 137756600 134245123 130868206 127686538 124718806 121787347 118946975 116260995
4719 116260995 113582551 110979072 108443837 105954446 103467739 101121599 99012082 96959637
4711 96959637 95044841 93153427 91290827 89658724 88138117 86655013 85268890 83970126
4703 83970126 82777022 81614422 80601323 79501929 78513458 77475987 76616738 75797791 75003121
4694 75003121 74315780 73579798 72918814 72258843 71587889 70959551 70283544 69495285 68726584
4685 68726584 67997380 67305947 66616672 65946558 65312198 64711438 64106671 63557616 63040875
4676 63040875 62641679 62345760 62110690 61945536 61843525 61781520 61639629 61447941 61163461 60737702
4666 60737702 60214940 59563776 58861910 58082321 57187707 56235831 55170258 54026911 52866847
4657 52866847 51740478 50631044 49479241 48423382 47338196 46265250 45196331 44220211
4649 44220211 43271519 42318199 41402187 40604897 39803891 38910760 37977429 37167077 36317456
4640 36317456 35535944 34781997 33977981 33273975 32631687 31992991 31448348 30950281 30346032
4631 30346032 29911627 29580706 29130130 28708740 28421485 28138798 27857119 27616179 27443512
4622 27443512 27201682 27078890 26928542 26740226 26540894 26421945 26290754 26158775 26110937 26040498
4612 26040498 25927628 25792478 25695302 25613616 25515179 25507307 25533318 25447208 25331098 25245845 25220776
4601 25220776 25244004 25226754 25237195 25169515 25101226 25061368 25018915 24960675 24910320 24891206 24835971
4590 24835971 24882816 24925535 24922349 24948332 24968572 24923196 24979073 25025972 25026378 25097275 25173105 25235670
4578 25235670 25241707 25249920 25398208 25498917 25581261 25620646 25769246 25966661 26007057 26054253 26184836
4567 26184836 26331764 26467108 26613320 26753843 26954210 27166235 27357210 27648321 27940033
4558 27940033 28169247 28448760 28764298 29051237 29327985 29676669 30048248 30364836 30718587
4549 30718587 31051143 31477880 31932147 32474853 33026384 33555212 34249096 34959288 35796532
4540 35796532 36712991 37612768 38792158 39996403 41309537 42879480 44429675 45993447
4532 45993447 47508671 49112079 50727496 52504707 54414831 56407175 58668353 61132845
4524 61132845 63829276 66697736 69585489 72786020 76271251 79981529 84061923 88467088
4516 88467088 93124569 97848963 102449524 107022547 111140125 114717399 117920806 120743026
4508 120743026 123649261 126640253 129737867 133205459 137195195 141829400 147432797 154196453
4500 154196453 162358572 172229627 183549231 196181698 209771117 223292308 235516330
4493 235516330 245331021 252172391 256020836 257297054 256666021 254835723 252498630 249825987
4485 249825987 246779372 242972295 237792904 231213153 224002519 216733160 209907116 203987568
4477 203987568 198706868 193793275 188954718 183799851 178400436 172775670 166858254 160876452
4469 160876452 155005144 149147183 143262718 137565743 132067198 126835655 121819555 117039105
4461 117039105 112615520 108625264 104818131 101212355 97700873 94317944 91073682 87891473
4453 87891473 84886561 81926782 79318452 76867590 74466810 72147578 69927252 67769893
4445 67769893 65659629 63719101 61761814 59931743 58224821 56592596 54986076 53529447
4437 53529447 52187586 50903857 49632742 48446462 47375176 46306254 45370757 44519014
4429 44519014 43653057 42901585 42139548 41415325 40820929 40191487 39634064 39230473 38780527
4420 38780527 38391855 38065910 37717169 37338013 36975705 36632065 36182220 35721738 35262935
4411 35262935 34851806 34337954 33795599 33284694 32759867 32224675 31732653 31236788 30724349
4402 30724349 30172471 29749850 29352753 28947920 28636886 28277657 28008386 27793321 27607318
4393 27607318 27364430 27194602 26876908 26681599 26586720 26478522 26352275 26202728 26066234 25947901
4383 25947901 25903885 25768246 25760320 25715612 25637161 25658385 25702029 25634497 25668692 25676415 25737854
4372 25737854 25822165 25912236 25987053 26052964 26102725 26243345 26344397 26431638 26581505 26880924
4362 26880924 27132855 27353280 27542054 27659517 27732053 27689872 27636801 27481643 27399051 27219844
4352 27219844 27053124 26889634 26715833 26572096 26392013 26166842 25926601 25702272 25588988
4343 25588988 25528779 25390724 25310574 25281538 25110927 24947492 24763334 24555260 24441794 24292400
4333 24292400 24136625 23921247 23720472 23537021 23329432 23104816 22949033 22652623 22393536
4324 22393536 22137511 21869088 21668174 21440426 21192619 20907943 20680630 20443652 20276039
4315 20276039 20058232 19811083 19572466 19447869 19297101 19131382 18919439 18719474 18469234
4306 18469234 18207775 17966929 17756226 17618528 17438719 17230028 17007458 16824449 16742839 16536889
4296 16536889 16240863 16022587 15891663 15672685 15448807 15290040 15199077 15050975 14833850 14637695
4286 14637695 14440851 14179219 13965664 13779505 13601978 13404846 13171241 13054934 12855804
4277 12855804 12721866 12582056 12441199 12308466 12216342 12131874 12049116 11953580 11879650 11844410
4267 11844410 11744779 11749476 11708974 11593305 11587893 11630905 11591939 11509266 11508965 11575625 11564829 11510051
4255 11510051 11483314 11497183 11597295 11649588 11700146 11741186 11779234 11813977 11911230 12085102 12182669
4244 12182669 12203247 12316249 12483630 12588779 12630704 12750082 12826550 12867161 13101776 13183496
4234 13183496 13279433 13419070 13564002 13670619 13780333 14002307 14285128 14602878 14876282 15165897
4224 15165897 15486575 15859449 16170019 16299637 16455186 16476628 16521575 16539117 16402486 16342946
4214 16342946 16241069 15995545 15694863 15469558 15152109 14898635 14681322 14471645 14224986
4205 14224986 13963103 13693790 13428970 13243435 13004667 12715358 12506217 12327836 12102492
4196 12102492 11910428 11783731 11659448 11558486 11502911 11333079 11135775 11071564 11021828 10955184
4186 10955184 10818843 10768868 10637679 10560260 10537947 10457671 10417513 10407292 10344751 10351469 10309152
4175 10309152 10247210 10209040 10159140 10157857 10163799 10187921 10144532 10051548 10037384 10082937 10059070 10095426
4163 10095426 10108285 10071741 10047751 10097591 10118533 10092568 10082013 10072294 10102736 10076525 10195554
4152 10195554 10272322 10301515 10314886 10352325 10352813 10374702 10427279 10455119 10478415 10555876 10639698 10700660
4140 10700660 10791429 10881899 10885024 10920445 11104793 11117763 11131230 11238404 11313787 11413070 11507575
4129 11507575 11645300 11742827 11856847 11945538 12039540 12221114 12267092 12418978 12548922 12675300
4119 12675300 12789163 13014038 13119022 13232756 13356062 13545553 13633061 13701342 13868868 14045011
4109 14045011 14187195 14337937 14497984 14681718 14905452 15127275 15340506 15550439 15810042
4100 15810042 16071177 16260177 16592566 16911757 17304020 17782720 18111789 18584840 19149123
4091 19149123 19657526 20190070 20750867 21392853 22153200 22996321 23763886 24624363 25603293
4082 25603293 26659636 27780794 28984300 30289484 31620024 33013195 34547684 36200076
4074 36200076 37961895 39820936 41664984 43671468 45854606 48175686 50613808 53100700
4066 53100700 55738437 58537223 61396060 64354018 67451083 70719934 74098178 77609650
4058 77609650 81206618 84934561 88786231 92856724 96952163 101201726 105588411 109960185
4050 109960185 114453123 119055404 123661310 128285545 132879715 137586437 142286473 147033015
4042 147033015 151733859 156510379 161283211 165933199 170608439 175232833 179653636 184004137
4034 184004137 188222059 192167617 195975868 199598714 202914182 206164694 209130010 211799751
4026 211799751 214345831 216547105 218580125 220358166 221804032 222922103 223675789 224153439
4018 224153439 224265538 224061431 223488451 222572716 221342900 219778632 217954597 215839101 213462905
4009 213462905 210861700 208007342 204854588 201500261 197880325 194005065 190041481 185914647
4001 185914647 181536613 176995646 172420513 167726918 162847112 157888896 152940466 147987627
3993 147987627 143071732 138208419 133271655 128525670 123772967 119096009 114428695 109881690
3985 109881690 105474389 101143909 96889332 92805291 88788741 84814736 81067079 77516952
3977 77516952 74049789 70774454 67670318 64629595 61738403 58997191 56473443 54004407
3969 54004407 51704600 49545204 47521680 45508162 43598766 41916100 40277146 38747185
3961 38747185 37268028 35900225 34659552 33448221 32365196 31356926 30358375 29429688
3953 29429688 28619540 27763483 26980081 26284084 25586162 24896465 24275761 23689405 23161314
3944 23161314 22681634 22203309 21646550 21218184 20840918 20453730 20107077 19825147 19491424
3935 19491424 19119747 18822315 18508241 18210242 17952165 17734493 17431783 17170291 16889691
3926 16889691 16611606 16334440 16143973 15984840 15750619 15558055 15370559 15265916 15061201
3917 15061201 14868178 14728437 14500261 14391663 14293392 14221362 14051643 13919991 13824463 13672105
3907 13672105 13521225 13455786 13443694 13411172 13317318 13211309 13152555 13115440 13038537 13041544 13036131
3896 13036131 13031486 12992547 12999669 13017085 12942820 13046170 13126941 13105691 13194323 13224709 13233122 13287984
3884 13287984 13280305 13321212 13388553 13434632 13446409 13490520 13566045 13574061 13636838 13689865 13741222 13841106
3872 13841106 13858488 13846405 13941458 13995432 14043595 14125315 14125585 14159940 14163378 14247113 14366897 14419389
3860 14419389 14518315 14610559 14606431 14674199 14779922 14796797 14840567 14868493 14962604 14941690 14972496
3849 14972496 14988314 14931744 14967944 14987726 15002338 14967611 14972880 14950728 14929051 14846110 14794622
3838 14794622 14749284 14735771 14704180 14632326 14531023 14420615 14401547 14375262 14338891 14204375 14127069
3827 14127069 14124879 14054735 13989439 13990324 13972783 14015074 13956083 13917397 13948024 13911843 13975682 13970661
3815 13970661 13945619 13966607 14038758 14064400 14196059 14320175 14375921 14432622 14538976 14604947 14649740
3804 14649740 14770829 14954783 15051986 15154797 15303974 15420266 15457244 15510650 15611477 15722416
3794 15722416 15876198 15991013 16125517 16310451 16384987 16495073 16614003 16820463 16941264 17118050
3784 17118050 17287996 17360288 17500489 17613312 17774578 17941774 18121701 18223378 18374104 18586704
3774 18586704 18796742 18890509 19038966 19299760 19480893 19688200 19856670 20075124 20277557 20427776
3764 20427776 20703164 20947437 21209798 21542533 21847641 22142995 22455596 22816175 23166999
3755 23166999 23543038 23957861 24374654 24858224 25348900 25854903 26400968 26993411 27616430
3746 27616430 28285137 28970603 29755762 30507814 31288330 32144605 33063829 33960682 34941742
3737 34941742 36031788 37145287 38281598 39464246 40734410 42102965 43498292 44914348
3729 44914348 46428608 47967689 49532836 51235654 52934362 54611703 56360276 58188035
3721 58188035 60118600 61958935 63803532 65811835 67778689 69721773 71709941 73633981
3713 73633981 75534193 77510140 79363914 81146408 82873816 84559955 86189397 87810522
3705 87810522 89457551 91030216 92552282 94007613 95400922 96760800 98102159 99357804
3697 99357804 100571702 101887729 103048764 104273286 105555608 106770328 108036983 109402055
3689 109402055 110770948 112270526 113843465 115517275 117376843 119368505 121584145 123943494
3681 123943494 126519560 129404093 132498615 135874086 139536702 143344564 147558803 151983820
3673 151983820 156695767 161744083 166950623 172378633 178081924 183967574 190093277 196445599
3665 196445599 203027849 209988033 217106421 224360030 231708769 239181134 246826604 254375710
3657 254375710 261952270 269455385 276875732 284163812 291355241 298493939 305447855 312177429
3649 312177429 318627713 324859168 330790544 336345310 341512007 346272169 350749177 354950331
3641 354950331 358830671 362397070 365768271 368928414 371941444 374781578 377453393 380008678
3633 380008678 382612516 385087558 387590652 390058031 392456870 394788541 396931725 398947049
3625 398947049 400823410 402471488 404049703 405665620 407319005 409215471 411523925 414306383
3617 414306383 417559418 421441773 426082765 431489865 437571478 444446778 451926509 459776759
3609 459776759 467820731 475740963 483261904 490276609 496575539 502226122 507335754 512020940
3601 512020940 516411320 520728476 524908994 528956303 532932156 536672674 540013525 542886402
3593 542886402 545147451 546875940 547891544 548296763 548234815 547761680 547096344 546513178 546074844
3584 546074844 546051393 546252099 546697253 547370201 548016837 548537183 548834019 548940420 548595213
3575 548595213 547890834 546828981 545576473 543897096 542020863 539738401 537006395 533905264
3567 533905264 530400007 526230121 521416601 515909867 509451613 501920099 493419914 483903102
3559 483903102 473312762 461886058 449736257 436978565 423679442 410081722 396230247
3552 396230247 382226448 368248891 354468961 340880695 327705256 314929120 302487533
3545 302487533 290427427 278684524 267344422 256166239 245273735 234777924 224617360
3538 224617360 214776249 205388643 196423270 187890213 179703670 171910463 164642146 157661361
3530 157661361 151080743 144888600 139090272 133562423 128355180 123346208 118651434 114202464
3522 114202464 109993365 106024392 102331324 98830132 95344756 92085468 89031187 86119815
3514 86119815 83472750 80936979 78540435 76208417 74015709 71975680 69969314 68134287
3506 68134287 66327465 64574919 62954892 61393580 59926151 58524681 57184131 55981449
3498 55981449 54746290 53463038 52343319 51280774 50226047 49288602 48356981 47447561 46499485
3489 46499485 45678291 44922353 44127435 43338588 42662587 41906258 41194589 40615196 39937840
3480 39937840 39325716 38712997 38134791 37643924 37089978 36549639 36060325 35604248 35148502
3471 35148502 34651073 34190648 33807572 33416952 33040825 32734279 32425603 32060460 31624246
3462 31624246 31364836 31056848 30737752 30398199 30145266 29852204 29563349 29313866 29090837
3453 29090837 28832696 28601889 28407607 28198712 27882614 27632105 27531980 27369249 27121640
3444 27121640 26905141 26758730 26658130 26606444 26443530 26262200 26063762 26048316 25927791 25820630
3434 25820630 25740454 25578016 25465577 25378788 25342716 25260552 25201007 25102852 24961623 24850800
3424 24850800 24781104 24767814 24743384 24596048 24457141 24436881 24318957 24261957 24186093 24097840 23988685
3413 23988685 23911271 23747583 23684881 23638092 23519115 23420293 23316098 23250232 23189384 23078277
3403 23078277 22982696 22926937 22835704 22711865 22628890 22571764 22527666 22459049 22361998 22254186 22148248
3392 22148248 22033548 21929376 21898394 21897577 21812597 21656433 21559888 21579477 21556083 21532718 21501414
3381 21501414 21485208 21475616 21435523 21415641 21431644 21445792 21370295 21378732 21368839 21412091 21497160 21485556
3369 21485556 21448603 21464431 21527601 21579494 21686761 21713330 21645210 21668709 21681240 21717272 21791138
3358 21791138 21819852 21863154 21980078 21951802 22007979 22094583 22112318 22130807 22264103 22426033 22498011
3347 22498011 22601706 22702915 22768629 22849405 23000903 23082836 23149870 23176610 23214789 23266405 23296889
3336 23296889 23334530 23345329 23354397 23352170 23359466 23375921 23355058 23319652 23322015 23284710 23241509 23214211
3324 23214211 23202481 23110415 23107721 23018976 22882376 22870106 22844567 22747198 22633841 22537372 22477171
3313 22477171 22343868 22343319 22357718 22300559 22291708 22222203 22159082 22091336 22057780 22012182 21899476
3302 21899476 21817506 21713303 21653756 21624359 21523223 21400282 21318589 21235000 21159816 21104010 21084727
3291 21084727 21126854 21254228 21352033 21437273 21648569 21871809 22058590 22158314 22202520 22144262
3281 22144262 22061056 21911749 21865156 21776144 21624462 21530040 21410348 21261037 21161370 21001114
3271 21001114 20811940 20663958 20452432 20312930 20166337 19968117 19780940 19554796 19414746
3262 19414746 19192351 19029421 18919797 18857842 18803117 18869047 19049078 19254728 19556014 19810684
3252 19810684 19968494 19919519 19665633 19370857 19091039 18809968 18614090 18481206 18301324 18041241
3242 18041241 17612526 17185192 16946635 16679841 16455036 16210405 15991889 15849822 15698782
3233 15698782 15504346 15247399 14972164 14726566 14500221 14286447 14175279 14090493 14057871 14108634
3223 14108634 14155170 14300256 14349670 14296816 14217439 14015273 13804266 13603429 13487211 13384991
3213 13384991 13321190 13131335 12905407 12721849 12527314 12298258 12093947 12072809 11939330 11841313
3203 11841313 11778260 11617943 11455605 11302253 11194791 11085756 10868041 10714405 10684681 10571403
3193 10571403 10437251 10419687 10295252 10242890 10198297 10137282 10076649 10033629 9957795 9862918 9827916
3182 9827916 9796220 9755065 9685957 9609753 9533878 9501822 9553075 9561123 9477403 9476348 9360004 9202216
3170 9202216 9163863 9222943 9198029 9202472 9159241 9079008 9142058 9109710 9103634 9073627 9073128 9136027
3158 9136027 9124246 9114445 9082155 9046213 9010106 8959588 8987319 9048660 8985517 9021236 9082330 9153708
3146 9153708 9114563 9042917 9067679 9048841 9024545 8964270 8881977 8895792 8961809 8883473 8860162
3135 8860162 8784828 8718885 8668102 8682347 8709869 8599650 8565588 8636430 8725266 8721537 8652009
3124 8652009 8579387 8569382 8590963 8624894 8691232 8609965 8550485 8581608 8551470 8473589 8392136
3113 8392136 8373698 8334554 8328584 8226492 8224923 8134185 8114870 8048505 7908936 7863989 7842402
3102 7842402 7815421 7718283 7637742 7522548 7504964 7481440 7401800 7331272 7356916 7317251 7236278
3091 7236278 7202751 7163230 7132730 7038912 7017381 6958609 6955614 6899661 6825417 6845026 6761556 6654727
3079 6654727 6612716 6565137 6420184 6347362 6301137 6255650 6237003 6172809 6141335 6112235 5973523
3068 5973523 6029823 6046325 6019671 5992157 5917413 5841989 5814118 5800154 5693194 5671469 5674683
3057 5674683 5667270 5580451 5522490 5541493 5495535 5409808 5399294 5380380 5358326 5349011 5292114 5282545
3045 5282545 5201849 5177894 5176635 5210436 5108154 5044018 5026001 5014581 4996160 4952486 4895265
3034 4895265 4895854 4891905 4864083 4847503 4800560 4830082 4809465 4750918 4746737 4780248 4733754 4605575
3022 4605575 4532213 4510309 4514999 4476102 4362581 4355885 4369167 4326133 4246880 4208832 4246784 4276861
3010 4276861 4206840 4200085 4225444 4174027 4184873 4230064 4179460 4152228 4064050 4019623 4071712 4063210
2998 4063210 4063675 4022248 4006468 3955808 3971842 4005116 3994556 3931177 3872718 3910573 3902327 3903391
2986 3903391 3849451 3862637 3833948 3850210 3867174 3802177 3750343 3756060 3735898 3698899 3680874 3645260
2974 3645260 3615895 3566430 3564076 3586567 3555313 3550004 3548120 3561385 3582500 3551804 3528688 3562091
2962 3562091 3609162 3538854 3519509 3573654 3531552 3463875 3466901 3450705 3395060 3392556 3393036 3381716
2950 3381716 3345184 3423459 3438308 3363244 3307907 3312439 3263463 3273163 3218736 3222165 3182252 3138200
2938 3138200 3130865 3106329 3102159 3071910 3090417 3084649 3090183 3054830 3057497 2966139 2981619 3060489
2926 3060489 3073442 3077479 2999257 2929851 2907465 2868646 2812146 2819256 2781599 2776134 2757502 2716922
2914 2716922 2781041 2760447 2677172 2652445 2699960 2840373 2780103 2703312 2697938 2637279 2678444
2903 2678444 2681135 2660712 2593505 2528199 2494380 2508190 2513067 2460390 2406635 2482829 2486355 2432355
2891 2432355 2384245 2439003 2442027 2398513 2368030 2399905 2377869 2337700 2296752 2358991 2366870 2353595
2879 2353595 2361584 2369046 2334119 2286823 2296487 2263232 2183916 2160349 2182882 2180616 2219763 2262578
2867 2262578 2161145 2124974 2125828 2159362 2154472 2098198 2096969 2114237 2074826 2046074 1967782 1958421
2855 1958421 2031093 2042739 2019355 2024647 1975468 1965063 1952607 1940994 1956213 1931564 1990277 2022904
2843 2022904 1994135 1932189 1920984 1821530 1860327 1820828 1773019 1731102 1763215 1807169 1792771
2832 1792771 1762141 1751670 1786157 1822086 1856533 1881095 1770759 1713316 1801317 1752894 1780137
2821 1780137 1782257 1689386 1725494 1679222 1670951 1663800 1690779 1686278 1656346 1618575 1622111 1569729
2809 1569729 1541819 1573381 1609854 1621487 1591845 1554644 1508145 1463809 1546346 1577246 1532416
2798 1532416 1472550 1435125 1412194 1449039 1450830 1431080 1450276 1434524 1421419 1383866 1366781 1398282
2786 1398282 1336373 1286820 1239176 1228095 1323828 1368608 1320523 1306121 1394777 1314662 1296424
2775 1296424 1299637 1232135 1170486 1205042 1192081 1200617 1200975 1156151 1136281 1118342 1198587 1181410
2763 1181410 1130086 1161369 1175788 1176577 1211154 1168670 1129795 1170212 1131831 1098439 1058655 997118
2751 997118 1029351 1061394 1009797 1047068 1005378 1066368 1108492 1050937 1042323 1088359 1099159 1049864
2739 1049864 978497 952165 1008779 986623 947797 845327 848123 876521 890993 918867 937915
2728 937915 977636 931769 973738 953354 859412 897730 930170 940661 953221 964484 923485 844264
2716 844264 810987 835570 780098 793017 847802 837127 821536 814720 827311 866542 898068 846513
2704 846513 850776 866789 857591 853877 792940 791705 775521 737548 708468 746209 823566 761247
2692 761247 745428 715906 775619 744906 694751 704582 741996 735348 722684 734546 694110 630625
2680 630625 705865 754882 713407 657896 702653 742622 694852 690907 619876 616450 603603 599038
2668 599038 604838 607867 650524 666032 666355 689846 680399 592986 623225 611722 668082 650036 607452
2655 607452 617845 616259 588363 648453 637748 610022 565090 543044 544461 544988 612881 590086
2643 590086 574052 543930 541347 617246 598081 578511 574025 514572 549245 556146 512390 511484 558894
2630 558894 530062 481138 458744 518447 485291 396218 419744 489460 495703 432495 432386 499246
2618 499246 468905 495526 421738 411811 400097 476511 441409 407460 387673 375598 372223 395626
2606 395626 375658 343564 387740 435455 452265 456321 452405 386322 354612 353115 394215 419626
2594 419626 317589 255818 317401 388500 374743 387851 381419 382539 432663 399855 342586 373053
2582 373053 372339 303695 319911 357863 293502 308161 352026 360904 370403 389170 372202 307318
2570 307318 272905 325057 320999 269464 267433 267952 330745 339644 230519 246006 260830 237019
2558 237019 227004 211017 250643 310092 303015 247754 272492 237609 244171 185956 185824 236523
2546 236523 242116 227609 158927 195756 288073 269520 191014 228411 158805 166911 180339 171919
2534 171919 176224 226593 294824 291835 237596 205874 249872 247146 232160 196236 184731 112391
2522 112391 137975 168613 164459 158342 163731 156696 218097 165546 255308 208196 172046 224437
2510 224437 262298 172316 188847 199216 202847 228311 179382 144710 148876 118011 114179 83726
2498 83726 104699 132415 145312 168098 158347 146235 133678 153561 188286 155241 148748 143682
2486 143682 201918 216012 288696 260200 196858 187355 243152 228060 195759 241069 209760 206346
2474 206346 243234 267601 249976 248974 228991 215572 212528 154661 161907 173045 193978 175512
2462 175512 124543 203269 122585 147375 190645 174483 149099 150751 135146 174455 230765 170847
2450 170847 41059 47879 -3035 55335 70438 85307 56109 100306 81010 106164 80838 94428
2438 94428 58954 77658 50111 74960 118204 112106 85099 20367 14914 28204 74738 52653
2426 52653 33606 21042 18485 24044 21020 38390 53208 49109 20124 77459 132672 114836 113632
2413 113632 112633 35391 -34341 -64885 -56698 1458 64354 50097 -7148 -44594 3570 54761
2401 54761 56749 78535 17457 -2149 -13416 46953 16498 4154 -19354 -7930 -28176 -17671
2389 -17671 -9024 -27994 -94319 -53753 -37998 -87573 -42331 -45029 -35127 -9206 13215 24184
2377 24184 -34146 -94030 -78887 -51154 -33247 -19562 16280 30966 3239 -6681 -72448 -81791
2365 -81791 -110323 -137819 -107576 -100511 -29005 29910 64139 65307 16649 -40871 -15745 -10338
2353 -10338 -63368 -71616 -97749 -131473 -55485 -9652 -33239 -50593 -77838 -125276 -115232 -63056
2341 -63056 -69574 -127815 -136613 -77929 -91396 -118927 -93713 -134324 -65146 -74997 -116394 -84947
2329 -84947 -83374 -7470 13020 -45725 -118023 -135275 -77276 -70070 -82821 -118511 -108863 -85453
2317 -85453 -96083 -169953 -183330 -120195 -174166 -100777 -40022 -80223 -74377 -52402 -99709 -90469
2305 -90469 -100546 -107014 -80601 -77090 -79116 -96273 -72935 -72659 -154363 -135541 -164162 -159248 -118317
2292 -118317 -119826 -96315 -91779 -116210 -79657 -77364 -117413 -135101 -70512 -76443 -67133 -115424 -76096
2279 -76096 -56580 -2939 -30694 -40945 -33560 -46461 -74834 -148096 -138313 -107892 -7524 5761
2267 5761 -17648 -19134 13353 8339 -1693 -7651 7853 -41630 -29498 -42523 6530 97431 99624
2254 99624 30892 39319 76021 144218 150116 160003 217465 265168 291149 328960 422398 509401
2242 509401 544241 621160 653701 662678 728198 837446 923522 979975 1092940 1183369 1396695
2231 1396695 1589271 1755496 1928610 2062086 2262164 2419760 2619562 2756950 2817913 2814404
2221 2814404 2883898 3030763 3109154 3190311 3253665 3309635 3452793 3790436 4235509 4802309
2211 4802309 5527704 6413488 7324410 7998561 8379161 8412815 8076280 7735859 7498624 7301331
2201 7301331 6991889 6597961 6181972 5592326 5023460 4610513 4337090 4274897 4232735 4125757
2191 4125757 3946156 3679595 3385615 3076084 2887430 2554844 2203459 2005381 1766795 1556877
2181 1556877 1446484 1287076 1166442 1048657 941949 889867 913825 850767 706537 625671
2171 625671 567673 458416 403336 431040 449675 377657 335920 258946 231016 255430 257306 244635
2159 244635 265122 240735 187514 135677 108282 178989 140262 102746 89203 124268 107554 20611
2147 20611 1616 -59794 -17063 -14184 -40114 -35486 -69005 -33562 -1398 -36993 -82600 -105052
2135 -105052 -107235 -31847 -64706 -113049 -60509 -120297 -139949 -77166 -101494 -161044 -128833 -111461
2123 -111461 -97425 -107490 -150642 -171554 -225284 -171999 -175231 -154082 -203225 -204448 -243023 -304533
2111 -304533 -260842 -176706 -127639 -131375 -169614 -169154 -162244 -93980 -125844 -178695 -209339 -196826
2099 -196826 -209273 -233483 -157739 -263347 -322101 -252380 -259076 -270273 -192816 -163710 -223261 -217445
2087 -217445 -295520 -239832 -249398 -298965 -238756 -270553 -276964 -236995 -239482 -268269 -277125 -254578
2075 -254578 -176337 -239466 -269369 -266904 -270673 -218807 -204566 -255842 -284550 -238021 -272289 -216519
2063 -216519 -275762 -336250 -262950 -250638 -244526 -286819 -273193 -293220 -237103 -228941 -267903 -310671
2051 -310671 -283141 -240662 -252443 -279548 -320834 -294567 -317463 -285539 -274615 -241446 -255193 -262325
2039 -262325 -283136 -287019 -270033 -235587 -191916 -181814 -232612 -259426 -346365 -330945 -294318 -294854
2027 -294854 -331631 -357677 -345545 -388346 -451775 -410645 -325904 -330776 -278131 -302263 -303754 -315873
2015 -315873 -304703 -259007 -271425 -305666 -253207 -254091 -254118 -294486 -260255 -275667 -273819 -330549 -242884
2002 -242884 -258990 -317509 -333006 -312810 -262132 -272555 -302746 -377351 -346521 -311425 -293327 -299829
1990 -299829 -371864 -389270 -402677 -367410 -293874 -325810 -357340 -353699 -376058 -344352 -442178 -510643
1978 -510643 -405425 -344185 -341504 -309955 -299086 -358121 -291500 -304990 -356203 -387132 -377766 -387615
1966 -387615 -391039 -384427 -350139 -318351 -300702 -345054 -422749 -368127 -362122 -335341 -323505 -399467
1954 -399467 -377127 -351240 -368439 -317881 -308535 -317251 -330683 -310666 -323151 -385598 -315318 -331330
1942 -331330 -337409 -309920 -352971 -323341 -319702 -334049 -252093 -235690 -215057 -326720 -375372 -364742
1930 -364742 -387358 -411102 -416861 -346539 -292998 -245866 -328646 -335664 -367576 -401802 -380682 -352132
1918 -352132 -385343 -405350 -440238 -373541 -323853 -358897 -406659 -379645 -375061 -392453 -359909 -387665
1906 -387665 -338213 -362573 -325844 -334269 -354346 -300694 -267351 -363078 -352994 -308591 -312372 -339425
1894 -339425 -353265 -355571 -421785 -413397 -351666 -438509 -487709 -428205 -406792 -422443 -489668 -419274
1882 -419274 -402419 -386833 -360856 -393988 -420654 -425505 -433782 -392326 -363349 -369155 -399143 -450388
1870 -450388 -472615 -448128 -437872 -386257 -372760 -405851 -420129 -436856 -418193 -459720 -388457 -358949
1858 -358949 -280651 -330073 -378432 -391837 -397209 -346646 -401911 -435965 -385649 -397174 -429311 -408471
1846 -408471 -405744 -433255 -379791 -385699 -366986 -371692 -422019 -377561 -387157 -453889 -495724 -458516
1834 -458516 -444245 -400943 -427242 -457779 -495548 -452403 -407150 -399773 -425726 -426037 -356888 -401621
1822 -401621 -349137 -377753 -382060 -368217 -401168 -458722 -498344 -447251 -432838 -436742 -444914 -465637
1810 -465637 -503039 -452165 -385964 -446247 -449831 -415277 -413056 -377676 -352057 -393464 -399646 -369201
1798 -369201 -388537 -329347 -317779 -349677 -411895 -413506 -412002 -403198 -446351 -418263 -414764 -416670 -386671
1785 -386671 -395016 -411258 -372896 -419817 -434288 -458503 -413628 -353964 -371147 -401008 -425917 -388849
1773 -388849 -365787 -332416 -378059 -307818 -311904 -325577 -261985 -320781 -341933 -364167 -383584 -411997
1761 -411997 -410067 -405788 -384984 -388246 -414844 -405235 -402574 -348249 -396087 -391262 -344985 -361461 -384425
1748 -384425 -388198 -424522 -455360 -431592 -309039 -312818 -346407 -354048 -392468 -421315 -382885 -381836
1736 -381836 -383768 -375757 -423178 -352860 -329558 -309253 -376070 -395607 -387131 -381681 -345766 -355844
1724 -355844 -435195 -388955 -361578 -397067 -338241 -348464 -315382 -344339 -366469 -340549 -359631 -406485
1712 -406485 -382959 -371624 -350132 -380762 -400621 -397128 -376962 -390425 -373911 -423022 -381582 -342847
1700 -342847 -375216 -361501 -427948 -489429 -494203 -405232 -442646 -442803 -435705 -454922 -452777 -405079 -375325
1687 -375325 -393131 -447395 -450898 -388564 -405197 -396742 -392888 -393088 -365134 -373605 -356316 -309799 -289642
1674 -289642 -358346 -422586 -397319 -404003 -374896 -331436 -404531 -422537 -431282 -448408 -414792 -450212
1662 -450212 -483888 -389720 -342496 -338212 -403664 -371247 -400787 -373118 -403592 -332681 -321258 -444641
1650 -444641 -457498 -400360 -386182 -363840 -344814 -379792 -380775 -294913 -266920 -378208 -381612 -419830
1638 -419830 -375491 -338448 -304692 -355958 -406880 -380055 -373162 -365732 -342260 -339290 -356281 -326223
1626 -326223 -340763 -362942 -381948 -398297 -407540 -411455 -401846 -374369 -363092 -358339 -303963 -333717
1614 -333717 -294872 -325814 -275058 -291902 -322709 -382448 -420393 -350570 -325708 -381035 -402717 -443044
1602 -443044 -442514 -481917 -471720 -415343 -371611 -321501 -350995 -396064 -337926 -323529 -381037 -367510
1590 -367510 -352127 -383737 -393837 -364144 -359987 -375569 -337055 -381249 -363133 -375650 -331952 -276572
1578 -276572 -287872 -327033 -346619 -303672 -395795 -437285 -407732 -355155 -374189 -385018 -358606 -331916
1566 -331916 -361175 -346108 -348309 -386165 -399380 -345818 -320582 -326530 -312383 -373949 -411425 -351635
1554 -351635 -361135 -425353 -389886 -319290 -324050 -375687 -325752 -360135 -401096 -364076 -377423 -360897
1542 -360897 -354063 -311526 -327692 -366617 -423804 -404978 -413018 -372550 -331675 -387503 -397045 -325436
1530 -325436 -332958 -367446 -378515 -388644 -345472 -317249 -349019 -308117 -274563 -351244 -366173 -355616
1518 -355616 -329950 -294509 -280948 -368828 -314188 -347521 -398010 -410971 -423339 -302947 -250090
1507 -250090 -269630 -325684 -327546 -385226 -370925 -381272 -336135 -370848 -336784 -243930 -302812 -296418
1495 -296418 -287131 -361011 -312270 -299152 -292858 -354610 -323682 -345117 -349984 -382018 -357780 -349500
1483 -349500 -329154 -393205 -401160 -293872 -260170 -290431 -277457 -325245 -323889 -375804 -369379 -331097
1471 -331097 -372816 -331009 -300935 -220528 -313344 -289963 -303733 -353899 -351760 -350420 -322383 -368713
1459 -368713 -356965 -292780 -355273 -322528 -316209 -314739 -366987 -350144 -304557 -344248 -375513 -319511
1447 -319511 -337228 -340828 -321838 -353828 -320442 -287619 -330746 -302909 -353093 -382282 -373463 -341158
1435 -341158 -379528 -316877 -359818 -406272 -323758 -282066 -333263 -319649 -303388 -279642 -313979 -359769
1423 -359769 -348741 -277875 -244941 -261270 -222825 -212368 -194667 -166071 -163775 -215037 -248859 -265445
1411 -265445 -275103 -316333 -336540 -305681 -261451 -252325 -245305 -214759 -268901 -284629 -289360 -245971
1399 -245971 -263645 -265728 -259161 -281447 -273839 -336913 -323513 -348133 -309078 -300634 -317537 -304008
1387 -304008 -272319 -282307 -228895 -206814 -216418 -221743 -203213 -195983 -208042 -297903 -280255 -225172
1375 -225172 -197105 -226666 -341372 -346414 -329014 -250992 -293293 -291815 -264711 -291892 -294989 -307949
1363 -307949 -329875 -302707 -256244 -196489 -169701 -219182 -210520 -210122 -222989 -216376 -254985 -340302
1351 -340302 -305719 -315667 -303633 -255703 -304121 -310936 -294702 -243566 -266722 -316274 -308103 -316313
1339 -316313 -254852 -269494 -319781 -293411 -303307 -297458 -256060 -215202 -193212 -183606 -213560 -218453
1327 -218453 -150295 -147505 -170837 -191018 -239225 -229068 -205084 -214245 -231453 -201928 -202508 -147750
1315 -147750 -130532 -153731 -203382 -209997 -190266 -280408 -264908 -240565 -250911 -215360 -139544 -193205
1303 -193205 -147703 -101159 -186302 -227460 -169593 -160577 -180070 -210783 -183304 -166872 -195584 -200416
1291 -200416 -209603 -240749 -172210 -228675 -252764 -206881 -259870 -225272 -168256 -205097 -238553 -148848
1279 -148848 -102397 -169831 -225103 -176151 -244571 -216763 -187101 -165239 -203287 -275319 -226809 -212920
1267 -212920 -227830 -232705 -222961 -212089 -169830 -161360 -155918 -200653 -202961 -160118 -138627 -170604 -192674
1254 -192674 -219012 -183721 -247210 -226286 -288461 -276315 -247898 -260190 -220098 -213422 -207132 -211232
1242 -211232 -244962 -266719 -231723 -230257 -182516 -185242 -139869 -173158 -155665 -152201 -141297 -118263
1230 -118263 -143189 -163116 -118665 -114675 -152441 -155834 -126989 -122649 -158884 -175297 -197616 -156294
1218 -156294 -214141 -169813 -105029 -190553 -182426 -162569 -169559 -179811 -203068 -170346 -107980 -160196
1206 -160196 -129324 -204149 -179181 -170362 -243020 -173345 -136915 -202834 -221528 -137202 -134673 -201367
1194 -201367 -154507 -173813 -174963 -136133 -152354 -136804 -177784 -223832 -205216 -191787 -200242 -168309
1182 -168309 -126793 -131121 -96809 -72559 -106585 -62205 -119486 -191604 -210899 -221560 -166441 -88024
1170 -88024 -55183 -78932 -69571 -173218 -167734 -173567 -150820 -171838 -171620 -137819 -148344 -236022 -260706
1157 -260706 -244728 -199589 -180895 -179415 -163759 -151060 -139361 -121884 -26605 -89833 -162918 -129783
1145 -129783 -125092 -148584 -158324 -127714 -106106 -104571 -121423 -150296 -160317 -88234 -87602 -112301 -96083
1132 -96083 -95205 -41748 -75176 -49801 -127974 -194483 -174407 -97193 -101624 -144289 -153185 -148674 -59286
1119 -59286 -47242 -51493 -49509 -91789 -73898 -59515 -58915 -106807 -187389 -188251 -88534 -65605 -74074
1106 -74074 -60879 -107972 -42211 -44547 -128791 -184154 -176247 -91160 -46047 -53301 -77883 -58249
1094 -58249 -84745 -113738 -161786 -139241 -125077 -100900 -138530 -152701 -198038 -148317 -101203 -119398
1082 -119398 -165088 -130743 -115996 -122935 -127528 -100311 -118795 -119442 -105894 -93481 -44183 -43558 -30613
1069 -30613 -24001 -36529 -77325 -125824 -70488 -89165 -129426 -126691 -99759 -76458 -136101 -98912
1057 -98912 -142017 -109676 -75728 -95215 -58624 -67669 -64276 -36147 11598 -26183 -50370 -63330
1045 -63330 -58724 -73071 -54952 -85818 -19562 -6313 38722 -20589 -96477 -3610 33310 -8724
1033 -8724 -26654 -23644 -59563 22783 6463 9321 -65133 -41817 -50837 -101694 -148711 -80155 -53474
1020 -53474 -110839 -66102 -27305 -24233 -56917 -81049 -106270 -44420 12636 3180 24298 -41234
1008 -41234 -40913 -93853 -81870 -113258 -126860 -82617 -55132 -18822 -20890 -72759 -57422 -31603
996 -31603 -82512 -34089 -21337 -120297 -9931 -14365 -53689 -18923 -35425 -29658 -43859 -58467
984 -58467 -69288 -8419 29465 26093 -13678 -81768 -98816 -46193 13277 3417 2007 -8135 -34077
971 -34077 -11898 11332 -38370 -70255 -52926 2846 -13740 1629 42412 49950 41079 39079 117280
958 117280 57721 7441 38950 -3922 32388 87763 84600 19750 3919 35397 24145 -5115
946 -5115 -37685 10010 96033 41969 -21178 33396 56529 13973 -1387 15681 27717 43123
934 43123 25539 -15045 -30361 44523 80630 51406 27981 6275 -11587 -6625 -14367 22649
922 22649 -57263 -67281 -8188 -20987 -43038 -47812 -379 -6326 16554 45972 86349 52694
910 52694 55279 50460 75064 124348 89142 109554 35325 -37648 -31461 68984 62963 61076 74360
897 74360 60010 114394 71551 42355 32479 6204 15565 -38095 -2917 116306 103478 43323
885 43323 53879 100488 144091 115920 128748 82320 29320 67897 72745 36578 72777 29228
873 29228 28174 27710 44779 29223 103157 64669 83434 18653 -2892 -10 29301 69335 40011
860 40011 55642 62645 72847 9147 37502 77256 83670 34069 87605 84778 115000 62199 -3160
847 -3160 57665 83345 100079 94709 59779 76930 110158 122237 96264 84248 84505 107239 143011
834 143011 207053 160148 145906 131836 72317 121533 149297 156992 193396 155821 58319 76303
822 76303 80740 175449 258600 175928 145775 124778 89123 81238 96086 76202 161658 145213
810 145213 115048 109599 63491 134806 166857 122215 111761 157372 135907 134500 161809 124552
798 124552 111108 118863 153394 187192 125181 97385 104309 97621 109533 17101 34257 86426
786 86426 88821 121932 118135 123371 176181 169011 159711 207063 99327 137378 121963 76844 112102
773 112102 133810 166642 208349 216029 186566 155310 178148 156319 142964 182806 149327 141904
761 141904 168234 208398 169507 150966 227851 291543 222900 200846 188338 222358 161224 214791
749 214791 191492 175044 148436 130623 144825 215527 198434 232884 204504 108579 155297 155257
737 155257 128866 156971 118458 173249 145645 108978 160232 230775 263096 210627 219100 263315
725 263315 217136 216726 129744 165204 259460 205479 163312 153427 141934 212700 269535 293948
713 293948 279936 211360 243707 191707 235844 193893 227124 140190 152646 182783 226808 238420
701 238420 204531 147017 194480 254467 257918 254289 217257 196475 240190 236113 246697 251019 310550
688 310550 296802 233245 257146 279894 170231 175162 248710 216962 125980 162847 245568 213156
676 213156 220684 283572 288676 255115 189686 232674 244738 243549 311778 303367 230434 217259 242924
663 242924 181437 150858 234916 290493 235971 181945 224689 273041 277755 268658 258389 230001
651 230001 271102 225864 242025 314812 288137 261556 222798 262213 375286 374183 269484 217440
639 217440 225318 252676 297358 294760 270512 267539 231321 309142 372300 383545 263123 287992
627 287992 304342 264265 272177 344877 342115 279707 288371 330316 325277 269993 297685 300200 259916
614 259916 276811 326581 322829 313231 355012 363991 290449 249419 317974 320748 287267 271700 313258
601 313258 271884 309798 302486 285727 248099 265344 310245 267880 310236 366435 389331 323824
589 323824 315748 308598 303374 314159 322585 299116 299712 350311 378769 441629 399666 352891 391022
576 391022 380858 271513 268519 319643 373852 399300 391733 349488 366927 350790 384036 398322
564 398322 388269 365672 319600 271998 292589 276347 322121 369840 427043 438789 390615 373094
552 373094 358186 376328 289758 392500 421585 407765 384508 330777 341268 399145 420224 433464
540 433464 439820 478755 482102 409854 474888 450070 398844 434734 399210 344075 382681 446463
528 446463 405843 393846 356780 407148 384588 405991 480241 474705 423566 417267 424142 440984
516 440984 426812 429397 351133 368984 384480 401009 381998 440669 499422 443119 403136 409145
504 409145 402920 395970 421337 414624 453688 436576 385642 373326 364116 336697 334105 345423 388044
491 388044 347431 393489 414229 421284 408119 390792 372880 413582 430958 462178 536740 513848
479 513848 496363 471822 482210 446188 392662 387133 375485 415623 381626 357382 388980 357686
467 357686 406844 457216 454202 399388 383370 404690 388858 476988 488887 442283 411658 400979
455 400979 407145 424257 482007 506101 490180 481469 481431 461366 419282 440461 442306 473806 530258
442 530258 535899 520869 455775 431594 523403 495784 440868 450399 505071 493321 487662 523727
430 523727 519798 559170 577016 527438 549823 565666 386319 407001 452678 465131 506452 508047
418 508047 508394 571242 519168 512239 551866 572469 496108 496943 452198 425022 494248 481761 452228
405 452228 440337 510157 526048 533477 512603 531764 500349 512862 503066 468185 479553 494748
393 494748 510921 512751 452406 480961 517933 416198 449682 516120 483728 495108 548267 641925
381 641925 611224 591968 539424 501444 505446 560928 549689 556852 500381 539943 534285 524600 576783
368 576783 575044 603029 637672 610688 596961 589133 515248 490231 521975 561045 537846 589883
356 589883 514066 568753 524268 531546 562604 539583 494683 511266 552378 466941 509284 528458
344 528458 496126 507954 567876 622712 538500 572879 611044 566202 506984 454281 492950 558780
332 558780 594605 572130 578856 627989 629774 543500 528007 570355 508490 541740 591832 501537
320 501537 490219 479981 464599 581009 589957 541267 537504 538353 576821 574651 568132 642114 638693
307 638693 612743 644732 564750 547726 521334 557565 570069 541551 591968 570315 520217 568537
295 568537 568856 530582 477154 540522 566893 563237 664293 692367 680280 644712 664904 609563
283 609563 582648 643337 691863 645920 691150 668452 680387 683104 636736 586503 591809 577660
271 577660 534698 568558 584520 603984 610819 622724 641107 673211 675919 664467 678350 690108
259 690108 668695 704396 653626 671180 688450 685510 668754 656286 643131 610800 658915 665714
247 665714 616848 653828 713878 699299 633044 624645 645329 721438 608771 600523 609634 647682
235 647682 648220 596486 614333 585999 622697 601233 635133 674382 654982 625911 589236 608222
223 608222 634588 644673 665950 655187 657911 648455 637365 607638 650253 685822 716017 697616
211 697616 710020 706187 653485 653832 700181 741482 686996 702542 683587 681443 678655 655341 645156
198 645156 630968 636204 658724 684444 701566 741589 699912 673011 643608 659327 666596 656164
186 656164 670378 682181 718134 682655 715986 711506 599109 675219 762945 755313 730950 709477
174 709477 702201 710027 655246 709806 788886 764577 721440 692260 688140 706369 768813 695175
162 695175 670482 711753 715329 759425 750808 728542 737744 717837 718957 690817 738103 781797 782251
149 782251 808305 765585 792681 750574 744398 734910 744091 731536 752828 724065 758832 731879
137 731879 712325 724744 745176 763981 764323 785940 764155 770437 780686 756132 743933 719434
125 719434 691347 755446 748898 768540 744336 722293 714275 747763 771968 764270 773272 752714 671673
112 671673 638021 654537 698002 693423 713421 737301 741436 746642 757089 747681 738895 742738 776979
99 776979 749893 730175 762172 756589 753552 809123 829165 831864 810572 780540 793597 810580 815298
86 815298 821825 844766 822139 827911 796553 820543 841249 799590 789396 822369 808349 782406
74 782406 816721 789014 805259 803851 782686 783555 827561 846436 828924 804823 804835 825423 853605
61 853605 829196 815358 843605 837861 820714 823975 836232 813480 815296 805564 852014 804301 822920
48 822920 846264 786489 807004 792460 809358 778595 795717 822936 836371 876651 822471 810812
36 810812 818149 873631 870003 807818 857988 819132 801219 862461 859305 789938 771850 788323 762516
23 762516 767219 862970 874889 840079 839364 852867 823301 803898 853210 908129 912010 864447 855679
10 855679 835289 854137 843963 870809 859720 880878 881173 880743 898510 877157
0 877157
$$ Imaginary data points
##PAGE= N=2
##DATA TABLE= (X++(I..I)), XYDATA
16383 -3005949 -2908586 -2849956 -2835700 -2788843 -2735200 -2702394 -2607768 -2500906 -2494572 -2481072 -2495743
16372 -2495743 -2458654 -2345642 -2260952 -2183588 -2133824 -2065180 -2021098 -2020598 -2009868 -1972741 -1913707
16361 -1913707 -1872484 -1834776 -1744823 -1678709 -1662620 -1572682 -1506615 -1492794 -1458926 -1395962 -1335231
16350 -1335231 -1274683 -1210183 -1186604 -1125768 -1096668 -1100739 -1041591 -951009 -874392 -851728 -813334
16339 -813334 -785052 -712720 -714408 -628437 -509448 -466150 -497945 -427898 -331784 -324148 -252132 -220206
16327 -220206 -248798 -229278 -161471 -70687 -8078 9480 45146 110418 187838 206267 215439 288393
16315 288393 323086 395012 440195 473837 529721 539799 591256 581107 652307 725168 738883
16304 738883 780270 861795 918579 909083 964400 1090981 1100751 1113671 1181141 1216184 1309274 1338529
16292 1338529 1306338 1373000 1459406 1494910 1491458 1538927 1543704 1622722 1663022 1721903 1749985 1771649
16280 1771649 1804179 1827865 1887908 1967904 1937445 1925696 1982407 2085132 2086220 2097408 2153257
16269 2153257 2162806 2216125 2277432 2323161 2334236 2348888 2412443 2465475 2427123 2426722 2458406 2494809
16257 2494809 2539266 2626558 2646436 2691397 2707639 2700770 2700957 2752771 2784519 2776290 2746553 2870657
16245 2870657 2985580 3003509 2995931 3040129 3014020 2985077 3059834 3102868 3142258 3151502 3207166
16234 3207166 3286266 3297414 3295366 3342151 3350854 3418958 3405456 3424074 3442229 3449248 3456408 3496600
16222 3496600 3536414 3526168 3536388 3553601 3571703 3641772 3658491 3679202 3760246 3750318 3726695
16211 3726695 3701739 3721304 3747519 3806013 3841045 3878849 3919966 3914231 3954943 3924824 3897239
16200 3897239 3983617 3997112 3986509 4014929 4021727 4018120 4057747 4042384 4061040 4128715 4134712 4124432
16188 4124432 4166312 4156899 4151001 4184263 4183143 4145573 4204519 4234244 4196402 4218054 4262252 4308720
16176 4308720 4339456 4441171 4380474 4354681 4370403 4302105 4411905 4469163 4508525 4517029 4509086
16165 4509086 4554572 4551338 4505240 4497866 4533261 4496672 4438670 4482646 4502542 4541639 4566377 4566409
16153 4566409 4627604 4663139 4551715 4521199 4535932 4565739 4634501 4623475 4715071 4726955 4682347
16142 4682347 4752575 4707134 4647903 4733607 4789348 4779175 4812697 4842087 4793075 4753810 4791946
16131 4791946 4782796 4739183 4748723 4809385 4878936 4800082 4825014 4773964 4744936 4818508 4862082 4933438
16119 4933438 4879587 4878595 4924238 4940990 4972269 4963789 4948420 4998510 5065314 5047923 5031186 4987418
16107 4987418 5040718 5006187 4963841 4939388 4921715 4979896 4973723 4999576 5075623 5042859 5048501 5039179
16095 5039179 5000494 5053756 5033985 4974656 4969774 5014056 5013536 5000958 5057215 5062706 5037891 5035827
16083 5035827 5039078 5065858 5074837 5104643 5064661 5066853 5074276 5062385 5025615 5022242 5039710 5055375
16071 5055375 4989781 5020310 5097136 5165509 5074194 4975256 5094837 5154242 5120237 5055547 5062193
16060 5062193 5123947 5144801 5139634 5207932 5207332 5203999 5116387 5068132 5097142 5088390 5106410 5105168
16048 5105168 5196118 5164424 5136457 5147035 5040967 5054818 5105991 5100710 5059145 5101222 5136767
16037 5136767 5148664 5145901 5050976 5094860 5128926 5129302 5061305 5153148 5238800 5196421 5209970 5193808
16025 5193808 5119635 5072658 5146842 5126596 5145489 5124606 5116175 5119679 5110123 5196233 5219650 5191869
16013 5191869 5216876 5206368 5171232 5172284 5196709 5190223 5168555 5185457 5155035 5112979 5162569 5191517
16001 5191517 5252107 5205033 5132119 5100253 5092533 5124754 5135367 5068947 5107058 5156023 5128061
15990 5128061 5161832 5224801 5160881 5199506 5212374 5212562 5149585 5163680 5218485 5300322 5275812 5222135
15978 5222135 5166501 5206034 5231338 5177974 5133395 5145858 5209782 5182424 5176673 5145401 5168386
15967 5168386 5181514 5236933 5205859 5173517 5146681 5160409 5132946 5164748 5166897 5220829 5197501
15956 5197501 5209180 5166290 5229424 5177915 5173585 5199650 5268756 5301357 5225627 5219532 5213217 5175800
15944 5175800 5143924 5157326 5203023 5216697 5210676 5171743 5191452 5149878 5160424 5179021 5185842 5185126
15932 5185126 5187050 5211956 5156810 5160741 5216540 5201413 5218544 5247627 5240356 5248309 5208687 5231296
15920 5231296 5221493 5218544 5226753 5267952 5204551 5125081 5069509 5152890 5203392 5224436 5229131 5270992
15908 5270992 5307924 5319285 5324115 5308510 5304716 5293720 5288075 5313353 5268779 5177716 5167026 5225740
15896 5225740 5186212 5170455 5145989 5150294 5160813 5164070 5210342 5188671 5214293 5260545 5325034 5292826
15884 5292826 5240295 5221808 5208332 5223361 5191831 5180952 5144235 5166743 5246867 5220802 5226348
15873 5226348 5227604 5199130 5223043 5195988 5217046 5242696 5186216 5155153 5229395 5302498 5320321
15862 5320321 5263842 5278455 5244832 5182235 5278363 5308702 5282573 5277294 5317158 5263463 5287706
15851 5287706 5350262 5273420 5242556 5213709 5268205 5346642 5303426 5228622 5250244 5278286 5273049
15840 5273049 5313966 5288353 5244609 5164495 5224766 5232450 5255145 5325684 5355265 5302932 5259750
15829 5259750 5303354 5282740 5259518 5255335 5332325 5333308 5280822 5260324 5252521 5310482 5283278 5272503
15817 5272503 5320375 5283107 5255792 5272816 5278220 5202576 5234640 5286288 5240115 5217078 5227934
15806 5227934 5254597 5296584 5343348 5278730 5271292 5321134 5284123 5238208 5214047 5249997 5291153
15795 5291153 5369809 5424686 5418763 5403276 5382528 5292974 5266794 5278221 5333123 5344450 5309255
15784 5309255 5249397 5219522 5203853 5209355 5204670 5247930 5310529 5330189 5296214 5306789 5331622 5346215
15772 5346215 5374563 5355009 5341854 5385276 5334585 5287140 5324403 5360923 5311205 5327999 5289736
15761 5289736 5366671 5415433 5362360 5372069 5297044 5332078 5332792 5361632 5346729 5352967 5337176 5321796
15749 5321796 5314034 5317926 5283587 5263152 5232874 5260370 5296852 5322768 5332734 5315488 5304917 5283047
15737 5283047 5331456 5386683 5354820 5329465 5286994 5328636 5300367 5342112 5347808 5368553 5434774
15726 5434774 5415534 5361014 5344159 5355403 5415621 5390451 5377423 5469717 5472774 5393863 5361740
15715 5361740 5343569 5362648 5402007 5400976 5347585 5351783 5406842 5433517 5486579 5434190 5395029 5359327
15703 5359327 5348158 5334455 5329453 5344887 5348671 5373479 5383904 5310650 5341159 5358269 5388358 5358995
15691 5358995 5355619 5374005 5411495 5440834 5351171 5372411 5406222 5396736 5408611 5431004 5398981 5348647
15679 5348647 5429434 5412450 5403236 5337212 5315041 5374413 5377896 5438644 5456574 5477511 5425823 5399268
15667 5399268 5345806 5339654 5418921 5424189 5387431 5420451 5413883 5441618 5447943 5436124 5429540 5402603
15655 5402603 5413370 5456599 5406684 5421202 5420630 5380275 5423638 5395314 5342400 5357715 5413026 5395149
15643 5395149 5373015 5373825 5348369 5329338 5364025 5420719 5420147 5371822 5358813 5433750 5416370 5379794
15631 5379794 5421974 5399778 5408811 5377015 5395499 5382911 5434335 5413337 5402390 5436029 5459410
15620 5459410 5441406 5402739 5409484 5393223 5402117 5438737 5417158 5405551 5454357 5492206 5439646 5452142
15608 5452142 5400502 5375792 5369438 5348079 5412467 5371660 5386969 5440175 5442749 5441813 5376481 5391187
15596 5391187 5387488 5355848 5411036 5392315 5399274 5401724 5395874 5380508 5348038 5379383 5429103 5464974
15584 5464974 5397576 5424981 5468546 5431586 5440800 5378266 5377130 5437881 5408136 5406073 5432094 5417417
15572 5417417 5423215 5411794 5436887 5412118 5380791 5409116 5465757 5430325 5445546 5494016 5494402 5487997
15560 5487997 5448622 5460577 5427889 5436324 5397979 5404144 5434276 5384330 5392934 5448720 5444478 5431038
15548 5431038 5479291 5476566 5478237 5504187 5530767 5483849 5472127 5490256 5501157 5554132 5529990 5479669
15536 5479669 5528677 5425322 5381067 5411657 5458289 5475575 5486148 5480907 5488732 5516260 5496349
15525 5496349 5537132 5510537 5463328 5475608 5450527 5447754 5450655 5531956 5572490 5497874 5465980 5473916
15513 5473916 5497113 5524430 5524970 5502044 5527416 5530388 5496189 5484545 5552703 5557000 5543414 5537449
15501 5537449 5547503 5549303 5546843 5549186 5532078 5544580 5536389 5516314 5560774 5535858 5560004 5540213
15489 5540213 5527122 5506753 5506183 5531514 5470095 5518749 5515617 5523856 5444168 5435283 5455590 5510555
15477 5510555 5585718 5571955 5508911 5489908 5480091 5478212 5441795 5495844 5488883 5463332 5434148 5431394
15465 5431394 5444925 5457972 5558278 5543018 5564472 5544254 5532150 5481885 5512902 5532594 5511117
15454 5511117 5507702 5579654 5605589 5471334 5510774 5537903 5525834 5569947 5557732 5528297 5542802
15443 5542802 5539958 5517822 5550921 5604742 5597105 5498744 5496744 5474707 5435798 5417004 5503598 5497002
15431 5497002 5542109 5537559 5512028 5488436 5506742 5566300 5571706 5557753 5559678 5563483 5566541 5529973
15419 5529973 5488535 5518886 5534097 5567691 5577872 5582287 5585942 5604411 5522784 5510130 5545280 5621887
15407 5621887 5593489 5572973 5574998 5583260 5524724 5476048 5550552 5497788 5441475 5475530 5437117 5425284
15395 5425284 5462525 5523784 5559506 5541095 5582370 5627883 5522512 5528048 5553021 5571230 5627812
15384 5627812 5639198 5610682 5508667 5532853 5574137 5617757 5592590 5584987 5544861 5523287 5622623
15373 5622623 5619469 5583202 5581903 5562473 5592157 5528796 5503958 5569379 5637754 5658221 5581745 5583245
15361 5583245 5599373 5585796 5564131 5585781 5659724 5621866 5616170 5566950 5551325 5551904 5570887 5651091
15349 5651091 5623512 5600695 5603320 5551751 5572803 5595884 5615644 5624149 5596505 5615789 5643548 5603354
15337 5603354 5523941 5582135 5608473 5600851 5650715 5583839 5585529 5602164 5564008 5490069 5583064 5664531
15325 5664531 5645563 5596696 5585364 5596662 5542350 5530549 5583269 5577019 5575125 5599591 5646195 5689728
15313 5689728 5621578 5654858 5630405 5608399 5567380 5634174 5692353 5697734 5677489 5677391 5657670 5642234
15301 5642234 5662456 5596897 5637866 5668553 5626769 5676584 5708653 5686205 5685649 5695135 5678467 5632684
15289 5632684 5628490 5610925 5628362 5631473 5642330 5617833 5622333 5720026 5723254 5703081 5671703 5657111
15277 5657111 5643272 5659679 5658657 5663888 5685413 5707587 5651849 5630835 5646228 5668140 5654157 5626520
15265 5626520 5597558 5707075 5719048 5717473 5680685 5687713 5681882 5729611 5745221 5706844 5738663 5745574
15253 5745574 5709978 5641088 5641628 5644541 5579898 5554478 5534801 5589210 5633976 5613045 5669775 5663432
15241 5663432 5703953 5741443 5700043 5668743 5691405 5685900 5701624 5661116 5708542 5658135 5631878
15230 5631878 5665708 5670637 5643563 5627525 5625571 5621075 5628807 5597674 5639670 5685291 5678659 5631724
15218 5631724 5661840 5664008 5685542 5730094 5740197 5689649 5685081 5690813 5703309 5657692 5617401 5613902
15206 5613902 5581771 5641723 5659114 5708503 5679194 5690415 5738146 5749249 5750549 5735918 5766855
15195 5766855 5749529 5705568 5638382 5620501 5696590 5663790 5742151 5769369 5738436 5717082 5730200
15184 5730200 5648504 5705864 5733256 5735238 5763640 5755177 5803915 5800981 5757983 5709869 5725717 5751860
15172 5751860 5744161 5750308 5734911 5726211 5725202 5737895 5762039 5758685 5732187 5725248 5802249 5782873
15160 5782873 5737984 5760655 5796462 5801713 5767701 5757239 5761010 5745594 5729722 5774943 5780659 5753417
15148 5753417 5729029 5806500 5704647 5722179 5716045 5685450 5755666 5761133 5745878 5778017 5778972 5712546
15136 5712546 5781207 5753740 5676768 5676615 5730633 5739467 5774322 5784961 5777256 5772263 5784564 5813252
15124 5813252 5758839 5736824 5738794 5712183 5769118 5746636 5726681 5772716 5766559 5752501 5791655 5748855
15112 5748855 5807826 5791110 5680250 5698780 5690495 5677858 5710264 5648307 5712361 5736269 5714641
15101 5714641 5715316 5816900 5770433 5766403 5808240 5783942 5806510 5775419 5773827 5796985 5754766 5710840
15089 5710840 5772787 5794713 5817934 5860864 5849790 5784220 5714604 5750262 5743933 5750702 5744076 5749108
15077 5749108 5808933 5787524 5719555 5731189 5784540 5776025 5763837 5804219 5778666 5733158 5736998 5798300
15065 5798300 5745546 5699962 5702547 5730524 5763714 5798300 5846251 5827904 5749129 5784474 5780636 5744582
15053 5744582 5788402 5787155 5826662 5879656 5817010 5790656 5762470 5732423 5811325 5833060 5824387 5779987
15041 5779987 5792607 5762234 5732892 5769037 5831832 5781444 5748860 5806829 5835394 5851193 5821031
15030 5821031 5811852 5815331 5798663 5829015 5769441 5780235 5865315 5843349 5821566 5834346 5828649 5806742
15018 5806742 5764325 5865824 5796547 5771545 5810971 5807807 5844415 5797212 5781496 5823854 5841777
15007 5841777 5896353 5876138 5880959 5865399 5896316 5861923 5786478 5764979 5853084 5813966 5785943
14996 5785943 5827124 5746569 5770445 5797835 5785269 5766209 5777806 5754997 5814443 5812930 5817164 5848687
14984 5848687 5826727 5793399 5808133 5840463 5868381 5836487 5778054 5809422 5851672 5895572 5903139
14973 5903139 5826516 5790201 5826016 5827991 5829191 5818310 5828906 5825636 5796871 5800002 5891555 5906186
14961 5906186 5864934 5858810 5870943 5837678 5867322 5893885 5845880 5802737 5818156 5885342 5905903
14950 5905903 5887894 5876158 5920242 5832943 5823465 5857972 5875893 5912350 5864556 5829705 5833759 5815125
14938 5815125 5808730 5795463 5795235 5827403 5791582 5863800 5852098 5903871 5958240 5928308 5931323 5859041
14926 5859041 5874726 5807267 5826548 5834110 5863349 5888805 5855423 5890875 5801064 5809719 5820378 5836965
14914 5836965 5859426 5863064 5835407 5822163 5849976 5868409 5902769 5842556 5856519 5801511 5826674
14903 5826674 5908748 5913873 5910820 5892194 5846102 5907326 5934696 5908379 5891712 5874247 5872142 5900863
14891 5900863 5962584 5934276 5913241 5916740 5905732 5893815 5865337 5851376 5879417 5924093 5904900
14880 5904900 5950539 5873801 5839655 5848375 5856265 5861682 5887247 5907734 5893297 5896612 5859393 5886227
14868 5886227 5931720 5903055 5873067 5861917 5894267 5934622 5965630 5897253 5898853 5892801 5893526 5943299
14856 5943299 5931161 5978154 5846183 5821395 5837187 5815954 5877605 5967260 6024447 5975889 5959876
14845 5959876 5989745 5949373 5960788 5974208 5948757 5899583 5935342 5986241 5951871 5948996 5988740
14834 5988740 5972375 5875760 5846614 5892373 5906156 5987397 6013194 5922047 5901177 5925125 5948152
14823 5948152 5899712 5931860 6017020 5989018 5971765 5934789 5910580 5859802 5857898 5859403 5882444 5964707
14811 5964707 6001032 5985202 5989575 5911192 5880577 5882585 5931386 5929122 5942447 5937964 5852173 5898356
14799 5898356 5929732 5911260 5884481 5941056 5940293 5981860 5976327 5984730 6023649 5987674 5938222 5898224
14787 5898224 5934858 5926432 5891249 5917560 5932345 6011882 6031520 6023754 6022782 6012989 5972714 5984854
14775 5984854 5981508 5964019 5937739 5953729 5948252 5963173 5986065 5889247 5877311 5888568 5897524 5935458
14763 5935458 5949729 5923933 5943363 5959059 5942271 5964420 5959205 5963497 5940604 5954581 5968953 6009788
14751 6009788 5984975 5973782 5980324 5969078 5968788 5946949 6028296 6040497 6077106 6002679 5965740 5940781
14739 5940781 5981926 5962797 6011732 6007199 6036998 6031227 6043012 5999291 6006238 5991284 5957535 5953082
14727 5953082 5974631 6007543 5994010 6019331 6011813 6028891 5999238 5988878 6007175 5986518 5966138
14716 5966138 5962477 5998482 6004386 6015926 6042112 6007024 5970363 5976206 5951776 5952568 6029444 5993960
14704 5993960 5970773 5950258 5976373 5986308 6051964 6105873 6109118 6024105 6000608 5985294 5976662 6016762
14692 6016762 6043227 6019522 6037480 6055237 6053289 5976000 5912973 5978641 5987943 6021954 6041794 6042684
$$ [...]
##END NTUPLES=NMR SPECTRUM
##END=
