##TITLE=1H_DE-80H_X3
 200.13MHz, d2o
 8 sc
 
 19ns.26.2.2025
##JCAMPDX= 6.0         $$ Bruker NMR JCAMP-DX V2.0
##DATA TYPE= NMR SPECTRUM
##DATA CLASS= NTUPLES
##ORIGIN= UXNMR, Bruker Analytische Messtechnik GmbH
##OWNER= pz
$$ XWIN-NMR		Version 3.5
$$ Thu Oct  9 12:12:03 2025 Russian Standard Time (UT+4h)  Yarkov@DPX200
##.OBSERVE FREQUENCY= 200.1313
##.OBSERVE NUCLEUS= ^1H
##.ACQUISITION MODE= SIMULTANEOUS
##.ACQUISITION SCHEME= undefined
##.AVERAGES= 8
##.DIGITISER RES= 18
##SPECTROMETER/DATA SYSTEM= spect
##.PULSE SEQUENCE= zg30
##.SOLVENT NAME= CDCl3
##.SHIFT REFERENCE= (INTERNAL, CDCl3, 0, 15.5243)
##AUDIT TRAIL= $$ (NUMBER, WHEN, WHO, WHERE, WHAT)
$$ ##TITLE= Audit trail, XWIN-NMR		Version 3.5
$$ ##JCAMPDX= 5.01
$$ ##ORIGIN= Bruker BioSpin GmbH
$$ ##OWNER= Yarkov
$$ C:/Bruker/XWIN-NMR/data/yarkov2/nmr/H-C/1/pdata/1/auditp.txt
$$ ##AUDIT TRAIL=  $$ (NUMBER, WHEN, WHO, WHERE, WHAT)
(   1,<2025-10-09 12:11:24.39 +0400>,<Yarkov>,<DPX200>,
      <created by zg, POWCHK disabled, PULCHK disabled
       configuration hash MD5:
       00 E9 B6 7A A2 85 ED C7 34 08 36 98 17 FE 4E 26
       data hash MD5: 16K
       E6 81 57 C6 BA 53 E7 67 D1 35 0B 62 24 F0 78 A8>)
(   2,<2025-10-09 12:11:28.65 +0400>,<Yarkov>,<DPX200>,
      <Start of raw data processing
       efp BC_mod = 2 LB = 0.25 FT_mod = 6 PKNL = 1 PHC0 = -2432.963 PHC1 = 8.79097 SI = 16K 
       data hash MD5: 16K
       4E 44 B7 33 9F 92 28 39 21 ED D8 F8 B8 9A 3B 68>)
(   3,<2025-10-09 12:11:33.54 +0400>,<Yarkov>,<DPX200>,
      <abs ABSG = 5 
       data hash MD5: 16K
       3A F3 60 94 88 60 AB 55 23 B2 EF 36 9E 86 92 DE>)
$$ ##END=
$$ 
$$ hash MD5
$$ BB 7A 69 72 07 B5 51 68 C8 E5 71 10 46 63 6C 3B
##$RELAX= 
##$RELAX= 
##$RELAX= 
##$RELAX= 
##$RELAX= 
##$RELAX= 
$$ Bruker specific parameters
$$ --------------------------
##$DU= <C:/Bruker/XWIN-NMR>
##$EXPNO= 1
##$NAME= <H-C>
##$PROCNO= 1
##$TYPE= <nmr>
##$USER= <yarkov2>
##$AMP= (0..31)
100 100 100 100 100 100 100 100 100 100 100 100 100 100 100 100 100 100 
100 100 100 100 100 100 100 100 100 100 100 100 100 100 
##$AQSEQ= 0
##$AQ_mod= 1
##$AUNM= <au_zg>
##$AUTOPOS= <>
##$BF1= 200.13
##$BF2= 200.13
##$BF3= 200.13
##$BF4= 200.13
##$BF5= 200.13
##$BF6= 200.13
##$BF7= 200.13
##$BF8= 200.13
##$BYTORDA= 1
##$CFDGTYP= 0
##$CFRGTYP= 5
##$CHEMSTR= <none>
##$CNST= (0..31)
1 1 145 1 1 1 1 1 1 1 1 1 1 1 1 1 1 1 1 1 1 1 1 1 1 1 1 1 1 1 1 1 
##$CPDPRG= <>
##$CPDPRG1= <>
##$CPDPRG2= <>
##$CPDPRG3= <>
##$CPDPRG4= <mlev>
##$CPDPRG5= <mlev>
##$CPDPRG6= <mlev>
##$CPDPRG7= <mlev>
##$CPDPRG8= <mlev>
##$CPDPRGB= <>
##$CPDPRGT= <>
##$D= (0..31)
0 0.7 0 0 0 0 0 0 0 0 0 0.03 0 0 0 0 0 0 0 0 0 0 0 0 0 0 0 0 0 0 0 0 
##$DATE= 1759997483
##$DBL= (0..7)
120 120 120 120 120 120 120 120 
##$DBP= (0..7)
150 150 150 150 150 150 150 150 
##$DBP07= 0
##$DBPNAM0= <>
##$DBPNAM1= <>
##$DBPNAM2= <>
##$DBPNAM3= <>
##$DBPNAM4= <>
##$DBPNAM5= <>
##$DBPNAM6= <>
##$DBPNAM7= <>
##$DBPOAL= (0..7)
0.5 0.5 0.5 0.5 0.5 0.5 0.5 0.5 
##$DBPOFFS= (0..7)
0 0 0 0 0 0 0 0 
##$DE= 6
$$ [...]
##$SUBNAM3= <"">
##$SUBNAM4= <"">
##$SUBNAM5= <"">
##$SUBNAM6= <"">
##$SUBNAM7= <"">
##$SUBNAM8= <"">
##$SUBNAM9= <"">
##$SW= 18.0517328524113
##$SWIBOX= (0..15)
0 0 2 0 0 0 0 0 0 0 0 0 0 0 0 0 
##$SW_h= 3612.71676300578
##$TD= 16384
##$TD0= 1
##$TE= 0
##$TE2= 300
##$TE3= 300
##$TEG= 300
##$TL= (0..7)
0 120 120 120 120 120 120 120 
##$TP= (0..7)
150 150 150 150 150 150 150 150 
##$TP07= 0
##$TPNAME0= <>
##$TPNAME1= <>
##$TPNAME2= <>
##$TPNAME3= <>
##$TPNAME4= <>
##$TPNAME5= <>
##$TPNAME6= <>
##$TPNAME7= <>
##$TPOAL= (0..7)
0.5 0.5 0.5 0.5 0.5 0.5 0.5 0.5 
##$TPOFFS= (0..7)
0 0 0 0 0 0 0 0 
##$TUNHIN= 0
##$TUNHOUT= 0
##$TUNXOUT= 0
##$USERA1= <user>
##$USERA2= <user>
##$USERA3= <user>
##$USERA4= <user>
##$USERA5= <user>
##$V9= 5
##$VALIST= <valist>
##$VCLIST= <CCCCCCCCCCCCCCC>
##$VD= 0
##$VDLIST= <DDDDDDDDDDDDDDD>
##$VPLIST= <PPPPPPPPPPPPPPP>
##$VTLIST= <TTTTTTTTTTTTTTT>
##$WBST= 1024
##$WBSW= 4
##$XGAIN= (0..3)
0 0 0 0 
##$XL= 0
##$YL= 0
##$YMAX_a= 893717
##$YMIN_a= -739669
##$ZGOPTNS= <>
##$ZL1= 120
##$ZL2= 120
##$ZL3= 120
##$ZL4= 120
##$ABSF1= 15.62129
##$ABSF2= -2.430561
##$ABSG= 5
##$ABSL= 3
##$ALPHA= 0
##$AQORDER= 0
##$ASSFAC= 0
##$ASSFACI= 0
##$ASSFACX= 0
##$ASSWID= 0
##$AUNMP= <proc_1d>
##$AZFE= 0.1
##$AZFW= 0.1
##$BCFW= 0
##$BC_mod= 2
##$BYTORDP= 0
##$COROFFS= 0
##$CY= -3
##$DATMOD= 1
##$DC= 0
##$DFILT= <>
##$DTYPP= 0
##$F1P= 0
##$F2P= 0
##$FCOR= 1
##$FTSIZE= 16384
##$FT_mod= 6
##$GAMMA= 0
##$GB= 0
##$INTBC= 1
##$INTSCL= 3.241238e-09
##$ISEN= 128
##$LB= 0.25
##$LEV0= 0
##$LPBIN= 0
##$MAXI= 10000
##$MC2= 0
##$MEAN= 0
##$ME_mod= 0
##$MI= 1.114404
##$NCOEF= 0
##$NC_proc= -6
##$NLEV= 6
##$NOISF1= 3.799351
##$NOISF2= 2.8
##$NSP= 0
##$NTH_PI= 0
##$NZP= 0
##$OFFSET= 15.52433
##$PC= 1
##$PHC0= -2432.963
##$PHC1= 8.79097
##$PH_mod= 1
##$PKNL= yes
##$PPARMOD= 0
##$PSCAL= 0
##$PSIGN= 0
##$REVERSE= no
##$SF= 200.129999475578
##$SI= 16384
##$SIGF1= 3
##$SIGF2= 2
##$SINO= 0.751879
##$SIOLD= 32768
##$SREGLST= <19F.Aceton>
##$SSB= 0
##$STSI= 16384
##$STSR= 0
##$SW_p= 3612.71676300578
##$SYMM= 0
##$S_DEV= 0
##$TDeff= 16384
##$TDoff= 0
##$TI= <>
##$TILT= no
##$TM1= 0
##$TM2= 0
##$TOPLEV= 0
##$USERP1= <user>
##$USERP2= <user>
##$USERP3= <user>
##$USERP4= <user>
##$USERP5= <user>
##$WDW= 1
##$XDIM= 16384
##$YMAX_p= 454679019
##$YMIN_p= -751459
$$ End of Bruker specific parameters
$$ ---------------------------------
##NTUPLES= NMR SPECTRUM
##VAR_NAME=  FREQUENCY,     SPECTRUM/REAL,   SPECTRUM/IMAG
##SYMBOL=    X,             R,               I
##VAR_TYPE=  INDEPENDENT,   DEPENDENT,       DEPENDENT
##VAR_FORM=  AFFN,          ASDF,            ASDF
##VAR_DIM=   16384,         16384,           16384
##UNITS=     HZ,            ARBITRARY UNITS, ARBITRARY UNITS
##FACTOR=    0.220516191357247, 1,           1
##FIRST=     3106.88418260882, 0,            0
##LAST=      -505.832580396959, 0,           0
##MIN=       -505.832580396959, -751459,     0
##MAX=       3106.88418260882, 454679019,    0
$$ Real data points
##PAGE= N=1
##DATA TABLE= (X++(R..R)), XYDATA
$$ [...]
8642 54109512 54542135 55265406 55796113 55704519 55203589 53989908 52012308 48965111 45227026
8633 45227026 41559512 38130917 35433091 32936163 30811566 28991559 27503973 26297004
8625 26297004 25183825 24198867 23266744 22465136 21771997 21239989 20602770 20087395 19536392
8616 19536392 19057871 18653772 18196126 17887428 17635112 17484203 17334389 17206814 17147706 17124899
8606 17124899 17167200 17077370 16994314 16846185 16671635 16558378 16586645 16510878 16379634 16254395
8596 16254395 16390840 16617660 16825216 16866845 16771610 16818491 16839562 16967628 16997856 17024155
8586 17024155 17103725 17218991 17397502 17523266 17662961 17905223 18118727 18401535 18710762 19034661
8576 19034661 19596648 20037793 20392776 20808365 21278965 22020172 22859320 23699657 24452405
8567 24452405 25238184 26327743 27592145 29144563 30918234 32759112 34611212 36270867
8559 36270867 37672233 38694146 39164494 39196370 38703326 38059862 37602743 37495932 37901135
8550 37901135 38418514 38791424 39139385 39119964 38824796 38119735 36896570 35412322 33913878
8541 33913878 32664289 31675561 30902904 30259800 29758181 29478289 29274378 29183842 29211971 29388237
8531 29388237 29822926 30424574 31217862 32274815 33436286 34628337 35994070 37632436 39778345
8522 39778345 42252797 44980242 47685617 50269556 52456288 54197759 55202735 55330103
8514 55330103 54728369 53702081 52673960 51817217 51646978 51844531 52255797 52397146 52027813
8505 52027813 51107823 49567562 47576468 45033474 42147336 39250861 36755896 34851660
8497 34851660 33189857 31709115 30278480 29147411 28089009 27290917 26559732 25908213 25464707
8488 25464707 25064051 25001672 24936683 25007365 25129361 25309739 25739855 26421429 27340969 28499602
8478 28499602 29457347 30294390 30838031 30967747 30981660 30437539 29608409 28768786 28208792 28252130
8468 28252130 28378117 28595505 28519772 28375091 27910749 27141152 26041472 24577859 23003883
8459 23003883 21603773 20203078 18924537 18014525 17159416 16579172 15721715 15038890 14450026
8450 14450026 13800180 13310550 12771297 12433688 11944054 11512837 11051787 10597136 10176293
8441 10176293 9832744 9459273 9251497 9047826 8732289 8599746 8315461 8240812 8039855 7982250
8431 7982250 7884669 7717711 7706295 7499549 7503542 7360764 7233777 7138101 7129025 7083558 7000576
8420 7000576 6756618 6524411 6455337 6363566 6430813 6229930 6136924 6024143 5955690 5850101
8410 5850101 5631527 5538076 5459679 5424929 5313708 5276092 5067552 4988436 4898526 4777188 4793148
8399 4793148 4729333 4732346 4648357 4636709 4467703 4416456 4411617 4487836 4383701 4152446 4041088
8388 4041088 3952377 4062334 4044164 3990181 3835411 3774127 3898390 3947993 3920014 3806930 3718905
8377 3718905 3698121 3826259 3914983 3867864 3772326 3711327 3688431 3696967 3750176 3698324 3740866
8366 3740866 3527025 3365059 3336638 3373084 3375096 3287426 3154126 3069344 3101150 3086609 3143104
8355 3143104 2990171 2904889 2829347 2896388 2954479 2859018 2735667 2562861 2628800 2657002 2683375
8344 2683375 2732113 2728608 2626793 2529623 2561819 2532582 2683509 2714128 2715757 2612271 2646887
8333 2646887 2675366 2756490 2828579 2746193 2657008 2587656 2658463 2669970 2657573 2622690 2537746
8322 2537746 2553141 2599483 2664225 2681525 2673163 2477595 2406209 2501106 2571399 2656816 2518078
8311 2518078 2452728 2404743 2482133 2511779 2423652 2339064 2342114 2356216 2315580 2186920 2118291
8300 2118291 2072680 2059659 2107366 1971818 1953499 2011139 2087520 2099589 1819181 1769332 1969531
8289 1969531 2149864 2192382 1902092 1826522 1906776 2036116 2241785 2087262 1985449 1947410
8279 1947410 2060021 2199196 2081858 1960308 2011169 2001273 2007903 1888201 1780937 1818283 1719009
8268 1719009 1778488 1567035 1471668 1459645 1441560 1621542 1395354 1240622 1199058 1354360
8258 1354360 1438194 1334632 1250353 1079732 1068055 1138462 1273734 1281688 1308580 1188479 1273004
8247 1273004 1149332 1137830 1168852 1061229 1274879 1215144 1360092 1270956 1212523 1253808 1206001
8236 1206001 1263218 1158790 1144686 1115142 1207034 1180106 1133595 952003 1085002 1095485 1008563
8225 1008563 1062891 904096 1085903 913299 925917 807660 765557 947565 864467 775716
8215 775716 694101 750652 901789 976352 890575 838036 616283 788548 834779 787215 818207
8204 818207 588183 907757 885163 947284 839338 705128 821209 727947 746718 681812 813217
8193 813217 863416 875732 839623 755581 688012 886138 989138 784580 708618 454330 787580
8182 787580 840984 859042 810833 575482 726348 708878 872180 751707 679692 698919 704581
8171 704581 622442 682296 642454 674557 700443 470311 632152 653413 801650 741296 589213
8160 589213 545589 409756 622705 601778 753337 740194 604900 531998 516133 582725 716919
8149 716919 806763 705231 639268 549310 694672 648854 696410 588742 513868 637786 634395
8138 634395 676803 512166 574291 576754 551931 515572 393113 406301 483525 536736 437025
8127 437025 373163 319874 526817 527432 404137 334262 243740 341616 423561 490061 362000
8116 362000 345807 417943 375878 431098 421969 469514 487340 535230 479932 356499 374030 429910
8104 429910 367638 274882 239346 326233 424814 413993 456554 283221 247471 345416 396535
8093 396535 452608 412499 295659 219912 238348 278247 360535 356274 221303 193079 115228
8082 115228 139183 243363 253951 253611 285369 197064 134557 96553 129059 209454 240381 153531
8070 153531 188678 227391 222862 170680 88252 164998 209620 202895 151858 175736 160013 277226
8058 277226 205427 79657 58500 89305 255073 284069 157694 10273 42452 166678 247276
8047 247276 243690 56390 20170 151925 196261 109158 100743 81652 200748 99812 -31060
8036 -31060 72460 88162 337806 191897 120336 33526 7110 85443 78064 8263 -118347
8025 -118347 -24838 172785 257760 91636 22585 -91633 -33249 10269 -8894 116626 12334
8014 12334 77589 -12400 -33046 6319 76834 202860 54964 12649 13496 153012 186468 135946
8002 135946 16306 -2238 -112978 -31380 38327 572 122823 -18934 -11224 -32023 -26913
7991 -26913 -2280 -142405 -122153 -251503 -148343 -42174 75043 104163 -46047 -134849 -175827
7980 -175827 -135994 4881 150778 13728 -8620 -15923 69491 -18264 -58209 -18911 -107509
7969 -107509 -41064 -42890 87503 71954 -6947 -25386 -1428 66405 141515 54561 -65419
7958 -65419 -87167 -95220 -40591 8898 123937 41355 26224 -41756 -107894 20994 124756
7947 124756 215897 91619 -51846 -22949 58234 77988 137856 62445 39663 136927 136012 176146
7935 176146 119005 104169 105059 218945 242027 135847 192997 179415 182602 190256 276277 356457
7923 356457 429530 416337 312285 284817 303539 337510 420536 459671 353603 394212 438654
7912 438654 540554 624889 599819 581236 514948 699263 749708 827134 850682 907895 1059203
7901 1059203 1239657 1390673 1553898 1728390 1861248 2043609 2207379 2376121 2425240 2567767
7891 2567767 2438613 2288462 2136259 1875224 1753001 1484817 1367849 1209463 1106690 944274
7881 944274 694946 634212 606239 665751 558996 451996 350692 428027 393993 501348 438222
7870 438222 439254 482357 408771 518769 359527 383769 366705 312807 352345 370649 520889
7859 520889 420790 365542 257130 231417 286679 415607 400831 288999 101509 5151 15063
7848 15063 -41026 162559 61365 57276 20560 -34077 15235 -26331 138766 126555 94937
7837 94937 -19588 -40927 78239 109312 -28344 -122843 -144368 -9328 141592 -559 -17183
7826 -17183 -127561 -147580 -80381 -163347 -133586 -188131 -52646 -66435 -275302 -280866 -173876
7815 -173876 46313 69072 -118175 -301333 -259548 -124036 -25076 -203236 -488559 -229475
7805 -229475 -44993 31473 20558 -89862 -155771 -204571 -151308 -121469 -64870 -109675 -119460
7794 -119460 -150577 -188229 -113947 23267 -5713 -26189 -181601 -245663 -142349 20824 109231
7783 109231 112814 -70469 -206705 -240145 -146653 -41857 -145004 -244561 -282210 -201291 -127632
7772 -127632 -115128 -141160 -243152 -327651 -227286 -53446 17892 -84767 -268366 -318207 -301967
7761 -301967 -143603 -65192 -29655 -49612 -120274 -151715 -104207 -33045 17099 15117 -115734
7750 -115734 -171521 -197941 -62665 -5967 -108120 -125184 -110442 10105 -8579 -17582 -160065
7739 -160065 -177539 -148290 -105353 -82726 -173318 -181253 -229798 -176281 -237989 -193949 -109333 -51499
7727 -51499 -23399 -153697 -194788 -252996 -179313 -194920 -249111 -216143 -148412 -66877 -118564 -162182
7715 -162182 -142994 -25408 -109905 -51479 -166414 -261882 -233177 -238614 -137149 -221953 -237568
7704 -237568 -264695 -228775 -172116 -137348 -108328 -80414 -31512 -22176 20880 -146493 -232312 -271019
7692 -271019 -175992 -131781 -94792 836 -68345 -122416 -288041 -340365 -286311 -179801 -67417
7681 -67417 -102041 -155211 -231824 -237641 -201071 -143252 -240851 -267858 -212466 -123807 -80119 -103723
7669 -103723 -164588 -275641 -220351 -311216 -233047 -234675 -194064 -126870 -123617 -106194 -96438 -85590
7657 -85590 -87483 -70834 -169778 -234686 -270353 -198774 -209795 -172968 -237133 -292169 -326656 -355958
7645 -355958 -181232 -221806 -183523 -143518 -103201 -103378 -234436 -249432 -327534 -247867 -178555 -194140
7633 -194140 -239310 -173699 -198948 -91176 -84000 -117804 -158767 -243498 -208148 -202858 -197483 -191682
7621 -191682 -209499 -135032 -129965 -118513 -130496 -100786 -60683 -7187 -66098 -52763 -102515 -77280
7609 -77280 -127214 -261327 -197450 -184711 31390 105908 100034 -27387 -171651 -167225 -64472
7598 -64472 -84717 -36037 45119 60160 134623 54621 115543 23606 160406 240649 177904 355669
7586 355669 231496 235296 111254 31445 22658 66085 21967 -33662 -68152 -39287 2991 -67386
7574 -67386 -45921 -164384 -188826 -237452 -223799 -167989 -322557 -264824 -329339 -194899 -226972
7563 -226972 -173607 -132649 -235955 -284320 -184557 -50365 -13178 -62637 -245852 -223911 -281721
7552 -281721 -175798 -196560 -280161 -227151 -213250 -20471 -115170 -149819 -195201 -235056 -196262
7541 -196262 -202552 -264826 -212131 -214307 -351174 -275921 -314781 -107088 -145208 -190273 -227658 -247374
7529 -247374 -119514 -80777 -19877 -173138 -200286 -132049 -72734 -19297 3025 46649 114791
7518 114791 185222 206749 207311 66972 -10657 -129254 -74779 132695 171576 203560 79533
7507 79533 24556 -4098 57226 145529 195251 82217 10173 -51102 -160162 -119144 -241565
7496 -241565 -271896 -309636 -222324 -147421 -63930 -47275 -179224 -139039 -145683 -155436 -69890 -39446
7484 -39446 -164543 -327508 -312406 -144908 -150213 -196115 -287681 -283046 -161327 -165300 -68055 -95014
7472 -95014 -90903 -90079 -129906 -207950 -297329 -262423 -173312 -177258 -138257 -86609 2745 59896 -97811
7459 -97811 -226719 -244940 -91621 84015 -49479 -137519 -222585 -142064 -36954 -67549 -120670
7448 -120670 -134707 -69009 28743 5315 72402 168091 61929 117790 47464 82139 154578
7437 154578 129290 173886 135818 302706 330271 387600 408861 285863 148070 161747 275377
7426 275377 383605 367994 328596 441485 377602 402187 295168 410996 520897 470306 544403
7415 544403 396049 411926 431423 297836 210264 138509 247971 383703 406394 355467 283713
7404 283713 282425 408192 292238 231566 169873 250979 307137 331752 429534 402439 453787
7393 453787 548365 538295 487703 390625 513679 547217 471690 449847 467385 429325 502257
7382 502257 422448 346476 384776 380761 491016 440549 433435 253700 280721 304252 234293 254307
7370 254307 251838 277798 291049 215206 231723 333514 342885 297233 291352 365564 434617 425188
7358 425188 396941 290476 251984 331800 394009 425874 304243 325454 412677 427717 444995
7347 444995 442828 463832 405559 322104 317475 282547 322802 365271 333785 317674 266635 348077
7335 348077 347100 296503 311659 289416 385292 445602 313072 242876 72212 135544 214460 218625
7323 218625 254802 208369 208047 267934 310338 212793 55198 -32820 126947 265994 314782
7312 314782 308204 260973 342274 352254 395513 375132 267341 278513 251363 280756 314649 234359
7300 234359 228765 303247 195588 99375 101635 194598 248122 252430 253946 143850 189746 167291
7288 167291 133091 79850 27809 123980 215107 270685 184270 78417 37633 113333 179072
7277 179072 206322 95380 76379 103406 94550 71625 -58316 28595 104554 149120 100247
7266 100247 4127 58468 119239 154274 18324 43232 52641 85862 34774 -44354 -57198 -73138
7254 -73138 80012 138714 144600 -38836 -223795 -156277 -99126 -38898 -112731 -208884 -309871
7243 -309871 -240813 -314091 -255595 -279931 -278713 -138752 -178334 -135336 -200413 -271092 -348636 -366552
7231 -366552 -327814 -292633 -301715 -325826 -379545 -413937 -381688 -440299 -390088 -396254 -406534 -431374
7219 -431374 -509322 -434691 -480755 -402550 -405373 -505460 -471651 -412037 -352982 -409296 -398925 -289839
7207 -289839 -234605 -263432 -395003 -525466 -499078 -456781 -387500 -316070 -386035 -371611 -372483 -334165
7195 -334165 -324884 -413720 -421656 -363675 -379006 -340168 -386364 -405994 -407451 -403701 -487907 -515004
7183 -515004 -432834 -285524 -251801 -305121 -434304 -410412 -411812 -318395 -403342 -437051 -385467
7172 -385467 -386163 -250311 -263578 -306153 -282379 -167459 -75118 -131135 -237540 -274232 -284540
7161 -284540 -205257 -133310 -210790 -207178 -270268 -310188 -356527 -390534 -322280 -315803 -312174 -428878
7149 -428878 -470164 -443463 -394876 -293903 -283776 -321075 -307860 -402144 -363209 -255226 -291641
7138 -291641 -405852 -477158 -398485 -266519 -261002 -300744 -452197 -401526 -344759 -294243 -218601
7127 -218601 -331472 -359388 -255298 -164332 -187466 -239301 -153324 -80980 -89752 -43757 -146892
7116 -146892 -206376 -89558 -40102 -22288 -189480 -188580 -148583 -118066 -90595 -220996 -289057
7105 -289057 -207285 -244164 -89054 -249604 -314537 -336502 -303000 -245437 -393393 -358043 -394088
7094 -394088 -357159 -347679 -454495 -487267 -413886 -371168 -312015 -443370 -481119 -417355 -397504
7083 -397504 -321674 -379231 -331048 -312573 -441635 -368872 -382462 -347223 -364746 -388398 -346586
7072 -346586 -397460 -398596 -372120 -416952 -411811 -447321 -372544 -241963 -301871 -356946 -409050 -360406
7060 -360406 -282174 -416865 -322887 -302176 -302492 -315551 -347670 -266037 -314464 -184816 -221175 -258366
7048 -258366 -308465 -197645 -97093 -71962 -138104 -174102 -133527 -98428 14861 -58768 11605
7037 11605 -11553 64354 126359 53420 -15032 -47535 -96140 -228467 -273104 -255305 -148491
7026 -148491 -15003 -31860 -198864 -344208 -322604 -309807 -197712 -181840 -194193 -210685 -174957
7015 -174957 -160858 -190783 -164526 -272239 -264054 -283044 -189809 -121857 -22881 -64558 -105597 -88623
7003 -88623 -173444 -58071 -67700 -150171 -245753 -216540 -156604 -87627 -148076 -294663 -359394 -444229
6991 -444229 -387285 -355075 -229677 -257514 -211550 -227400 -344913 -377026 -424814 -288585 -246998
6980 -246998 -255498 -354160 -433138 -269255 -164035 -186809 -325722 -428840 -375439 -187299 -106944
6969 -106944 -83460 -174022 -258790 -171000 -186083 -72490 -72551 -61559 -121430 -219880 -289767 -217147
6957 -217147 -161251 -165854 -285211 -432854 -508807 -408778 -210033 -274744 -352993 -413776 -518526
6946 -518526 -465015 -471875 -358324 -319760 -332073 -366670 -357976 -348722 -394015 -354494 -416471 -479033
6934 -479033 -517885 -280251 -73099 -81510 -240237 -409738 -427806 -285955 -180234 -200155 -216836
6923 -216836 -213559 -132943 -97584 -57535 -55247 -140481 -117222 -190909 -276836 -270292 -127790 -26020
6911 -26020 -165991 -391591 -300097 -230956 -95901 -65286 -171301 -294069 -333205 -252045 -236395
6900 -236395 -304187 -459401 -458143 -435387 -430953 -357507 -319407 -422104 -466026 -463944 -497877 -470787
6888 -470787 -422200 -336571 -396249 -436594 -476258 -532642 -521922 -488971 -543469 -461131 -402688 -403331
6876 -403331 -407384 -433753 -436786 -522108 -546516 -512764 -506305 -353218 -337167 -351595 -372404 -361794
6864 -361794 -335825 -455964 -376705 -256775 -265737 -273281 -285219 -179917 -48170 -114199 -163435
6853 -163435 -408577 -410038 -232666 -197123 -143231 -251513 -185666 -84421 -191489 -231465 -405776
6842 -405776 -320874 -262314 -373127 -446422 -489345 -442115 -416806 -482553 -591729 -734248 -704353
6831 -704353 -489912 -445670 -492527 -633177 -675264 -487470 -491414 -539886 -680547 -751459 -646356
6820 -646356 -582974 -579799 -560969 -610374 -575763 -680318 -720327 -637529 -595808 -508097 -543480 -622146
6808 -622146 -694017 -711348 -565235 -603866 -605481 -610374 -627344 -544318 -497145 -502567 -575109 -640238
6796 -640238 -719662 -606995 -517501 -451347 -567003 -592955 -641352 -664218 -544443 -547495 -624743
6785 -624743 -652998 -686671 -581732 -554288 -560246 -559622 -584692 -590353 -553571 -638351 -574977 -617276
6773 -617276 -566077 -548487 -600720 -538116 -597408 -501881 -577966 -591330 -564341 -608337 -580383 -520442
6761 -520442 -496212 -483404 -552909 -591627 -488954 -487166 -445669 -505422 -521868 -389439 -443648
6750 -443648 -436077 -587146 -620059 -588636 -544419 -442525 -553936 -645447 -644995 -505426 -432582
6739 -432582 -513892 -598914 -594377 -471087 -392110 -434357 -471300 -451787 -383452 -250650 -400002
6728 -400002 -444055 -369239 -373624 -336259 -314163 -247354 -237562 -164563 -278964 -262565 -267527 -319049
6716 -319049 -307974 -400617 -455595 -467558 -395118 -470186 -472153 -568569 -485312 -397865 -423590 -425674
6704 -425674 -538619 -511922 -541240 -512480 -609407 -598691 -466371 -434352 -377174 -437418 -463570
6693 -463570 -444390 -357741 -421030 -448128 -536547 -426389 -312159 -293017 -237658 -349245 -196444
6682 -196444 -162211 -150358 -265588 -302543 -137292 -175557 -49350 -55293 -252035 -320811 -243431
6671 -243431 -211875 -144619 -297257 -286675 -255744 -166386 -75144 -242707 -137867 -197940 -27900
6660 -27900 4896 -31149 -61929 -73688 54673 25595 -88534 -163149 -61449 -25100 66030
6649 66030 -111040 -121581 -65244 -42483 145711 -27142 -101531 -257603 -179591 -74568 -90957
6638 -90957 -69504 -157408 -94754 -73196 64931 -2111 -19527 -101085 -107232 -3019 27216 -14235
6626 -14235 -222849 -206616 -180506 -27470 -26136 -37432 -112855 -145442 -92671 -206527 -255261
6615 -255261 -379878 -368299 -292541 -258648 -317941 -357582 -285998 -298889 -284804 -418080 -462363
6604 -462363 -515471 -338833 -286265 -343026 -491392 -521404 -415468 -358946 -355442 -521384 -499188
6593 -499188 -528697 -340924 -245084 -353366 -381923 -469575 -446073 -410066 -389131 -471811 -487299
6582 -487299 -481531 -400225 -388849 -397948 -374908 -527462 -363307 -405022 -355069 -267828 -285016 -289115
6570 -289115 -299590 -272510 -311769 -202031 -141908 -126644 -171153 -232076 -233665 -159343 -90291 -184871
6558 -184871 -185365 -253361 -181433 -105471 -22202 -111618 -204004 -123379 -149856 -124158 -167790 -111024
6546 -111024 -141234 -48153 14598 12519 37370 -45133 -77193 -148932 33150 128564 135769 128045
6534 128045 92380 63241 154255 257056 198268 187504 236454 404337 491241 367538 299919
6523 299919 425081 534546 582534 543168 502386 618661 770242 893004 870260 822461 851037
6512 851037 1012975 1056595 1079840 1113900 1133902 1384022 1425512 1407075 1306929 1352404 1528312
6501 1528312 1557406 1524919 1512822 1659159 1861071 2043280 2020341 2010939 2144199 2394418 2667828
6490 2667828 2921508 3104655 3158825 3405502 3686518 3976731 4121474 4368155 4747633 5105707
6480 5105707 5574247 5975430 6373350 6650961 6815667 6928686 7032109 6979909 6839034 6432850
6470 6432850 6053340 5679651 5279679 5023348 4616597 4273549 4069647 3973797 3936785 3739760
6460 3739760 3717541 3672089 3607727 3549559 3469682 3465768 3490683 3395469 3346315 3214292 3100153
6449 3100153 3099839 2873349 2678942 2372751 2309727 2225618 2139367 2028208 1802118 1630364 1473699
6438 1473699 1398740 1331313 1328240 1275747 1239756 1204720 1152245 1138566 1104954 1133285 941230
6427 941230 1011193 1007250 1088679 1051262 958811 1018595 1001823 1069473 962658 843172 847162 972799
6415 972799 983065 866109 796185 812114 900634 907013 886187 734458 771129 812428 777060
6404 777060 697487 558386 504826 447747 492060 409209 353004 414366 422707 347807 191208
6393 191208 162421 230305 272022 256998 287509 223529 234600 246327 252151 249828 116339 160585
6381 160585 140222 200859 182183 244605 209893 79712 20492 27258 176375 165242 112301
6370 112301 1159 -84093 -7992 121199 162054 45061 -20600 -75058 12957 38367 80402
6359 80402 -52123 -58912 -31575 33163 108650 46215 119161 103879 126591 180451 70220 67679
6347 67679 79497 90833 115167 32608 53432 249821 222560 232883 176468 18869 89483
6336 89483 123924 292190 195237 151932 133271 203722 292098 281513 299992 269048 211645 226530
6324 226530 284126 296807 409177 405437 452606 340275 292750 397920 424522 490373 366211
6313 366211 321877 417109 496580 592552 533818 471649 356815 404748 522507 594793 561505
6302 561505 551432 543208 488177 462591 467526 566240 534136 578824 518091 544423 527795 557186
6290 557186 637785 591772 571347 612810 782686 822208 800766 738122 747532 771397 760315 816810
6278 816810 896170 913543 892130 827044 782696 837254 894932 1024593 1000040 894500 852160
6267 852160 905208 1055990 1071170 933289 842272 818112 1028105 1085620 1034493 1037912 1027398
6256 1027398 1089612 1160555 1040981 967258 967681 1094705 1270005 1156093 1183903 1286872 1389151
6245 1389151 1450467 1340454 1160665 1166045 1336534 1393939 1283683 1233582 1132899 1170132 1287197
6234 1287197 1259649 1278596 1262118 1267119 1275448 1273908 1315727 1346769 1389085 1359159 1271673 1353856
6222 1353856 1528078 1602571 1567494 1501469 1529101 1587715 1631543 1578034 1447955 1514662 1589394
6211 1589394 1625012 1622225 1599911 1721708 1786242 1807303 1731500 1710002 1830528 1959741 2018563
6200 2018563 1848565 1768610 1935366 2151805 2226261 2186922 2135136 2370729 2509506 2606066
6190 2606066 2679484 2606533 2755532 2918678 3052499 2984551 2913362 3069496 3244652 3335698
6180 3335698 3208186 3142932 3118179 3304162 3354566 3222834 3092461 3195363 3354957 3351898
6170 3351898 3409047 3378123 3436870 3419708 3519027 3618237 3729851 3869330 3988495 4154903 4241653
6159 4241653 4436640 4496633 4733703 4958292 5102186 5155957 5173290 5265560 5289300 5450403
6149 5450403 5310912 5250641 5129438 5176418 5197977 5220220 5142068 5086600 5143811 5243223 5371732
6138 5371732 5396313 5418276 5542545 5699430 5947626 6016714 6151054 6346134 6584228 6861416
6128 6861416 7055142 7252436 7488512 7798671 7947309 8185754 8349448 8649501 8860224 9054000
6118 9054000 9192801 9336729 9483872 9465759 9416813 9400077 9489136 9643113 9729710 9679807 9612352
6107 9612352 9637427 9781122 9876926 9844578 9884950 9848748 10027937 10081071 10166318 10163083 10176361
6096 10176361 10373616 10409545 10521411 10589246 10739845 10858510 10888010 10843357 10994651 11096704
6086 11096704 11256823 11296978 11247859 11329343 11353835 11442541 11431609 11446605 11475586 11547360 11585782
6075 11585782 11614171 11614406 11572046 11589063 11515147 11455735 11445431 11578740 11656915 11629912 11691236
6064 11691236 11730744 11957910 12124234 12317524 12550233 12848786 13167308 13469580 13791415 14168752
6054 14168752 14487256 14776413 15140417 15286521 15504533 15712201 16011507 16131607 16217964 16257355
6044 16257355 16351479 16658964 16925541 17299179 17654401 18166482 18691390 19249622 19849962 20388171
6034 20388171 21050640 21637147 22235720 22901485 23681290 24518638 25436508 26219406 26921193
6025 26921193 27715767 28442257 29212776 29737229 30119061 30477432 30889015 31379860 32085722
6016 32085722 32906637 33740770 34832316 36082539 37725828 39537576 41331223 43200040
6008 43200040 45245911 47465503 49892623 52472408 55078725 57724239 60101213 62405754
6000 62405754 64229303 65554727 66190011 66076121 65409325 64084884 62617958 60977498 59326175
5991 59326175 57851816 56587589 55490720 54734399 54497304 54644139 55123755 55751622 56864053
5982 56864053 58210406 60058214 62156363 64358243 66778811 69362534 72298729 75397609
5974 75397609 78888506 82528930 86541465 90498271 94082903 97137958 99117139 100028848
5966 100028848 99556998 97807798 94743122 90648580 85804897 80763457 75875801 71144193
5958 71144193 67041199 63534232 60722558 58313844 56349325 54636128 53215591 52169738
5950 52169738 51389868 50922517 50672260 50734328 50904160 51367248 51917868 52716376 53586879 54523431
5940 54523431 55804032 57021730 58159200 58790480 58982487 58524400 57549063 55799625 53422704
5931 53422704 50658883 47580647 44502862 41565164 38842722 36221336 34018602 31898027
5923 31898027 30214260 28752365 27322538 26184240 25074486 24220367 23491581 22799061 22109918
5914 22109918 21602040 21232794 20980353 20677951 20410568 20296212 20081482 19925705 19523847
5905 19523847 19058126 18449625 17749618 17164696 16407757 15721346 15000757 14423160 13955888
5896 13955888 13449013 13016393 12673976 12422825 12159456 11814029 11511202 11400628 11212019
5887 11212019 11099340 10750708 10402892 10140931 9935356 9943932 9785746 9591865 9318997 9197091
5877 9197091 9050974 8919354 8817419 8636072 8422676 8324471 8304854 8233424 8228062 8165399 8120530
5866 8120530 8023921 7903174 7876116 7775453 7789426 7814742 7799852 7822538 7806271 7771371 7729950
5855 7729950 7635389 7539230 7505044 7468196 7580736 7493832 7375663 7170998 7028528 7035104 7108119
5844 7108119 7058570 6969215 6922276 6885459 6819963 6673644 6628544 6568386 6510057 6473623 6341994
5833 6341994 6352141 6361265 6373700 6304320 6184852 6099364 6123162 6240710 6256454 6103973 5941819
5822 5941819 5905089 6009819 6169006 6070409 5977213 5856258 5973029 5976013 5800951 5781174 5787914
5811 5787914 5778914 5753225 5618160 5690578 5756738 5775716 5747193 5527724 5368022 5394564 5413768
5800 5413768 5375661 5236488 5118802 5068454 5205373 5268893 5053041 4914355 4719709 4735045
5790 4735045 4781986 4729157 4690003 4694404 4676926 4632575 4620144 4611688 4664126 4615789 4558318 4387673
5778 4387673 4313420 4332224 4332076 4314999 4126882 4059764 4218360 4266802 4176725 4118613 4042996
5767 4042996 4063573 4015884 4022838 4010008 3915527 3876709 3794999 3787538 3787684 3716643 3745547 3712307
5755 3712307 3672515 3636373 3635216 3611369 3511754 3423297 3451618 3539549 3615628 3553711 3408308
5744 3408308 3442080 3416050 3497919 3522520 3310954 3281204 3283731 3368117 3377610 3401108 3425096 3392771
5732 3392771 3451065 3548842 3520633 3507306 3475028 3481852 3541442 3555946 3589519 3610372 3646952 3584703
5720 3584703 3592542 3701169 3769842 3821835 3801454 3702960 3772821 3774534 3884553 3958270 3932475
5709 3932475 3914495 3931249 3983743 4032548 4190731 4301234 4299562 4216261 4224575 4310426 4441003
5698 4441003 4547644 4556109 4571789 4575777 4614540 4717705 4732484 4723884 4744372 4852302 4901932
5687 4901932 4979007 5011235 5016079 5041097 4945844 5134144 5194386 5270796 5281123 5294058 5382623
5676 5382623 5451956 5541015 5643029 5606877 5710291 5876784 5939932 6029585 5965761 6107212 6245298
5665 6245298 6382249 6417444 6441938 6629360 6806197 7099982 7157062 7282273 7449185 7640204
5655 7640204 7921855 8073780 8173081 8380937 8699019 8973064 9282330 9399344 9705183 10016802
5645 10016802 10297810 10439037 10446704 10732618 10980918 11246616 11333492 11348869 11419760 11538984
5635 11538984 11723749 11799324 11921746 12087640 12289001 12413342 12596909 12686794 12943615 13190951
5625 13190951 13363250 13739576 13889467 14342249 14705460 15023918 15334604 15681827 16100689
5616 16100689 16423189 16861063 17264122 17645769 17966768 18422149 18617078 18918219 19103473
5607 19103473 19458255 19955389 20285505 20944449 21505903 22191655 22896324 23513263 24391459
5598 24391459 25377070 26495965 27523927 28681262 29812809 31123749 32375246 33574283
5590 33574283 34649322 35885363 37283031 38642852 40067445 41192346 42543842 43734602
5582 43734602 45120119 46440196 47785723 49315442 50851780 52718561 54538731 56412505
5574 56412505 58411100 60668156 63171812 66006270 69099853 72648083 76848595 81543496
5566 81543496 86950849 92640265 99012191 105874679 113306499 121109156 129065456 137270735
5558 137270735 145338192 153506273 161253127 168407339 174482891 179241353 182291297 183436936
5550 183436936 182609729 179670174 174737358 168107201 160321823 151457929 142254901 133021439
5542 133021439 124088671 115697229 107547164 100004889 92992198 86756689 81162977 76126566
5534 76126566 71530391 67305825 63633770 60300926 57357495 54581947 52083984 49785785
5526 49785785 47704252 45558793 43605236 41714644 40035549 38425964 36619297 35011797
5518 35011797 33237331 31731344 30283693 28858450 27414593 26080957 25107684 24123714
5510 24123714 23235827 22261090 21364899 20521607 19865945 19020367 18199088 17491714 16932706
5501 16932706 16558846 15888249 15376757 14845246 14540445 14217969 13779209 13280381 12847590
5492 12847590 12652619 12403509 12164071 11761417 11435559 11147402 11037084 10761087 10563514
5483 10563514 10385377 10237943 10218335 10062591 10027382 9784142 9671865 9580908 9508221 9300051
5473 9300051 9125996 9142960 9160911 9200769 9109543 8871634 8609095 8535940 8480509 8432997 8310548
5462 8310548 8160011 7944867 7789713 7713351 7529030 7447336 7203720 7144832 7198440 7134335
5452 7134335 6977908 6905841 6940677 6779328 6747493 6632684 6471441 6420093 6453283 6391901 6186964
5441 6186964 6012863 5944032 5921492 5862264 5841132 5654643 5659582 5661243 5777055 5863085 5743768
5430 5743768 5772728 5703284 5770409 5787318 5838315 5903821 6046149 6170978 6251099 6188369 6184826
5419 6184826 6215744 5970117 5818431 5478798 5310889 5154566 5035424 4971143 4794807 4748311
5409 4748311 4620301 4664318 4768604 4862471 4823502 4741830 4742350 4804462 4865320 5025025 5165403
5398 5165403 5094519 5286513 5487184 5740524 5945302 5929319 5873484 5638848 5621454 5407184
5388 5407184 5048768 4746179 4438516 4255718 4186049 4089638 4084858 4055128 3943518 3936758 3793511
5377 3793511 3914377 4009410 4234471 4332722 4097873 4110928 4144906 4417150 4631760 4720222
5367 4720222 4684823 4749823 4890246 4903579 4775418 4601576 4377894 4023845 3857880 3694074
5357 3694074 3674183 3575825 3490099 3395498 3325134 3369689 3352270 3413606 3379062 3231418 3253136
5346 3253136 3326840 3421444 3375211 3272970 3294084 3313985 3336181 3409100 3300358 3399762 3389036
5335 3389036 3354440 3168004 2948133 2908332 2824272 2799438 2725086 2595717 2652981 2691550 2610825
5324 2610825 2474981 2386177 2436798 2549010 2630128 2587597 2464376 2501879 2564803 2560686 2477051
5313 2477051 2382943 2440583 2524442 2572166 2460910 2380511 2335706 2341645 2260355 2328040 2310360
5302 2310360 2186229 2149003 2145910 2211179 2317220 2279810 2147638 2019271 1927667 2046808 2180108
5291 2180108 2293597 2213569 2091511 2193217 2175649 2268727 2116012 2097652 2122761 2250291
5281 2250291 2271630 2287236 2318538 2275960 2203484 1986029 2037148 2116650 2342089 2289947 2252290
5270 2252290 2142229 2095087 2335528 2336404 2366340 2236311 2221743 2342818 2456404 2589825 2669727
5259 2669727 2632418 2597285 2607094 2612717 2795844 2838729 2963939 2955116 3036316 3126244 2973679
5248 2973679 3076363 3001663 3037893 2998681 3025254 3119948 3076424 3047160 3040324 2972731 2903106
5237 2903106 2900678 2905554 3071972 2970028 2994043 2919464 2838292 2917641 2880690 2982128 2913395
5226 2913395 3027108 3069528 3033849 3063913 3009740 3062889 3046451 2937084 2923491 3000857 3029339
5215 3029339 3179725 3088626 3092123 3058227 2952479 3067080 3016982 3134359 3107779 3152802 3226084
5204 3226084 3178853 3299970 3323868 3365287 3282719 3303234 3394197 3598411 3679531 3762311 3665596
5193 3665596 3657017 3647343 3631662 3707676 3589049 3685305 3693307 3742727 3753147 3740632 3786439 3733940
5181 3733940 3717887 3731475 3765052 3873156 3890238 3918027 3903468 3794309 3818927 3897762 3959680
5170 3959680 4047462 4053985 4147033 4182794 4215361 4271493 4219972 4189661 4088481 4137297 4262153
5159 4262153 4367501 4428815 4300390 4204177 4216850 4290819 4349960 4271054 4272599 4391261 4445745
5148 4445745 4540430 4534887 4395769 4441262 4478846 4606937 4605891 4612585 4596960 4610664 4663362 4629896
5136 4629896 4578472 4601830 4632629 4780232 4882105 4877640 4920530 4888002 4971828 4993567 5059190
5125 5059190 5160220 5312585 5462650 5530506 5540141 5571235 5701882 5834654 5762480 5753207 5685331
5114 5685331 5698940 5867412 5982031 6011303 5930855 5890537 5982129 6088832 6246670 6329123 6340682
5103 6340682 6364849 6436229 6643738 6723452 6756687 6752793 6803907 6918907 7046088 7185730 7303060
5092 7303060 7303749 7499704 7625321 7786211 8014826 8175399 8452879 8646402 8852804 9164015
5082 9164015 9476861 9893769 10071743 10163587 10293785 10384834 10651209 10727377 10758886 10819858
5072 10819858 10680747 10867268 11085949 11233818 11393808 11323132 11496955 11702827 11964602 12066806
5062 12066806 12038322 12142643 12345499 12525902 12707198 12742359 12935087 13151155 13264098 13377539
5052 13377539 13430568 13661709 13825948 14076607 14338082 14453513 14784283 14929558 15010328 15201394
5042 15201394 15411898 15850127 16380909 16896608 17375267 17648613 18013496 18321251 18334280 18210335
5032 18210335 18032930 18052485 17866022 17438194 17069499 16760597 16658039 16593699 16568469 16624962
5022 16624962 16589096 16567612 16624855 16619013 16706869 16760199 16865016 16927037 16904353 16943758 16969324
5011 16969324 17178986 17308678 17259709 17243567 17153583 17242035 17310302 17353405 17309174 17178472 17176408
5000 17176408 17317210 17442867 17509411 17622732 17793752 18107747 18395015 18710291 18914815 19169772
4990 19169772 19456792 19752979 20070374 20343849 20869037 21254093 21585711 21896789 22179160
4981 22179160 22621772 23146707 23700662 24112460 24565706 24981665 25571667 26171930 26735417
4972 26735417 27151362 27617515 28203687 28959213 29678671 30310979 31043563 31878733 32815380
4963 32815380 33703971 34536842 35358939 36231318 37229439 38207698 39184378 40109363 41237292
4954 41237292 42328854 43489917 44699156 45882031 47192068 48500411 49947642 51460956
4946 51460956 53095185 54856923 56705102 58571187 60690301 62944253 65331998 67918605
4938 67918605 70416054 73100237 75913524 78997931 82243673 85474695 89010664 92662535
4930 92662535 96526052 100520607 104700378 108841633 112920074 116919561 120539073 123659933
4922 123659933 126284752 128266752 129535589 130197052 130194304 130024882 129826705 129774006 129904144
4913 129904144 130222975 131005616 132245401 134189838 136702999 139530843 142746251 146440098
4905 146440098 150742922 155545596 160634875 166031455 171755666 177528091 183601427 189778166
4897 189778166 196143540 202671003 209079541 215237824 220688556 225408991 228876877 230892997
4889 230892997 231574997 230793385 228951092 226313698 223168192 220032398 217181668 214889229
4881 214889229 213101777 211584445 210439206 209509294 208738006 208053537 207164599 206259879 205292054
4872 205292054 204589522 204005643 203609776 203556459 203913228 204836025 206271145 208044877 210074128
4863 210074128 212180897 214110064 215415689 215569452 214517121 212163830 208516710 203727648
4855 203727648 197826181 191266164 184545022 178085472 172183382 166838750 162344041 158965417
4847 158965417 156680745 155197504 153945685 152635282 151124202 149060660 146218859 142256831
4839 142256831 137287982 131727747 125602030 119431050 113252878 107477808 102358265 97808094
4831 97808094 93817668 90097732 86964765 84347148 82074397 80084539 78219110 76537687
4823 76537687 75226309 73977332 72585792 71099352 69660149 68298831 66833395 65272518
4815 65272518 63572012 61856128 60372644 58908417 57463140 56033014 54716153 53798318
4807 53798318 52812149 51751749 50642774 49408796 48382570 47322734 46273688 45148346
4799 45148346 43911099 42919151 41872845 40888325 40008137 38940946 38062961 37324035 36467488
4790 36467488 35766748 35026383 34381213 33807204 33128820 32476180 31890061 31410362 30793929
4781 30793929 30319598 29941795 29408712 28983050 28539995 28155594 27802576 27435433 27001933
4772 27001933 26602064 26332367 26220645 25874725 25505116 25114355 24772627 24802243 24573418 24193888
4762 24193888 23846154 23627896 23554084 23301053 23036101 22687276 22446921 22403878 22399742 22199420
4752 22199420 21972323 21814243 21809681 21790865 21630586 21526349 21381837 21490794 21329359 21270601
4742 21270601 21155359 21145678 21256457 21267207 21355250 21236637 21231455 21440828 21543662 21555735 21573673
4731 21573673 21659238 21900390 22088102 22148410 22248726 22229738 22519034 22682629 22943453 23050812
4721 23050812 23134131 23414435 23544973 23782379 23924785 24090010 24251503 24432274 24669704 24782744
4711 24782744 24873282 24977287 25065298 25209045 25440852 25450952 25757789 25770934 25947920 26192144
4701 26192144 26234408 26498153 26548609 26840795 26979457 27094529 27296035 27509931 27703257 27802225
4691 27802225 27817387 28071212 28433005 28652074 28983264 29124448 29521827 29932275 30364277 30884352
4681 30884352 31051770 31467899 31623995 31884062 31894595 31855579 32024116 32057153 32002851 31902528
4671 31902528 31876943 32053167 32256734 32270268 32355799 32336895 32463244 32735026 32916059 33095708
4661 33095708 33106392 33456881 33868088 34251785 34641014 34863938 35201418 35663944 36167661 36643950
4651 36643950 37096935 37618028 38320346 38912686 39658222 40553877 41494920 42609161 43563786
4642 43563786 44784742 46002462 47535432 49287165 51047779 52869749 54654024 56557112
4634 56557112 58576963 60653132 62548322 64336629 65822188 67133111 68334616 69589426
4626 69589426 70930303 72020419 73158465 74263109 75598751 77182039 78829848 80629645
4618 80629645 82490649 84719184 87442632 90446961 93820188 97757971 102222019 107414251
4610 107414251 113299168 120266897 128247759 137270055 147363918 158271580 170007312 182321358
4602 182321358 195428158 210009173 226454521 245339194 266052999 286813424 305568282
4595 305568282 320210668 329417418 332134452 328006950 316989154 299249108 276898531
4588 276898531 253240235 230705485 210648138 192799988 176938111 162997352 150615494
4581 150615494 139772801 130101173 121521756 113777505 106698208 100350829 94597184 89455121
4573 89455121 84942629 80801132 77152685 73847507 71001155 68625281 66586521 64807604
4565 64807604 63171949 61483523 59800470 58003217 56260019 54344841 52200797 49979099
4557 49979099 47583025 45344730 43172709 41209153 39470110 37928425 36537931 35301883
4549 35301883 34169851 33139715 32139476 31183313 30273265 29416872 28797751 28159929 27625889
4540 27625889 27103460 26463035 26065473 25707512 25477190 25095352 24708812 24450870 24217496
4531 24217496 24051588 23924871 23702788 23417896 23187283 22989580 22854809 22597554 22398650
4522 22398650 22038825 21842436 21557335 21183523 20941795 20649763 20526335 20227345 20068810
4513 20068810 19877744 19533640 19331526 19173434 19021930 18797808 18678305 18555167 18604824 18666540
4503 18666540 18607033 18420394 18332430 18316388 18406519 18550267 18640696 18940566 19293988 19563779
4493 19563779 19838157 20126583 20490852 20876520 21327016 21696757 22098013 22707991 23394117
4484 23394117 24207042 24961721 25674112 26242499 26725602 27029470 27178042 26988653 26647358
4475 26647358 25964041 25221610 24595697 24041475 23816679 23537216 23401887 23342104 23636592 24165976
4465 24165976 24562737 24791941 24909262 24886561 24858216 24668218 24035902 23286029 22289032 21411473
4455 21411473 20536608 19770232 19040411 18379486 18094269 17763583 17407157 17027937 16758109
4446 16758109 16680096 16506823 16207798 15984061 15814280 15817769 15721058 15600107 15369101 15266785
4436 15266785 15359261 15369585 15316416 15180681 15051747 14937086 14979139 14851967 14662525 14564527
4426 14564527 14536894 14456783 14327382 14289554 14234162 14267939 14161972 14020593 13837382 13481370
4416 13481370 13170327 12872471 12651311 12435525 12272017 11987207 11763164 11696004 11682876 11595151
4406 11595151 11433736 11179236 11068542 11117521 11112786 11118357 10921454 10739174 10720773 10641310 10612459
4395 10612459 10457541 10390121 10355183 10244430 10085424 10041885 9878389 9786282 9673575 9508421
4385 9508421 9429901 9286202 9397012 9396862 9258107 9060556 8952170 8981174 9054603 9124778 9013820
4374 9013820 8933062 8865240 8970760 8990909 8914440 8826772 8633535 8557554 8566489 8654669 8560443
4363 8560443 8410455 8259361 8141307 8059745 7994967 7919157 7978033 8020604 7976720 7891833 7840721
4352 7840721 7839829 7795145 7810152 7806569 7681402 7789378 7831775 7964545 8009823 7920307 7861779
4341 7861779 7840074 7918396 8078283 8200631 8201266 8269669 8368732 8478900 8526794 8654426 8716660
4330 8716660 8784326 8940513 9091890 9227281 9234893 9234098 9152523 9029596 8904406 8679970 8584289
4319 8584289 8546859 8551367 8589104 8539041 8504442 8470174 8400367 8363778 8345973 8322802 8374751 8418437
4307 8418437 8381624 8339076 8476533 8446163 8575737 8686531 8736331 8849307 8930777 9114839
4297 9114839 9200054 9377372 9564561 9624313 9689500 9737322 9897489 10171905 10228624 10142472 10049240
4286 10049240 10016918 10072280 10019199 9982703 9862657 9770558 9888855 9949023 9991097 9978609 9914410
4275 9914410 9971697 10026767 10016549 10149539 10164240 10294510 10298719 10242020 10206439 10283551 10543044
4264 10543044 10549007 10565052 10587285 10669996 10821593 10877751 10833743 10849607 10766467 10951195 11184676
4253 11184676 11214960 11309036 11140737 11244871 11243766 11369987 11513105 11453937 11568603 11608500
4243 11608500 11686047 11851714 11824799 11993044 12145614 12254091 12489451 12581378 12799705 13019889
4233 13019889 13087921 13317280 13355930 13540039 13791788 13955410 14223696 14149334 14303989 14431403
4223 14431403 14566748 14873571 14934424 14932216 15052871 15181280 15517346 15744156 15902923 16055216
4213 16055216 16053781 16435076 16656175 16829390 17167616 17368910 17701731 17873556 18183966 18546708
4203 18546708 18860883 19231949 19441989 19699450 19975314 20341728 20813018 21270275 21587764
4194 21587764 21913814 22154727 22717935 23285694 23714454 24242019 24518380 25127277 25701818
4185 25701818 26353639 26954837 27527185 28152282 28728195 29490125 30303568 31197664 31983637
4176 31983637 32872031 33674191 34657403 35666678 36781898 37973978 39092184 40356110 41592867
4167 41592867 43065142 44407716 45833117 47275312 48852530 50688457 52423978 54328569
4159 54328569 56205222 58300263 60446987 62671702 65018540 67425891 70048241 72675982
4151 72675982 75394773 78064325 80923131 83863694 86987871 89960647 93052416 96143769
4143 96143769 99284502 102609889 105770971 109138607 112309290 115549937 118808365 121882704
4135 121882704 124913426 127811486 130694357 133298661 135750531 137990817 140213382 142027617
4127 142027617 143803427 145340279 146736513 148106941 148993418 149836484 150210229 150399439 150112126
4118 150112126 149618086 148842844 147694192 146317636 144691904 142905776 140862895 138701549
4110 138701549 136381683 134020168 131202071 128343322 125357096 122226736 119088905 115426196
4102 115426196 111756613 107973750 104416503 100826292 97134847 93371048 89679261 86233757
4094 86233757 82938503 79643481 76166857 72883361 69743473 66733734 63711050 60730792
4086 60730792 57945181 55325143 52919040 50429363 48178157 45976921 44150320 42465393
4078 42465393 40659800 38939559 37380904 36083840 34791133 33506796 32049251 30910763
4070 30910763 29804130 28823740 27760256 26812881 26010352 25201351 24439920 23642288 23045269
4061 23045269 22494361 22004021 21406389 20950359 20396835 19940190 19657132 19138375 18732396
4052 18732396 18300617 18140378 17985405 17675345 17463762 17206255 17002127 16902279 16750587 16523841
4042 16523841 16459502 16389522 16259126 16042165 15893438 15799229 15705847 15653976 15384415 15225321
4032 15225321 15097730 15116239 15093550 14949201 14819523 14599090 14574119 14576777 14426099 14363964
4022 14363964 14319590 14166518 14139688 14023056 14024426 13996086 13828597 13890519 13870119 13848229 13742909
4011 13742909 13604672 13623399 13742499 13680771 13578308 13471667 13521327 13650651 13674924 13639670
4001 13639670 13426437 13477599 13553546 13705549 13739668 13619003 13675668 13746169 13824665 13877883 13837706
3990 13837706 13830433 13932909 13872611 13926036 13982612 14142762 14373693 14247545 14235027 14154501 14426878
3979 14426878 14667573 14792892 14783446 14647860 14766044 14966044 15235466 15285439 15333409 15298554
3969 15298554 15419755 15498387 15625080 15663230 15699645 15738237 15585042 15578720 15573931 15765013 15714566
3958 15714566 15516459 15388664 15477221 15630940 15543466 15396465 15267971 15220716 15135137 15056007
3948 15056007 14945060 14939428 14804107 14708979 14713899 14500517 14529800 14540690 14674538 14565936 14536713
3937 14536713 14634974 14731579 14910037 14774190 14770711 14800936 14966795 15100562 15179075 15244406 15372722
3926 15372722 15474908 15584518 15639614 15611655 15901897 16063093 16197288 16208226 16300590 16475982
3916 16475982 16634802 16779752 16851115 17046901 17302845 17586442 17785097 18036214 18316960 18620337
3906 18620337 18724180 18887934 19143586 19387040 19805183 20022201 20168862 20326261 20604220
3897 20604220 21046592 21236206 21365864 21359396 21559353 21861635 22116301 22228805 22219757 22295663
3887 22295663 22541877 22634833 22636956 22679314 22768687 23029884 23071806 23165546 23184439 23290649 23596107
3876 23596107 23677163 23794706 23845281 24037954 24394723 24602812 24736194 24909677 25172684 25578819
3866 25578819 25916934 26152140 26381276 26633425 27122642 27567713 27928710 28235902 28570311
3857 28570311 29144021 29694641 30245935 30661218 30992184 31494291 32073018 32655409 33183864
3848 33183864 33592062 34034122 34539976 34993578 35644993 36211623 36667140 37266083 37889137
3839 37889137 38639421 39309695 39941760 40717641 41406639 42079301 42631377 43404794 44334236
3830 44334236 45345340 46296139 47210097 48169621 49383258 50742587 52046303 53363868 54583881
3821 54583881 56168644 57891241 59596986 61234294 62726389 64417787 66153407 67926258
3813 67926258 69611592 71217214 72855972 74462259 75896664 77345469 78759237 80090689
3805 80090689 81538034 82774017 84040668 85089445 86187720 87275479 88104909 88738690
3797 88738690 89219021 89791426 90160839 90445176 90635966 90928593 91180260 91524342 91771813
3788 91771813 92110760 92632081 93175406 93833975 94405777 95106443 95852013 96882993 97843604
3779 97843604 98952232 100220918 101622838 103332915 105150263 107216533 109341922 111921451
3771 111921451 114736753 117827234 121163895 124751773 128816923 133079525 137484883 141948976
3763 141948976 146720863 151576287 156530365 161582789 166498432 171340598 176226063 181009054
3755 181009054 185480666 189989937 194188984 198337066 202266632 205983372 209571319 212753718
3747 212753718 215765652 218122753 220055510 221535997 222738160 223494652 223949428 224082520
3739 224082520 224214050 224368989 224339001 224536396 224594534 224970359 225413594 226109371 226793219 227609924
3729 227609924 228977647 230374372 232085558 233771374 235818141 238063233 240683590 243233738
3721 243233738 245727436 248259405 250925552 253811238 256604121 259526263 262180162 265165805
3713 265165805 268096682 271125019 274049516 276763221 279632923 282270239 284688444 286772569
3705 286772569 288746938 290620374 292601616 294495342 296638763 299124686 302226988 306125580
3697 306125580 310512377 315861168 321977971 329442306 337838976 347320104 357700318 368822462
3689 368822462 381008721 393489900 406098887 418033188 429082175 438457962 445827640
3682 445827640 450974438 453855602 454679019 453583649 450978020 447149305 443095364 438797197
3674 438797197 434422852 429493755 424065361 417861148 410166324 400960815 389518493 375931326
3666 375931326 360372661 343279235 325186358 306588382 288061958 270253280 253488298
3659 253488298 238069991 224196084 211567323 200479125 190363811 181235519 172704826
3652 172704826 164954527 157850779 151257385 145123412 139043292 133430838 128112128 123260876
3644 123260876 118629559 114143595 109773224 105725367 101895711 98232150 94746449 91278784
3636 91278784 87962799 84682436 81607968 78661762 75901429 73187715 70531328 68024274
3628 68024274 65603753 63492584 61502619 59551307 57725524 55956349 54363058 53006016
3620 53006016 51618405 50272649 49066461 47950013 47068665 46011686 45134678 44231140 43381868
3611 43381868 42664349 41750311 40976831 40128486 39547367 38954993 38245763 37614354 36998818
3602 36998818 36411229 35998622 35302285 34747953 34202731 33617679 33171836 32579999 32079874
3593 32079874 31596476 31195378 30713230 30121383 29752793 29355273 29020688 28758709 28390469
3584 28390469 27846610 27432735 27033802 26777854 26476133 26090655 25765931 25304813 25095012
3575 25095012 24879301 24783574 24474805 24158993 23882618 23639816 23575220 23431138 23190945 22900243
3565 22900243 22689888 22500253 22429285 22235430 22140915 21943144 21706104 21557814 21326939 21331179
3555 21331179 21107766 20899741 20613293 20536280 20471067 20417699 20168051 19870160 19697315 19508936
3545 19508936 19517125 19316385 19212950 19046526 19039941 18980924 18766479 18686768 18535187 18556354 18489777
3534 18489777 18400375 18263987 18198723 18280032 18213621 17980649 17792065 17803415 17790106 17880144 17665771
3523 17665771 17517645 17344513 17342838 17466864 17308253 17216680 16964738 17065964 17113299 17039660
3513 17039660 16819661 16725134 16733953 16835993 16841246 16650752 16697851 16723594 16913791 16806556 16786470
3502 16786470 16722201 16674332 16859442 16884211 16862796 16890777 16966035 17025256 17049113 17033572 17143047
3491 17143047 17217096 17349273 17434025 17432734 17543967 17515293 17735172 17816406 17849262 18056486 18128005
3480 18128005 18251311 18373308 18587454 18720835 18911699 18977474 19060174 19195646 19315593 19369748
3470 19369748 19338994 19397004 19331861 19525213 19567788 19646399 19721845 19809047 19982344 20046671 20267885
3459 20267885 20449588 20693565 20987387 21208067 21253686 21502355 21785273 22242391 22713132 23009431
3449 23009431 23534124 23908256 24581127 25190427 25769217 26332440 26852537 27502978 28016450
3440 28016450 28611449 29039561 29345455 29589804 29757042 29811401 29823114 29670006 29399346 29019442
3430 29019442 28353422 27808471 27200163 26699232 26190558 25689841 25363005 25068373 24898884
3421 24898884 24585702 24392256 24326024 24301423 24255297 24183892 24146235 24280055 24462071 24409835
3411 24409835 24329970 24212277 24218225 24130157 24089419 24043322 23742563 23501301 23221935 22904934
3401 22904934 22376029 21943514 21588046 21309519 20931544 20688301 20529759 20339135 20285439 20198339
3391 20198339 19970880 19753097 19784210 19888379 19927332 19910679 19753807 19678216 19666768 19609664
3381 19609664 19554967 19354872 19084730 18986961 19091069 19094214 18929923 18554443 18180182 17843594
3371 17843594 17595427 17359099 17098973 16786365 16505388 16341667 16179285 16007782 15743126
3362 15743126 15651202 15506513 15391929 15387694 15290796 15304330 15297631 15206591 15054243 14804986 14770300
3351 14770300 14677700 14503006 14294319 14129631 14164847 14367302 14503930 14560396 14451081 14476423
3341 14476423 14604093 14661941 14722466 14560257 14447881 14275867 14156367 14067216 13875569 13759433
3331 13759433 13607667 13475027 13583794 13459527 13287622 13114408 12824183 12659946 12533938
3322 12533938 12446116 12351849 12126145 12121129 12101920 12149310 12146941 12025504 12029019 11979111 12057406
3311 12057406 12265621 12252030 12283989 12182947 12087987 12131892 12012153 11913249 11708482 11509975
3301 11509975 11517842 11376524 11456550 11482467 11473087 11458419 11383349 11581664 11725370 11833417 11948467
3290 11948467 11947905 12000711 12108114 12172479 12355452 12372982 12339313 12309874 12352103 12508584 12466790
3279 12466790 12459710 12416999 12437444 12657265 12820392 13074560 13139423 13195326 13382853 13617470
3269 13617470 13895411 14225770 14503841 14927080 15447364 16122810 16956838 17663799 18559004
3260 18559004 19495595 20568736 21554904 22473906 23527286 24898188 26837921 29147869 31383357
3251 31383357 33200332 34710933 35449027 35317756 34445511 32593941 29748410 26890392 24648810
3242 24648810 22886276 21648903 20795168 20252806 19912487 19566012 19511623 19632695 19948565
3233 19948565 20392818 20913403 21451107 22072019 22786532 23704983 24919644 26644107 28835675
3224 28835675 30847992 32380563 33362396 33639083 33005430 31822634 29498151 26218591 23316102
3215 23316102 21040118 19322463 17873385 16780008 15888695 15121846 14496014 13954074 13495972
3206 13495972 13134877 12829433 12439452 12173750 11836649 11805499 11800330 11717725 11667789 11544396
3196 11544396 11547677 11375760 11328896 11104924 10832042 10768637 10552612 10358841 10144663 9910502
3186 9910502 9760565 9551784 9257549 9112303 9056839 9108103 9075001 9011635 8949400 8887988 8955414
3175 8955414 8985526 9023556 8988077 8997530 9198952 9324494 9448349 9442936 9386126 9381978 9404364
3164 9404364 9226028 9038604 8804066 8636345 8568353 8333062 8253013 8136618 8128925 8000060
3154 8000060 7953148 8014582 7992154 8025883 7942192 7845897 7853410 7897378 7884321 7920131 7948358 7966080
3142 7966080 8021364 8013407 8129956 8192837 8317974 8308955 8250990 8260160 8118823 8147310 8140603 8174893
3130 8174893 8156904 8126193 8226167 8372143 8369800 8390653 8373923 8430978 8612781 8640962 8677636
3119 8677636 8588103 8628079 8663158 8683067 8724753 8685171 8709097 8846851 8891729 8925111 8993856
3108 8993856 9015511 9061155 9173905 9236014 9340750 9460039 9548734 9701250 9811916 9942659
3098 9942659 10043603 10195675 10379890 10573547 10605672 10629831 10663706 10696022 10622160 10499726
3088 10499726 10390382 10254941 10159122 10101091 10062141 9947093 9926330 9936367 9917022 10023029
3078 10023029 10011096 10071873 10110780 10102532 10038294 10084920 10291563 10346393 10352009 10319517 10186754
3067 10186754 10175327 10246579 10210441 10084166 9851333 9718870 9705142 9535802 9405618 9125914
3057 9125914 8980245 8837065 8676460 8618538 8526890 8509730 8394126 8286936 8163038 8090245
3047 8090245 8040186 8034163 7915695 7722621 7553318 7502172 7541900 7342011 7108821 6952215
3037 6952215 6787813 6722715 6563303 6359602 6107967 6024626 5897371 5793952 5653825 5509812
3027 5509812 5493272 5435298 5419342 5314083 5155172 5085712 5027672 4943403 4815873 4738659 4714673
3016 4714673 4676471 4581517 4582671 4431822 4364925 4322902 4245432 4254754 4169432 4089689 4034668 3990235
3004 3990235 3968077 3862561 3724308 3739095 3838102 3891166 3779974 3655204 3654425 3721643 3778461
2993 3778461 3642212 3451085 3378436 3378371 3519788 3553712 3449263 3302673 3293900 3365991 3368149
2982 3368149 3384085 3272960 3185894 3203704 3123876 3109053 3201697 3173438 3106291 3042616 3039598
2971 3039598 3104888 3215335 3244635 3024110 2998848 3056207 3066745 3044052 2945676 2808802 2735106
2960 2735106 2814418 2964170 3033768 2954977 2913085 2832024 2826481 2681426 2771663 2832773 2705121
2949 2705121 2764470 2734850 2684561 2677605 2705827 2719892 2675038 2690389 2701429 2717207 2770921 2680288
2937 2680288 2588619 2510474 2463049 2481852 2428505 2449556 2512435 2440443 2427906 2404712 2407888 2379784
2925 2379784 2331062 2339562 2243491 2268282 2257941 2114146 2191915 2210406 2289166 2250961 2108889
2914 2108889 2140469 2204674 2236973 2236774 2002392 1921697 1959163 2073449 2116606 2058439 2040528
2903 2040528 2010801 2080149 2137069 1979587 2019710 2035435 1990046 2075719 2028044 2094294 2036624
2892 2036624 1988534 1991620 1941234 1936710 1929314 1947210 2016885 1992910 2023393 1998734 1983722 1998706
2880 1998706 1854535 1895026 1809578 1787899 1925145 1832190 1847158 1850434 1898198 1990817 1958852
2869 1958852 1761155 1663864 1695197 1813088 1819413 1768018 1702659 1547524 1718933 1796522 1800007
2858 1800007 1762414 1619093 1728696 1720667 1783917 1743196 1640024 1652525 1594364 1586318 1582236
2847 1582236 1664544 1770287 1775775 1593352 1572913 1630986 1805674 1825913 1667365 1500475 1402819
2836 1402819 1597762 1685128 1759350 1648546 1433451 1480092 1531800 1676680 1676158 1613313 1602241
2825 1602241 1528881 1485385 1511065 1573025 1519170 1497561 1427214 1515057 1507658 1643311 1594665
2814 1594665 1509819 1408265 1311602 1467915 1566312 1634535 1414579 1314333 1365279 1414178 1451141
2803 1451141 1471533 1422285 1409276 1437268 1440230 1455064 1417269 1447000 1312739 1308243 1381733 1372503
2791 1372503 1451105 1335759 1356678 1306120 1243486 1293548 1345519 1437721 1397086 1225984 1145181
2780 1145181 1217581 1166526 1239133 1198732 1251732 1263342 1205075 1361915 1234733 1274909 1209957
2769 1209957 1108283 1124066 1063055 1216870 1275788 1262344 1211051 1118049 1156577 1274542 1335250
2758 1335250 1378741 1232098 1260184 1217001 1155067 1223338 1209829 1210812 1095245 1028275 1082905
2747 1082905 1129985 1199803 1159857 1053271 1092290 1123512 1187186 1183683 1087963 1113486 1024639
2736 1024639 1046461 1009435 878081 1062470 1100214 1155871 1076558 1075776 1201932 1236210 1148496
2725 1148496 1097708 1039475 1079031 1117003 1110765 1024436 977782 1001538 966715 1035670 1063964 1022845
2713 1022845 1054638 1029065 997823 947281 965804 1075588 1066299 1036320 1010663 930866 1013862
2702 1013862 1115340 1163370 1099735 909495 866289 886324 929058 892304 840611 871513 842022
2691 842022 834909 868791 835673 866775 881423 869822 803039 786267 805032 804115 805560 823474
2679 823474 786100 862227 984245 979447 930496 973210 989749 942598 905532 938138 903480 916942
2667 916942 804322 789574 883925 910992 859663 821918 875873 857013 848061 828395 842601 802493
2655 802493 799041 822493 744180 661114 609973 684079 750376 813088 809084 753316 782543 827059
2643 827059 868123 773678 720594 636660 795949 891072 864384 768704 732641 685449 746711
2632 746711 807996 739238 800923 742718 747697 749058 689562 590363 664967 768990 790304 830391
2620 830391 763133 769204 842742 917919 751717 639898 732221 825944 925226 781307 689991
2609 689991 589725 785482 816681 756230 637164 503075 725926 809880 747169 568866
2599 568866 571160 604863 685002 647174 515575 561043 612487 737004 692945 650336 585947
2588 585947 634302 623841 545146 614813 604640 768997 711767 666317 592465 647310 776283
2577 776283 778021 723148 531402 614395 582777 687900 623859 617734 622511 532312 630105 603234
2565 603234 703003 647114 702736 628488 643755 615507 659169 676301 623144 615419 496275 616891
2553 616891 679607 646751 550515 611409 635103 606951 604086 532209 623849 645874 738879 661210
2541 661210 564231 552920 511615 571737 540364 588948 659653 739352 602082 520011 512896 576794
2529 576794 589581 501781 480653 524482 659929 592447 488667 381053 489928 607539 589470
2518 589470 563497 411721 444347 606098 595715 473917 416542 402078 477800 499553 432452
2507 432452 396561 324841 503751 469383 299591 278944 341964 520032 503026 432857 409591
2496 409591 475833 555853 643024 524535 433587 430258 605405 653711 609802 513359 461241
2485 461241 500243 551754 522467 530595 582768 599914 586623 511044 443953 489150 586445 490254
2473 490254 444177 446908 337272 403743 493356 464656 470619 427112 411938 483146 537378 417216
2461 417216 399099 386293 487438 518141 453060 375231 377924 429553 418387 363190 358582 462866
2449 462866 584937 653852 479663 333294 406291 507308 564780 547364 529909 505717 529323
2438 529323 500136 539059 492531 385535 399987 425965 492334 494686 502986 436254 353231 287959
2426 287959 297566 420214 448455 493696 420561 455917 452076 458087 463123 441509 444505 422706
2414 422706 461158 474367 479696 506989 571427 453953 427730 428225 544786 657668 566641 499393
2402 499393 394441 452472 597109 589138 566015 554030 554636 591785 645480 584721 609371 587648
2390 587648 602736 575444 571703 666586 710265 750079 595807 550967 629991 784168 796616
2379 796616 672073 640014 609804 697579 706062 633618 600000 591109 656942 725108 707631 721537
2367 721537 708915 738521 803576 806404 811977 807959 871810 880743 901913 764012 784635 907853
2355 907853 932952 1031636 967755 906987 978182 998236 947814 1026375 992775 1129399 1224494
2344 1224494 1191503 1211060 1159621 1361430 1424072 1511482 1508279 1484424 1672559 1833371 1972098
2333 1972098 1999013 1955406 1964276 2087036 2062246 2153232 2125309 2146460 2230308 2168971 2256204
2322 2256204 2261931 2329136 2328444 2430122 2455126 2516582 2625907 2853094 3095197 3368870 3568367
2311 3568367 3849007 4261849 4583959 5000399 5269718 5741254 6494520 7330466 8313749 9127257
2301 9127257 10166172 11612168 13117290 14517142 15634816 16397162 16149646 15423990 13329806
2292 13329806 10748507 8848235 7445782 6406107 5732812 5248265 4737750 4366168 3914488
2283 3914488 3733148 3480369 3282539 2983102 2737528 2646039 2500757 2311751 2012864 1923465
2273 1923465 1830879 1892386 1851386 1679528 1514675 1486324 1489282 1381562 1291622 1068200 1091766
2262 1091766 1128947 1176489 1082132 917450 908527 808003 889770 749876 695638 693969 715796
2251 715796 720680 653903 736866 731398 628759 543940 587783 558146 740674 716546 612111
2240 612111 551316 467571 528418 501933 510447 346621 367481 466940 466144 550789 482902 436737
2228 436737 298523 320221 360612 514961 455107 389708 290820 339327 531385 490652 546565
2217 546565 355018 354119 402583 504828 578229 489160 459102 359692 315162 244245 213768 277107
2205 277107 343453 234951 155877 228507 298309 464457 355866 194567 118572 253394 380272
2194 380272 329410 333877 117280 204406 304515 367774 321287 270789 218308 281842 303471
2183 303471 265473 207313 250268 343943 211033 190938 153089 180692 297003 264726 212534
2172 212534 156112 249384 297190 232942 218856 156562 241360 287107 229508 94847 66563
2161 66563 137517 224131 247369 223237 142187 145160 168776 157377 247915 108364 -15036 27677
2149 27677 157742 280253 158837 75182 5578 -3220 155427 215504 67611 13130 36712
2138 36712 135306 172723 93937 -27074 -20487 39906 143010 146741 132163 117445 264151 223064
2126 223064 219677 131556 127760 275817 249339 176433 31665 30218 210045 166927 153734 105864
2114 105864 55691 123055 55645 54548 19673 40589 143303 126883 -33785 123 -31806
2103 -31806 112272 136289 92883 -10581 -89033 -303 125802 264758 216317 108742 -1514
2092 -1514 27427 59439 252023 225852 101346 38740 -43501 94001 86759 140408 94499 -82
2080 -82 -31352 -66647 90954 112903 112313 34472 -109467 -17963 116539 141410 112882 65798
2068 65798 -47855 40642 76748 189260 52653 -59822 -36142 -40598 125219 47631 27738
2057 27738 -126685 -231785 -149139 -28192 92565 137431 70741 -97603 -81975 -41920 102404
2046 102404 85840 6890 -44208 18647 129473 109229 182484 96189 -11988 11569 76836
2035 76836 148224 175565 209065 136055 121585 76302 59992 107608 170485 164709 89135 8324
2023 8324 3032 10472 73316 -601 -28784 -67497 -46027 10598 -1911 -18832 -27368 4202 -61704
2010 -61704 -31859 -13917 43156 -30888 -9163 35966 1083 6067 11309 114622 30156 -50520
1998 -50520 4962 -60543 -8219 -39387 -744 67070 81692 -42912 -30037 -81414 84248
1987 84248 131313 94286 21589 -84255 84703 17426 37095 -6977 -190675 -148384 -39144
1976 -39144 21685 102304 71983 5429 -25007 -151879 -41036 -67731 20998 13621 -190573
1965 -190573 -168839 -205526 -26538 139 13765 -140202 -245019 31145 160331 74667 -69877
1954 -69877 -218534 -192181 24570 36816 84419 -8194 20345 85102 -47526 89247 -39936
1943 -39936 73967 22957 -182531 -125897 -75153 110872 72723 -134351 -303818 -189300 -66047
1932 -66047 122960 43051 -53178 -161589 -222494 18964 -21974 14965 -235973 -291070 -185598
1921 -185598 -37326 43436 -44979 -25699 -64081 25021 55562 135431 30606 -48633 -101744
1910 -101744 -105111 -106092 -141060 7630 -86062 -64668 -91498 -13177 -7440 -309 -16515 -130375
1898 -130375 -104443 -115246 -107462 -144389 -115363 -147531 -78121 61544 50488 -17233 -88193 -28677
1886 -28677 -102324 -44051 -47018 -48970 -153454 -190150 -128769 -108590 -69502 -131099 -121946 -172096
1874 -172096 -102940 -38677 13969 -37060 -139552 -170162 -196606 -74607 -37851 -26221 -14397
1863 -14397 -30080 7106 -64585 -15189 22724 29516 -48215 -154774 -175837 -39605 67180
1852 67180 97704 -130510 -181421 -92413 -26630 9541 -119231 -124251 -69411 29217 -54485 -173245
1840 -173245 -183577 -107537 -33364 -91764 -242270 -205151 5799 -18371 26929 -117531 -169690
1829 -169690 -4632 -19192 2814 -169119 -242074 -73775 -20892 -26863 -103401 -171604 -56403
1818 -56403 35344 77688 -72027 -127082 33494 -99122 -135593 -230247 -233580 -93114 -26965
1807 -26965 20334 -45637 -54636 20120 86278 27178 -161739 -266090 -46669 106464 78147
1796 78147 -3478 -199573 -114674 -38316 -40113 -104659 -245439 -180923 -120330 -23528 -52229 -141889
1784 -141889 -158398 -125833 -166661 -157458 -153821 -106318 -21109 -74721 -105847 -110820 23743 6526
1772 6526 -55349 -93751 -152995 -111463 -20525 6939 -40691 -139319 -100221 46018 31686 37821
1760 37821 -128939 -26159 -3848 -118131 -96626 -239620 -205137 -192997 -246148 -284586 -137075
1749 -137075 -51103 -2536 -90413 -123251 -120101 -60203 30410 -90604 -128801 -262827 -178052
1738 -178052 -79536 -62895 -125930 -88464 -39883 -64329 -92777 -137930 -16157 -27980 -69976
1727 -69976 -283946 -347281 -146091 -140109 -94877 -180422 -108831 -46531 699 -72259 -101889 -135736
1715 -135736 -68435 -75546 -133984 -175118 -230719 -61974 -74736 -80340 -220611 -230982 -19069
1704 -19069 35649 53074 -127428 -154881 -94673 -70483 -2824 -122051 -202832 -134193 -108567
1693 -108567 -126500 -63342 -125065 40798 13936 -52848 -135031 -179204 -20094 -55360 -80649
1682 -80649 -153554 -173784 -61117 12340 53866 -14288 -74933 -26645 33818 -6457 -32083 -195372
1670 -195372 -101727 -139648 -94700 -87831 -262876 -88917 -153953 -119376 -148436 -112754 -66355
1659 -66355 -63519 -64221 -173892 -288875 -224670 -164464 -166624 -157585 -256652 -79457 -61281 -148500
1647 -148500 -107192 -181751 -42484 -125296 -109718 -113586 -158424 -102247 -136589 -159203 -213493 -188395
1635 -188395 6657 78205 15330 -45759 -258491 -213859 -208312 -146668 -104114 -229692 -178671
1624 -178671 -127527 -81730 -61724 -47678 85665 -123919 -177407 -64035 -57523 59218 -55545
1613 -55545 -263680 -319805 -223319 -29909 -43447 -59027 -49455 -205305 -30197 52136 -46020
1602 -46020 -21780 -266428 -261690 -281266 -246289 -93683 -95419 -79142 -181417 -282355 -187763
1591 -187763 -60549 62040 -29595 -261403 -271606 -176166 -56709 3437 -217816 -187213 -235791
1580 -235791 -123865 -12591 -46213 -9 -137847 -110287 -143821 -146708 -209713 -225628 -189789
1569 -189789 -236637 -215872 -191085 -163316 -109780 -101031 -183779 -164265 -158739 -138068 -61766 -227067
1557 -227067 -76969 -183301 -184648 -147967 -147275 -151279 -175480 -87195 -84686 673 -50663 -72326
1545 -72326 -208100 -160208 -159099 -107793 -182793 -257223 -135838 -96910 -11931 -139806 -195723
1534 -195723 -227509 -137797 -41572 -100498 -157431 -265424 -214597 -193189 -184182 -159626 -133763 -127751
1522 -127751 -153240 -177886 -174123 -33080 -6997 -51381 -301186 -252109 -112801 -13517 11861
1511 11861 -184149 -225669 -147499 -53599 -23223 -116064 -143358 -108007 -146152 -78198 -53060 -75500
1499 -75500 -104155 -279861 -267114 -165000 -43840 50600 9441 -92263 -157364 -91825 -59555
1488 -59555 -53174 -131342 -149589 -156975 -112944 -60668 -57133 -50853 -29210 -78814 -199432 -224304
1476 -224304 -235264 -124246 -88898 -170148 -272413 -237272 -190655 -177928 -117342 -125256 -144902
1465 -144902 -126775 -40038 -40106 -100322 -131678 -114922 -136303 -116397 -75673 -98629 -114881 -161142
1453 -161142 -39073 -57593 -55667 -110018 -212008 -140491 -81441 -49309 -152940 -161730 -169507 -80959
1441 -80959 -149360 -181699 -221509 -226482 -90618 -90727 60321 -77316 -65624 -116172 -223222 -232039
1429 -232039 -261903 -123035 -207031 -148614 -139221 -127430 -124384 -75759 -100902 -142087 -143507 -132620
1417 -132620 7537 -65545 -74418 -262726 -275078 -161856 -121305 9988 -28536 -58728 -158012
1406 -158012 -135119 -143557 -52307 -118845 -234910 -298439 -213118 -64156 -56608 -64510 -156709 -147869
1394 -147869 -133141 -95628 -79587 -139326 -68353 -194560 -211521 -201443 -104632 -76736 -67841 -218141
1382 -218141 -269356 -94146 19137 119600 33188 -31834 -164215 -157508 -90782 -132147 -132709
1371 -132709 -144255 -108468 -130007 -113006 -45146 -13438 -87750 -154383 -239478 -228320 -94229
1360 -94229 -111389 -73254 -232715 -187998 -124297 -30960 -19250 -94249 -118030 -117911 -85874 -54711
1348 -54711 33367 -82284 -140225 -210937 -208860 -159601 -150849 -26077 -23406 -100834 -203750 -187033
1336 -187033 -112049 -73877 -162780 -179378 -130714 -64302 -107091 -115422 -127725 -153634 -200698 -176712
1324 -176712 -140978 -76630 19783 -62824 -118945 -207829 -194221 -6686 -63998 -79318 -91835
1313 -91835 -104770 -53956 -3737 -34543 -148580 -227046 -139307 -113845 -149537 -92405 -153294 -145027
1301 -145027 -225244 -228867 -143475 -67236 -78224 -197289 -230615 -182724 -4141 61454 -55030
1290 -55030 -194825 -195708 -61227 8753 -41423 -130336 -70827 -42907 114946 40848 -7860 30961
1278 30961 -90384 -41464 -128665 -119497 -41665 -4004 2863 -54566 -209142 -124495 -20943 -17662
1266 -17662 -116596 -229010 -158289 -111583 -44610 -167402 -312964 -256013 -238381 -79776 -63418
1255 -63418 -132720 -26413 -752 36676 -85209 -139395 -124773 -85680 -102882 -89735 -83384 -18672
1243 -18672 -76160 -80379 -151583 -222436 -106524 -123087 -152363 -199095 -144336 -100395 -204927 -164442
1231 -164442 -105519 -80407 -57468 -58580 -47817 -72846 -63530 -46454 -38724 -29730 6297 -91070
1219 -91070 -32631 -39663 -80617 -64527 -153593 -105416 -221140 -203491 -120333 -19738 -80375 -174051
1207 -174051 -168589 -190696 -161981 -99142 -144971 -195036 -118073 -65535 -51223 -29906 -76656 -32768
1195 -32768 -14835 -97924 -154274 -110917 -47245 -8493 -47665 -139208 -70590 -96735 -100609 -127812
1183 -127812 -85420 -131760 -122139 -90996 -86220 -125911 -189345 -107882 -83188 -161235 -225368 -209155
1171 -209155 -122692 11629 -13916 -141866 -139075 -178750 -160588 -122954 -132561 -122730 -171583 -92267
1159 -92267 13900 33016 -84896 -146593 -179474 -132634 19782 27231 41941 -109964 -206679
1148 -206679 -205207 -122856 -98115 -115320 18368 63678 -13890 -93319 -52735 -46968 -24046 -54375
1136 -54375 -94988 -86848 -20778 146046 75130 -19635 -150546 -128220 23013 21405 12027 -142274
1124 -142274 -184925 -116563 40132 -3963 -160824 -222165 -236811 -85088 -38257 -25249 -122334
1113 -122334 -101801 -43737 -132858 -145526 -153843 -53737 10163 -20141 -92170 -115632 -143547 -89757
1101 -89757 -92324 -97958 -40876 35070 22855 -110008 -133638 -188630 -108372 24785 -101948 -183643
1089 -183643 -79314 8673 -3745 -55976 -191934 -153937 -72898 -62915 -162344 -135266 34432
1078 34432 -65158 -25442 -115290 -43277 64571 57211 -28754 -162886 -182505 -55215 26358
1067 26358 9764 -35659 -148528 -41889 8263 -4207 -70534 -170429 -5854 -57147 53558
1056 53558 100924 32177 40236 -128579 -61911 20407 25326 34207 8393 -46037 -29371 -47629
1044 -47629 95755 49242 -39831 -35641 -129290 -14361 -9477 41400 -29468 -139953 -92434 -169671
1032 -169671 -140443 -73599 -8385 -43625 -55896 -113077 -48568 -24638 6561 -90100 -156907 -84022
1020 -84022 -50166 100032 -14081 -99886 -161728 -149814 -12395 -48924 -39988 -10427 -50113
1009 -50113 -23517 -2921 -135023 -117212 -97560 -4882 4149 -106527 -119206 -237242 -5067
998 -5067 12959 -20327 -173613 -118808 -42083 9486 -19692 -103895 -59176 -21918 160007 93098
986 93098 -5039 -68334 -12347 -39164 -81427 -22770 -18074 172852 166925 -29419 -220287 -204411
974 -204411 35952 75008 72303 -142573 -216895 -75520 33710 6017 -87516 -162888 -106162
963 -106162 -50288 12117 53245 29055 123655 125827 41796 -17788 7889 196241 110871 -19414
951 -19414 -69336 -69177 9565 93728 12636 -195814 -217504 -71916 64663 27315 9407 -143445
939 -143445 -200512 -163374 -125092 -19106 9973 34025 -188085 -107462 -45150 113268 185010
928 185010 106040 -27878 -98936 133113 223663 144525 8446 -43130 -76123 66768 109712
917 109712 13811 -40156 -134143 -75135 -37160 11355 85226 3506 -86541 -129401 -103787 -95835
905 -95835 -34289 -43148 44088 27514 33432 31222 -3868 9230 -60154 -1810 49783 42949 59023
892 59023 92741 53849 15109 -38100 -17903 85794 99688 47712 -18573 -26408 -22247 -56902
880 -56902 -42214 -83599 -49035 -27313 -20096 16092 -42587 -3930 15126 117460 77202 84407
868 84407 14822 76764 64777 137885 135832 6968 1196 -25150 -12861 -21208 73834 136264
856 136264 81701 107065 17374 -47860 -54983 -90038 -39376 31643 6378 36119 -32237 -17506
844 -17506 52035 3954 53144 -71930 16644 25162 4002 1898 -66338 30846 35095 23622
832 23622 762 40179 73383 100988 82885 -34923 -101147 -62537 42394 41037 31457 -137656
820 -137656 -81677 48719 92615 62615 -129328 -72043 68947 89889 66296 56170 91367
809 91367 74263 79185 70588 35338 63246 121471 79463 122563 69689 124557 176415 162102
797 162102 38982 -102681 -86844 -21736 80704 82451 4972 69821 51747 61052 40479 -76209
785 -76209 1783 -34260 15750 25396 95136 189015 22108 -93924 -73744 751 141963 95698
773 95698 69440 -468 -88695 186557 221927 97731 51664 -63702 38625 66348 102023
762 102023 71033 34525 3720 5550 -25807 -108929 17425 100500 151943 48639 -8873 -51457
750 -51457 68062 92885 3373 64016 26805 181766 181803 133984 -2166 -32456 67237 14306
738 14306 66090 83555 94977 52998 107890 61808 131148 86062 51222 -659 -77694 -74932
726 -74932 -64203 93236 37469 -502 1165 79793 91671 90954 60475 -77223 123372 174774
714 174774 136890 14491 -89858 -28385 20173 44930 -35534 7203 56247 99665 91534 115252
702 115252 69998 102068 107768 -19367 68339 -46818 92760 87134 33430 9547 -39285 82317
690 82317 151139 196861 149554 40652 41228 155774 39102 64542 -84844 -89884 87448 91091
678 91091 193370 112021 127180 108279 70027 77337 -58879 -32565 26634 82375 163956 133594
666 133594 -40331 67106 50703 206376 109788 50648 102284 132881 175905 123684 55389
655 55389 32560 34386 12302 47192 93841 154949 107470 65150 93092 -39356 86338 31456
643 31456 30751 23892 -25070 105120 148995 271114 159598 163383 20075 63980 83224 194584
631 194584 258320 147923 99343 8430 93510 118910 134022 -52868 18014 109908 202473
620 202473 292609 158218 148736 17708 192283 111950 102192 59338 130992 174123 120024 154768
608 154768 62717 261214 232994 166915 20664 -8390 116435 191799 156332 17367 59795
597 59795 -38338 176001 93525 86285 139050 125620 185071 49278 136921 110696 126605 127550
585 127550 120689 7799 144552 245973 235757 158782 7675 127411 132910 367539 266806
574 266806 146237 88623 35870 177772 91615 105946 -30573 58421 74367 151477 167526
563 167526 178821 237436 182729 138000 1604 131179 103399 133568 99100 77310 168343
552 168343 182998 260798 168643 82658 -12024 44936 179271 298231 260801 83265 128886
541 128886 90844 206776 109027 68904 111835 221681 310065 275749 164203 75539 149696
530 149696 226357 290343 44528 19033 136049 273344 371185 164011 203700 107054 197328
519 197328 287895 148300 230602 185641 153677 141914 66864 119411 127712 34227 128838 88444
507 88444 245829 278455 229219 264187 36182 73938 154885 134028 327293 207900 198549
496 198549 176388 114867 232899 158196 177299 105255 44283 266954 350704 274906 155586
485 155586 -34364 21327 121654 192078 261200 64362 157413 85877 200454 302277 202722
474 202722 200607 108797 133728 182896 229218 256038 269197 243731 215942 209146 217933 249538
462 249538 218149 131453 19953 202859 254263 198270 237705 68059 122613 171338 253976
451 253976 294137 286266 214951 153569 161179 243430 243907 193168 236626 138194 205536 292105 364071
438 364071 254454 168719 177471 74772 171448 151481 176769 75390 108282 141115 211715
427 211715 251244 172811 181541 166780 158943 245409 272258 248528 270767 218645 226280 205927
415 205927 165877 217357 196023 324012 258869 195988 211270 173424 318634 222581 139239
404 139239 142874 214522 341716 344492 210637 81718 52394 197750 269136 318251 385122
393 385122 282000 333174 239313 96242 204460 171721 222190 153862 128215 247390 292402
382 292402 421878 344006 96394 77941 53192 181880 290794 254897 306000 173669 131330
371 131330 174510 176791 248328 282946 154678 144284 201506 410933 333763 144071 43016
360 43016 -5950 251880 308998 354536 281044 159596 220556 334387 294002 309379 249025
349 249025 262612 288319 239058 337041 395269 339949 197392 83007 146354 224649 373184
338 373184 360271 172580 98468 123513 220525 255572 204609 49864 51608 83700 214532
327 214532 316525 336699 264717 177170 97848 166324 318761 421653 327968 211083 257472
316 257472 265663 327614 254761 182141 181910 202036 340944 316095 281117 293553 189244 235401
304 235401 203016 217872 293379 221943 211978 247763 233190 346105 352882 341827 272148 166653
292 166653 255604 164876 238668 302671 223582 203515 171153 260423 310490 206523 200012 200296
280 200296 201543 280979 214138 232170 122558 127359 242243 205758 310244 276349 276494 297575
268 297575 234268 259795 249952 258073 324750 223628 156226 230723 316642 391363 286603 231658
256 231658 224816 290566 340834 237681 294934 282230 219063 220598 263181 310278 261500 177480
244 177480 208263 188930 217890 298290 264217 271591 216242 172129 217342 337131 402148 346649
232 346649 219884 221639 279686 233710 229777 161941 229297 248766 264137 245809 186749 261817
220 261817 253645 227876 240354 261140 288060 284300 248137 219492 265096 347250 307446 271807
208 271807 281345 240386 169823 184324 216634 216935 252789 334570 266867 249169 240629 303923 327440
195 327440 308616 273421 251180 280684 270293 291434 294678 275874 263739 230090 156806 207827
183 207827 250345 314599 272411 210353 309357 450443 410331 252690 197577 251576 372566
172 372566 435393 351771 166376 162286 249827 262703 261920 189792 279621 296887 292701 231041
160 231041 148453 189585 248033 394772 328637 268685 288869 304779 269078 195538 169320 300754
148 300754 331521 351206 344322 251758 369107 309674 269258 253503 201329 348987 327508 263222
136 263222 288877 221342 349308 358882 232143 269531 300894 321211 243487 201439 237352 276606
124 276606 338162 276887 207219 221051 301137 489502 415278 294206 264519 279321 375340
113 375340 356409 248709 173776 171493 327520 328061 308595 364349 266715 242295 163242 252280
101 252280 358441 346737 384226 292465 251126 341375 303957 319156 264574 196099 273888 316843
89 316843 435113 325136 270500 277880 186428 253689 269759 307826 344996 257444 305441 363768
77 363768 366530 320687 158177 160432 203365 301755 409937 322121 283265 235220 222189 281856
65 281856 261906 258054 232201 219410 304965 327386 342379 274428 173420 193341 211037 310725
53 310725 331719 327271 300458 278070 281923 335240 298179 299488 297025 308751 380725 323209 321146
40 321146 301342 299541 311470 222421 267317 312833 367254 348357 252441 248846 320027 378818
28 378818 308886 186281 184064 354639 434512 427662 354895 331605 346366 335740 331576 328521
16 328521 315253 304848 353015 366954 307058 288185 265853 283179 286145 298177 319394 335021
4 335021 314089 286920 262879 207530
0 207530
$$ Imaginary data points
##PAGE= N=2
##DATA TABLE= (X++(I..I)), XYDATA
16383 -2876411 -2837081 -2817611 -2839158 -2751754 -2699404 -2688453 -2622202 -2611789 -2627277 -2571525 -2514325
16372 -2514325 -2372130 -2337490 -2314088 -2289318 -2338875 -2186793 -2130425 -2097895 -2083108 -2022142 -1942964
16361 -1942964 -1947974 -1905174 -1882943 -1744615 -1694903 -1661547 -1677010 -1626465 -1510835 -1370862 -1404593
16350 -1404593 -1426998 -1399590 -1318222 -1179657 -1218148 -1164084 -1168539 -1105992 -1040596 -1036075 -930923
16339 -930923 -953766 -887074 -907745 -891482 -783139 -734343 -679742 -667096 -645591 -610553 -534520
16328 -534520 -456183 -402124 -466311 -364548 -316066 -295949 -239722 -243761 -105787 -59196 -1510
16317 -1510 -66493 -54670 92115 168659 176885 162376 121475 240185 313356 288740 363891 312551
16305 312551 434778 462684 495197 503876 487646 583388 601619 601480 674235 765747 823304 900973
16293 900973 921606 975286 913536 1007494 1155312 1065961 1109527 1079632 1184361 1238699 1236313
16282 1236313 1318652 1281951 1312446 1330818 1359820 1449137 1541813 1564333 1553347 1550130 1540652 1561442
16270 1561442 1603378 1646139 1625680 1722885 1726335 1828856 1863709 1860363 1925881 1980773 2052806
16259 2052806 2050527 2026875 2007825 2025854 2068630 2121204 2099348 2152168 2189677 2247220 2324889
16248 2324889 2201303 2266012 2295312 2342947 2401339 2369127 2340587 2380097 2420668 2467719 2528448
16237 2528448 2560006 2612463 2586886 2651188 2626525 2631045 2671657 2693499 2695548 2691954 2738794 2821624
16225 2821624 2842727 2827763 2726179 2714555 2832879 2948447 3053355 3045213 2880502 2923469
16215 2923469 3051142 3139935 3200439 3062663 3089016 3130243 3184644 3223605 3194761 3225290 3202814
16204 3202814 3261281 3294013 3258951 3340295 3331267 3307052 3359289 3253137 3319651 3375912 3315755
16193 3315755 3301152 3258597 3380915 3427389 3430743 3528961 3393135 3380654 3469879 3453195 3651207
16182 3651207 3613186 3620682 3567313 3553924 3726301 3708873 3716716 3597538 3662304 3699066 3687116
16171 3687116 3629011 3718570 3725421 3791112 3815694 3760896 3776016 3651181 3744907 3736362 3838040
16160 3838040 3817644 3802841 3868446 3816149 3941544 3859699 3873739 3870461 3889819 3930763 3977331
16149 3977331 3999831 4042722 4017579 3937480 4039713 4004019 4073477 3993173 3994477 4000385 3940963
16138 3940963 4023823 4004008 4077301 3946965 4042516 3969303 4047693 4100796 4168561 4115093 3930550
16127 3930550 4014629 4044284 4215979 4118938 4074665 4006375 4159313 4290961 4221667 4193200 4123752
16116 4123752 4295035 4263469 4305307 4229474 4208632 4207416 4123783 4137775 3976018 4112843 4141312
16105 4141312 4279859 4091783 4084802 4084448 4140187 4162903 4076085 4147446 4112656 4281303 4221796
16094 4221796 4206050 4219413 4222632 4286482 4268667 4341789 4290311 4373614 4243951 4277994 4252564
16083 4252564 4279037 4361914 4308771 4363045 4260825 4317810 4213200 4321603 4267386 4248463 4259450
16072 4259450 4199199 4257368 4084182 4190744 4213558 4245955 4205313 4263604 4283916 4306853 4380494
16061 4380494 4315165 4322391 4213423 4413251 4369814 4353048 4323007 4256275 4316438 4264265 4378912
16050 4378912 4293838 4330672 4252282 4303477 4354597 4431478 4451428 4333873 4311726 4258519 4380840
16039 4380840 4357658 4420848 4288649 4238492 4264949 4327613 4360127 4332763 4343366 4302982 4298040
16028 4298040 4310979 4388682 4359972 4377314 4336197 4273525 4313239 4298387 4334894 4333682 4318496
16017 4318496 4239685 4258657 4324007 4349905 4336264 4201156 4211598 4307819 4379312 4347585 4273481
16006 4273481 4241823 4290773 4335539 4350634 4378502 4362768 4350444 4402087 4459262 4488842 4549271
15995 4549271 4442369 4385482 4388357 4422128 4519785 4494253 4472592 4330135 4257155 4256440 4287472
15984 4287472 4266849 4307600 4280711 4239448 4308521 4345018 4435110 4367136 4334286 4265954 4344499
15973 4344499 4337675 4377831 4378961 4340423 4402088 4479961 4460574 4409730 4403428 4380504 4458909 4411625
15961 4411625 4393311 4379178 4333890 4435317 4422420 4405790 4370560 4367996 4388254 4462733 4473342
15950 4473342 4402030 4362687 4358722 4346257 4308570 4381501 4420693 4479529 4393759 4386202 4429649 4383570
15938 4383570 4472289 4271373 4271106 4408637 4446382 4483024 4341854 4300386 4276617 4280185 4334334
15927 4334334 4386591 4353506 4380542 4299794 4339249 4420473 4419729 4402084 4265177 4283907 4208287
15916 4208287 4402249 4514043 4492734 4460309 4390873 4464677 4464295 4520916 4517342 4485584 4377652
15905 4377652 4427459 4444649 4492297 4488043 4432465 4370312 4304074 4378767 4425165 4471109 4493264
15894 4493264 4365995 4391017 4373672 4440979 4464498 4395342 4374227 4398838 4451471 4530590 4479006
15883 4479006 4509236 4427141 4396397 4399735 4366011 4416584 4379616 4408519 4420862 4469071 4398745
15872 4398745 4392965 4335804 4274409 4323243 4359804 4426463 4409137 4458168 4451367 4569713 4484951
15861 4484951 4388818 4376513 4346075 4561992 4559686 4551053 4396360 4401399 4532080 4495855 4554356
15850 4554356 4531071 4412210 4446349 4427314 4395524 4392461 4288394 4355955 4367253 4364534 4419317
15839 4419317 4387157 4541727 4441041 4422982 4335548 4335892 4434784 4441745 4489134 4438462 4358753
15828 4358753 4463822 4523484 4550553 4591084 4450787 4483747 4474287 4467003 4465942 4325232 4484112
15817 4484112 4443056 4473877 4526379 4434741 4504271 4462168 4521474 4504597 4458801 4436415 4462381
15806 4462381 4445519 4488528 4401989 4412651 4431929 4395207 4497433 4501567 4576074 4457233 4460592
15795 4460592 4476513 4361761 4508448 4441507 4331316 4350296 4385299 4467553 4434273 4302319
15785 4302319 4381719 4405637 4501598 4466731 4349541 4444927 4393958 4499350 4411363 4315837 4416792
15774 4416792 4509984 4532792 4464819 4424291 4500999 4659023 4657718 4624549 4452443 4485226 4548123
15763 4548123 4644267 4646939 4517966 4516775 4446349 4529935 4499358 4436585 4431696 4465580 4532594 4437119
15751 4437119 4412345 4502052 4429014 4334663 4416056 4426197 4438604 4415012 4391544 4405595 4438679
15740 4438679 4561256 4512565 4494119 4430092 4438840 4581997 4518570 4453952 4426608 4455663 4523058
15729 4523058 4570493 4519981 4451517 4347533 4479208 4592195 4564964 4561199 4493321 4491205 4394779
15718 4394779 4421863 4492066 4503662 4513196 4500165 4484631 4586180 4571839 4580628 4448810 4319690
15707 4319690 4340103 4305233 4450633 4513869 4450384 4437991 4280790 4349849 4487889 4561822 4527981
15696 4527981 4436520 4404557 4501244 4551128 4626471 4544591 4379354 4430722 4511561 4634881 4510112
15685 4510112 4459440 4524041 4617530 4672576 4492539 4398948 4412641 4565916 4596040 4449383 4371140
15674 4371140 4507247 4591123 4555229 4491521 4386951 4549343 4644176 4693686 4497767 4451624
15664 4451624 4468956 4519023 4583252 4454708 4464292 4473607 4560945 4591316 4571807 4555862 4620925
15653 4620925 4553016 4459550 4443577 4352749 4485803 4446697 4481023 4464926 4468767 4638172 4579696
15642 4579696 4562935 4471007 4571529 4663546 4628802 4551209 4496790 4591877 4651234 4574303 4421186
15631 4421186 4514058 4528033 4773011 4666059 4575338 4557418 4493286 4612900 4466719 4468290 4415008
15620 4415008 4519273 4593540 4491530 4496760 4413279 4536060 4556163 4542332 4462086 4528813 4556623
15609 4556623 4695216 4679813 4537164 4490189 4447252 4604185 4587744 4617776 4566253 4646685 4696044
15598 4696044 4688826 4644451 4560872 4580004 4490028 4541984 4527592 4624696 4681655 4695076 4696365 4570746
15586 4570746 4537752 4468538 4582068 4559429 4627863 4535166 4525316 4507466 4555574 4610591 4481983
15575 4481983 4574609 4551957 4676441 4732042 4729185 4698727 4541399 4479281 4392195 4503062 4577535
15564 4577535 4649232 4580680 4499584 4518559 4568832 4582318 4633738 4605923 4475813 4588747 4550170
15553 4550170 4594902 4643864 4538192 4516752 4456477 4486362 4474246 4560428 4736193 4699110 4607763
15542 4607763 4640821 4690111 4730694 4664517 4537781 4487835 4535483 4716898 4807674 4695172 4622296
15531 4622296 4522875 4615041 4622764 4577612 4563153 4465695 4545849 4545766 4570693 4504647 4480834 4527558
15519 4527558 4477391 4470598 4421114 4633649 4768398 4762699 4528049 4514862 4492017 4548176 4664517
15508 4664517 4590471 4638931 4559933 4778794 4796194 4759521 4677907 4644421 4713970 4634809 4625911
15497 4625911 4583349 4689046 4685587 4642553 4522094 4469550 4609233 4694106 4794553 4563808
15487 4563808 4575330 4621272 4765217 4748707 4554765 4413370 4453222 4655934 4580150 4647708
15477 4647708 4498244 4603370 4709133 4734878 4685040 4615110 4782254 4669076 4684306 4499462
15467 4499462 4523702 4540925 4719238 4639843 4513395 4494731 4575018 4873690 4764570 4739984
15457 4739984 4525928 4633382 4826261 4736502 4656646 4444506 4571275 4757554 4793618 4583627
15447 4583627 4570376 4673488 4732344 4697814 4525140 4603844 4611090 4809155 4549459 4470665 4470893
15436 4470893 4633673 4829262 4632347 4557330 4449738 4699286 4769969 4740165 4631146 4577666
15426 4577666 4614849 4666483 4645918 4532241 4634397 4658346 4745524 4591095 4616094 4708040 4758929
15415 4758929 4695966 4424429 4488426 4581316 4766052 4730920 4624453 4548454 4580300 4743851
15405 4743851 4745415 4693946 4624110 4705853 4715378 4774330 4688484 4698401 4721804 4636314 4645614 4512318
15393 4512318 4681603 4744805 4779541 4688895 4548924 4650140 4686286 4648779 4507083 4508118 4630688
15382 4630688 4668481 4597190 4561190 4518300 4561208 4660987 4625492 4613286 4662921 4846968 4879665
15371 4879665 4812475 4686760 4671918 4842020 4806405 4643259 4544931 4623648 4766476 4809049
15361 4809049 4724283 4647563 4644934 4635459 4701722 4695203 4656618 4671460 4756423 4697922 4594736 4664249
15349 4664249 4654831 4651405 4683673 4559419 4542604 4566823 4680474 4714618 4678344 4695497 4676838
15338 4676838 4736582 4761612 4828212 4907155 4802557 4622617 4684499 4731109 4810857 4724721 4614292
15327 4614292 4563381 4618830 4808558 4868944 4741453 4670426 4665162 4720942 4742801 4779948 4793621
15316 4793621 4858650 4832100 4791455 4720732 4774918 4819555 4877068 4777498 4621177 4706062 4854913
15305 4854913 4992833 4860673 4668761 4600296 4687012 4756204 4684305 4666225 4639461 4725626 4732263
15294 4732263 4690663 4699561 4737442 4699780 4622584 4617538 4635029 4844370 4828497 4749889 4581167
15283 4581167 4556425 4735366 4813870 4847315 4789005 4823053 4822832 4831818 4779973 4733487 4763101 4793033
15271 4793033 4790637 4726388 4691265 4737406 4961149 4878068 4772457 4591412 4622171 4735086 4719193
15260 4719193 4696847 4598411 4588468 4736617 4797203 4771783 4756719 4751485 4742624 4789736 4859147 4846818
15248 4846818 4744725 4803761 4803075 4705073 4642671 4715273 4799506 4830881 4787949 4742686 4757455
15237 4757455 4767300 4793676 4812520 4814977 4717164 4715485 4844116 4951959 4921652 4800196 4736542
15226 4736542 4666407 4694029 4781437 4828431 4872193 4769028 4793055 4813679 4790486 4738666 4783017
15215 4783017 4736099 4798120 4883050 4926085 4919032 4840500 4782128 4609930 4562848 4645550 4742418
15204 4742418 4740963 4702844 4666297 4625398 4685282 4740913 4711742 4610465 4636894 4645316 4808793
15193 4808793 4940884 4849799 4733691 4679814 4716956 4749150 4837983 4865121 4879653 4838450 4873341
15182 4873341 4894191 4925729 4894819 4789251 4756454 4696959 4787767 4833980 4830847 4761628 4678848
15171 4678848 4690240 4734325 4825563 4778948 4704342 4667931 4691142 4797471 4868318 4737054 4611260
15160 4611260 4617037 4698123 4820446 4906822 4896840 4838829 4835978 4860988 4790687 4783301 4886564 4952605
15148 4952605 4877266 4804614 4782409 4864050 4865281 4832738 4741690 4785144 4829998 4874095 4889753
15137 4889753 4743080 4789968 4829479 4917995 4888670 4805553 4770901 4813835 4883714 4850692 4860560
15126 4860560 4868463 4853737 4749014 4759947 4773624 4758550 4761791 4729043 4804153 4777585 4826181
15115 4826181 4763445 4711629 4773133 4864657 4839839 4767424 4836868 4870071 4909825 4888649 4818608
15104 4818608 4736211 4863233 4904532 4847963 4875070 4896130 5008255 4919562 4909653 4822402 4805580
15093 4805580 4886627 4911846 4840950 4677456 4736885 4916571 4965158 4910242 4687131 4691296 4863780
15082 4863780 4910345 4902421 4796254 4739194 4830849 4924476 4896696 4752016 4773213 4952315 4936774
15071 4936774 4897779 4843359 4869540 4864709 4835232 4790155 4658916 4728222 4839495 4807276 4799341
15060 4799341 4668834 4757619 4911076 4915849 4943082 4830387 4787936 4778728 4755079 4904265 4922807
15049 4922807 4827089 4868735 4765398 4865794 4895126 4892259 4910585 4855104 4918430 4905435 4877559
15038 4877559 4865990 4857732 4861493 4833466 4832798 4892212 4858487 4964368 4944717 4820352 4821289 4737647
15026 4737647 4890680 4937935 4842140 4793993 4744052 4885658 4907267 4868408 4859750 4785441 4860083
15015 4860083 4983716 4982650 4975404 4839465 4909079 4899361 4876149 4891836 4842977 5013575 4999159
15004 4999159 4899221 4854882 4767294 4935127 4977343 4838421 4749149 4801617 4895026 4864646 4822903
14993 4822903 4751503 4745039 4847450 4874275 4877217 4923061 4832651 4884707 4851330 4839308 4942228
14982 4942228 4893361 4956646 4798280 4887035 4890305 4865991 4863153 4764375 4798910 4850439 5012692
14971 5012692 4862567 4842370 4769765 4888682 4912284 4829010 4841623 4827315 4954302 4855060 4916097
14960 4916097 4874554 4973129 4936603 4889888 4892236 4817500 4952387 4972038 4931490 4767555 4852205
14949 4852205 4981036 5014561 4908103 4833794 4901021 4924746 5093440 5017452 4958934 4828785
14939 4828785 4914469 5002508 4910965 4952513 4802733 4885179 4812097 4873574 4867332 4924722 4986053
14928 4986053 4944650 4890576 4822484 4969916 4994857 4990988 4810432 4822560 4887854 5070783 5163539
14917 5163539 4968130 4864978 4877279 4997636 5043710 5044746 4971781 4893706 4917760 4952715 4975408
14906 4975408 4881399 4950546 4903779 4889666 4875312 4919956 4964278 4922924 4989472 4870942 4860192
14895 4860192 4921024 4998065 5029064 4927358 4789890 4814919 4911671 5063602 5031816 4856619
14885 4856619 4846065 4905453 4966155 5016253 4824577 4882791 4822588 5037182 5071884 4961699 4982062
14874 4982062 4856674 4947219 5018328 4999113 5019586 5021269 4990376 5064893 4981199 5044928 5016803
14863 5016803 4932095 5006699 4870332 4936059 4974698 5000367 5041335 4924182 5015974 4973714 4998964
14852 4998964 4983997 4898544 4954497 4980855 4976514 4989519 4911664 4875755 4937162 4880410 5012529
14841 5012529 4931355 4957480 4961978 4923359 5000532 4836791 4957246 4955407 4987937 5039878 4999672
14830 4999672 5077067 5069328 4967601 4943266 4968208 5103680 5186148 5022084 4989164 4873612 4949807
14819 4949807 5109103 4982157 5005932 4881781 5014327 5012147 5009101 5035118 4920061 5015548 4938400
14808 4938400 4988016 5092822 5109544 4954574 4919888 4928658 4974671 5016007 5049232 5061268 4889666
14797 4889666 4926460 4948098 5034127 5095762 4940271 4870406 4855084 4977444 5019656 5013912 4985110
14786 4985110 4953015 4913080 4970783 5078433 5067650 5078527 4939587 4997258 4989415 5119225 5116442
14775 5116442 5028027 4963976 4927163 5068640 5108913 5087370 5103109 5070717 4988619 5051712 5154210
14764 5154210 5147207 5106774 4923685 4946952 4994439 5010450 4987781 5020286 5023494 4976378 4979956 5007560
14752 5007560 5130147 5037416 5064333 4993181 4979221 5000318 4939469 5064383 5018747 5010214 5008533
14741 5008533 5038439 5205969 5134443 5086056 5058278 4998178 5068046 5060798 5096537 5131339 5143160
$$ [...]
##END NTUPLES=NMR SPECTRUM
##END=
