##TITLE=1H_DE-80H_X3
 200.13MHz, d2o
 8 sc
 
 19ns.26.2.2025
##JCAMPDX= 6.0         $$ Bruker NMR JCAMP-DX V2.0
##DATA TYPE= NMR SPECTRUM
##DATA CLASS= NTUPLES
##ORIGIN= UXNMR, Bruker Analytische Messtechnik GmbH
##OWNER= pz
$$ XWIN-NMR		Version 3.5
$$ Wed Oct  8 12:05:53 2025 Russian Standard Time (UT+4h)  Yarkov@DPX200
##.OBSERVE FREQUENCY= 200.1313
##.OBSERVE NUCLEUS= ^1H
##.ACQUISITION MODE= SIMULTANEOUS
##.ACQUISITION SCHEME= undefined
##.AVERAGES= 8
##.DIGITISER RES= 18
##SPECTROMETER/DATA SYSTEM= spect
##.PULSE SEQUENCE= zg30
##.SOLVENT NAME= DMSO
##.SHIFT REFERENCE= (INTERNAL, DMSO, 0, 15.5662)
##AUDIT TRAIL= $$ (NUMBER, WHEN, WHO, WHERE, WHAT)
$$ ##TITLE= Audit trail, XWIN-NMR		Version 3.5
$$ ##JCAMPDX= 5.01
$$ ##ORIGIN= Bruker BioSpin GmbH
$$ ##OWNER= Yarkov
$$ C:/Bruker/XWIN-NMR/data/yarkov2/nmr/H-C/1/pdata/1/auditp.txt
$$ ##AUDIT TRAIL=  $$ (NUMBER, WHEN, WHO, WHERE, WHAT)
(   1,<2025-10-08 12:04:41.21 +0400>,<Yarkov>,<DPX200>,
      <created by zg, POWCHK disabled, PULCHK disabled
       configuration hash MD5:
       00 E9 B6 7A A2 85 ED C7 34 08 36 98 17 FE 4E 26
       data hash MD5: 16K
       3D BC D3 F5 1A 74 DC AF 37 0E 15 B3 82 3D E9 B8>)
(   2,<2025-10-08 12:05:15.71 +0400>,<Yarkov>,<DPX200>,
      <Start of raw data processing
       efp BC_mod = 2 LB = 0.25 FT_mod = 6 PKNL = 1 PHC0 = -2281.05 PHC1 = 12.99097 SI = 16K 
       data hash MD5: 16K
       42 B2 CC 1B 58 62 3A B7 31 60 0E E3 C8 1E 5B 6B>)
$$ ##END=
$$ 
$$ hash MD5
$$ E7 21 55 05 59 80 BA 21 03 A3 10 E7 AE DE 18 50
##$RELAX= 
##$RELAX= 
##$RELAX= 
##$RELAX= 
##$RELAX= 
##$RELAX= 
$$ Bruker specific parameters
$$ --------------------------
##$DU= <C:/Bruker/XWIN-NMR>
##$EXPNO= 1
##$NAME= <H-C>
##$PROCNO= 1
##$TYPE= <nmr>
##$USER= <yarkov2>
##$AMP= (0..31)
100 100 100 100 100 100 100 100 100 100 100 100 100 100 100 100 100 100 
100 100 100 100 100 100 100 100 100 100 100 100 100 100 
##$AQSEQ= 0
##$AQ_mod= 1
##$AUNM= <au_zg>
##$AUTOPOS= <>
##$BF1= 200.13
##$BF2= 200.13
##$BF3= 200.13
##$BF4= 200.13
##$BF5= 200.13
##$BF6= 200.13
##$BF7= 200.13
##$BF8= 200.13
##$BYTORDA= 1
##$CFDGTYP= 0
##$CFRGTYP= 5
##$CHEMSTR= <none>
##$CNST= (0..31)
1 1 145 1 1 1 1 1 1 1 1 1 1 1 1 1 1 1 1 1 1 1 1 1 1 1 1 1 1 1 1 1 
##$CPDPRG= <>
##$CPDPRG1= <>
##$CPDPRG2= <>
##$CPDPRG3= <>
##$CPDPRG4= <mlev>
##$CPDPRG5= <mlev>
##$CPDPRG6= <mlev>
##$CPDPRG7= <mlev>
##$CPDPRG8= <mlev>
##$CPDPRGB= <>
##$CPDPRGT= <>
##$D= (0..31)
0 0.7 0 0 0 0 0 0 0 0 0 0.03 0 0 0 0 0 0 0 0 0 0 0 0 0 0 0 0 0 0 0 0 
##$DATE= 1759910680
##$DBL= (0..7)
120 120 120 120 120 120 120 120 
##$DBP= (0..7)
150 150 150 150 150 150 150 150 
##$DBP07= 0
##$DBPNAM0= <>
##$DBPNAM1= <>
##$DBPNAM2= <>
##$DBPNAM3= <>
##$DBPNAM4= <>
##$DBPNAM5= <>
##$DBPNAM6= <>
##$DBPNAM7= <>
##$DBPOAL= (0..7)
0.5 0.5 0.5 0.5 0.5 0.5 0.5 0.5 
##$DBPOFFS= (0..7)
0 0 0 0 0 0 0 0 
##$DE= 6
##$DECBNUC= <off>
##$DECIM= 32
##$DECNUC= <off>
##$DECSTAT= 4
##$DIGMOD= 1
##$DIGTYP= 9
##$DL= (0..7)
0 120 120 120 120 120 120 120 
##$DP= (0..7)
$$ [...]
##$SUBNAM2= <"">
##$SUBNAM3= <"">
##$SUBNAM4= <"">
##$SUBNAM5= <"">
##$SUBNAM6= <"">
##$SUBNAM7= <"">
##$SUBNAM8= <"">
##$SUBNAM9= <"">
##$SW= 18.0517328524113
##$SWIBOX= (0..15)
0 0 2 0 0 0 0 0 0 0 0 0 0 0 0 0 
##$SW_h= 3612.71676300578
##$TD= 16384
##$TD0= 1
##$TE= 0
##$TE2= 300
##$TE3= 300
##$TEG= 300
##$TL= (0..7)
0 120 120 120 120 120 120 120 
##$TP= (0..7)
150 150 150 150 150 150 150 150 
##$TP07= 0
##$TPNAME0= <>
##$TPNAME1= <>
##$TPNAME2= <>
##$TPNAME3= <>
##$TPNAME4= <>
##$TPNAME5= <>
##$TPNAME6= <>
##$TPNAME7= <>
##$TPOAL= (0..7)
0.5 0.5 0.5 0.5 0.5 0.5 0.5 0.5 
##$TPOFFS= (0..7)
0 0 0 0 0 0 0 0 
##$TUNHIN= 0
##$TUNHOUT= 0
##$TUNXOUT= 0
##$USERA1= <user>
##$USERA2= <user>
##$USERA3= <user>
##$USERA4= <user>
##$USERA5= <user>
##$V9= 5
##$VALIST= <valist>
##$VCLIST= <CCCCCCCCCCCCCCC>
##$VD= 0
##$VDLIST= <DDDDDDDDDDDDDDD>
##$VPLIST= <PPPPPPPPPPPPPPP>
##$VTLIST= <TTTTTTTTTTTTTTT>
##$WBST= 1024
##$WBSW= 4
##$XGAIN= (0..3)
0 0 0 0 
##$XL= 0
##$YL= 0
##$YMAX_a= 803822
##$YMIN_a= -984668
##$ZGOPTNS= <>
##$ZL1= 120
##$ZL2= 120
##$ZL3= 120
##$ZL4= 120
##$ABSF1= 0
##$ABSF2= 0
##$ABSG= 0
##$ABSL= 0
##$ALPHA= 0
##$AQORDER= 0
##$ASSFAC= 0
##$ASSFACI= 0
##$ASSFACX= 0
##$ASSWID= 0
##$AUNMP= <proc_1d>
##$AZFE= 0.1
##$AZFW= 0.1
##$BCFW= 0
##$BC_mod= 2
##$BYTORDP= 0
##$COROFFS= 0
##$CY= -3
##$DATMOD= 1
##$DC= 0
##$DFILT= <>
##$DTYPP= 0
##$F1P= 0
##$F2P= 0
##$FCOR= 1
##$FTSIZE= 16384
##$FT_mod= 6
##$GAMMA= 0
##$GB= 0
##$INTBC= 1
##$INTSCL= 3.241238e-09
##$ISEN= 128
##$LB= 0.25
##$LEV0= 0
##$LPBIN= 0
##$MAXI= 10000
##$MC2= 0
##$MEAN= 0
##$ME_mod= 0
##$MI= 1.114404
##$NCOEF= 0
##$NC_proc= -6
##$NLEV= 6
##$NOISF1= 3.799351
##$NOISF2= 2.8
##$NSP= 0
##$NTH_PI= 0
##$NZP= 0
##$OFFSET= 15.5662
##$PC= 1
##$PHC0= -2281.05
##$PHC1= 12.99097
##$PH_mod= 1
##$PKNL= yes
##$PPARMOD= 0
##$PSCAL= 0
##$PSIGN= 0
##$REVERSE= no
##$SF= 200.129991095741
##$SI= 16384
##$SIGF1= 3
##$SIGF2= 2
##$SINO= 0.751879
##$SIOLD= 32768
##$SREGLST= <19F.Aceton>
##$SSB= 0
##$STSI= 16384
##$STSR= 0
##$SW_p= 3612.71676300578
##$SYMM= 0
##$S_DEV= 0
##$TDeff= 16384
##$TDoff= 0
##$TI= <>
##$TILT= no
##$TM1= 0
##$TM2= 0
##$TOPLEV= 0
##$USERP1= <user>
##$USERP2= <user>
##$USERP3= <user>
##$USERP4= <user>
##$USERP5= <user>
##$WDW= 1
##$XDIM= 16384
##$YMAX_p= 477313421
##$YMIN_p= -1726095
$$ End of Bruker specific parameters
$$ ---------------------------------
##NTUPLES= NMR SPECTRUM
##VAR_NAME=  FREQUENCY,     SPECTRUM/REAL,   SPECTRUM/IMAG
##SYMBOL=    X,             R,               I
##VAR_TYPE=  INDEPENDENT,   DEPENDENT,       DEPENDENT
##VAR_FORM=  AFFN,          ASDF,            ASDF
##VAR_DIM=   16384,         16384,           16384
##UNITS=     HZ,            ARBITRARY UNITS, ARBITRARY UNITS
##FACTOR=    0.220516191357247, 1,           1
##FIRST=     3115.26351869738, 0,            0
##LAST=      -497.453244308403, 0,           0
##MIN=       -497.453244308403, -1726095,    0
##MAX=       3115.26351869738, 477313421,    0
$$ Real data points
##PAGE= N=1
##DATA TABLE= (X++(R..R)), XYDATA
$$ [...]
$$ plain form
6493 1721508 1773060 1823253 1784744 1914235 2055009 1987811 2143018 2166947 2211393 2341508 2426106
6482 2426106 2487974 2591096 2914840 3006068 3001948 3105876 3484352 3621227 3800069 3838095
6472 3838095 3914510 3988089 4035404 4151851 4366299 4296888 4166064 4028423 4068922 3937194
6462 3937194 3680430 3639362 3646752 3631215 3576401 3452552 3345545 3257087 3203519 3163472 3189582
6451 3189582 3241612 3196071 3083182 3177227 3128940 2998195 2953030 3035689 3052806 2967263 2918335
6440 2918335 2957710 2824513 2862674 2906016 2858924 2817890 2741071 2742082 2790907 2688783 2834360
6429 2834360 2917037 2912198 2885786 2697400 2828875 2868626 3004801 3032273 3077279 3080156 3043695
6418 3043695 3053423 3191233 3085197 3105840 3189982 3207301 3177984 3101229 3080260 2898028 2846204
$$ packed form
6493A721508N1552N0193l8509J29491J40774o7198J55207K3929M4446J30115Q4598
6482B426106O1868J03122L23744R1228m120J03928L78476J36875J78842L8026
6472C838095P6415P3579M7315J16447K14448o9411j30824j37641M0499j31728
6462C937194k56764m1068P390j5537n4814j23849j07007q8458n3568m0047K6110
6451C189582N2030m5541j12889R4045m8287j30745m5165Q2659J7117q5543m8928
6440B918335L9375j33197L8161M3342m7092m1034p6819J011M8825j02124J45577
6429B834360Q2677m839k6412j88386J31475L9751J36175K7472M5006K877l6461
6418C043695R728J37810j06036K0643Q4142J7319k9317p6755k0969j82232n1824
$$ plain form
6407 2846204 3005990 2830082 2868539 2732981 2748284 2706243 2587167 2576783 2397418 2251048
6397 2251048 2266118 2273919 2225030 2227646 2146537 2142821 2074626 2100630 1908006 1828268 1917327 1861604
6385 1861604 1839698 1757584 1785736 1777410 1791481 1824731 1749838 1645500 1658196 1716038 1719899 1736788
6373 1736788 1733891 1632555 1581873 1433353 1371030 1464315 1395920 1451249 1511474 1500733 1468306
6362 1468306 1551639 1626926 1503994 1561039 1409711 1346242 1280860 1236642 1413052 1406619 1251334
6351 1251334 1191530 1219620 1257145 1301522 1240900 1362567 1447935 1221044 1196696 1244247 1103211
6340 1103211 1251290 1238671 1233301 1215909 1063062 1185731 1226238 1170130 1217217 1245546 1150100
6329 1150100 1120154 1166316 1216607 1343797 1331638 1273631 1191307 1207645 1332944 1178944 1176442
$$ packed form
6407B846204J59786j75908L8457j35558J5303m2041j19076j0384j79365j46370
6397B251048J5070P801m8889K616q1109l716o8195K6004j92624p9738Q9059n5723
6385A861604k1906q2114K8152q326J4071L3250p4893j04338J2696N7842L861J6889
6373A736788k897j01336n0682j48520o2323R3285o8395N5329O0225j0741l2427
6362A468306Q3333P5287j22932N7045j51328o3469o5382m4218J76410o433j55285
6351A251334n9804K8090L7525M4377o0622J21667Q5368k26891k4348M7551j41036
6340A103211J48079j2619n370j7392j52847J22669M0507n6108M7087K8329r5446
6329A150100k9946M6162N0291J27190j2159n8007q2324J6338J25299j54000k502
$$ plain form
6318 1176442 1257078 1290742 1176652 1100539 982852 1057803 1152795 1208779 1310348 1048242 1047350
6307 1047350 1259586 1349172 1298465 1262703 1191531 1221103 1208508 1085394 1225303 1279650 1233766
6296 1233766 1300851 1294353 1394757 1277764 1233855 1110432 1128537 1193259 1212034 1167172 1130568
6285 1130568 1204630 1323058 1311271 1279544 1254912 1180582 1105994 1151749 1371510 1255486 1217677
6274 1217677 1328780 1367600 1421615 1464665 1549814 1532096 1522051 1466882 1480999 1581687 1506613
6263 1506613 1564549 1582813 1553601 1444777 1367140 1409040 1468854 1365392 1374045 1394574 1567762
6252 1567762 1604055 1471332 1554190 1429908 1326107 1549120 1510103 1463019 1584844 1588302 1571012
6241 1571012 1584605 1613637 1709140 1668019 1687541 1777297 1827685 1855501 1850313 1890321 1779844
$$ packed form
6318A176442Q0636L3664j14090p6113j17687P4951R4992N5984J01569k62106q92
6307A047350K12236Q9586n0707l5762p1172K9572j2595j23114J39909N4347m5884
6296A233766O7085o498J00404j16993m3909j23423J8105O4722J8775m4862l6604
6285A130568P4062J18428j1787l1727k4632p4330p4588M5755K19761j16024l7809
6274A217677J11103L8820N4015M3050Q5149j7718j0045n5169J4117J00688p5074
6263A506613N7936J8264k9212j08824p7637M1900N9814j03462Q653K0529J73188
6252A567762L6293j32723Q2858j24282j03801K23013l9017m7084J21825L458j7290
6241A571012J3593K9032R5503m1121J9522Q9756N0388K7816n188M0008j10477
$$ plain form
6230 1779844 1784024 1854494 1984287 1922487 1984072 1978741 2058987 2122860 2065774 2033633 2106572 2234953
6218 2234953 2246123 2261522 2246765 2177569 2179207 2265567 2194463 2128617 2210738 2218348 2238550 2275721
6206 2275721 2361193 2398871 2315984 2410015 2478640 2479304 2391856 2404327 2463384 2427638 2494939 2608623
6194 2608623 2534946 2512612 2577041 2568106 2545948 2434603 2458939 2411268 2373963 2286900 2361314
6183 2361314 2357621 2417110 2379493 2443375 2597297 2564385 2476298 2388205 2476515 2488327 2498917
6172 2498917 2544849 2542177 2455680 2511384 2579928 2579650 2603181 2598243 2729354 2827398 2796164 2725424
6160 2725424 2645891 2836450 2906148 2793970 2793675 2778213 2708926 2774704 2858493 2797821 2868791
6149 2868791 2968034 2997158 3015050 2978886 3042740 3071156 3273999 3245456 3329463 3422311 3423613
$$ packed form
6230A779844M180P0470J29793o1800O1585n331Q0246O3873n7086l2141P2939J28381
6218B234953J1170J5399j4757o9196J638Q6360p1104o5846Q2121P610K0202L7171
6206B275721Q5472L7678q2887R4031O8625O64q7448J2471N9057l5746O7301J13684
6194B608623p3677k2334O4429q935k2158j11345K4336m7671l7305q7063P4414
6183B361314l693N9489l7617O3882J53922l2912q8087q8093Q8310J1812J0590
6172B498917M5932k672q6497N5704O8544k78K3531m938J31111R8044l1234p0740
6160B725424p9533J90559O9698j12178k95j5462o9287O5778Q3789o0672P0970
6149B868791R9243K9124J7892l6164O3854K8416K02843k8543Q4007R2848J302
$$ plain form
6138 3423613 3424112 3498013 3579478 3721740 3714149 3848324 4025607 4154202 4217441 4236271 4528555
6127 4528555 4680415 4685834 4795787 4867935 4927391 4983660 5042805 5163643 5108660 5085419 5236177
6116 5236177 5155496 5200590 5283082 5230417 5287745 5312180 5267494 5369344 5444159 5397436 5516758
6105 5516758 5585553 5614121 5789167 5852535 5832687 5856818 5991049 6048518 5928963 5797706 5775859
6094 5775859 5838645 5929928 6057260 6153365 6127932 6201222 6234504 6248287 6296985 6267644 6210639
6083 6210639 6156638 6148618 6066059 6121112 6151505 6080540 6047782 5968756 5846247 5951699 5922638
6072 5922638 5915362 5867380 5925477 5944790 5871819 5978566 6019599 6025362 6140797 6123080 6101596
6061 6101596 6148813 6324534 6381951 6383991 6434255 6505487 6742425 7006353 7136551 7199594 7416031
$$ packed form
6138C423613M99P3901Q1465J42262p591J34175J77283J28595O3239J8830K92284
6127D528555J51860N419J09953P2148N9456N6269N9145J20838n4983k3241J50758
6116E236177q0681M5094Q2492n2665N7328K4435m4686J01850P4815m6723J19322
6105E516758O8795K8568J75046O3368j9848K4131J34231N7469j19555j31257k1847
6094E775859O2786R1283J27332R6105k5433P3290L3282J3783M8698k9341n7005
6083F210639n4001q020q2559N5053L0393p0965l2758p9026j22509J05452k9061
6072E922638p276m7982N8097J9313p2971J06747M1033N763J15435j7717k1484
6061F101596M7217J75721N7417K040N0264P1232K36938K63928J30198O3043K16437
$$ plain form
6050 7416031 7638364 7799130 8031255 8152926 8207934 8333054 8583949 8571405 8699458 8832630
6040 8832630 8751206 8811666 8971849 9036813 9262445 9308352 9513784 9733448 9776750 9953069
6030 9953069 10148173 10522436 10883625 11076893 11267114 11748858 12167919 12577630 12910471 13238516
6020 13238516 13641119 13973174 14438184 14917223 15269699 15410161 15559101 15857034 16195301
6011 16195301 16534571 17017530 17453189 17878819 18471198 19199038 19936214 20497298 21270938
6002 21270938 21989752 22904813 23904066 25069020 26291938 27397763 28704324 29904097 30882110
5993 30882110 32029100 33153013 33970989 34598498 35256793 35667640 35917238 35953918 35827560
5984 35827560 35655824 35439891 35339324 35180076 35192873 35299102 35490501 35758044 36085437 36380657
$$ packed form
6050G416031K22333J60766K32125J21671N5008J25120K50895j2544J28053J33172
6040H832630q1424O0460J60183O4964K25632M5907K05432K19664M3302J76319
6030I953069J95104L74263L61189J93268J90221M81744M19061M09711L32841L28045
6020A3238516M02603L32055M65010M79039L52476J40462J48940K97933L38267
6011A6195301L39270M82959M35659M25630N92379P27840P37176N61084P73640
6002B1270938P18814R15061R99253J164954J222918J105825J306561J199773R78013
5993C0882110J146990J123913Q17976O27509O58295M10847K49598L6680j26358
5984C5827560j71736k15933j00567j59248J2797J06229J91399K67543L27393K95220
$$ plain form
5974 36380657 36792029 37466969 38342648 39176462 40139697 41224479 42627666 44098927 45465290
5965 45465290 46853041 48432317 50175653 51879738 53302200 54510814 55576646 56286713
5957 56286713 56519222 56393349 55886849 54780371 53384648 51822651 50266120 48638358 47132261
5948 47132261 45658254 44322566 43074329 42042242 41091811 40269869 39441291 38904097 38479989
5939 38479989 38091897 37759821 37579339 37450896 37360928 37581532 37698839 37766691 37937109 38188814
5929 38188814 38500822 38438724 38399351 38362501 37895822 37234211 36459510 35427335 34190993 32894418
5919 32894418 31682274 30397094 29080604 27991120 26895879 25833808 24931647 23916758
5911 23916758 23014103 22126241 21242749 20639862 19898481 19318712 18688741 18096020 17649314
$$ packed form
5974C6380657M11372O74940Q75679Q33814R63235J084782J403187J471261J366363
5965D5465290J387751J579276J743336J704085J422462J208614J065832P10067
5957E6286713K32509j25873n06500j106478j395723j561997j556531j627762j506097
5948D7132261j474007j335688j248237j032087r50431q21942q28578n37194m24108
5939C8479989l88092l32076j80482j28443q9968K20604J17307O7852J70418K51705
5929C8188814L12008o2098l9373l6850m66679o61611p74701j032175j236342j296575
5919C2894418j212144j285180j316490j089484j095241j062071r02161j014889
5911B3916758r02655q87862q83492o02887p41381n79769o29971n92721m46706
$$ plain form
5902 17649314 17171133 16642818 16390110 16051570 15689749 15291423 14908283 14660832 14560940 14458002
5892 14458002 14292212 14327773 14278876 14117174 13945573 13927163 13788925 13779503 13705607 13645389 13516879
5881 13516879 13380507 13226857 13066500 12946436 12691799 12554880 12436026 12403764 12228042 11928889
5871 11928889 11832108 11869180 11877200 11766736 11623530 11482970 11441004 11445815 11601475 11634725 11482230
5860 11482230 11439218 11441904 11460519 11563664 11628735 11534438 11263363 10995369 10958752 10940564 10874599
5849 10874599 10781849 10785334 10757763 10704778 10665379 10801966 10909390 10874620 10985409 11021109 10969556
5838 10969556 11152786 11151594 11255972 11398715 11445423 11564524 11795141 11895224 11833366 11848323
5828 11848323 11862617 11893452 11752195 11535616 11324317 11087077 11058083 10785009 10718683 10603386
$$ packed form
5902A7649314m78181n28315k52708l38540l61821l98326l83140k47451r9892j02938
5892A4458002j65790L5561m8897j61702j71601j8410j38238r422p3896o0218j28510
5881A3516879j36372j53650j60357j20064k54637j36919j18854l2262j75722k99153
5871A1928889r6781L7072Q020j10464j43206j40560m1966M811J55660L3250j52495
5860A1482230m3012K686J8615J03145O5071r4297k71075k67994l6617j8188o5965
5849A0874599r2750L485k7571n2985l9399J36587J07424l4770J10789L5700n1553
5838A0969556J83230j192J04378J42743M6708J19101K30617J00083o1858J4957
5828A1848323J4294L0835j41257k16579k11299k37240k8994k73074o6326j15297
$$ plain form
5818 10603386 10501522 10319327 10201826 10274122 10218335 10064140 10052610 10064904 10025033 9915634
5808 9915634 9800614 9690794 9637230 9726920 9628524 9715671 9664487 9676450 9600854 9511274 9241637
5797 9241637 8961433 8737346 8487725 8351131 8406964 8275427 8167772 8039470 7715745 7581699
5787 7581699 7329945 7283542 7283090 7113665 7094552 7019094 6992910 6962673 6945302 6798710 6708236
5776 6708236 6764945 6638664 6704351 6666744 6528327 6355759 6223496 6147135 6107207 6071390 5807551
5765 5807551 5712706 5559312 5491825 5409860 5346053 5328780 5271089 5162940 5149614 5111931 5106903
5754 5106903 5034633 5035017 4979361 4966028 5029799 4837954 4794535 4838838 5079568 5043542 4838465
5743 4838465 4713392 4686943 4697421 4614665 4673887 4637843 4346601 4261640 4286551 4308406 4106918
$$ packed form
5818A0603386j01864j82195j17501P2296n5787j54195j1530J2294l9871j09399
5808I915634j15020j09820n3564Q9690r8396Q7147n1184J1963p5596q9580k69637
5797I241637k80204k24087k49621j36594N5833j31537j07655j28302l23725j34046
5787G581699k51754m6403m52j69425j9113p5458k6184l0237j7371j46592r0474
5776F708236N6709j26281O5687l7607j38417j72568j32263p6361l9928l5817k63839
5765E807551r4845j53394o7487q1965o3807j7273n7691j08149j3326l7683n028
5754E106903p2270L84n5656j3333O3771j91845m3419M4303K40730l6026k05077
5743D838465j25073k6449J0478q2756N9222l6044k91242q4961K4911K1855k01488
$$ plain form
5732 4106918 4179297 4184478 4147482 4205009 4225178 4251605 4119078 4139604 4334671 4301901 4221128
5721 4221128 4171740 4111474 4076003 4110535 4337031 4295026 4139650 4132200 4130237 4080912 4036526
5710 4036526 4112929 4290084 4210340 4129011 4270086 4281957 4281081 4280911 4397252 4711529 4664594
5699 4664594 4639313 4724437 4785344 4720191 4723289 4831171 4730174 4913345 5068058 5090026 5240438
5688 5240438 5282936 5417957 5521562 5498491 5440933 5363467 5368643 5513468 5458512 5362658 5450438
5677 5450438 5304455 5347066 5434850 5299731 5476881 5461873 5489589 5535028 5503550 5601614 5650639
5666 5650639 5728445 5806490 5789611 5940261 5965603 6002218 6102091 6023353 6050833 6110090 6118408
5655 6118408 6193689 6082643 6035360 6022476 5892375 5842882 5851390 5724045 5716886 5653949 5722506
$$ packed form
5732D106918P2379N181l6996N7527K0169K6427j32527K0526J95067l2770q0773
5721D221128m9388o0266l5471L4532K26496m2005j55376p450j963m9325m4386
5710D036526P6403J77155p9744q1329J41075J1871q76j70J16341L14277m6935
5699D664594k5281Q5124O0907o5153L098J07882j00997J83171J54713K1968J50412
5688E240438M2498J35021J03605k3071n7558p7466N176J44825n4956r5854Q7780
5677E450438j45983M2611Q7784j35119J77150j5008K7716M5439l1478R8064M9025
5666E650639P7806P8045j6879J50650K5342L6615R9873p8738K7480N9257Q318
5655F118408P5281j11046m7283j2884j30101m9493Q508j27345p159o2937O8557
$$ plain form
5644 5722506 5720426 5562071 5566221 5596409 5702204 5702508 5729382 5702164 5725521 5811123 5748903 5850643
5632 5850643 5905051 5897971 5868680 5814013 5828463 5864307 5788867 5796934 5944598 5878217 5822660 5759551
5620 5759551 5771896 5980397 6112210 6051665 6024961 6117824 6248974 6402880 6452792 6463026 6461777
5609 6461777 6311378 6293222 6444666 6600065 6539201 6549824 6647102 6779317 6826166 6953165
5599 6953165 7030813 7187832 7195932 7469436 7543148 7698983 7918204 8048676 8138741 8437429
5589 8437429 8687526 8804960 9139092 9591686 9849043 9963171 10101345 10293789 10560472 10788910
5579 10788910 11259331 11488106 11573643 11721061 11942544 12207179 12445958 12647327 13055781 13368716
5569 13368716 13594121 13955171 14329536 14812035 15228094 15648021 16106790 16654662 17277151
$$ packed form
5644E722506k080j58355M150L0188J05795L04K6874k7218K3357Q5602o2220J01740
5632E850643N4408p080k9291n4667J4450L5844p5440Q067J47664o6381n5557o3109
5620E759551J2345K08501J31813o0545k6704R2863J31150J53906M9912J0234j249
5609F461777j50399j8156J51444J55399o0864J0623R7278J32215M6849J26999
5599F953165P7648J57019Q100K73504P3712J55835K19221J30472R0065K98688
5589H437429K50097J17434L34132M52594K57357J14128J38174J92444K66683K28438
5579A0788910M70421K28775Q5537J47418K21483K64635K38779K01369M08454L12935
5569A3368716K25405L61050L74365M82499M16059M19927M58769N47872O22489
$$ plain form
5560 17277151 17939216 18725211 19381014 19956520 20763209 21591683 22382062 22992534 23729482
5551 23729482 24628946 25577921 26462085 27529464 28501742 29153063 29951706 30901568 31997372
5542 31997372 33275254 34652803 36223870 37979988 39933826 42035540 44248816 46770606
5534 46770606 49422365 52251688 55115433 58344268 61934720 65450334 69086541 73123135
5526 73123135 77210109 81666080 86117054 90415424 94526494 98250367 101733908 104903189
5518 104903189 107701460 109890972 111417053 112148555 112019228 111116241 109549405 107860333
5510 107860333 105612987 103133213 100572617 97700336 94809879 91829603 88632631 85660229
5502 85660229 82536009 79418132 76326100 73277485 70384968 67593340 64911315 62362434
$$ packed form
5560A7277151O62065P85995O55803N75506Q06689Q28474P90379O10472P36948
5551B3729482Q99464R48975Q84164J067379R72278O51321P98643R49862J095804
5542C1997372J277882J377549J571067J756118J953838K101714K213276K521790
5534D6770606K651759K829323K863745L228835L590452L515614L636207M036594
5526G3123135M086974M455971M450974M298370M111070L723873L483541L169281
5518A04903189K798271K189512J526081P31502j29327r02987j566836j689072
5510A07860333k247346k479774k560596k872281k890457k980276l196972k972402
5502H5660229l124220l117877l092032l048615k892517k791628k682025k548881
$$ plain form
5494 62362434 59835679 57364014 55065492 52931881 50869516 48971343 47140362 45325728
5486 45325728 43694419 42066693 40516506 39089489 37566336 36029648 34591263 33187429
5478 33187429 31984431 30847521 29772435 28733465 27768510 26714554 25886610 25042326 24154351
5469 24154351 23457393 22787018 21991027 21244392 20750313 20092971 19491112 18964473 18439065
5460 18439065 17954885 17380081 16833996 16483209 16009333 15732194 15398072 14987261 14425181
5451 14425181 14204404 14015974 13801573 13468801 13106849 12808647 12545433 12447609 12114822 11847196
5441 11847196 11622963 11493062 11339937 11211857 10992418 10927152 10692262 10484943 10335320 10224475
5431 10224475 10205782 10046791 9880657 9887340 9740930 9583876 9441406 9264094 9278477 9200773
$$ packed form
5494F2362434k526755k471665k298522k133611k062365j898173j830981j814634
5486D5325728j631309j627726j550187j427017j523153j536688j438385j403834
5478C3187429j202998j136910j075086j038970r64955j053956q27944q44284q87975
5469B4154351o96958o70375p95991p46635m94079o57342o01859n26639n25408
5460A8439065m84180n74804n46085l50787m73876k77139l34122m10811n62080
5451A4425181k20777j88430k14401l32772l61952k98202k63214r7824l32787k67626
5441A1847196k24233j29901j53125j28080k19439o5266k34890k07319j49623j10845
5431A0224475j8693j58991j66134O683j46410j57054j42470j77312J4383p7704
$$ plain form
5421 9200773 9007176 8788368 8675669 8651305 8520381 8431167 8270798 8250236 8201818 8195323 8150935
5410 8150935 8218833 8283166 8277403 8227557 8187240 8221629 8211203 8076443 8171754 8223270 8098741
5399 8098741 8042548 8165570 8121112 7967765 7819791 7610239 7640635 7582007 7436725 7512470
5389 7512470 7478896 7383668 7221232 7300363 7194183 7276538 7297115 7213784 7199799 7264884 7327900
5378 7327900 7500827 7616851 7609941 7740164 7664079 7605942 7665413 7820427 7828364 7776144 7683914
5367 7683914 7460219 7332696 7343946 7310651 7227289 7151605 7269570 7252713 7297513 7225626 7091262
5356 7091262 7166156 7323372 7293106 7318038 7396144 7458983 7510348 7695156 7730716 7870756 7834605
5345 7834605 7882460 8005465 8018213 8075224 8179281 8246903 8262993 8253919 8243479 8381230 8536329
$$ packed form
5421I200773j93597k18808j12699k4364j30924q9214j60369k0562m8418o495m4388
5410H150935O7898O4333n763m9846m0317L4389j0426j34760R5311N1516j24529
5399H098741n6193J23022m4458j53347j47974k09552L0396n8628j45282P5745
5389G512470l3574r5228j62436P9131j06180Q2355K0577q3331j3985O5085O3016
5378G327900J72927J16024o910J30223p6085n8137N9471J55014P937n2220r2230
5367G683914k23695j27523J1250l3295q3362p5684J17965j6857M4800p1887j34364
5356G091262P4894J57216l0266K4932P8106O2839N1365J84808L5560J40040l6151
5345G834605M7855J23005J2748N7011J04057O7622J6090r074j0440J37751J55099
$$ plain form
5334 8536329 8687145 8811228 8928413 9066322 9207813 9294252 9541671 9970419 10241177 10555463
5324 10555463 10962402 11457843 12005464 12429709 13047759 13798590 14585261 15493683 16368752
5315 16368752 17498486 18733616 19979503 21481374 23288837 25230484 27370675 29810372
5307 29810372 32666632 35536413 37960799 39318640 40619337 42352203 44404751 46442530
5299 46442530 47889581 48486569 47933096 45393935 41879504 38859810 36439432 34341553
5291 34341553 32416740 30815753 29126444 27637939 26144188 24859815 23665828 22651404
5283 22651404 21476244 20452182 19521439 18551575 17597562 16732132 15989387 15313868 14660524
5274 14660524 14124380 13573976 13017002 12538858 12064361 11662918 11302877 10998731 10670359
$$ packed form
5334H536329J50816J24083J17185J37909J41491Q6439K47419M28748K70758L14286
5324A0555463M06939M95441N47621M24245O18050P50831P86671R08422Q75069
5315A6368752J129734J235130J245887J501871J807463J941647K140191K439697
5307B9810372K856260K869781K424386J357841J300697J732866K052548K037779
5299D6442530J447051N96988n53473k539161l514431l019694k420378k097879
5291C4341553j924813j600987j689309j488505j493751j284373j193987j014424
5283B2651404j175160j024062r30743r69864r54013q65430p42745o75519o53344
5274A4660524n36144n50404n56974m78144m74497m01443l60041l04146l28372
$$ plain form
5265 10670359 10293464 9880109 9592629 9248104 8944854 8887080 8659928 8505443 8314810 8112347
5255 8112347 7926186 7766341 7657874 7565317 7360388 7280736 7105058 6958236 6894143 6796976
5245 6796976 6782966 6693448 6601421 6416967 6400203 6404823 6295718 6352010 6256916 6234533 6197060
5234 6197060 6045988 6187815 6163431 6081439 5972537 6067196 6192802 6106698 6062184 5948766
5224 5948766 5975552 5948264 5877506 6013759 5888687 6030338 6124172 6063428 6116864 6225174 6164638
5213 6164638 6114783 6044657 6194549 6209527 6190246 6204155 6189483 6282797 6316168 6255839 6178588
5202 6178588 6188484 6194789 6216564 6219900 6277817 6342520 6348922 6214140 6187221 6253366 6189593 6163403
5190 6163403 6214717 6084261 6126585 6210350 6260271 6151425 6201506 6287201 6303448 6344467 6340953
$$ packed form
5265A0670359l76895m13355k87480l44525l03250n7774k27152j54485j90633k02463
5255H112347j86161j59845j08467r2557k04929p9652j75678j46822o4093r7167
5245F796976j4010q9518r2027j84454j6764M620j09105N6292r5094k2383l7473
5234F197060j51072J41827k4384q1992j08902R4659J25606q6104m4514j13418
5224E948766K6786k7288p0758J36253j25072J41651R3834o0744N3436J08310o0536
5213F164638m9855p0126J49892J4978j9281J3909j4672R3314L3371o0329p7251
5202F178588R896O305K1775L336N7917O4703O402j34782k6919O6145o3773k6190
5190F163403N1314j30456M2324Q3765M9921j08846N0081Q5695J6247M1019l514
$$ plain form
5179 6340953 6426396 6460337 6412705 6286112 6394783 6607176 6589189 6576210 6641499 6622292 6653237
5168 6653237 6772670 6738216 6642542 6681450 6772716 6857383 6897427 6967274 6917533 6954356 7085928
5157 7085928 7026458 7081491 7144856 7066184 7149624 7287775 7246629 7261909 7254766 7198612 7216954
5146 7216954 7298397 7231986 7314340 7340569 7369081 7368074 7432472 7315089 7324331 7511807 7557410
5135 7557410 7513438 7428868 7439464 7524054 7476277 7465206 7567282 7576920 7660445 7697600 7706782 7705203
5123 7705203 7888147 8114173 8044413 7958512 7956810 8038298 8071035 8224657 8395571 8298117 8362137
5112 8362137 8503592 8652243 8751776 8825120 8905887 8935396 9061746 9283247 9458898 9639007
5102 9639007 9751363 9924683 10024954 10320170 10575139 10750463 10907517 10943024 11104083 11474306
$$ packed form
5179F340953Q5443L3941m7632j26593J08671K12393j7987j2979O5289j9207L0945
5168F653237J19433l4454r5674L8908R1266Q4667M0044O9847m9741L6823J31572
5157G085928n9470N5033O3365p8672Q3440J38151m1146J5280p143n6154J8342
5146G216954Q1443o6411Q2354K6229K8512j007O4398j17383R242J87476M5603
5135G557410m3972q4570J0596Q4590m7777j1071J02076R638Q3525L7155R182j579
5123G705203J82944K26026o9760q5901j702Q1488L2737J53622J70914r7454O4020
5112H362137J41455J48651R9533P3344Q0767K9509J26350K21501J75651J80109
5102I639007J12356J73320J00271K95216K54969J75324J57054L5507J61059L70223
$$ plain form
5092 11474306 11665199 11928596 12342333 12642206 12882153 13161030 13394665 13722453 14091936
5083 14091936 14571900 15059667 15391378 15681874 15882456 15700257 15321912 14778828 14478008
5074 14478008 14249257 13948697 13904322 13839539 13758078 13625453 13663090 13793881 13790745 13712542 13755100
5063 13755100 13856987 13862841 13791501 13939695 13957204 14099359 14332608 14493577 14487534 14509920 14519771
5052 14519771 14624084 14693612 14665768 14721092 14819947 14835547 14885657 15008034 15081675 15152012 15314113
5041 15314113 15380753 15516769 15619083 15658456 15848844 15822967 15910088 16087875 16220745 16271219
5031 16271219 16335633 16276314 16269754 16451141 16488914 16609331 16731205 16726089 16836454 16972087 16908219
5020 16908219 16976313 17029269 17150665 17278246 17309622 17518718 17466381 17574074 17693267 17703981
$$ packed form
5092A1474306J90893K63397M13737K99873K39947K78877K33635L27788L69483
5083A4091936M79964M87767L31711K90496K00582j82199l78345n43084l00820
5074A4478008k28751l00560m4375o4783q1461j32625L7637J30791l136p8203M2558
5063A3755100J01887N854p1340J48194J7509J42155K33249J60969o043K2386R851
5052A4519771J04313O9528k7844N5324R8855J5600N0110J22377P3641P0337J62101
5041A5314113O6640J36016J02314L9373J90388k5877Q7121J77787J32870N0474
5031A6271219O4414n9319o560J81387L7773J20417J21874n116J10365J35633o3868
5020A6908219O8094N2956J21396J27581L1376K09096n2337J07693J19193J0714
$$ plain form
5010 17703981 17799268 17843482 17914888 18121083 18281882 18394551 18409229 18447445 18613224 18852545
5000 18852545 19042509 19226038 19317108 19443718 19683365 19741114 19959111 20142397 20355482 20525704
4990 20525704 20558213 20797537 21088490 21276188 21410616 21582069 21703580 21836944 21990471 22087854
4980 22087854 22127117 22287343 22349542 22416303 22477972 22630431 22849062 23046188 23065068 23161690
4970 23161690 23305758 23536391 23757922 23982078 24222627 24464602 24696109 24952036 25189035
4961 25189035 25406746 25657941 25837059 26161063 26479511 26669187 27002215 27251351 27512425
4952 27512425 27887248 28278915 28625205 28986518 29346676 29674927 30109759 30544597 30961572
4943 30961572 31274042 31793273 32235905 32643052 33180288 33736974 34191585 34761926 35266475
$$ packed form
5010A7703981R5287M4214P1406K06195J60799J12669J4678L8216J65779K39321
5000A8852545J89964J83529R1070J26610K39647N7749K17997J83286K13085J70222
4990B0525704L2509K39324K90953J87698J34428J71453J21511J33364J53527R7383
4980B2087854L9263J60226O2199O6761O1669J52459K18631J97126J8880R6622
4970B3161690J44068K30633K21531K24156K40549K41975K31507K55927K36999
4961B5189035K17711K51195J79118L24004L18448J89676L33028K49136K61074
4952B7512425L74823L91667L46290L61313L60158L28251M34832M34838M16975
4943C0961572L12470N19231M42632M07147N37236N56686M54611N70341N04549
$$ plain form
4934 35266475 35780622 36294237 37028731 37721773 38333741 39006305 39860045 40745425 41702729
4925 41702729 42538027 43392929 44344877 45378585 46346309 47327506 48442392 49757547 50996160
4916 50996160 52197906 53456600 54842873 56265858 57644536 59147664 60819057 62409244
4908 62409244 64227679 66132657 67957562 69959046 71929031 74151209 76476373 78742917
4900 78742917 81002713 83523011 85996362 88460589 91036359 93314585 95489483 97704087
4892 97704087 99923122 101785400 103568952 105296384 106938035 108551642 110031056 111664949
4884 111664949 113377635 115122064 117016257 119097176 121177003 123461568 125519412 127654170
4876 127654170 129855182 132151367 134639193 137159525 139591515 142355141 145204289 148263916
$$ packed form
4934C5266475N14147N13615P34494O93042O11968O72564Q53740Q85380R57304
4925D1702729Q35298Q54902R51948J033708R67724R81197J114886J315155J238613
4916E0996160J201746J258694J386273J422985J378678J503128J671393J590187
4908F2409244J818435J904978J824905K001484J969985K222178K325164K266544
4900G8742917K259796K520298K473351K464227K575770K278226K174898K214604
4892I7704087K219035J862278J783552J727432J641651J613607J479414J633893
4884A11664949J712686J744429J894193K080919K079827K284565K057844K134758
4876A27654170K201012K296185K487826K520332K431990K763626K849148L059627
$$ plain form
4868 148263916 151524398 154743175 157979727 161016120 163859556 166401880 168579970 170311074
4860 170311074 171749679 172554964 172773767 172351011 171468292 170371207 169080535 167760690 166568382
4851 166568382 165522338 164687618 163964210 163401684 162960918 162589023 162219241 161853576 161475121
4842 161475121 160946086 160264531 159457134 158488792 157518563 156512152 155504306 154453591 153372046
4833 153372046 152406653 151463123 150582804 149737875 148805651 147884964 146657573 145135833 143378393
4824 143378393 141226578 139016516 136396564 133635366 130611004 127475200 124336659 121250614
4816 121250614 118305753 115548539 112880255 110333264 108006030 106078536 104109128 102360118
4808 102360118 100746870 99242571 97768248 96450051 95242747 94044328 92744836 91462650
$$ packed form
4868A48263916L260482L218777L236552L036393K843436K542324K178090J731104
4860A70311074J438605Q05285K18803m22756q82719j097085j290672j319845j192308
4851A66568382j046044q34720p23408n62526m40766l71895l69782l65665l78455
4842A61475121n29035o81555q07397r68342r70229j006411j007846j050715j081545
4833A53372046r65393r43530q80319q44929r32224r20687j227391j521740j757440
4824A43378393k151815k210062k619952k761198l024362l135804l138541l086045
4816A21250614k944861k757214k668284k546991k327234j927494j969408j749010
4808A02360118j613248j504299j474323j318197j207304j198419j299492j282186
$$ plain form
4800 91462650 90262894 88956047 87589392 86421576 85057667 83798724 82499483 81264756
4792 81264756 80069926 78903508 77896564 76923275 76039672 75112439 74257340 73429303 72605958
4783 72605958 71766125 71193876 70464111 69799990 68958439 68117324 67442169 66874214 66129468
4774 66129468 65527413 64935822 64361565 63848773 63379905 62834764 62372200 62032511 61609155
4765 61609155 61268363 60764732 60103698 59787259 59320105 58854198 58511576 58126483 57787409
4756 57787409 57553129 57139859 56855078 56803581 56699832 56709175 56790717 57000393 57155273 57304582
4746 57304582 57477092 57503288 57557776 57808879 58049624 58378098 58755517 59107551 59488626 59498671
4736 59498671 59163535 58744205 58079598 57217915 56293836 55369653 54333069 53591179 52832863
$$ packed form
4800I1462650j199756j306847j366655j167816j363909j258943j299241j234727
4792H1264756j194830j166418j006944r73289q83603r27233q55099q28037q23345
4783G2605958q39833n72249p29765o64121q41551q41115o75155n67955p44746
4774F6129468o02055n91591n74257n12792m68868n45141m62564l39689m23356
4765F1609155l40792n03631o61034l16439m67154m65907l42622l85093l39074
4756E7787409k34280m13270k84781n1497j03749R343Q1542K09676J54880J49309
4746E7304582J72510K6196N4488K51103K40745L28474L77419L52034L81075J0045
4736E9498671l35136m19330o64607q61683r24079r24183j036584p41890p58316
$$ plain form
4727 52832863 52064585 51243595 50554728 49995975 49355027 48794499 48123389 47415553 46746970
4718 46746970 46241265 45655647 45119544 44631232 44100418 43607064 43042810 42624968 42195661
4709 42195661 41639516 41309577 41022386 40534810 39986236 39714196 39417739 39045011 38769258
4700 38769258 38579353 38315306 37991366 37786804 37651471 37391881 37329912 37069582 36939596 36849214
4690 36849214 36612700 36453024 36261635 36146716 36028179 35813980 35533491 35367877 35337955 35192178
4680 35192178 35059970 34884330 34901977 34805441 34690410 34609122 34451849 34223052 34071297 34030324
4670 34030324 34005502 34062714 33940621 33777328 33778753 33596895 33502328 33479379 33460683 33407888 33253527
4659 33253527 33167338 33116706 33027280 32924995 32942144 32763815 32864142 32715798 32717091 32801024 32821066
$$ packed form
4727E2832863p68278q20990o88867n58753o40948n60528o71110p07836o68583
4718D6746970n05705n85618n36103m88312n30814m93354n64254m17842m29307
4709D2195661n56145l29939k87191m87576n48574k72040k96457l72728k75753
4700C8769258j89905k64047l23940k04562j35333k59590o1969k60330j29986r0382
4690C6849214k36514j59676j91389j14919j18537k14199k80489j65614k9922j45777
4680C5192178j32208j75640J7647r6536j15031q1288j57273k28797j51755m0973
4670C4030324k4822N7212j22093j63293J425j81858r4567k2949j8696n2795j54361
4659C3253527q6189n0632q9426j02285J7149j78329J00327j48344J293Q3933K0042
$$ plain form
4648 32821066 32800668 32828996 32895993 32854948 32903024 33027272 33061048 33214610 33468170 33628044
4638 33628044 33539657 33752665 33939637 34094987 34339139 34602715 34906628 35075823 35236798 35402037
4628 35402037 35615947 35924061 36241853 36478417 36811202 37057251 37163420 37406908 37579373
4619 37579373 37799541 38084026 38321458 38750856 39215727 39621077 40048880 40525677 41245658
4610 41245658 41672661 42192022 42791642 43509163 44243744 44972916 45691098 46433701 47367084
4601 47367084 48139939 49061669 49923362 50829195 51775162 52695021 53806768 55079885 56407563
4592 56407563 57943110 59695856 61467386 63300832 65504507 67817197 70405308 73362557
4584 73362557 76339299 79584248 83303744 87357555 91447990 96135443 101430524 107051725
$$ packed form
4648C2821066k0398K8328O6997m1045M8076J24248L3776J53562K53560J59874
4638C3628044q8387K13008J86972J55350K44152K63576L03913J69195J60975J65239
4628C5402037K13910L08114L17792K36564L32785K46049J06169K43488J72465
4619C7579373K20168K84485K37432M29398M64871M05350M27803M76797P19981
4610D1245658M27003N19361N99620P17521P34581P29172P18182P42603R33383
4601D7367084P72855R21730Q61693R05833R45967R19859J111747J273117J327678
4592E6407563J535547J752746J771530J833446K203675K312690K588111K957249
4584G3362557K976742L244949L719496M053811M090435M687453N295081N621201
$$ plain form
4576 107051725 113280605 120042595 127373372 135331792 143685136 152132052 160657692 168290737
4568 168290737 174970318 180842463 185985491 190220918 192870597 193314034 191298376 187197653
4560 187197653 181985280 176426456 171029917 166010348 161038108 156107311 151308819 146580171
4552 146580171 142145980 137788245 133319835 128695563 123711427 118575782 113449440 108525539
4544 108525539 103968458 99729305 95824769 92164023 88655240 85592312 82712861 79974040
4536 79974040 77333719 74856563 72404027 69953638 67824842 65693036 63702777 61892632
4528 61892632 59999284 58067048 56472193 54959965 53570225 52137252 50819296 49547523
4520 49547523 48186457 47123891 46026231 45040086 44085213 43028573 42099662 41345115 40360721
$$ packed form
4576A07051725O228880O761990P330777P958420Q353344Q446916Q525640P633045
4568A68290737O679581N872145N143028M235427K649679M43437k015658m100723
4560A87197653n212373n558824n396539n019569m972240m930797m798492m728648
4552A46580171m434191m357735m468410m624272m984136n135645n126342m923901
4544A08525539m557081m239153l904536l660746l508783l062928k879451k738821
4536G9974040k640321k477156k452536k450389k128796k131806j990259j810145
4528F1892632j893348j932236j594855j512228j389740j432973j317956j271773
4520D9547523j361066j062566j097660r86145r54873j056640r28911p54547r84394
$$ plain form
4511 40360721 39451038 38536081 37804335 37056719 36136582 35342739 34607624 33902891 33303904
4502 33303904 32632656 32125264 31648979 31093746 30558415 30060475 29746413 29300896 28890587
4493 28890587 28484823 28067241 27718129 27577618 27348927 27156502 26782307 26537082 26333913
4484 26333913 26162471 26158417 26053627 25778570 25712203 25719605 25728440 25667734 25546035 25514896 25742822
4473 25742822 25710610 25763289 25996513 26247454 26399048 26455770 26465874 26653141 26807161 27047097
4463 27047097 27272015 27164603 27238186 27117274 27047937 27021025 27079724 26920551 27004067 27170273
4453 27170273 27132385 26973811 26984744 27094426 27052488 26950472 26819891 26736677 26496448 26269375
4443 26269375 26092861 25820384 25600425 25405232 25220243 25002138 24748959 24504522 24359024
$$ packed form
4511D0360721r09683r14957p31746p47616r20137p93843p35115p04733n98987
4502C3303904o71248n07392m76285n55233n35331m97940l14062m45517m10309
4493B8890587m05764m17582l49112j40511k28691j92425l74195k45225k03169
4484B6333913j71442m054j04790k75057o6367P402Q835o0706j21699l1139K27926
4473B5742822l2212N2679K33224K50941J51594N6722J0104J87267J54020K39936
4463B7047097K24918j07412P3583j20912o9337k6912N8699j59173Q3516J66206
4453B7170273l7888j58574J0933J09682m1938j02016j30581q3214k40229k27073
4443B6269375j76514k72477k19959j95193j84989k18105k53179k44437j45498
$$ plain form
4434 24359024 24036834 23748918 23651765 23306683 23114838 22937776 22649715 22462616 22297878 22143774
4424 22143774 21893688 21725984 21746808 21750595 21561624 21384626 21322449 21377668 21326580 21172319
4414 21172319 20969870 20837906 20580748 20379743 20184850 19834395 19545785 19311697 19146079
4405 19146079 18921629 18683719 18509951 18187641 18135654 17964249 17584957 17142307 17044689 16935407
4395 16935407 16639247 16499293 16349162 16173368 15991869 15871366 15657847 15524065 15271683
4386 15271683 15230532 15159156 14988875 14950372 14956070 14953350 14752301 14560378 14483125 14450613 14290327
4375 14290327 14245125 14163497 14205462 14141593 13952238 13881060 13786692 13741916 13737121 13565234 13387610
4364 13387610 13332080 13351971 13344729 13345175 13457755 13194846 13101912 13059360 12932783 12946252 12964782
$$ packed form
4434B4359024l22190k87916r7153l45082j91845j77062k88061j87099j64738j54104
4424B2143774k50086j67704K0824L787j88971j76998o2177N5219n1088j54261
4414B1172319k02449j31964k57158k01005j94893l50455k88610k34088j65618
4405A9146079k24450k37910j73768l22310n1987j71405l79292m42650r7618j09282
4395A6935407k96160j39954j50131j75794j81499j20503k13519j33782k52382
4386A5271683m1151p1376j70281l8503N698k720k01049j91923p7253l2512j60286
4375A4290327m5202q1628M1965o3869j89355p1178r4368m4776m795j71887j77624
4364A3387610n5530J9891p242M46J12580k62909r2934m2552j26577J3469J8530
$$ plain form
4353 12964782 12984912 12960479 12846950 12713309 12713192 12749967 12507426 12483235 12588627 12587488 12636861
4342 12636861 12616806 12635755 12476761 12261661 12222359 12223881 12320134 12265007 12194345 12281683 12341964
4331 12341964 12294844 12292886 12347997 12350374 12366187 12352988 12368712 12425610 12243636 12209124 12128938
4320 12128938 12189170 12289148 12208088 12242372 12383411 12498772 12428515 12374035 12429735 12452397 12326449
4309 12326449 12283687 12297962 12326908 12330160 12243750 12085650 12045127 11997655 11938163 11821186 11582058
4298 11582058 11549594 11621544 11478903 11307959 11273920 11116771 10904733 10822156 10826079 10699585
4288 10699585 10655128 10632563 10531307 10548602 10535386 10439298 10410588 10427190 10343834 10263829 10313933
4277 10313933 10315345 10303603 10395677 10442069 10331038 10279918 10364766 10413662 10449325 10503276 10556553
$$ packed form
4353A2964782K0130k4433j13529j33641j17L6775k42541k4191J05392j139M9373
4342A2636861k0055J8949j58994k15100l9302J522R6253n5127p0662Q7338O0281
4331A2341964m7120j958N5111K377J5813j3199J5724N6898j81974l4512q0186
4320A2128938O0232R9978q1060L4284J41039J15361p0257n4480N5700K2662j25948
4309A2326449m2762J4275K8946L252q6410j58100m0523m7472n9492j16977k39128
4298A1582058l2464P1950j42641j70944l4039j57149k12038q2577L923j26494
4288A0699585m4457k2565j01256J7295j3216r6088k8710J6602q3356q0005N0104
4277A0313933J412j1742R2074M6392j11031n1120Q4848M8896L5663N3951N3277
$$ plain form
4266 10556553 10568441 10650514 10763938 10858530 10845018 10867782 11039879 10943028 10893535 10997427 11106371
4255 11106371 11116118 11193511 11253294 11404381 11602294 11555342 11671066 11836252 11879666 11834928 11901948
4244 11901948 12052348 12332841 12337742 12260756 12231180 12214140 12277756 12166958 12309648 12250969 12237591
4233 12237591 12317386 12234665 12248145 12163622 12261607 12167713 12041182 11967347 11920002 11886429 11863849
4222 11863849 11890932 11768630 11670872 11549028 11381225 11402036 11448717 11435680 11448390 11419932 11451448
4211 11451448 11597434 11678069 11583829 11521765 11566238 11538224 11651524 11674739 11825322 12041041
4201 12041041 12034401 12102717 12235614 12256950 12404610 12687605 12726777 12900119 13062280 13339701
4191 13339701 13618356 13722260 13885022 14147758 14349339 14551626 14751868 14899767 15210368
$$ packed form
4266A0556553J1888Q2073J13424R4592j3512K2764J72097r6851m9493J03892J08944
4255A1106371R747P7393N9783J51087J97913m6952J15724J65186M3414m4738O7020
4244A1901948J50400K80493M901p6986k9576j7040O3616j10798J42690n8679j3378
4233A2237591P9795q2721J3480q4523R7985r3894j26531p3835m7345l3573k2580
4222A1863849K7083j22302r7758j21844j67803K0811M6681j3037J2710k8458L1516
4211A1451448J45986Q0635r4240o2064M4473k8014J13300K3215J50583K15719
4201A2041041o640O8316J32897K1336J47660K82995L9172J73342J62161K77421
4191A3339701K78655J03904J62762K62736K01581K02287K00242J47899L10601
$$ plain form
4182 15210368 15631340 16083772 16269603 16617198 17119343 17517953 17934714 18253879 18790250
4173 18790250 19200154 19791553 20441421 21132964 21734399 22333398 23110584 23851435 24696290
4164 24696290 25543947 26366073 27303371 28454409 29652390 30891735 32156907 33507967 34865738
4155 34865738 36454749 37941302 39534666 41358174 43220229 45147604 47055647 49244720
4147 49244720 51632208 53881014 56220902 58494682 60872467 63413063 66061690 68786954
4139 68786954 71699227 74471026 77396218 80345681 83328090 86476080 89591360 92714692
4131 92714692 95755299 98903413 102007679 105104243 108167214 111185839 114114918 117032896
4123 117032896 119878365 122670540 125424620 128127715 130647177 133103059 135439170 137734591
$$ packed form
4182A5210368M20972M52432J85831L47595N02145L98610M16761L19165N36371
4173A8790250M09904N91399O49868O91543O01435N98999P77186P40851Q44855
4164B4696290Q47657Q22126R37298J151038J197981J239345J265172J351060J357771
4155C4865738J589011J486553J593364J823508J862055J927375J908043K189073
4147D9244720K387488K248806K339888K273780K377785K540596K648627K725264
4139F8786954K912273K771799K925192K949463K982409L147990L115280L123332
4131I2714692L040607L148114L104266L096564L062971L018625K929079K917978
4123A17032896K845469K792175K754080K703095K519462K455882K336111K295421
$$ plain form
4115 137734591 139846737 141751326 143490497 145057408 146527587 147781753 148900308 149953531
4107 149953531 150791515 151532518 151898424 152327761 152488024 152354132 152137478 151663614 151192048
4098 151192048 150467757 149488120 148339900 147074948 145696642 143999872 142150049 140281031
4090 140281031 138335945 136155863 133932448 131741530 129268617 126762096 124082849 121589763
4082 121589763 118950079 116138876 113238044 110426205 107542910 104644393 101600190 98604715
4074 98604715 95708572 92723708 89783778 86958222 84259440 81512509 78724898 75912260
4066 75912260 73312248 70756972 68206276 65715590 63385363 61111481 58724020 56582817
4058 56582817 54427098 52375661 50530207 48627767 46915212 45188547 43652366 42137907
$$ packed form
4115A37734591K112146J904589J739171J566911J470179J254166J118555J053223
4107A49953531Q37984P41003L65906M29337J60263j33892k16654m73864m71566
4098A51192048p24291r79637j148220j264952j378306j696770j849823j869018
4090A40281031j945086k180082k223415k190918k472913k506521k679247k493086
4082A21589763k639684k811203k900832k811839k883295k898517l044203k995475
4074I8604715k896143k984864k939930k825556k698782k746931k787611k812638
4066G5912260k600012k555276k550696k490686k330227k273882k387461k141203
4058E6582817k155719k051437j845454j902440j712555j726665j536181j514459
$$ plain form
4050 42137907 40686638 39303019 37920496 36684886 35561869 34457015 33386261 32450436
4042 32450436 31633683 30706780 29838284 29107797 28409582 27735104 27127997 26573849 26009247
4033 26009247 25333848 24836809 24513046 24163631 23788754 23398478 23092621 22706787 22288506
4024 22288506 22074112 21778259 21489822 21362794 21235827 20803427 20548078 20257265 20033866
4015 20033866 19884377 19662264 19503308 19177759 18843006 18611520 18442702 18307335 18089929
4006 18089929 17895400 17616410 17358511 17226117 17116445 16893388 16660856 16382466 16212902
3997 16212902 16052617 15730662 15652131 15477569 15253373 15018396 14887771 14613602 14331628 14168011
3987 14168011 14153589 14003927 13829273 13699061 13583425 13608805 13535399 13373196 13361995 13267744
$$ packed form
4050D2137907j451269j383619j382523j235610j123017j104854j070754r35825
4042C2450436q16753r26903q68496p30487o98215o74478o07107n54148n64602
4033B6009247o75399m97039l23763l49415l74877l90276l05857l85834m18281
4024B2288506k14394k95853k88437j27028j26967m32400k55349k90813k23399
4015B0033866j49489k22113j58956l25549l34753k31486j68818j35367k17406
4006A8089929j94529k78990k57899j32394j09672k23057k32532k78390j69564
3997A6212902j60285l21955p8531j74562k24196k34977j30625k74169k81974j63617
3987A4168011j4422j49662j74654j30212j15636K5380p3406j62203j1201r4251
$$ plain form
3977 13267744 13255813 13254940 13297426 13305618 13389365 13460844 13361731 13329049 13351729 13431822 13465460 13441285
3965 13441285 13302958 13248717 13329334 13479267 13489906 13462007 13598237 13469764 13516457 13609325
3955 13609325 13599123 13566696 13669667 13583123 13640217 13667977 13569853 13550936 13513088 13592805 13584108
3944 13584108 13645706 13595493 13619451 13565954 13539259 13528572 13544389 13623761 13626127 13440915 13355705
3933 13355705 13300564 13370353 13317407 13366895 13434791 13370667 13346714 13349649 13345601 13362964 13386605 13474377
3921 13474377 13455029 13414868 13462733 13481617 13453910 13466445 13530450 13624210 13785008 13773959 13691900
3910 13691900 13684167 13721215 13707102 13750917 13867193 14061792 14179139 14235469 14282731 14302398 14397226
3899 14397226 14507419 14556566 14538988 14507548 14636486 14660574 14684000 14772538 14821142 14869182 14992927
$$ packed form
3977A3267744j1931q73M2486Q192Q3747P1479r9113l2682K2680Q0093L3638k4175
3965A3441285j38327n4241Q0617J49933J0639k7899J36230j28473M6693R2868
3955A3609325j0202l2427J02971q6544N7094K7760r8124j8917l7848P9717q697
3944A3584108O1598n0213K3958n3497k6695j0687J5817P9372K366j85212q5210
3933A3355705n5141O9789n2946M9488O7896o4124k3953K935m048J7363K3641Q7772
3921A3474377j9348m0161M7865J8884k7707J2535O4005R3760J60798j1049q2059
3910A3691900p733L7048j4113M3815J16276J94599J17347N6330M7262J9667R4828
3899A4397226J10193M9147j7578l1440J28938K4088K3426Q8538M8604M8040J23745
$$ plain form
3888 14992927 15047529 15036499 15071757 15076633 15035831 15131251 15250138 15291907 15345260 15405698 15410426
3877 15410426 15386115 15419240 15466788 15386214 15415914 15409676 15418281 15401877 15394185 15468038 15478947 15508824
3865 15508824 15608871 15546048 15640984 15811451 15813293 15765823 15947590 16078822 16228350 16327202
3855 16327202 16415547 16550394 16645166 16898849 16991666 17151636 17191024 17249689 17458814 17731597
3845 17731597 17840476 17975650 18194831 18530816 18816178 18972993 19156301 19397160 19593405
3836 19593405 19915668 20192805 20572091 20846911 21194485 21695183 22109269 22374739 22646552
3827 22646552 23062167 23486176 23906096 24451672 25030548 25486456 26012881 26560163 27289100
3818 27289100 27995938 28653088 29389910 30113514 30930757 31816036 32689275 33656388 34642908
$$ packed form
3888A4992927N4602j1030L5258M876m0802R5420J18887M1769N3353O0438M728
3877A5410426k4311L3125M7548q0574K9700o238Q605j6404p692P3853J0909K9877
3865A5508824J00047o2823R4936J70467J842m7470J81767J31232J49528R8852
3855A6327202Q8345J34847R4772K53683R2817J59970L9388N8665K09125K72783
3845A7731597J08879J35174K19181L35985K85362J56815J83308K40859J96245
3836A9593405L22263K77137L79286K74820L47574N00698M14086K65470K71813
3827B2646552M15615M24009M19920N45576N78876M55908N26425N47282P28937
3818B7289100P06838O57150P36822P23604Q17243Q85279Q73239R67113R86520
$$ plain form
3809 34642908 35587635 36679937 37957403 39118526 40313879 41615642 42857167 44117330
3801 44117330 45522793 46914011 48149416 49649264 51031983 52683916 54337425 55771817
3793 55771817 57458109 59044805 60796943 62369967 64060156 65829718 67261221 68884689
3785 68884689 70482434 72009887 73371145 74781369 76270775 77705426 79098589 80480426
3777 80480426 81921282 83289579 84865250 86304362 87614606 89004932 90520750 92155978
3769 92155978 93695129 95413631 97329774 99452072 101661058 104117710 106807718 109780731
3761 109780731 113019892 116535761 120486462 124786244 129391250 134428649 139978790 145903727
3753 145903727 152370948 159439723 166787120 174680282 182960857 191689057 200677866 210194029
$$ packed form
3809C4642908R44727J092302J277466J161123J195353J301763J241525J260163
3801D4117330J405463J391218J235405J499848J382719J651933J653509J434392
3793E5771817J686292J586696J752138J573024J690189J769562J431503J623468
3785F8884689J597745J527453J361258J410224J489406J434651J393163J381837
3777H0480426J440856J368297J575671J439112J310244J390326J515818J635228
3769I2155978J539151J718502J916143K122298K208986K456652K690008K973013
3761A09780731L239161L515869L950701M299782M605006N037399N550141N924937
3753A45903727O467221P068775P347397P893162Q280575Q728200Q988809R516163
$$ plain form
3745 210194029 220313819 230750619 241813810 253273617 265312395 277620965 290383582
3738 290383582 303511002 317006566 330803379 344850944 358977490 373096792 387079556
3731 387079556 400830285 413987865 426156497 437292220 447193746 455543977 462549119
3724 462549119 467980765 471970416 474801921 476438807 477185373 477313421 476815456 475446300
3716 475446300 473346373 470698368 466897824 462026266 455854654 448429181 439882845 430285944
3708 430285944 419935936 408937826 397886814 386892451 376216027 365916320 355994775
3701 355994775 346750308 338014358 329809879 322204515 315123155 308615878 302345685 296404041
3693 296404041 290870540 285721367 280986807 276518886 272363902 268753561 265498888 262524756
$$ packed form
3745B10194029J0119790J0436800J1063191J1459807J2038778J2308570J2762617
3738B90383582J3127420J3495564J3796813J4047565J4126546J4119302J3982764
3731C87079556J3750729J3157580J2168632J1135723R901526Q350231P005142
3724D62549119N431646L989651K831505J636886P46566J28048m97965j369156
3716D75446300k099927k648005l800544m871558o171612p425473q546336r596901
3708D30285944j0350008j0998110j1051012j0994363j0676424j0299707r921545
3701C55994775r244467q735950q204479p605364p081360o507277o270193n941644
3693B96404041n533501n149173m734560m467921m154984l610341l254673k974132
$$ plain form
3685 262524756 260131475 258114432 256414467 255110998 254116559 253424794 253143503 253277233 253802390
3676 253802390 254782089 256066027 257766516 260228510 263083764 266372508 270197375 274295929
3668 274295929 278806422 283722406 288675910 293639647 298428998 302830020 306764807 310272829
3660 310272829 313032394 314871742 316119894 316503622 316200787 315268997 313729688 311773358
3652 311773358 309389270 306394836 303026210 299187484 294752401 289598888 283600447 276889323
3644 276889323 269619020 261762640 253344541 244582894 235615906 226672664 217887007 209262467
3636 209262467 201133724 193204194 185707334 178826613 172210504 166010899 160006029 154330728
3628 154330728 149105081 144176568 139411472 134945865 130649744 126525273 122684627 118883577
$$ packed form
3685B62524756k393281k017043j699965j303469r94439o91765k81291J33730N25157
3676B53802390R79699J283938J700489K461994K855254L288744L824867M098554
3668B74295929M510493M915984M953504M963737M789351M401022L934787L508022
3660C10272829K759565J839348J248152L83728l02835r31790j539309j956330
3652C11773358k384088k994434l368626l838726m435083n153513n998441o711124
3644B76889323p270303p856380q418099q761647q966988q943242q785657q624540
3636B09262467q128743p929530p496860o880721o616109o199605o004870n675301
3628A54330728n225647m928513m765096m465607m296121m124471l840646l801050
$$ plain form
3620 118883577 115223523 111883280 108612717 105332001 102287308 99321028 96411192 93651338
3612 93651338 90873701 88379843 85986767 83381622 80998857 78562955 76270256 74122019
3604 74122019 72002664 69914072 67830368 65867851 63974520 62228941 60492620 58785507
3596 58785507 57253537 55541394 54057625 52714491 51358302 50009521 48686657 47577807
3588 47577807 46454411 45343579 44332393 43410369 42403055 41614061 40897535 39992168 39263476
3579 39263476 38478465 37654509 36802700 36049604 35409271 34666251 33913602 33256649 32629283
3570 32629283 32051760 31566875 30983106 30286590 29792335 29216674 28721740 28195767 27617262
3561 27617262 27170273 26749925 26259465 25773367 25409508 25068834 24713916 24193304 23905241
$$ packed form
3620A18883577l660054l340243l270563l280716l044693k966280k909836k759854
3612I3651338k777637k493858k393076k605145k382765k435902k292699k148237
3604G4122019k119355k088592k083704j962517j893331j745579j736321j707113
3596E8785507j531970j712143j483769j343134j356189j348781j322864j108850
3588D7577807j123396j110832j011186r22024j007314p88994p16526r05367p28692
3579C9263476p85011q23956q51809p53096o40333p43020p52649o56953o27366
3570C2629283n77523m84885n83769o96516m94255n75661m94934n25973n78505
3561B7617262m46989m20348m90460m86098l63859l40674l54918n20612k88063
$$ plain form
3552 23905241 23566577 23080085 22843705 22648372 22214238 21936739 21711132 21361960 21123634
3543 21123634 20916643 20629496 20307529 20018783 19882518 19548351 19287812 19167521 19048755
3534 19048755 18855694 18662673 18406393 18178511 17918655 17741569 17456675 17148013 17089917 16877124
3524 16877124 16623611 16534281 16355563 16093318 15931558 15731102 15628370 15440894 15300721 15231611
3514 15231611 14991258 14735466 14662448 14496294 14411312 14283063 14020220 14013779 13865712 13577128
3504 13577128 13325546 13199873 13196255 13168889 13027617 12948197 12767867 12641057 12441135 12370128
3494 12370128 12214586 11976780 11781651 11752588 11710396 11489816 11347678 11396290 11259206 11268877
3484 11268877 11218098 11110150 11000073 10987247 10957552 10843854 10815679 10857262 10905935 10775686
$$ packed form
3552B3905241l38664m86492k36380j95333m34134k77499k25607l49172k38326
3543B1123634k06991k87147l21967k88746j36265l34167k60539j20291j18766
3534A9048755j93061j93021k56280k27882k59856j77086k84894l08662n8096k12793
3524A6877124k53513q9330j78718k62245j61760k00456j02732j87476j40173o9110
3514A5231611k40353k55792p3018j66154q4982j28249k62843o441j48067k88584
3504A3577128k51582j25673l618k7366j41272p9420j80330j26810j99922p1007
3494A2370128j55542k37806j95129k9063m2192k20580j42138M8612j37084R671
3484A1268877n0779j07948j10077j2826k9695j13698k8175M1583M8673j30249
$$ plain form
3474 10775686 10891119 10969468 11020477 11016323 11088310 11119081 11018448 10971643 11075981 11051990 11052546
3463 11052546 11131840 11180597 11217248 11318374 11321192 11314704 11321363 11279518 11300900 11406756 11286555
3452 11286555 11306699 11298643 11475611 11594395 11641894 11672252 11664224 11718876 11766101 11974426 11993701
3441 11993701 11958442 12070794 12223359 12244548 12225614 12347047 12422886 12537696 12579150 12641137
3431 12641137 12528740 12515371 12668944 12623293 12555608 12613184 12657201 12592757 12760859 12856367 12799006
3420 12799006 12901341 12957653 13079975 13204521 13353259 13511037 13604122 13730518 13919893 14157623
3410 14157623 14447012 14829793 14929221 15014171 15247628 15731517 16028062 16260084 16535549 16823032
3400 16823032 17102197 17363923 17450584 17513829 17749496 17899095 18014438 17932169 17958770 17899826
$$ packed form
3474A0775686J15433P8349N1009m154P1987L0771j00633m6805J04338k3991N56
3463A1052546P9294M8757L6651J01126K818o488O659m1845K1382J05856j20201
3452A1286555K0144q056J76968J18784M7499L0358q028N4652M7225K08325J9275
3441A1993701l5259J12352J52565K1189j8934J21433P5839J14810M1454O1987
3431A2641137j12397j3369J53573m5651o7685N7576M4017o4444J68102R5508n7361
3420A2799006J02335N6312J22322J24546J48738J57778R3085J26396J89375K37730
3410A4157623K89389L82781R9428Q4950K33457M83889K96545K32022K75465K87483
3400A6823032K79165K61726Q6661O3245K35667J49599J15343q2269K6601n8944
$$ plain form
3390 17899826 17831395 17763958 17510520 17392533 17330730 17123790 17032808 17127043 17155083 17161939 17393378
3379 17393378 17376405 17389612 17396795 17444193 17604654 17819396 17988384 18093883 18325821 18541502
3369 18541502 18751635 19031199 19269506 19390820 19678885 19838067 20028105 20359365 20532323
3360 20532323 20708848 20877909 21045869 21206643 21187330 20941222 20705706 20422488 20122719 19975018
3350 19975018 19719686 19768886 19890131 20013009 20216245 20567174 20880430 21321259 21733315 22351595
3340 22351595 22858727 23518640 24158176 25115746 25986427 27017106 28206433 29734066 31422864
3331 31422864 32943768 34301202 35549141 37069067 38883095 40940744 42957207 44841830
3323 44841830 45859755 46107418 45914480 46346262 47104822 47816311 48166309 47829571 46312958
$$ packed form
3390A7899826o8431o7437k53438j17987o1803k06940r0982R4235K8040O856K31439
3379A7393378j6973J3207P183M7398J60461K14742J68988J05499K31938K15681
3369A8541502K10133K79564K38307J21314K88065J59182J90038L31260J72958
3360B0532323J76525J69061J67960J60774j9313k46108k35516k83218k99769j47701
3350A9975018k55332M9200J21245J22878K03236L50929L13256M40829M12056O18280
3340B2351595N07132O59913O39536R57570Q70681J030679J189327J527633J688798
3331C1422864J520904J357434J247939J519926J814028K057649K016463J884623
3323D4841830J017925K47663j92938M31782P58560P11489L49998l36738j516613
$$ plain form
3314 46312958 44160906 42189301 40659775 39250454 38252327 37381329 36818815 36339790 35999268
3305 35999268 35960064 36127867 36453897 36807894 37568366 38299934 39202354 40178636 41427707
3296 41427707 43048612 44157137 44819778 45025457 45383415 45634841 45728955 45440702 44191140
3287 44191140 42119855 39416458 36810020 34489177 32532635 30830499 29293033 27756875
3279 27756875 26382267 25327102 24405208 23295828 22150345 21252900 20392760 19441300 18503960
3270 18503960 17666209 16988540 16409487 15945696 15300643 14647968 14201003 13843899 13440831
3261 13440831 13068751 12671650 12388967 12059726 11677329 11343020 11165956 10985235 10680112
3252 10680112 10414489 10256741 10055034 9950088 9819226 9724068 9694631 9524972 9402002 9320807
$$ packed form
3314D6312958k152052j971605j529526j409321r98127q70998n62514m79025l40522
3305C5999268l9204J67803L26030L53997P60472P31568R02420R76282J249071
3296D1427707J620905J108525O62641K05679L57958K51426R4114k88253j249562
3287D4191140k071285k703397k606438k320843j956542j702136j537466j536158
3279B7756875j374608j055165r21894j109380j145483q97445q60140r51460r37340
3270A8503960q37751o77669n79053m63791o45053o52675m46965l57104m03068
3261A3440831l72080l97101k82683l29241l82397l34309j77064j80721l05123
3252A0680112k65623j57748k01707j04946j30862r5158k9437j69659j22970q1195
$$ plain form
3242 9320807 9214357 9282505 9276949 9329977 9250175 9155271 9300228 9361870 9527758 9764597 9972737
3231 9972737 10024736 10262299 10510132 10853750 11169091 11454374 11907982 12442254 12829619 13463809
3221 13463809 14245217 15024898 15798994 16582370 17327634 17938489 18388466 18731757 19176959
3212 19176959 19550782 19544291 19154254 18398106 17614422 16925449 16324664 15802539 15602265 15292407
3202 15292407 15059877 14919959 14667814 14717157 14806048 14928423 15176059 15554876 15752341 16065850
3192 16065850 16500963 17179982 17834769 18128996 18305697 18674705 18898274 18934520 18918151 18541661
3182 18541661 17864145 17027487 16135786 15211952 14391185 13766316 13076393 12474250 12030089
3173 12030089 11619827 11201785 10937772 10645151 10213697 9824469 9460739 9251982 9071969
$$ packed form
3242I320807j06450O8148n556N3028p9802r4904J44957O1642J65888K36839K08140
3231I972737N1999K37563K47833L43618L15341K85283M53608N34272L87365O34190
3221A3463809P81408P79681P74096P83376P45264O10855M49977L43291M45202
3212A9176959L73823o491l90037p56148p83684o88973o00785n22125k00274l09858
3202A5292407k32530j39918k52145M9343Q8891J22375K47636L78817J97465L13509
3192A6065850M35113O79019O54787K94227J76701L69008K23569L6246j6369l76490
3182A8541661o77516q36658q91701r23834q20767o24869o89923o02143m44161
3173A2030089m10262m18042k64013k92621m31454l89228l63730k08757j80013
$$ plain form
3164 9071969 8826628 8657573 8410591 8387642 8333036 8194609 8076109 7932185 7778558 7645166
3154 7645166 7626611 7488339 7419103 7257331 6990518 6789800 6653815 6526518 6297310 6183557
3144 6183557 6299961 6229709 5998990 5988595 5974416 5838890 5651486 5559941 5637512 5594884 5583754
3133 5583754 5570511 5612482 5693335 5616907 5558965 5499273 5494155 5505928 5487724 5384514 5328375
3122 5328375 5231272 5106364 4925867 4887831 4820369 4651828 4439992 4391918 4518014 4502903
3112 4502903 4395377 4312718 4229755 4181191 4166232 4049124 4125060 4098049 4092109 4040405 4072694
3101 4072694 4066724 3978863 4065940 4040297 4030589 4111693 4089659 4118056 4138338 4182878 4010813 3964408
3089 3964408 4013088 4028988 4037730 4203146 4262109 4220974 4229581 4343057 4383291 4342032 4367625
$$ packed form
3164I071969k45341j69055k46982k2949n4606j38427j18500j43924j53627j33392
3154G645166j8555j38272o9236j61772k66813k00718j35985j27297k29208j13753
3144F183557J16404p0252k30719j0395j4179j35526j87404r1545P7571m2628j1130
3133E583754j3243M1971Q0853p6428n7942n9692n118J1773j8204j03210n6139
3122E328375r7103j24908j80497l8036o7462j68541k11836m8074J26096j5111
3112D502903j07526q2659q2963m8564j4959j17108P5936k7011n940n1704L2289
3101D072694n970q7861Q7077k5643r708Q1104k2034K8397K0282M4540j72065m6405
3089C964408M8680J5900Q742J65416N8963m1135Q607J13476M0234m1259K5593
$$ plain form
3078 4367625 4380663 4428613 4471480 4306006 4242083 4376993 4434633 4406385 4394026 4453500 4433037
3067 4433037 4387558 4448766 4695474 4733718 4792038 4929905 4928857 4937734 5060986 5121884 5093986
3056 5093986 5060200 5046603 5064130 5150675 5043082 5071076 5187341 5064915 4821442 4797664 4999176
3045 4999176 5149761 5193971 5264931 5224862 5165504 5130695 5312156 5372010 5364019 5237276 5260999
3034 5260999 5355124 5385950 5347375 5375111 5443934 5311304 5182404 5055794 5206138 5162289 5055688
3023 5055688 4990018 4865536 4785968 4869214 4721989 4619594 4540513 4502944 4482555 4452474 4430958
3012 4430958 4352206 4317892 4290469 4295400 4169088 4121504 4040850 4048444 3989933 3877559 3636573
3001 3636573 3500057 3453525 3458614 3571017 3445085 3300474 3293106 3195445 3133173 3005455 2933961
$$ packed form
3078D367625J3038M7950M2867j65474o3923J34910N7640k8248j2359N9474k0463
3067D433037m5479O1208K46708L8244N8320J37867j048Q877J23252O0898k7898
3056E093986l3786j3597J7527Q6545j07593K7994J16265j22426k43473k3778K01512
3045D999176J50585M4210P0960m0069n9358l4809J81461N9854p991j26743K3723
3034E260999R4125L0826l8575K7736O8823j32630j28900j26610J50344m3849j06601
3023E055688o5670j24482p9568Q3246j47225j02395p9081l7569k0389l0081k1516
3012D430958p8752l4314k7423M931j26312m7584q0654P594n8511j12374k40986
3001C636573j36516m6532N089J12403j25932j44611p368r7661o2272j27718p1494
$$ plain form
2990 2933961 2890809 2756890 2724691 2640562 2607394 2632602 2547837 2392944 2357067 2383324 2327977
2979 2327977 2290460 2116812 2024715 2124278 2101184 1940933 1904146 1987967 1920692 1883072 1934800
2968 1934800 1960717 2027441 2014636 1755749 1753746 1762422 1728662 1631615 1721814 1692782 1521564
2957 1521564 1533567 1670211 1584051 1635830 1775812 1612789 1518816 1496268 1440376 1427012 1497607
2946 1497607 1440684 1389711 1449069 1448651 1366564 1251825 1172273 1175163 1316112 1344041 1192587
2935 1192587 1141975 1216058 1317561 1242990 1320994 1309096 1109913 1052280 1173578 1138574 1140149
2924 1140149 1141014 1135959 1147536 1093997 1103244 1038262 1029839 1143073 1079416 1013852 1090554 1086371
2912 1086371 1121437 1059482 947395 1035796 1026286 1067112 1032238 1045749 1023313 891204 870868
$$ packed form
2990B933961m3152j33919l2199q4129l3168K5208q4765j54893l5877K6257n5347
2979B327977l7517j73648r2097R9563k3094j60251l6787Q3821o7275l7620N1728
2968A934800K5917O6724j2805k58887k003Q676l3760r7047R0199k9032j71218
2957A521564J2003J36644q6160N1779J39982j63023r3973k2548n5892j3364P0595
2946A497607n6923n0973N9358m18q2087j14739p9552K890J40949K7929j51454
2935A192587n0612P4083J01503p4571P8004j1898j99183n7633J21298l5004J575
2924A140149Q65n055J1577n3539R247o4982q423J13234o3657o5564P6702m183
2912A086371L5066o1955j12087Q8401r510M0826l4874J3511k2436j32109k0336
$$ plain form
2901 870868 929918 945980 1043990 1057048 1043338 930372 774776 844257 910579 871862 893062
2890 893062 870361 856534 842562 874418 953213 758456 757999 740041 801253 849562 802549 809708
2878 809708 905057 709741 741041 747079 815016 789010 695155 782009 798604 747241 625035
2867 625035 594361 560937 555147 727041 781584 770351 694243 570917 457341 556190 605544
2856 605544 592726 581543 488437 557594 487459 424889 503228 603395 638067 662085 574831
2845 574831 562609 526551 528695 635455 606565 475649 592013 615754 572095 587651 656028
2834 656028 706340 572576 452323 513604 531371 596915 532493 501073 572891 549221 545183
2823 545183 591797 737138 684176 550751 572587 515568 532317 540972 627956 517503 482393
$$ packed form
2901H70868N9050J6062R8010J3058j3710j12966j55596O9481O6322l8717K1200
2890H93062k2701j3827j3972L1856P8795j94757m57j7958O1212M8309m7013P159
2878H09708R5349j95316L1300O038O7937k6006r3855Q6854J6595n1363j22206
2867F25035l0674l3424n790J71894N4543j1233p6108j23326j13576R8849M9354
2856F05544j2818j1183r3106O9157p0135o2570P8339J00167L4672K4018q7254
2845E74831j2222l6058K144J06760k8890j30916J16364K3741m3659J5556O8377
2834F56028N0312j33764j20253O1281J7767O5544o4422l1420P1818k3670m038
2823E45183M6614J45341n2962j33425K1836n7019J6749Q655Q6984j10453l5110
$$ plain form
2812 482393 457759 562860 576194 360144 431859 500821 547921 548096 529032 576919 471297
2801 471297 411498 447562 527606 520804 388369 373759 386798 423205 411129 297832 306089 365965
2789 365965 305510 390244 307893 112873 123593 201672 293144 213529 131320 225030 258232
2778 258232 401360 396708 348575 216980 216474 258829 346279 319667 252677 222174 100369 211503
2766 211503 306765 270198 235956 283291 279267 198962 223292 197592 211454 138656 104018 28689
2754 28689 -19646 204471 263037 206894 305280 392086 321247 232351 169443 207118 160958 125606
2742 125606 70066 155714 197922 4465 30240 68690 32481 55606 170748 223451 46398
2731 46398 11692 172719 161530 134221 251559 277628 69015 71221 185229 84207 80614
$$ packed form
2812D82393k4634J05101J3334k16050P1715O8962M7100J75j9064M7887j05622
2801D71297n9799L6064Q0044o802j32435j4610J3039L6407j2076j13297Q257N9876
2789C65965o0455Q4734q2351j95020J0720P8079R1472p9615q2209R3710L3202
2778B58232J43128m652m8133j31595n06M2355Q7450k6612o6990l0503j21805J11134
2766B11503R5262l6567l4242M7335m024q0305K4330k5700J3862p2798l4638p5329
2754B8689m8335K24117N8566n6143R8386Q6806p0839q8896o2908L7675m6160l5352
2742A25606n5540Q5648M2208j93457K5775L8450l6209K3125J15142N2703j77053
2731D6398l4706J61027j1189k7309J17338K6069k08613K206J14008j01022l593
$$ plain form
2720 80614 154795 76939 -18984 89303 72606 28933 49948 51584 -13946 -7695 46126 160499
2708 160499 77034 16288 91019 127062 193419 174450 190572 123524 3301 20913 136544
2697 136544 199921 190565 202326 156381 217564 152186 87923 55905 89028 211239 184047 89371
2685 89371 -14916 100969 101473 183100 129084 133226 129323 190069 85131 5755 98508 107716
2673 107716 -68339 -7215 112924 132015 139878 145257 208640 205986 149980 34730 45003 86792
2661 86792 60564 3133 63930 140992 100677 160804 139429 33536 64275 -52337 84937
2650 84937 143506 148902 77067 -2192 -76173 1858 77659 38985 -45946 66946 170563 201787
2638 201787 219375 180492 129767 194605 255180 112274 5263 107398 102966 96818 106401 175572
$$ packed form
2720H0614P4181p7856r5923J08287j6697m3673K1015J636o5530O251N3821J14373
2708A60499q3465o0746P4731L6043O6357j8969J6122o7048j20223J7612J15631
2697A36544O3377r356J1761m5945O1183o5378o4263l2018L3123J22211k7192r4676
2685H9371j04287J15885N04Q1627n4016M142l903O0746j04938p9376R2753R208
2673A07716j76055O1124J20139J9091P863N379O3383k654n6006j15250J0273M1789
2661H6792k6228n7431O0797P7062m0315O0127k1375j05893L0739j16612J37274
2650H4937N8569N396p1835p9259p3981P8031P5801l8674q4931J12892J03617L1224
2638B01787J7588l8883n0725O4838O0575j42906j07011J02135m432o148R583O9171
$$ plain form
2626 175572 184546 -13040 18452 110856 19007 68567 103991 151825 234743 56425 51788 59993
2614 59993 48011 -6218 10506 9188 106321 123512 69582 124610 148259 140425 137830 17241
2602 17241 -75496 -71616 -23791 20475 157234 216878 114270 137875 168253 135120 127783 105237
2590 105237 102181 182033 118512 102176 91044 178841 172065 146878 39486 59294 192670 129721
2578 129721 98584 155793 214127 86771 134287 225806 231318 219421 164165 157234 131355 151506
2566 151506 160078 132987 225193 89221 97123 213087 101086 -24500 205642 247001 154242
2555 154242 127037 148352 187386 253700 215265 145717 36775 50012 166232 187319 59609
2544 59609 -33806 88449 63274 107274 62009 155772 156279 191479 133395 156443 178548 190537
$$ packed form
2626A75572Q974j97586L1492R2404r1849M9560L5424M7834Q2918j78318m637Q205
2614E9993j1982n4229J6724j318R7133J7191n3930N5028K3649p834k595j20589
2602A7241r2737L880M7825M4266J36759N9644j02608K3605L0378l3133p337k2546
2590A05237l056P9852o3521j6336j1132Q7797o776k5187j07392J9808J33376o2949
2578A29721l1137N7209N8334j27356M7516R1519N512j1897n5256o931k5879K0151
2566A51506Q572k7091R2206j35972P902J15964j12001j25586K30142M1359r2759
2555A54242k7205K1315L9034O6314l8435o9548j08942J3237J16220K1087j27710
2544E9609r3415J22255k5175M4000m5265R3763N07L5200n8084K3048K2105J1989
$$ plain form
2532 190537 257504 276727 213148 204502 255870 212921 245493 226210 183687 248254 361843 313671
2520 313671 46993 104868 145478 141437 259373 174183 214071 143173 57087 87350 87048 89341
2508 89341 73271 58026 75402 -18289 71900 121335 145755 204628 208288 236413 97046 120624
2496 120624 215398 185324 112371 92205 237627 161223 229955 95976 51311 161817 178630
2485 178630 173627 77333 98260 72619 7032 88579 185098 214201 273044 126461 156269 120214
2473 120214 137718 102086 7672 25307 77867 174751 146215 119908 149587 100149 135467 285107
2461 285107 235637 155503 210548 238717 231062 106072 11008 57379 -5944 8846 88059 235890
2449 235890 280901 312548 218552 101762 64392 109692 98433 143511 173755 260279 302705
$$ packed form
2532A90537O6967J9223o3579q646N1368m2949L2572j9283m2523O4567J13589m8172
2520C13671k66678N7875M0610m041J17936q5190L9888p0898q6086L0263l02K293
2508H9341j6070j5245J7376r3691R0189M9435K4420N8873L660K8125j39367K3578
2496A20624R4774l0074p2953k0166J45422p6404O8732j33979m4665J10506J6813
2485A78630n003r6294K0927k5641o5587Q1547R6519K9103N8843j46583K9808l6055
2473A20214J7504l5632r4414J7635N2560R6884k8536k6307K9679m9438L5318J49640
2461B85107m9470q0134N5045K8169p655j24990r5064M6371o3323J4790P9213J47831
2449B35890M5011L1647r3996j16790l7370M5300j1259M5078L0244Q6524M2426
$$ plain form
2438 302705 199222 197860 150528 158241 92748 98541 163202 289811 254282 123751 80377 108255
2426 108255 58178 58870 76972 152410 171424 150590 162598 108172 92730 251515 115652 65490
2414 65490 -27535 27667 112761 72221 -14186 42951 121134 90882 101254 73972 194780 45608
2402 45608 32860 91509 138688 154615 99051 212785 255189 236174 148780 124242 143557 112338
2390 112338 229612 152548 212260 234089 141188 190090 186644 112533 168122 222822 128317 183712
2378 183712 171155 141020 126324 69033 142251 93802 93983 73970 110994 162878 103763 190461
2366 190461 227740 133612 213824 279863 218607 234815 279989 115574 193890 218703 221878 251604
2354 251604 234706 259809 177377 274091 235614 168566 150387 224009 180369 311150 434703
$$ packed form
2438C02705j03483j362m7332P713o5493N793O4661J26609l5529j30531m3374K7878
2426A08255n0077O92J8102P5438J9014k0834J2008n4426j5442J58785j35863n0162
2414F5490r3025N5202Q5094m0540q6407N7137P8183l0252J0372k7282J20808j49172
2402D5608j2748N8649M7179J5927n5564J13734M2404j9015q7394k4538J9315l1219
2390A12338J17274p7064N9712K1829r2901M8902l446p4111N5589N4700r4505N5395
2378A83712j2557l0135j4696n7291P3218m8449J81k0013L7024N1884n9115Q6698
2366A90461L7279r4128Q0212O6039o1256J6208M5174j64415P8316K4813L175K9726
2354B51604j6898K5103q2432R6714l8477o7048j8179P3622m3640J30781J23553
$$ plain form
2343 434703 436983 428458 344604 322793 408652 398731 371737 515998 417362 353461 463602 525822
2331 525822 405172 448632 463140 544505 637604 457097 530635 546732 592951 718353 713642
2320 713642 708621 693812 752181 627006 726401 792100 953494 900480 1018728 1123078 1038529
2309 1038529 980848 1027847 1063895 1079351 1087359 1090781 1297370 1359905 1363143 1410499 1430925 1502498
2297 1502498 1540941 1635084 1838966 1874613 1852611 1967419 2079134 2210221 2368344 2601612
2287 2601612 2845367 2972881 3236820 3446428 3858050 4181994 4610070 5046609 5619911 6158973
2277 6158973 6740946 7208655 7640128 8374498 9188956 9862014 10597025 11486185 12476258 13649745
2267 13649745 14975765 16282597 17698408 19195658 20922822 22676331 24078784 24952165
$$ packed form
2343D34703K280q525q3854k1811Q5859r921k6994J44261r8636o3901J10141O2220
2331E25822j20650M3460J4508Q1365R3099j80507P3538J6097M6219J25402m711
2320G13642n021j4809N8369j25175R9395O5699J61394n3014J18248J04350q4549
2309A038529n7681M6999L6048J5456Q008L422K06589O2535L238M7356K0426P1573
2297A502498L8443R4143K03882L5647k2002J14808J11715J31087J58123K33268
2287B601612K43755J27514K63939K09608M11622L23944M28076M36539N73302N39062
2277F158973N81973M67709M31473P34370Q14458O73058P35011Q89160R90073J173487
2267A3649745J326020J306832J415811J497250J727164J753509J402453Q73381
$$ plain form
2259 24952165 25899656 26954562 27571160 27395653 25778693 23227405 21011698 19298457 17778528
2250 17778528 16561574 15452104 14491995 13496408 12590783 11845864 11171305 10445345 9835807
2241 9835807 9454167 8894139 8253631 7642222 7119498 6683176 6254824 5918851 5769918 5474223
2231 5474223 5261023 4945498 4665472 4507411 4363757 4072444 3765494 3704640 3570402 3507692
2221 3507692 3395794 3196422 3002965 3027880 2845128 2605419 2475715 2340893 2068463 1925506
2211 1925506 1957583 1871444 1749377 1649970 1636397 1742146 1665132 1612702 1649234 1521398 1472123
2200 1472123 1446436 1413618 1302313 1319812 1390608 1285804 1116139 1111907 1071974 1092036 1099145
2189 1099145 1011444 952512 981086 1089453 998358 942663 903275 1005030 928563 917374 951469
$$ packed form
2259B4952165R47491J054906O16598j75507j616960k551288k215707j713241j519929
2250A7778528j216954j109470r60109r95587r05625p44919o74559p25960o09538
2241I835807l81640n60028o40508o11409n22724m36322m28352l35973j48933k95695
2231E474223k13200l15525k80026j58061j43654k91313l06950o0854j34238o2710
2221C507692j11898j99372j93457K4915j82752k39709j29704j34822k72430j42957
2211A925506L2077q6139j22067r9407j3573J05749p7014n2430L6532j27836m9275
2200A472123k5687l2818j11305J7499P0796j04804j69665m232l9933K0062P109
2189A099145q7701n8932K8574J08367r1095n5695l9388J01755p6467j1189L4095
$$ plain form
2178 951469 918173 913086 929628 871734 828564 799819 801554 668550 634272 700975 779288 829835
2166 829835 619504 713607 723212 673976 558123 439229 593712 720616 587451 680342 515095
2155 515095 433106 596274 624760 758954 644253 612490 511575 599921 633743 640047 502817
2144 502817 576475 544682 583621 603814 450172 487049 448622 556600 571346 462006 379409
2133 379409 343195 385703 456932 521399 465938 319916 387677 323080 421629 328560 349070
2122 349070 387632 333799 341077 351366 480147 475138 351759 298770 285614 345841 329569 228005
2110 228005 406002 454551 329136 189965 340008 240835 240953 253034 167653 361055 237704
2099 237704 331293 469126 422413 267905 301662 312309 347793 384823 377143 352765 355655 239623
$$ packed form
2178I51469l3296n087J6542n7894m3170k8745J735j33004l4278O6703P8313N0547
2166H29835k10331R4103R605m9236j15853j18894J54483J26904j33165R2891j65247
2155E15095q1989J63168K8486J34194j14701l1763j00915Q8346L3822O304j37230
2144E02817P3658l1793L8939K0193j53642L6877l8427J07978J4746j09340q2597
2133C79409l6214M2508P1229O4467n5461j46022O7761o4597R8549r3069K0510
2122C49070L8562n3833P278J0289J28781n009j23379n2989j3156O0227j6272j01564
2110B28005J77997M8549j25415j39171J50043r9173J18J2081q5381J93402j23351
2099B37704R3589J37833m6713j54508L3757J0647L5484L7030p680k4378K890j16032
$$ plain form
2087 239623 111813 202329 94492 138156 237593 289847 294533 284720 289123 270581 160643 168873
2075 168873 203191 232587 202031 279261 233296 377668 390155 249766 176727 153490 149850
2064 149850 210899 257872 275679 274699 241062 218158 64631 136822 106524 248674 332539 219230
2052 219230 209140 340039 199528 156774 271984 231598 211777 260261 258531 69564 -18309
2041 -18309 83889 127224 135906 92736 19201 5500 95140 144389 140644 5589 16127 94994
2029 94994 48290 93561 97999 126751 162243 129601 35126 2953 65140 50052 71151 149818
2017 149818 210198 201373 203822 194662 180030 169724 218886 199210 196241 132743 212574 144600
2005 144600 151264 139134 171929 220972 258616 376429 301363 283666 297272 220270 258550 253259
$$ packed form
2087B39623j27810R0516j07837M3664R9437N2254M686r813M403j8542j09938Q230
2075A68873L4318K9396l0556P7230m5965J44372J2487j40389p3039k3237l640
2064A49850O1049M6973J7807r80l3637k2904j53527P2191l0298J42150Q3865j13309
2052B19230j0090J30899j40511m2754J15210m0386j9821M8484j730j88967q7873
2041a8309J02198M3335Q682m3170p3535j3701Q9640M9249l745j35055J0538P8867
2029I4994m6704M5271M438K8752L5492l2642r4475l2173O2187j5088K1099P8667
2017A49818O0380q825K449r160j4632j0306M9162j9676k969o3498P9831o7974
2005A44600O664j2130L2795M9043L7644J17813p5066j7697J3606p7002L8280n291
$$ plain form
1993 253259 246178 300221 256420 154706 256055 300797 196269 304579 205130 247781 187236
1982 187236 177405 234979 175178 188395 290278 278600 102871 209257 55551 -70239 14204
1971 14204 72127 -39 -98036 8150 64347 56802 9887 36883 24026 -12185 69999 12153
1959 12153 -2563 220260 205157 160604 56532 15430 111220 140942 86033 242485 205215
1948 205215 196428 115813 36756 87329 111390 8125 9456 -61162 53793 129761 -16767
1937 -16767 -38605 39476 74207 32978 37836 11116 81979 97141 98554 138232 54721 142588
1925 142588 281581 246780 147974 6195 3424 124605 157308 169500 87782 7777 95872
1914 95872 65850 33730 114521 192963 231309 116926 140807 141225 101126 94475 112143 176224
$$ packed form
1993B53259p081N4043m3801j01714J01349M4742j04528J08310r9449M2651o0545
1982A87236r831N7574n9801J3217J01883j1678j75729J06386j53706j25790Q4443
1971A4204N7923p2166r7997J06186N6197p545m6915K6996j2857l6211Q2184n7846
1959A2153j4716K22823j5103m4553j04072m1102R5790K9722n4909J56452l7270
1948B05215q787q0615p9057N0573K4061j03265J331p0618J14955P5968j46528
1937a6767k1838P8081L4731m1229M858k6720P0863J5162J413L9678q3511Q7867
1925A42588J38993l4801r8806j41779k771J21181L2703J2192q1718q0005Q8095
1914I5872l0022l2120Q0791P8442L8346j14383K3881M18m0099o651J7668O4081
$$ plain form
1902 176224 176597 54381 36497 77194 92091 80075 76015 68457 -30797 78853 102412 25338
1890 25338 35477 153345 140905 34700 -155800 -114943 -31715 116745 104509 4342 56196
1879 56196 20916 126404 99353 -24714 1838 17219 -52211 -88083 17358 -58723 -120002
1868 -120002 10340 -1371 98859 151374 75302 85331 121352 135232 126564 137407 31806
1857 31806 -20393 106707 187567 75127 -14760 -101495 -31046 -14425 134079 92978 87587
1846 87587 17888 23310 55073 -22160 -33009 18612 86945 -81711 -103702 -67325 -67882 -60624
1834 -60624 30712 -20777 -130528 -101632 -56286 -28791 -55970 -77994 23864 108169 83907
1823 83907 -49410 -132574 -32899 72981 -35915 -33708 -157159 -71273 76463 -53342 -36953
$$ packed form
1902A76224L73j22216j7884M0697J4897j2016m060p558r9254J09650K3559p7074
1890B5338J0139J17868j2440j06205j90500M0857Q3228J48460j2236j00167N1854
1879E6196l5280J05488k7051j24067K6552J5381o9430l5872J05441p6081o1279
1868a20002J30342j1711J00230N2515p6072J0029L6021J3880q668J0843j05601
1857C1806n2199J27100Q0860j12440q9887q6735P0449J6621J48504m1101n391
1846H7587o9699N422L1763p7233j0849N1621O8333j68656k1991L6377n57P258
1834f0624R1336n1489j09751K8896M5346K7495k7179k2024J01858Q4305k4262
1823H3907j33317q3164R9675J05880j08896K207j23451Q5886J47736j29805J6389
$$ plain form
1812 -36953 -32129 -37865 -57196 43473 47656 72154 72787 66256 9153 39502 94477 5277 -46332
1799 -46332 -48818 -66059 -68133 -60740 -38825 26495 15642 -8511 55591 -10492 16983 22808 70430
1786 70430 22994 70718 75091 29979 44402 -109897 -86261 -87903 -59985 -70185 22238 -66525
1774 -66525 61729 468 8685 -82907 -93597 28167 5943 -8432 16110 128168 139193
1763 139193 198169 83311 115645 193020 187606 78851 7069 43004 168809 107521 80903
1752 80903 -94616 -62042 -70361 24803 31651 -3486 -14224 -41604 77896 -7388 -70340 1623
1740 1623 37948 54184 108214 45868 61173 49885 8259 -25014 -60364 -32822 10230 -11982
1728 -11982 -32528 -81869 -74499 -67073 -27709 -99509 960 73339 156368 48771 123469 29062
$$ packed form
1812c6953M824n736j9331J00669M183K4498O33o531n7103L0349N4975q9200n1609
1799d6332k486j7241k074P393K1915O5320j0853k4153O4102o6083K7475N825M7622
1786G0430m7436M7724M373m5112J4423j54299K3636j642K7918j0200R2423q8763
1774f6525J28254o1261Q217r1592j0690J21764k2224j4375K4542J12058J1025
1763A39193N8976j14858L2334P7375n414j08755p1782L5935J25805o1288k6618
1752H0903j75519L2574q319R5164O848l5137j0738k7380J19500q5284o2952P1963
1740A623L6325J6236N4030o2346J5305j1288m1626l3273l5350K7542M3052k2212
1728a1982k0546m9341P370P426L9364p1800J00469P2379Q3029j07597P4698r4407
$$ plain form
1716 29062 45371 -48617 -155781 -100101 -89972 -97567 -94656 -16596 -62322 -109461 -4224 -8352
1704 -8352 44564 -87476 -99595 -31458 -116144 -132866 -130312 -206268 -46347 76747 97165 -29888
1692 -29888 -21266 -72097 -94573 34091 -44153 14033 82178 29600 -7860 123002 173690 188022
1680 188022 77083 47295 61779 58218 18759 -61762 -26025 109473 74326 11904 -89711
1669 -89711 -58829 -150060 -73700 7784 6074 2086 11854 -78512 14009 13131 10105 12283 -63350
1656 -63350 -42014 -108053 -145400 -97414 -60840 -63711 -85684 -80005 4212 18698 -152242 -108027
1644 -108027 -140827 -65236 13397 -109562 -34523 93071 109449 129971 3336 65596 141994
1633 141994 -29541 60441 95526 94684 250293 134391 5104 -134818 -129920 -149026 -92623
$$ packed form
1716B9062J6309r3988j07164N5680J0129p595K911P8060m5726m7139J05237m128
1704h352N2916j32040j2119O8137q4686j6722K554p5956J59921J23094K0418j27053
1692b9888Q622n0831k2476J28664p8244N8186O8145n2578l7460J30862N0688J4332
1680A88022j10939k9788J4484l561l9459q0521L5737J35498l5147o2422j01615
1669h9711L0882r1231P6360Q1484j710l988R768r0366R2521q78l026K178p5633
1656f3350K1336o6039l7347M7986L6574k871k1973N679Q4217J4486j70940M4215
1644a08027l2800P5591P8633j22959P5039J27594J6378K0522j26635O2260P6398
1633A41994j71535Q9982L5085q42J55609j15902j29287j39922M898j9106N6403
$$ plain form
1622 -92623 -44570 -70709 36107 27659 92751 118931 -64704 -79979 87327 92271 -40324
1611 -40324 -35540 -86469 -177692 -107326 -130859 -109672 -40885 -22610 11564 45649 -3555 -66047
1599 -66047 14363 15658 -23740 38483 185651 124658 82251 43566 -10437 57805 44180 102106
1587 102106 129777 82880 61216 -12243 -5035 132108 52658 -34550 -199616 -112563 28383
1576 28383 -5337 -2028 40413 116737 99630 79555 126661 23885 31201 107852 141593 97572
1564 97572 -10628 -116160 -91356 65328 38297 -66144 -37431 8841 112693 40506 -15980
1553 -15980 -162544 -27508 3701 -18632 61733 94468 152824 51585 107298 117804 129313
1542 129313 85492 12751 -52812 -92463 -136236 -122354 -34603 -29031 66099 119991 -18382 -81561
$$ packed form
1622i2623M8053k6139J06816q448O5092K6180j83635j5275J67306M944j32595
1611d0324M784n0929r1223P0366k3533K1187O8787J8275L4174L4085m9204o2492
1599f6047Q0410J295l9398O2223J47168o0993m2407l8685n4003O8242j3625N7926
1587A02106K7671m6897k1664p3459P208J37143p9450q7208j65066Q7053J40946
1576B8383l3720L309M2441P6324j7107k0075M7106j02776P316P6651L3741m4021
1564I7572j08200j05532K4804J56684k7031j04441K8713M6272J03852p2187n6486
1553a5980j46564J35036L1209k2333Q0365L2735N8356j01239N5713J0506J1509
1542A29313m3821p2741o5563l9651m3773J3882Q7751N572R5130N3892j38373o3179
$$ plain form
1530 -81561 -83847 -103950 -176090 -63977 92185 47756 -51063 -131696 -113345 30944 -40330
1519 -40330 -105451 -101844 2928 -24397 -44153 -28693 -125000 48966 -7244 -77406 -56676 8128
1507 8128 55251 2524 6455 102891 44278 -47394 -95498 71047 -88938 -34817 -79528 -31674
1495 -31674 -66644 -156995 -134393 -71915 -168106 -169474 -15330 35050 117409 53527 5790 10986
1483 10986 32402 -37293 -41723 -74443 -65462 28320 59397 -37429 -76269 -214277 -145467 -73522
1471 -73522 -11221 -120709 -45231 -4818 93405 157425 119089 128020 102076 -117626 -118707 -152435
1459 -152435 -62864 15430 48703 -29355 54922 -22006 -83360 -11902 -1419 8737 -87351 93811
1447 93811 36238 -36214 7382 40238 96915 148395 86816 105805 25801 2154 43136 38530
$$ packed form
1530h1561k286k0103p2140J12113J56162m4429r8819q0633J8351J44289p1274
1519d0330o5121L607J04772k7325j9756J5460r6307J73966n6210p0162K0730O4804
1507H128M7123n2727L931R6436n8613r1672m8104J66545j59985N4121m4711M7854
1495c1674l4970r0351K2602O2478r6191j368J54144N0380Q2359o3882m7737N196
1483A0986K1416o9695m430l2720Q981R3782L1077r6826l8840j38008O8810P1945
1471g3522O2301j09488P5478M0413R8223O4020l8336Q931k5944k19702j081l3728
1459a52435Q9571P8294L3273p8058Q4277p6928o1354P1458J0483J0156r6088J81162
1447I3811n7573p2452M3596L2856N6677N1480o1579J8989q0004k3647M0982m606
$$ plain form
1435 38530 -75911 -106009 -96166 -164564 -149942 78726 126974 81711 40446 -91557 -82167 31363
1423 31363 106807 -2868 -74490 -26108 26818 38791 -23255 32325 36446 17292 8000 -65660
1411 -65660 -32338 -43210 -65491 -183809 -27182 -102297 -152803 -82150 32447 -28455 -32989
1400 -32989 47914 -12523 7016 42865 68259 -102651 -153945 -73605 -114417 -227819 -275553
1389 -275553 -177257 -76087 -5585 14103 149380 148754 37775 -11099 -96728 -34023 -24243 -91833
1377 -91833 -36900 -2746 -39589 -99521 -14593 32726 -125833 -78144 -25816 -111700 -157442 -161369
1365 -161369 -158233 -108844 -178859 -47716 3400 37161 17771 76881 -31920 -90277 -156647
1354 -156647 -70495 -34273 20705 -119915 -71970 44119 44914 145089 82046 -58560 -78507
$$ packed form
1435C8530j14441l0098R843o8398J4622K28668M8248m5263m1265j32003R390J13530
1423C1363P5444j09675p1622M8382N2926J1973o2046N5580M121j9154r292p3660
1411f5660L3322j0872k2281j18318J56627p5115n0506P0653J14597o0902m534
1400c2989Q0903o0437J9539L5849K5394j70910n1294Q0340m0812j13402m7734
1389b75553R8296J01170P0502J9688J35277o26j10979m8874q5629O2705R780o7590
1377i1833N4933L4154l6843n9932Q4928M7319j58559M7689N2328q5884m5742l927
1365a61369L136M9389p0015J31143N1116L3761j9390N9110j08801n8357o6370
1354a56647Q6152L6222N4978j40620M7945J16089P95J00175o3043j40606j9947
$$ plain form
1343 -78507 39992 -46972 -68783 -150379 -10160 10795 -104025 -150383 -153764 -9163 85574
1332 85574 -75760 43893 60131 95139 46926 41642 92568 61341 121512 50031 50478 124900
1320 124900 53648 14683 49002 37342 40915 71646 47730 -42657 -12535 -9506 1636 33309
1308 33309 91426 40957 -54574 -102846 5648 -39788 -8300 112507 62401 -68801 16094
1297 16094 7886 -45660 -68004 -32049 -34500 -175134 -112926 -101007 -83426 -152248 -67164 -79742
1285 -79742 -64431 -77488 -111744 -94826 -7825 9294 -17701 8822 -44035 -108445 -15820 6987
1273 6987 -43631 44243 -18561 -130386 -27852 32891 -180506 -126974 -58313 76830 68038
1262 68038 -5206 -56232 -69415 -21949 58855 -5633 -51458 77597 45533 193 -4560 -117918
$$ packed form
1343g8507J18499q6964k1811q1596J40219K0955j14820m6358l381J44601R4737
1332H5574j61334J19653J6238L5008m8213n284N0926l1227O0171p1481M47P4422
1320A24900p1252l8965L4319j1660L573L0731k3916r0387L0122L029J1142L1673
1308C3309N8117n0469r5531m8272J08494m5436L1488J20807n0106j31202Q4895
1297A6094q208n3546k2344L5955k451j40634O2208J1919J7581o8822Q5084j2578
1285g9742J5311j3057l4256J6918Q7001J7119k6995K6523n2857o4410R2625K2807
1273F987n0618Q7874o2804j11825J02534O0743k13397N3532O8661J35143q792
1262F8038p3244n1026j3183M7466Q0804o4488m5825J29055l2064m5340m753j13358
$$ plain form
1250 -117918 -33704 87573 45077 -113905 -144290 -113943 -43095 91490 112419 96032 86455
1239 86455 63711 -77635 51975 163424 181119 163708 -97874 -69231 -25010 -63355 -198
1228 -198 13340 115022 23191 -88976 -24740 114044 131077 208573 65980 -5028 48976
1217 48976 27619 10923 -20937 -55853 -17322 -167758 -60218 39112 -118741 -64091 81161
1206 81161 61160 94998 60614 88426 99705 47759 14891 47521 83918 72976 -4036 -67121
1194 -67121 -14073 -81807 5436 -13153 -13818 19357 -35568 -106585 -113483 -30818 -150182 -164484
1182 -164484 -4953 6837 55298 80622 -75889 -46257 13522 -74474 7461 72660 6879
1171 6879 -31272 21905 -25738 -48545 5211 -16562 11814 59940 -39648 82883 -22109 -129861
$$ packed form
1250a17918Q4214J21277m2496j58982l0385L0347P0848J34585K0929j6387r577
1239H6455k2744j41346J29610J11449J7695j7411k61582K8643M4221l8345O3157
1228a98J3538J01682r1831j12167O4236J38784J7033P7496j42593p1008N4004
1217D8976k1357j6696l1860l4916L8531j50436J07540R9330j57853N4650J45252
1206H1161k0001L3838l4384K7812J1279n1946l2868L2630L6397j0942p7012o3085
1194f7121N3048o7734Q7243j8589o65L3175n4925p1017o898Q2665j19364j4302
1182a64484J59531J1790M8461K5324j56511K9632N9779q7996Q1935O5199o5781
1171F879l8151N3177m7643k2807N3756k1773K8376M8126r9588J22531j04992j07752
$$ plain form
1159 -129861 -122950 -50712 -143826 -229242 -116569 -47907 -24659 -118062 -64510 -75783 -144126 -135179
1147 -135179 -40069 -34208 -62281 -38473 -143451 -237993 -3064 91299 -33912 -24533 -24254 23956
1135 23956 109063 211740 198104 100915 63803 8343 -954 18045 -43706 -18173 -14276 -82755
1123 -82755 -202776 -128087 -34420 -39052 -45662 -106161 16040 47075 82143 115609 -5471 13861
1111 13861 53417 -14391 75730 59818 -970 -17445 -82674 -161018 31422 199503 97141
1100 97141 36930 42115 36547 30508 100668 87006 -7360 11611 107190 151970 149240 81788 17587
1087 17587 -76260 -114314 -72099 -65644 -90225 -28386 -20442 1100 31114 52742 33972 64717
1075 64717 108302 75991 105163 48956 -8510 -59173 -126879 -121025 30047 125693 99860 -3393
$$ packed form
1159a29861O911P2238r3114q5416J12673O8662K3248r3403N3552j1273o8343Q947
1147a35179R5110N861k8073K3808j04978r4542K34929R4363j25211R379K79M8210
1135B3956Q5107J02677j3636r7189l7112n5460r297J8999o1751K5533L897o8479
1123h2755j20021P4689R3667m632o610o0499J22201L1035L5068L3466j21080J9332
1111A3861L9556o7808R0121j5912o0788j6475o5229p8344J92440J68081j02362
1100I7141o0211N185n568o039P0160j3662r4366J8971R5579M4780k730o7452o4201
1087A7587r3847l8054M2215O455k4581O1839P944K1542L0014K1628j8770L0745
1075F4717M3585l2311K9172n6207n7466n0663o7706N854J51072R5646k5833j03253
$$ plain form
1063 -3393 45403 -48655 -114622 -71237 104191 83337 -30361 -19116 10184 -54434 25725 -21614
1051 -21614 -91485 39739 -30672 62058 -69163 57248 87190 39525 -118928 40485 10806
1040 10806 -184733 -263983 -220005 -150175 -43517 37633 -66089 -90872 6717 37919 124035
1029 124035 209631 76421 2746 -71692 77135 111821 86547 -3966 -51605 -122279 -211808
1018 -211808 -151100 -53872 55484 -52081 -59173 -147202 -115347 -103461 -171811 -6023 -101026
1007 -101026 -95291 -248890 -57889 -42774 -74838 -138696 -185730 -120530 -170657 -125529 -81465
996 -81465 -5742 72703 13174 -11687 -204475 -169956 -66904 -90465 -53075 -74140 -56639 -33334
984 -33334 -30787 38388 -20367 -120025 -20370 -6872 8761 29920 39538 32342 -22940 -168596
$$ packed form
1063c393M8796r4058o5967M3385J75428k0854j13698J1245K9300o4618Q0159m7339
1051b1614o9871J31224p0411R2730j31221J26411K9942m7665j58453J59413k9679
1040A0806j95539p9250M3978O9830J06658Q1150j03722k4783R7589L1202Q6116
1029A24035Q5596j33210p3675p4438J48827L4686k5274r0513m7639p0674q9529
1018b11808O0708R7228J09356j07565p092q8029L1855J1886o8350J65788r5003
1007a01026N735j53599J91001J5115l2064o3858m7034O5200n0127M5128M4064
996h1465P5723P8445n9529k4861j92788L4519J03052k3561L7390k1065J7501K3305
984c3334K547O9175n8755r9658R9655J3498J5633K1159R618p196n5282j45656
$$ plain form
972 -168596 -133765 -43205 -12875 -36247 -17884 -29208 -51922 -96396 2199 -42947 -39499 -91226
960 -91226 -52696 -6676 -23212 7125 642 -67072 -69069 -80193 -11976 13803 39727 -7221
948 -7221 -13144 11725 1709 16089 -28634 -124193 -192494 -90558 -16769 -182922 -231878 -26628
936 -26628 -8721 -38300 -106637 -3068 28163 -127178 -213236 -57110 44571 45551 -49048 -118979
924 -118979 -30549 -31967 17063 22340 21226 16917 -45581 57863 -88776 -73584 94094 67511
912 67511 32862 126114 -525 -66405 -114053 -80600 -87684 13583 41182 96517 8427 -147588
900 -147588 -53486 -4462 -27669 -12963 -17353 -57871 -45697 -94377 -90799 -126320 -108143 -9271
888 -9271 -276 91573 71709 -67140 47075 54037 -51546 -78009 -106659 -43645 -48881 -207887
$$ packed form
972a68596L4831R0560L0330k3372J8363j1324k2714m4474R8595m5146L448n1727
960i1226L8530M6020j6536L0337o483o7714j997j1124O8217K5779K5924m6948
948g221n923K4869j0016J4380m4723r5559o8301J01936P3789j66153m8956K05250
936b6628J7907k9579o8337J03569L1231j55341q6058J56126J01681R80r4599o9931
924a18979Q8430j418M9030N277j114m309o2498J03444j46639J5192J67678k6583
912F7511l4649R3252j26639o5880m7648L3453p084J01267K7599N5335q8090j56015
900a47588R4102M9024k3207J4706m390m0518J2174m8680L578l5521J8177R8872
888i271Q995R1849j9864j38849J14215O962j05583k6463k8650O3014n236j59006
$$ plain form
876 -207887 -139183 -130518 -3408 79268 70077 -71070 -204877 -158967 -87009 -8463 36658 45905
864 45905 60153 24805 -65154 -93545 -58845 -47847 -4458 -63686 -150084 -140447 -123286 -121833
852 -121833 -83354 -61915 -57257 -19221 -120325 -199955 24511 7067 28854 -5282 30903 4064
840 4064 107692 102238 -106137 -11807 -5791 56624 156466 85102 32636 21411 -44412 -121748
828 -121748 -91396 -156523 -184342 -78018 -73701 -25882 74159 10199 60108 148491 125461 42157
816 42157 22402 37966 -57756 -16360 -98095 -165118 -2636 10773 -67930 -203411 -96272
805 -96272 -4798 32297 29582 -117502 -84070 -31744 27870 -60135 -10720 -48452 4493 125425
793 125425 170409 85681 9548 32299 103455 85442 121683 32065 7506 -75816 -35967 64223
$$ packed form
876b07887O8704Q665J27110Q2676r191j41147j33807M5910P1958P8546M5121R247
864D5905J4248l5348q9959k8391L4700J0998M3389n9228q6398R637J7161J453
852a21833L8479K1439M658L8036j01104p9630K24466j7444K1787l4136L6185k6839
840D064J03628n454k08375R4330O016O2415R9842p1364n2466j1225o5823p7336
828a21748L0352o5127k7819J06324M317M7819J00041o3960M9909Q8383k3030q3304
816D2157j9755J5564r5722M1396q1735o7023J62482J3409p8703j35481J07139
805i6272R1474L7095k715j47084L3432N2326N9614q8005M9415l7732N2945J20932
793A25425M4984q4728p6133K2751P1156j8013L6241q9618k4559q3322L9849J00190
$$ plain form
781 64223 30094 48544 54823 -42724 -87494 -139792 -98689 -94923 -119407 -90905 -23681 4628
769 4628 27869 -28191 -50064 -29510 -143357 -58293 -108855 -78082 96166 67856 -29371 -7678
757 -7678 -2641 -24049 -25690 73790 23313 -47170 -74527 -7077 -16487 -106442 -75465 -19664 -37810
744 -37810 -63692 -126476 -60180 35582 -61247 -73691 -55477 39198 -3115 -76202 -19782 -41555
732 -41555 -99015 -70933 -20451 -19727 -29559 -1726 24809 -26806 -77510 2936 43884 1498 168769
719 168769 23399 -73991 -102718 -117467 -188286 -181623 -108491 -51502 25318 59230 71565 154015
707 154015 219552 38581 -7615 -90047 6496 -90979 -111958 -74908 -154678 -104421 -29906 3254
695 3254 346 58616 1501 -96161 -29537 -64365 -58056 -55597 74856 153825 -679 -184322
$$ packed form
781F4223l4129J8450O279r7547m4770n2298M1103L766k4484K8502O7224K8309
769D628K3241n6060k1873K0554j13847Q5064n0562L0773J74248k8310r7227K1693
757g678N037k1408j641R9480n0477p0483k7357O7450r410q9955L0977N5801j8146
744c7810k5882o2784O6296R5762r6829j2444J8214R4675m2313p3087N6420k1773
732d1555n7460K8082N0482P24r832K7833K6535n1615n0704Q0446M0948m2386J67271
719A68769j45370r7390k8727j4749p0819O663P3132N6989P6820L3912J2335Q2450
707A54015O5537j80971m6196q2432R6543r7475k0979L7050p9770N0257P4515L3160
695C254k908N8270n7115r7662O6624l4828O309K459J30453P8969j54504j83643
$$ plain form
683 -184322 -277935 -154257 -42982 10805 -20462 -51575 -33490 64028 43556 -7277 -73425
672 -73425 482 120589 32444 -8193 -29108 59592 -31332 -163234 -157316 -18885 22490 -27679
660 -27679 -21419 -81177 37787 -60172 18622 178626 121759 73186 21535 -73154 -67885 -65540
648 -65540 1856 -57049 -166172 -35148 -33301 -58554 -30107 -14814 -17335 80019 3349 100088
636 100088 80755 98185 170006 106601 124266 35855 107518 68618 51740 -18264 38981 84100
624 84100 120803 63557 99282 -67397 -265220 -113998 -17138 -33464 14082 48747 7565
613 7565 -42313 16692 -42112 -63472 6975 3156 -81958 -80860 -25507 -60916 -62678 -143294 -65094
600 -65094 5655 -10318 -4786 -14345 61445 179153 148399 143894 43047 -95060 -47019 61946
$$ packed form
683a84322r3613J23678J11275N3787l1267l1113J8085R7518k0472n0833o6148
672g3425P3907J20107q8145m0637k0915Q8700r0924j31902N918J38431M1375n0169
660b7679O260n9758J18964r7959P8794J60004n6867m8573n1651r4689N269K345
648f5540O7396n8905j09123J31024J847k5253K8447J5293k521R7354p6670R6739
636A00088j9333J7430P1821o3405J7665q8411P1663l8900j6878p0004N7245M5119
624H4100L6703n7246L5725j66679j97823J51222R6860j6326M7546L4665m1182
613G565m9878N9005n8804k1360P0447l819q5114J098N5353l5409j762q0616P8200
600f5094P0749j5973N532r559P5790J17708l0754m505j00847j38107M8041J08965
$$ plain form
588 61946 -38638 5700 26253 -198550 -130359 -44311 89467 130445 35448 -123277 -146185
$$ packed form
588F1946j00584M4338K0553k24803O8191Q6048J33778M0978r4997j58725k2908
$$ [...]
##END NTUPLES=NMR SPECTRUM
##END=
