##TITLE=1H_DE-80H_X3
 200.13MHz, d2o
 8 sc
 
 19ns.26.2.2025
##JCAMPDX= 6.0         $$ Bruker NMR JCAMP-DX V2.0
##DATA TYPE= NMR SPECTRUM
##DATA CLASS= NTUPLES
##ORIGIN= UXNMR, Bruker Analytische Messtechnik GmbH
##OWNER= pz
$$ XWIN-NMR		Version 3.5
$$ Wed Oct  8 11:57:04 2025 Russian Standard Time (UT+4h)  Yarkov@DPX200
##.OBSERVE FREQUENCY= 200.1313
##.OBSERVE NUCLEUS= ^1H
##.ACQUISITION MODE= SIMULTANEOUS
##.ACQUISITION SCHEME= undefined
##.AVERAGES= 8
##.DIGITISER RES= 18
##SPECTROMETER/DATA SYSTEM= spect
##.PULSE SEQUENCE= zg30
##.SOLVENT NAME= CDCl3
##.SHIFT REFERENCE= (INTERNAL, CDCl3, 0, 15.4759)
##AUDIT TRAIL= $$ (NUMBER, WHEN, WHO, WHERE, WHAT)
$$ ##TITLE= Audit trail, XWIN-NMR		Version 3.5
$$ ##JCAMPDX= 5.01
$$ ##ORIGIN= Bruker BioSpin GmbH
$$ ##OWNER= Yarkov
$$ C:/Bruker/XWIN-NMR/data/yarkov2/nmr/H-C/1/pdata/1/auditp.txt
$$ ##AUDIT TRAIL=  $$ (NUMBER, WHEN, WHO, WHERE, WHAT)
(   1,<2025-10-08 11:56:13.87 +0400>,<Yarkov>,<DPX200>,
      <created by zg, POWCHK disabled, PULCHK disabled
       configuration hash MD5:
       00 E9 B6 7A A2 85 ED C7 34 08 36 98 17 FE 4E 26
       data hash MD5: 16K
       64 FE DB 34 D3 11 C7 8B D2 D3 18 E6 5B 4E 85 0C>)
(   2,<2025-10-08 11:56:19.90 +0400>,<Yarkov>,<DPX200>,
      <Start of raw data processing
       efp BC_mod = 2 LB = 0.25 FT_mod = 6 PKNL = 1 PHC0 = -2281.05 PHC1 = 12.99097 SI = 16K 
       data hash MD5: 16K
       F5 71 BB 6D 29 74 BA E9 42 A5 7B B0 23 2A E5 35>)
(   3,<2025-10-08 11:56:24.21 +0400>,<Yarkov>,<DPX200>,
      <abs ABSG = 5 
       data hash MD5: 16K
       DA 63 28 A0 58 1F 32 A6 23 4B 27 31 35 DB B3 0A>)
$$ ##END=
$$ 
$$ hash MD5
$$ A9 C0 57 C5 07 46 60 76 E0 C5 BE B4 F8 94 D0 EE
##$RELAX= 
##$RELAX= 
##$RELAX= 
##$RELAX= 
##$RELAX= 
##$RELAX= 
$$ Bruker specific parameters
$$ --------------------------
##$DU= <C:/Bruker/XWIN-NMR>
##$EXPNO= 1
##$NAME= <H-C>
##$PROCNO= 1
##$TYPE= <nmr>
##$USER= <yarkov2>
##$AMP= (0..31)
100 100 100 100 100 100 100 100 100 100 100 100 100 100 100 100 100 100 
100 100 100 100 100 100 100 100 100 100 100 100 100 100 
##$AQSEQ= 0
##$AQ_mod= 1
##$AUNM= <au_zg>
##$AUTOPOS= <>
##$BF1= 200.13
##$BF2= 200.13
##$BF3= 200.13
##$BF4= 200.13
##$BF5= 200.13
##$BF6= 200.13
##$BF7= 200.13
##$BF8= 200.13
##$BYTORDA= 1
##$CFDGTYP= 0
##$CFRGTYP= 5
##$CHEMSTR= <none>
##$CNST= (0..31)
1 1 145 1 1 1 1 1 1 1 1 1 1 1 1 1 1 1 1 1 1 1 1 1 1 1 1 1 1 1 1 1 
##$CPDPRG= <>
##$CPDPRG1= <>
##$CPDPRG2= <>
##$CPDPRG3= <>
##$CPDPRG4= <mlev>
##$CPDPRG5= <mlev>
##$CPDPRG6= <mlev>
##$CPDPRG7= <mlev>
##$CPDPRG8= <mlev>
##$CPDPRGB= <>
##$CPDPRGT= <>
##$D= (0..31)
0 0.7 0 0 0 0 0 0 0 0 0 0.03 0 0 0 0 0 0 0 0 0 0 0 0 0 0 0 0 0 0 0 0 
##$DATE= 1759910173
##$DBL= (0..7)
120 120 120 120 120 120 120 120 
##$DBP= (0..7)
150 150 150 150 150 150 150 150 
##$DBP07= 0
##$DBPNAM0= <>
##$DBPNAM1= <>
##$DBPNAM2= <>
##$DBPNAM3= <>
##$DBPNAM4= <>
##$DBPNAM5= <>
##$DBPNAM6= <>
##$DBPNAM7= <>
##$DBPOAL= (0..7)
0.5 0.5 0.5 0.5 0.5 0.5 0.5 0.5 
##$DBPOFFS= (0..7)
0 0 0 0 0 0 0 0 
##$DE= 6
$$ [...]
##$SUBNAM3= <"">
##$SUBNAM4= <"">
##$SUBNAM5= <"">
##$SUBNAM6= <"">
##$SUBNAM7= <"">
##$SUBNAM8= <"">
##$SUBNAM9= <"">
##$SW= 18.0517328524113
##$SWIBOX= (0..15)
0 0 2 0 0 0 0 0 0 0 0 0 0 0 0 0 
##$SW_h= 3612.71676300578
##$TD= 16384
##$TD0= 1
##$TE= 0
##$TE2= 300
##$TE3= 300
##$TEG= 300
##$TL= (0..7)
0 120 120 120 120 120 120 120 
##$TP= (0..7)
150 150 150 150 150 150 150 150 
##$TP07= 0
##$TPNAME0= <>
##$TPNAME1= <>
##$TPNAME2= <>
##$TPNAME3= <>
##$TPNAME4= <>
##$TPNAME5= <>
##$TPNAME6= <>
##$TPNAME7= <>
##$TPOAL= (0..7)
0.5 0.5 0.5 0.5 0.5 0.5 0.5 0.5 
##$TPOFFS= (0..7)
0 0 0 0 0 0 0 0 
##$TUNHIN= 0
##$TUNHOUT= 0
##$TUNXOUT= 0
##$USERA1= <user>
##$USERA2= <user>
##$USERA3= <user>
##$USERA4= <user>
##$USERA5= <user>
##$V9= 5
##$VALIST= <valist>
##$VCLIST= <CCCCCCCCCCCCCCC>
##$VD= 0
##$VDLIST= <DDDDDDDDDDDDDDD>
##$VPLIST= <PPPPPPPPPPPPPPP>
##$VTLIST= <TTTTTTTTTTTTTTT>
##$WBST= 1024
##$WBSW= 4
##$XGAIN= (0..3)
0 0 0 0 
##$XL= 0
##$YL= 0
##$YMAX_a= 671785
##$YMIN_a= -884704
##$ZGOPTNS= <>
##$ZL1= 120
##$ZL2= 120
##$ZL3= 120
##$ZL4= 120
##$ABSF1= 15.47585
##$ABSF2= -2.575999
##$ABSG= 5
##$ABSL= 3
##$ALPHA= 0
##$AQORDER= 0
##$ASSFAC= 0
##$ASSFACI= 0
##$ASSFACX= 0
##$ASSWID= 0
##$AUNMP= <proc_1d>
##$AZFE= 0.1
##$AZFW= 0.1
##$BCFW= 0
##$BC_mod= 2
##$BYTORDP= 0
##$COROFFS= 0
##$CY= -3
##$DATMOD= 1
##$DC= 0
##$DFILT= <>
##$DTYPP= 0
##$F1P= 0
##$F2P= 0
##$FCOR= 1
##$FTSIZE= 16384
##$FT_mod= 6
##$GAMMA= 0
##$GB= 0
##$INTBC= 1
##$INTSCL= 3.241238e-09
##$ISEN= 128
##$LB= 0.25
##$LEV0= 0
##$LPBIN= 0
##$MAXI= 10000
##$MC2= 0
##$MEAN= 0
##$ME_mod= 0
##$MI= 1.114404
##$NCOEF= 0
##$NC_proc= -6
##$NLEV= 6
##$NOISF1= 3.799351
##$NOISF2= 2.8
##$NSP= 0
##$NTH_PI= 0
##$NZP= 0
##$OFFSET= 15.47585
##$PC= 1
##$PHC0= -2281.05
##$PHC1= 12.99097
##$PH_mod= 1
##$PKNL= yes
##$PPARMOD= 0
##$PSCAL= 0
##$PSIGN= 0
##$REVERSE= no
##$SF= 200.130009176317
##$SI= 16384
##$SIGF1= 3
##$SIGF2= 2
##$SINO= 0.751879
##$SIOLD= 32768
##$SREGLST= <19F.Aceton>
##$SSB= 0
##$STSI= 16384
##$STSR= 0
##$SW_p= 3612.71676300578
##$SYMM= 0
##$S_DEV= 0
##$TDeff= 16384
##$TDoff= 0
##$TI= <>
##$TILT= no
##$TM1= 0
##$TM2= 0
##$TOPLEV= 0
##$USERP1= <user>
##$USERP2= <user>
##$USERP3= <user>
##$USERP4= <user>
##$USERP5= <user>
##$WDW= 1
##$XDIM= 16384
##$YMAX_p= 331265609
##$YMIN_p= -578104
$$ End of Bruker specific parameters
$$ ---------------------------------
##NTUPLES= NMR SPECTRUM
##VAR_NAME=  FREQUENCY,     SPECTRUM/REAL,   SPECTRUM/IMAG
##SYMBOL=    X,             R,               I
##VAR_TYPE=  INDEPENDENT,   DEPENDENT,       DEPENDENT
##VAR_FORM=  AFFN,          ASDF,            ASDF
##VAR_DIM=   16384,         16384,           16384
##UNITS=     HZ,            ARBITRARY UNITS, ARBITRARY UNITS
##FACTOR=    0.220516191357247, 1,           1
##FIRST=     3097.18202358212, 0,            0
##LAST=      -515.534739423658, 0,           0
##MIN=       -515.534739423658, -578104,     0
##MAX=       3097.18202358212, 331265609,    0
$$ Real data points
##PAGE= N=1
##DATA TABLE= (X++(R..R)), XYDATA
$$ [...]
8689 44430501 44163403 44089522 44446485 44967203 45508965 46125812 46455373 46350837 45754567 44481236
8679 44481236 42618559 40600000 38576411 36563356 34688725 32702561 30866192 29299171
8671 29299171 27912048 26618033 25463942 24362957 23566073 22781521 21839115 21177962 20611437
8662 20611437 19990943 19395679 19074903 18765246 18507124 18050263 17676388 17366160 17170421
8653 17170421 17074414 16890585 16627886 16448329 16347250 16218298 16214815 16195808 16182759 16116913
8643 16116913 16072736 16063261 16033709 16218599 16281658 16429511 16458554 16507693 16624159 16715470 16861622
8632 16861622 16878516 16933112 16978770 17168250 17372095 17512588 17494827 17714308 17964169 18264631
8622 18264631 18553216 18886274 19360300 19714780 20098415 20600015 21173388 21762806 22666987
8613 22666987 23747295 24928376 26176307 27436671 28602072 29576298 30327071 30506010 30398145
8604 30398145 30137203 30009194 30070814 30482930 31055763 31617237 31953124 32218960 32100413 31782955
8594 31782955 31204019 30522016 29765831 29213155 28835582 28363540 28030976 27759818 27410252
8585 27410252 27133863 26691641 26327718 26521392 26528777 26604018 26903569 27246602 27784630 28454298
8575 28454298 29178006 30049265 31212474 32626397 34220060 36059778 37965950 39837374
8567 39837374 41485990 42563727 43172606 43305440 43076457 42829671 42688776 42814613 43281226
8558 43281226 43796314 44302144 44554182 44159002 43463823 42348876 40751817 39189255 37570913
8549 37570913 36029877 34678078 33570198 32559622 31343940 30221054 29030455 27854868
8541 27854868 26892282 26100379 25398403 24787836 24454708 24212582 24048133 24059157 23972989 24034797
8531 24034797 24233566 24640912 25283965 25912048 26605815 27219410 27626428 27933407 27776214
8522 27776214 27318652 26889236 26673236 26606274 26762163 27031791 27207755 27244205 26983353 26374719
8512 26374719 25590024 24672582 23632771 22582980 21678243 20952807 20226396 19426269 18746089
8503 18746089 18099819 17343374 16461021 15717453 15062688 14535481 14077313 13542521 13066015
8494 13066015 12702507 12410227 12022464 11712365 11400874 11245800 10914468 10647881 10521269
8485 10521269 10457851 10296699 10084174 9984812 9699624 9529818 9617173 9438251 9347772 9288112
8475 9288112 9127542 8978224 8760199 8711530 8499265 8463899 8435456 8237449 8120238 8119843 8007515
8464 8007515 7852052 7751064 7590564 7550923 7553338 7622400 7526857 7551077 7617857 7665770 7784730
8453 7784730 7834087 7878468 7740566 7519398 7179805 6975634 6850439 6694082 6494257 6436584
8443 6436584 6395354 6177514 5951816 5855828 5973938 5878290 5748745 5734428 5808767 5901762 5841745
8432 5841745 5847888 5879486 6021734 6253858 6373843 6363391 6406314 6383189 6117735 5911418 5754623
8421 5754623 5585326 5480712 5322274 5411909 5349313 5207839 5193511 5218742 5022054 4748745
8411 4748745 4614700 4533769 4379680 4298649 4281264 4136296 4174773 4088416 4060014 4019741 4075082
8400 4075082 3920246 3997213 4126820 4239680 4328474 4451788 4592070 4705740 4877073 4899199
8390 4899199 4844668 4678119 4487248 4204720 4035965 3837928 3814949 3659941 3491091 3554434
8380 3554434 3624276 3587515 3551934 3590142 3666492 3637324 3750819 3727259 3818765 4002795 4122287
8369 4122287 4255066 4544550 4766330 4855975 4921408 4918514 4836330 4605134 4534825 4277061 3953657
8358 3953657 3824171 3910231 3773561 3572578 3389752 3316464 3183254 3076647 3057783 2936688
8348 2936688 2893760 2812393 2817288 2839738 2764261 2733402 2757514 2747903 2770313 2821512 2834373 2849010
8336 2849010 2879248 2970378 2944000 2899308 2984899 3093938 2985873 2938530 2912130 2871724 2791723
8325 2791723 2674363 2557432 2350153 2274486 2204794 2144358 2132275 2061771 2017129 1995079 1960864
8314 1960864 1790250 1717860 1632562 1534023 1611944 1640154 1580401 1564171 1602158 1546384 1558697
8303 1558697 1562424 1602018 1481332 1409022 1484623 1522019 1399069 1387651 1355330 1422056 1505603
8292 1505603 1451687 1410751 1295549 1429836 1483946 1416929 1491962 1547770 1641449 1458649 1329135
8281 1329135 1332621 1329279 1359348 1340322 1224401 1111140 1114853 1093577 1003919 1098683 917934
8270 917934 844112 936571 887283 843041 770797 754146 752246 829241 863046 867218 741956 773556
8258 773556 803774 838296 887696 816601 794107 802032 769985 754409 629340 766851 656493
8247 656493 688437 638696 751705 743637 797263 807085 746410 679736 638749 687375 573761 705004
8235 705004 752440 674876 689265 604950 574209 647044 585668 517466 537499 546836 611989 649826
8223 649826 511945 614692 620706 663733 593402 553566 549502 552060 499470 572811 546749 491894
8211 491894 548795 496762 473783 401673 299696 458388 448709 571780 614443 671457 488330
8200 488330 503227 485407 289033 151457 248480 161449 227965 -478120 -578104 770157 735034
8189 735034 717074 688714 641960 455264 620102 684373 594902 608605 459767 421024 515893
8178 515893 376132 394509 346240 382781 532194 404335 392305 357618 398372 369725 363628
8167 363628 319244 337374 301804 423018 429899 290920 359865 255138 295965 425123 473306
8156 473306 474804 473878 551176 533274 535931 625942 452457 387920 436839 350022 454259 488997
8144 488997 543430 438183 500535 572349 559156 466936 272783 242682 180516 262247 341791
8133 341791 229632 178233 133626 176803 130861 57848 131267 175683 104696 108166 42431 77466
8121 77466 61923 40279 73711 149396 242371 178559 193310 262136 207740 77691 171998 194510
8109 194510 35951 51614 126832 170100 181594 -23263 -8631 125404 142522 203888 209551
8098 209551 179389 177850 75439 80966 35994 103825 35970 -126218 -9923 105882 117745
8087 117745 123928 102441 -52802 -70924 58991 16943 -21950 25157 3702 10007 -15227 53273
8075 53273 56273 272980 332080 214440 116957 734 59033 119043 114618 152545 100337 -117113
8063 -117113 -181286 -53706 16566 66539 3782 3167 40600 30818 35213 -41020 29948 118316
8051 118316 57904 13626 19881 30504 65362 17222 75630 -115097 -105915 -18455 -78136 -146610
8039 -146610 -61905 9100 -19219 101596 180049 126243 76510 -9373 -112422 -198434 -156923
8028 -156923 29578 -64657 -6434 103362 77598 137337 247618 140596 -54047 20106 28537
8017 28537 -43044 -98482 -40170 -16106 60569 -28776 34233 77134 24236 12900 73708 17595
8005 17595 -42401 45100 3114 11692 -45067 -13503 181823 170205 138160 206545 163929 107091
7993 107091 169638 182468 278195 326942 273330 157070 85883 13444 85592 113959 121728 274555
7981 274555 243902 250957 288914 199726 236188 290366 203621 313230 288121 406455 429481
7970 429481 437912 418545 494344 424215 496269 620699 493443 646147 838548 823048 805483
7959 805483 823814 1038431 1297698 1514338 1573672 1703089 1962223 2145816 2189970 2220732
7949 2220732 2202473 2006569 1985686 1947835 1829980 1696225 1548286 1527387 1311624 1053580
7939 1053580 972331 1010653 962047 888323 725891 789863 815776 692563 604460 540173 648131
7928 648131 716824 775711 589125 468477 545053 593023 501464 507887 581803 542835 582194
7917 582194 539314 504556 545244 588312 638778 735361 938600 995814 1041098 1006738 950736
7906 950736 916593 965990 1083637 1017822 951145 779392 797919 770059 614566 692754 681868
7895 681868 684137 575809 595227 373687 255891 339188 289692 250768 306979 369909 266025
7884 266025 204314 169597 242785 216878 122240 104809 259417 352002 301144 225411 161599
7873 161599 202286 239709 237349 340902 211008 63255 36212 48013 158392 164651 162157
7862 162157 134721 200851 179919 120098 174235 114469 32207 147935 171314 36487 -44839
7851 -44839 186143 125956 107071 232868 195040 267287 297977 236667 187006 170263 58599
7840 58599 85888 189106 149618 93859 97755 246215 285026 237129 156466 53980 203348
7829 203348 147831 156277 200217 239693 135873 163859 139262 149791 89255 73370 5044 -46762
7817 -46762 137633 135224 98539 70438 149810 142338 146450 19015 -38892 32384 17554 56116
7805 56116 47163 52717 113946 63541 17425 285615 403207 330953 245723 244370 317748 247463
7793 247463 210127 231358 290684 192807 260698 170466 176346 243066 273500 205495 292346 131112
7781 131112 47176 208511 258166 119774 -5996 173866 214791 139479 200746 199067 245116
7770 245116 290285 248684 232306 199129 238098 225148 216046 44399 108246 196009 199400 309343
7758 309343 213069 221809 107520 182639 271769 311829 299870 199364 159152 219671 115079
7747 115079 163248 187397 97350 172135 193154 182866 81149 118887 247440 247740 240746 218567
7735 218567 275807 312657 302964 375414 363839 268421 278253 389179 250942 303006 344727 366868
7723 366868 275965 286271 284052 269416 148744 239660 329020 257186 226334 320837 264661 294368
7711 294368 252948 371387 370881 263587 258623 209396 178955 353358 341609 261986 396923
7700 396923 421947 402111 312582 355869 317958 210405 234811 362184 427645 519681 504157
7689 504157 524375 422682 433901 546299 544198 575609 543162 573398 479742 583252 628773
7678 628773 626677 683149 614177 498257 515562 522991 519783 694103 766526 747926 822292 841873
7666 841873 782644 755841 793902 968523 1036149 1062395 1091557 1040769 981001 1072011 1021228
7655 1021228 1046870 1026987 1144292 1088257 977023 980185 1101357 1103095 1015275 984509 946375
7644 946375 1057199 1135522 1106808 1050576 1164237 1110401 1263593 1266111 1348574 1401108 1331752
7633 1331752 1223537 1070554 1145055 1200816 1133201 1121817 1147587 1122316 1118764 1170115 1183718
7622 1183718 1131056 1083593 1099810 1047848 1000853 1050240 1021107 869881 736364 742257 888616
7611 888616 887354 843635 772947 709591 865877 758402 815763 755938 765567 752362 794786 826950
7599 826950 839675 811500 663995 630852 899912 976595 987821 937365 820239 786034 638676
7588 638676 659647 867778 897941 968094 981807 944562 947907 926872 946282 994666 932345 832509
7576 832509 821101 832499 844307 894520 913842 793669 826347 819140 951404 951751 911270 762043
7564 762043 893816 1086572 1004866 1033579 1151054 1182223 1125106 1169776 1109264 1142145 1166247
7553 1166247 1221757 1191816 1247507 1316278 1153719 1146516 1264317 1069500 931295 943175 1047148
7542 1047148 951560 991067 1090793 954892 900448 812725 836764 875064 732401 712074 744196
7531 744196 691619 688319 581325 564554 599314 527259 459355 531082 596500 662354 730790 702780
7519 702780 577935 733261 762493 628021 745985 661311 550447 531441 591006 601334 494829
7508 494829 596541 682211 706534 706214 682047 719144 713824 794273 879881 815640 874035 818788
7496 818788 940337 966839 974027 970431 1057514 1152801 1234422 1183472 1219172 1209060 1262829 1279328
7484 1279328 1198681 1198582 1052120 1147384 1207717 1218822 1240706 1225638 1240567 1273080 1225286 1255429
7472 1255429 1340479 1401349 1430394 1550230 1530799 1429800 1581690 1723336 1842651 1923310
7462 1923310 2002760 2080540 2108529 2143214 2288583 2295413 2278103 2191157 2048997 2008740 1996382
7451 1996382 1842109 1899401 1805283 1796259 1886244 1850906 1804384 1785888 1900007 1970158 1998316
7440 1998316 2015865 2103856 2201634 2402034 2469078 2646420 2707573 2806716 2887650 2884324 2894499
7429 2894499 2896997 2876466 2798069 2699315 2563360 2582324 2545566 2713397 2704081 2475594 2433057
7418 2433057 2449005 2297888 2156093 2118390 2026677 2097596 2007703 2084711 2146327 2081420 2095491
7407 2095491 2188009 2302557 2396611 2372899 2195418 2186827 2074405 1978942 2018272 2196897 2261728
7396 2261728 2237567 2286795 2322480 2413562 2414419 2241640 2240999 2136908 2158361 2276004 2223464 2280581
7384 2280581 2133393 2221433 2325685 2269004 2133306 2220807 2307313 2224800 2217359 2173090 2196857
7373 2196857 2208118 2141996 2034296 1990484 1989919 1991148 1942299 1806101 1897801 1985374 2056393 2014520
7361 2014520 1903719 1826304 1855322 1856569 1889441 1898906 2007537 1914586 1946587 2020065 2017428 1979909
7349 1979909 1917388 1938172 2150394 2154410 2169082 2132506 2203945 2135558 2017183 2017736 2079116 2006313
7337 2006313 1783336 1693400 1782595 1744629 1630412 1728941 1616453 1668092 1687572 1642177 1731587
7326 1731587 1714269 1650043 1592346 1483903 1537706 1619589 1519695 1362022 1435236 1519394 1617523
7315 1617523 1604332 1689428 1781801 1744396 1689443 1681179 1769434 1687402 1644499 1744684 1731353
7304 1731353 1735786 1595216 1772686 1640372 1521468 1483051 1547326 1539856 1637926 1624407 1468727
7293 1468727 1427032 1301827 1240899 1200471 1302824 1219770 1177881 1110577 1039178 1213263 1171121
7282 1171121 1111524 1067249 999808 1088176 1073518 1053381 1101959 1029118 1036937 1065462 1088947 1159356
7270 1159356 1028495 910016 973480 1003059 920982 854868 987418 932557 937518 1031064 879750
7259 879750 1013223 947338 833776 899813 893569 853981 809698 845007 708199 806428 903498
7248 903498 923729 819489 838017 967102 898972 954786 975320 916861 916272 1021711 973272
7237 973272 1016771 994366 1052456 1067436 997598 1064510 997531 974083 965121 1040015 1086308 1119750
7225 1119750 966400 785671 961512 974038 962549 1148209 1116223 1196358 1234729 1246202 1286309
7214 1286309 1302379 1324665 1307994 1151116 1223770 1270435 1293192 1204224 1119805 1323625 1227331
7203 1227331 1107545 1168591 1218874 1210542 1143247 1090831 1160661 1206859 1125430 1136103 1150361
7192 1150361 1149376 1162234 1162480 1219062 1196117 1358878 1336833 1289560 1212941 1319670 1393272 1361895
7180 1361895 1218281 1192030 1152362 1077289 1137516 1188603 1042242 1175690 1206287 1122351 1203222
7169 1203222 1169609 1321669 1402991 1376146 1268087 1255066 1355435 1371737 1363414 1304846 1319073
7158 1319073 1321676 1295940 1395924 1400055 1333391 1273613 1312202 1300973 1263481 1122325 1040568 1129808
7146 1129808 1248240 1128723 1004263 1066409 1092337 1049718 938137 868259 887906 877228 1020541
7135 1020541 1107571 1206697 1312574 1323736 1334730 1314001 1236493 1173723 1215525 1249896 1321730
7124 1321730 1249249 1300468 1316088 1384562 1388752 1446646 1455721 1519429 1473048 1446962 1395512 1437656
7112 1437656 1499198 1545620 1533855 1513452 1552615 1611717 1681001 1627971 1678351 1602854 1512931
7101 1512931 1627075 1726729 1806879 1782667 1826551 1949862 2204336 2221335 2319354 2336721 2218410
7090 2218410 2256564 2274717 2287424 2212743 2177570 2110109 2102686 2176295 2159032 2080065 1918858
7079 1918858 1797868 1838314 1754365 1789688 1827624 1888982 1737207 1672779 1722149 1598694 1494437
7068 1494437 1562473 1481966 1482466 1353907 1369716 1259790 1173586 1347975 1309538 1278095 1272297
7057 1272297 1200872 1106604 1143316 1348199 1378287 1349738 1238495 1274816 1320311 1332450 1264686
7046 1264686 1160653 1134371 1251168 1296386 1231557 1291248 1280511 1333059 1339794 1293596 1360568
7035 1360568 1386272 1329301 1284262 1423797 1413788 1364711 1545412 1660992 1631556 1584072 1661944
7024 1661944 1590763 1568061 1615445 1494456 1526472 1379180 1315841 1476303 1488820 1357821 1313614
7013 1313614 1219281 1230668 1296131 1266576 1293051 1292659 1305323 1219509 1273285 1331968 1346590 1416428
7001 1416428 1430244 1395610 1384599 1460271 1399157 1422503 1358284 1408790 1486346 1518850 1621926
6990 1621926 1796224 1860878 1829724 1866442 2115078 2202447 2178140 2347074 2534439 2871906
6980 2871906 3017794 3209601 3374642 3473159 3455566 3167126 2989300 3084438 3109131 3094384
6970 3094384 3067547 3203225 3302941 3392455 3368569 3329573 3102540 2849415 2804213 2583870 2341092
6959 2341092 2244932 2274226 2132622 2007235 1856431 1744215 1781795 1604161 1540949 1440862
6949 1440862 1439333 1374392 1408261 1476135 1431622 1416187 1419527 1380355 1372647 1319263 1314016 1386886
6937 1386886 1395461 1312354 1353804 1291680 1235432 1337743 1476118 1489693 1538236 1593143 1630238
6926 1630238 1747411 1816246 1972263 2114364 2291044 2320900 2543694 2902821 2878288 3032470
6916 3032470 3172266 3164287 3100752 2830778 2764317 2802033 2826022 2903892 2921729 3007545 3219150
6905 3219150 3302720 3090620 2967903 2761300 2555152 2302426 1960858 1852773 1641096 1520315
6895 1520315 1560942 1559804 1451844 1390492 1333120 1256890 1265845 1277805 1285222 1194857 1210413 1285446
6883 1285446 1220192 1162419 1091768 1085647 1112838 1092325 1126178 1008543 1015837 1012547 1076021 1106034
6871 1106034 1017339 1002965 953455 872157 799951 776769 728942 736617 833600 870045 812723 802315
6859 802315 869951 1034096 987313 954981 881167 817739 739634 774103 756694 912857 962912
6848 962912 868048 870085 970876 872586 865168 778728 766377 818893 822878 966079 894776 823573
6836 823573 905251 907200 971172 1091836 990619 948755 1003451 975661 863990 813660 898808
6825 898808 1009896 1076096 998870 819565 954387 977522 1111445 1060852 949543 939815 850209
6814 850209 919961 904328 907825 882449 956352 1007965 917432 851966 901957 953845 1021569 962324
6802 962324 944789 990300 975064 1016159 920664 1021678 976224 970175 950763 927911 1044177
6791 1044177 1021400 1127532 1171630 1129533 1250471 1404782 1441218 1556947 1541912 1530023 1517426
6780 1517426 1524968 1453199 1538230 1485973 1256503 1153168 1204602 1159091 1100540 1126368 1152669
6769 1152669 1006715 1082054 1132196 982511 962910 1032462 1039185 1112171 1094065 1196051 1227178
6758 1227178 1268846 1351775 1276649 1190047 1148557 1100108 1175546 1320692 1282484 1399984 1369546
6747 1369546 1427975 1414195 1520456 1564178 1623147 1820056 1861090 1983374 2137705 2115013 2156717
6736 2156717 2178682 2177679 2206289 2218097 2257141 2436340 2477617 2620917 2917262 3212075 3323509
6725 3323509 3446897 3543921 3736976 3776191 3754624 3505207 3361499 3309006 3391064 3515341
6715 3515341 3699256 3767264 3889883 4006074 3948870 3819274 3634118 3573930 3329730 3343688
6705 3343688 3378238 3402251 3258301 3286660 3460519 3597935 3710338 3898750 3983718 4096669
6695 4096669 3864087 3792064 3511060 3214621 3397785 3365463 3504235 3660376 3652983 3589764
6685 3589764 3679241 3461986 3299985 3151546 2950340 2712125 2525046 2402358 2362813 2178645
6675 2178645 2107201 2019044 1840517 1757753 1763565 1630615 1616992 1670323 1683739 1551686 1472896
6664 1472896 1476833 1455360 1568344 1478300 1537166 1409983 1519263 1444943 1485433 1481463 1486639
6653 1486639 1491833 1420539 1418036 1467556 1403647 1333050 1377898 1443918 1565093 1509032 1458736 1353058
6641 1353058 1446838 1297554 1292162 1418749 1473809 1407988 1379725 1360242 1296474 1242526 1330491
6630 1330491 1370427 1335490 1360020 1350966 1376097 1368454 1434984 1440755 1505697 1462539 1435911 1453005
6618 1453005 1582135 1445438 1389428 1361898 1391371 1527247 1375871 1313893 1265158 1416021
6608 1416021 1393631 1464276 1528332 1474671 1549385 1512079 1503398 1501540 1450598 1509110 1515518 1463986
6596 1463986 1526340 1539720 1651247 1772497 1728034 1795821 1878636 1903444 2003315 1915003 1983924
6585 1983924 1889123 1914765 2096550 2209022 2213627 2286244 2300932 2303622 2379361 2495583 2646912
6574 2646912 2690476 2614184 2663215 2861110 2889205 2811277 2866284 3025558 3145586 3396599 3642761
6563 3642761 3676260 3616902 3752462 3997951 4074450 4299420 4625871 4793417 4920914 5259063
6553 5259063 5608353 5854356 6298669 6790815 7330248 8037185 8515205 8898700 9244105 9542466
6543 9542466 9733200 9730317 9696336 9526172 9182511 8859481 8563771 8279416 8140479 7927797
6533 7927797 7914890 7978179 8035784 8119496 8112134 8191636 8231882 8295289 8158634 8135559 7932078
6522 7932078 7797611 7712768 7593480 7548924 7530322 7370640 7144030 6851062 6556287 6457072
6512 6457072 6292348 6172398 6059389 6048788 5880549 5863951 5810651 5925088 5982977 6042539
6502 6042539 6179856 6194776 6078037 6095618 6104991 5952262 5713570 5418713 5158316 5045855
6492 5045855 4996312 4870749 4624997 4515701 4500271 4370058 4370831 4293336 4206423 4265787 4304820
6481 4304820 4329067 4383793 4428892 4466782 4524487 4491468 4568422 4681710 4627638 4624301 4541903
6470 4541903 4355084 4488771 4450529 4209096 3975445 3903504 3780215 3742752 3650332 3594232
6460 3594232 3621295 3492767 3325582 3224993 3128108 3160915 3059304 2924071 2895544 2798263
6450 2798263 2743486 2665160 2695366 2684576 2607808 2622351 2608459 2557692 2529992 2406531 2358631
6439 2358631 2478330 2502966 2396466 2302464 2464189 2356379 2250144 2410804 2311920 2221307
6429 2221307 2163010 2157670 2125801 2187887 2303519 2223320 2149541 2240531 2150388 2139219 2253632
6418 2253632 2186859 2120225 2129186 2070503 2130039 2060701 1969278 2057754 2142466 2012700 2001284
6407 2001284 2070509 2058813 2044227 1944388 2017009 1975644 1930650 1906313 2010208 1927566 1964383
6396 1964383 2074338 2090032 2226645 2107530 2083537 2044454 2042232 2016191 2158001 2260204 2198547
6385 2198547 2227676 2167451 2141482 2195510 2075942 2117162 2239245 2254152 2130800 2105151 2166780
6374 2166780 2276016 2253454 2209899 2176682 2198986 2216610 2230431 2214141 2166728 2169597 2043061
6363 2043061 1994696 2112092 2169169 2229360 2159067 2046287 2280149 2241910 2225024 2386613 2334641
6352 2334641 2221026 2133964 2150236 2212683 2302999 2305015 2321847 2346451 2361612 2349930 2343041 2390029
6340 2390029 2268791 2245026 2212037 2145264 2186398 2250847 2273923 2306780 2244556 2263366 2416678
6329 2416678 2350059 2325077 2343703 2320507 2269972 2426032 2498622 2454281 2386843 2460911 2588110
6318 2588110 2552879 2519721 2591610 2693974 2601920 2517160 2538227 2583302 2599936 2471750 2621725
6307 2621725 2583383 2505749 2610656 2684098 2552160 2589777 2568152 2488591 2565727 2535259 2624599
6296 2624599 2697401 2728356 2667063 2681321 2848041 2924527 2840207 2871538 2829371 2931249 2966354
6285 2966354 2994191 2999163 2942676 2792642 2944616 3026286 3073295 3159291 3202414 3160224 3039331
6274 3039331 3104203 3216639 3251725 3361210 3352418 3351226 3506015 3612523 3743022 3772091 3856171
6263 3856171 4021347 4033920 3976576 3993625 3980189 4069289 4008288 4008573 3997137 4100160 4106332 4128097
6251 4128097 4052901 3950349 4044386 4113842 4249792 4483861 4583041 4662323 4673155 4786917 4966544
6240 4966544 5085027 5247334 5262249 5405435 5540335 5724469 5837281 5945646 6070321 5973990
6230 5973990 6017257 6071157 5837899 5809357 5749508 5693150 5651614 5672910 5540947 5435394 5385701
6219 5385701 5460348 5364688 5470149 5393040 5363498 5342859 5407035 5443285 5525415 5704012 5719727
6208 5719727 5811819 5959915 6053850 6171244 6383202 6511449 6717840 6977908 7013486 7062929
6198 7062929 7189319 7257190 7334894 7479303 7634946 7884885 8156839 8330664 8523436 8694152
6188 8694152 8916935 9166724 9242389 9339581 9484244 9508485 9424535 9427002 9559472 9520582 9474077
6177 9474077 9513217 9648396 9723919 9709944 9775775 9848937 9687548 9820811 9872767 9988970 10045013
6166 10045013 10308720 10386199 10285305 10405132 10471008 10525500 10653264 10708994 10725407 10839815
6156 10839815 10833637 10754402 11007032 11067144 10991579 11139058 11162204 11345018 11534341 11448115 11390043
6145 11390043 11488491 11453456 11372487 11365490 11101375 10935888 10872336 10692531 10570865 10445093
6135 10445093 10437601 10449984 10455533 10506718 10589507 10700951 10703851 10815355 10941764 11085250 11214067
6124 11214067 11381629 11446008 11577103 11753923 12081213 12153104 12497756 12872455 13318427 13740896
6114 13740896 14060708 14739062 15279387 15776149 16177297 16562950 16953290 17132807 17236084
6105 17236084 17218179 17085691 17003477 17069750 17251131 17550962 17940439 18282354 18688543 19206237
6095 19206237 20009430 20612203 21259629 22289234 23135649 24090176 25132915 26425666 27770761
6086 27770761 29360945 31141404 32820722 34488766 36013986 37552442 38798509 39921184
6078 39921184 40907407 41910497 43191290 44395904 45623542 46715410 47553904 48018398 47983118
6069 47983118 47510744 46761495 45895262 45266776 44412896 43709334 43309859 42924030 42845799 42777682
6059 42777682 42955010 43214410 43795011 44495332 45191376 45914260 46655576 47446332 48383727
6050 48383727 49237498 50421382 51949886 53954037 56179559 58892333 61800366 64749323
6042 64749323 67429359 69708860 71406826 72070466 71602019 70067598 67637186 64738803
6034 64738803 61681027 58651815 55676948 53011632 50778504 48616670 46610393 44993495
6026 44993495 43410656 41919226 40768224 39843515 39089930 38465303 37993035 37651936 37607631
6017 37607631 37747884 38183006 38855609 39555495 40538865 41776885 43088065 44019116 44975496
6008 44975496 45560926 45565534 45181341 44063469 42491496 40711330 38672735 36677153 34876516
5999 34876516 33262266 31769890 30440231 29166618 27893529 26741380 25684479 24640126
5991 24640126 23591542 22629900 21703625 20887174 20246260 19707072 19285411 18765397 18464173
5982 18464173 18040066 17604528 17392303 17130741 17068204 17005740 16857668 16984865 17059255 17197986
5972 17197986 17503530 17865422 18302733 18680462 19264495 19622729 19872077 20070216 20052780 19785532
5962 19785532 19470704 19085740 18739440 18275192 17790425 17487910 17001149 16384738 16019184
5953 16019184 15553139 15469393 15356884 15150571 14881789 14965441 14979882 14911403 15119992 15489877
5943 15489877 15969523 16209628 16551066 16849434 17098456 17342066 17149709 16796571 16376685
5934 16376685 15990935 15547965 15159264 14888491 14805284 14655725 14506432 14347486 14252884 14028565
5924 14028565 13963963 13824894 13565275 13526566 13570375 13566325 13601574 13871756 14117172 14347353
5914 14347353 14768663 15081088 15240495 15482178 15614645 15623243 15347821 14854133 14474341 14087471
5904 14087471 13702612 13517957 13375085 13084492 12836336 12703593 12411144 12253423 12145740
5895 12145740 11927559 11700030 11662915 11677405 11721722 11762696 11871318 11969865 12203843 12366986
5885 12366986 12480271 12682106 12662824 12657599 12401555 12087852 11929751 11776397 11613091 11270867
5875 11270867 11126727 10990275 10812997 10684487 10573494 10437465 10409725 10276547 10181005 10078570
5865 10078570 10000991 9970819 9774389 9629812 9500453 9453127 9383695 9207243 9217594 9255383
5855 9255383 9200505 9083950 8972473 8868895 8773578 8776625 8667976 8519288 8420940 8345355 8221735
5844 8221735 8146874 8051879 7977928 7956131 7807640 7699516 7541947 7438355 7403792 7408424 7370030
5833 7370030 7334733 7354521 7247238 7214328 7140118 6957530 6946125 6927404 6803924 6734747 6780675
5822 6780675 6743402 6682535 6644378 6677116 6497862 6290222 6344082 6280061 6293247 6201250 6002383
5811 6002383 5936160 5957290 5933678 5930719 5809978 5737481 5777199 5784368 5657066 5619152 5625776 5451324
5799 5451324 5586156 5496027 5491859 5403124 5396090 5401212 5340441 5316870 5309080 5378825 5258604 4999825
5787 4999825 5023431 5173726 5239426 5258766 5299401 5262114 5365522 5361186 5289491 5257544 5167033
5776 5167033 5167783 5120693 5155443 5288309 5282304 5239403 5316924 5314183 5509614 5437553 5303077 5389848
5764 5389848 5417800 5405157 5515086 5748037 5883857 5910177 5873691 5794817 5843191 5878791 5971974
5753 5971974 5924361 5904023 5966905 5977581 6095778 6031130 6142380 6127148 6180755 6275841 6298387
5742 6298387 6445485 6425778 6481993 6694825 6738598 6685350 6811274 6923561 6880506 6944587 7034490
5731 7034490 7160365 7256227 7139665 7292012 7328060 7437933 7541294 7600507 7647740 7672660
5721 7672660 7809244 8016210 8039184 8092879 8124346 8087478 8130061 8285208 8304755 8328893 8477118
5710 8477118 8770350 8847585 9011812 9162880 9400545 9496461 9559519 9600745 9664340 9810083
5700 9810083 9884487 9973973 10122900 10351619 10621445 10963818 11328773 11818215 12242987 12775691
5690 12775691 13364333 13879182 14378367 14806884 15042926 15166056 14979545 14778772 14691753 14595639
5680 14595639 14526215 14681460 14851126 14963912 15150723 15402313 15680650 15786259 15914251 16002904
5670 16002904 16109832 16266111 16582277 16907523 17280151 17884558 18612144 19537593 20479598
5661 20479598 21666258 23088590 24638646 26153652 27554801 28731230 29763060 30552798
5653 30552798 30703150 30054208 29168793 28160748 27361977 27041136 27096332 27161282 27220009 27340040
5643 27340040 27634681 28119564 28683527 29159184 29902373 30802822 32008667 33283589 34751352
5634 34751352 36548795 38456947 40749484 43466228 46442864 49811942 53433208 56966079
5626 56966079 60309948 63533732 66632114 69680296 72563548 75103464 77646587 80331856
5618 80331856 83305649 86985971 91665370 97025636 102737703 108819612 115284127 121741367
5610 121741367 128078758 134105984 139586926 144055108 147396792 149446062 150045781 149354692
5602 149354692 147408783 144438822 140570350 135877149 130667409 124756771 118543650 112192924
5594 112192924 106113790 100419035 95058839 89973092 85271044 80742918 76446248 72482431
5586 72482431 68696961 65259577 62398473 59802501 57181847 54708235 52486890 50548853
5578 50548853 48638941 46932246 45406492 43974020 42564267 41141064 39738487 38368464
5570 38368464 36984166 35432504 33938164 32298180 30809603 29392172 28156808 27042411
5562 27042411 25916078 24809514 23756328 22912553 22061800 21290260 20538943 19929526 19373456
5553 19373456 18685745 18180632 17861966 17425130 16960652 16548484 16228981 15808456 15410901
5544 15410901 15117842 14898683 14698449 14440366 14135918 13918535 13670135 13478059 13325989
5535 13325989 13167803 13017608 12772691 12605458 12357221 12066628 11883465 11709214 11639561 11431562
5525 11431562 11259105 11041030 10885167 10662119 10559542 10440953 10240722 10013658 9863836
5516 9863836 9764503 9606147 9500159 9257209 9072525 8933142 8908806 8725002 8679493 8691078
5506 8691078 8492435 8566440 8580012 8662791 8765401 8877919 8859540 8833845 8889860 8887084 8773815
5495 8773815 8738908 8807032 8646368 8605715 8680943 8544681 8449118 8328109 8325695 8297914 8366010
5484 8366010 8363324 8297746 8362302 8333298 8377101 8571064 8689052 8744399 8998119 9295978 9471654
5473 9471654 9751301 10113685 10342679 10484001 10643515 10611482 10443169 10272842 10217017 10027546
5463 10027546 9706614 9616120 9459446 9424350 9403384 9470717 9440594 9551527 9563469 9726571
5453 9726571 9850167 9876323 10211834 10573253 10935172 11233436 11681032 12215317 12681204 13154479
5443 13154479 13511962 13845721 14055481 14220023 14296217 14047220 13845085 13968129 14052128 14113146
5433 14113146 14289647 14487626 14734304 15127744 15523209 16078867 16761462 17453761 18310413
5424 18310413 19386752 20731004 22375398 23717057 24986139 26307370 27734208 29456979
5416 29456979 31547674 33817876 36418337 39194593 42655912 47044174 52760959 58846965
5408 58846965 65027477 71606236 78058992 83197415 86831217 89423176 89209739 84361618
5400 84361618 77194779 68985139 60314224 53888169 49788114 46726486 43494495 40393664
5392 40393664 37538839 34607812 32010763 29601335 27333563 25012598 22843763 21065395
5384 21065395 19567634 18405931 17242304 16297005 15441179 14599875 13871504 13413030 12804878
5375 12804878 12204922 11618234 11296819 10802103 10528826 10210646 9735796 9367270 9238631
5366 9238631 8878065 8525483 8424507 8195586 8033517 7844433 7794637 7731086 7636372 7424921
5356 7424921 7056500 6824525 6814617 6823585 6607306 6476272 6314595 6245643 6075907 5970132
5346 5970132 6004818 5962938 5855820 5839685 5702179 5664964 5683266 5622774 5493794 5330543 5176428
5335 5176428 5176577 5231150 5274373 5278802 5398696 5339642 5135613 5068509 5026632 5032389 5165632 4983260
5323 4983260 4919073 4943187 4979348 4984882 4988869 5117558 5168755 5183234 5165075 5330201 5362720
5312 5362720 5449774 5320822 5274433 5339007 5322951 5282949 5413256 5566639 5569247 5645910 5575244
5301 5575244 5444445 5488868 5494537 5552931 5538765 5462139 5412146 5456084 5341585 5292103 5257100
5290 5257100 5303867 5358762 5230505 5109463 5180268 5165233 5105144 5074555 5296093 5353559 5317203
5279 5317203 5335753 5334268 5430821 5521947 5375132 5289540 5357898 5267409 5259027 5278369 5338018 5234919
5267 5234919 5177689 5264319 5169585 5014094 4995620 5091959 5200899 5266738 5373815 5376535 5415239
5256 5415239 5451069 5401547 5318854 5339185 5518166 5574321 5591908 5620375 5776036 5790486 5720180
5245 5720180 5701990 5585500 5656473 5703888 5750486 5697023 5807162 5838404 5763933 5891008 5942684
5234 5942684 6029089 6185429 6310593 6123128 6121273 6275657 6460124 6647878 6778643 6801588
5224 6801588 6822160 6843481 6936990 6931504 6850630 6676489 6594740 6550696 6441674 6343529 6449751
5213 6449751 6404327 6237852 6300596 6332487 6389752 6248970 6232598 6300646 6285426 6381278 6377891
5202 6377891 6405405 6515861 6546107 6496644 6381803 6426160 6513210 6626877 6604658 6505590 6482144
5191 6482144 6461336 6410196 6503376 6693926 6718803 6775350 6851082 7010595 7079805 7202261 7248853
5180 7248853 7412380 7595259 7699401 7879199 7909590 7998134 8165211 8304269 8425254 8388590
5170 8388590 8328170 8278719 8225846 8234168 8167708 8012547 8098198 8275457 8307919 8378513 8396318
5159 8396318 8427619 8358773 8460037 8559321 8537866 8639976 8766841 8739157 8806777 8908471 8936267
5148 8936267 9080181 9276542 9287737 9424820 9614325 10077501 10250943 10515890 10907864 11325877
5138 11325877 11787785 12163188 12554769 12992627 13445536 13759351 13918790 14226470 14380323
5129 14380323 14267228 14242169 14330133 14513121 14777858 15183478 15357189 15710197 15973588 16063764
5119 16063764 16311555 16621884 16805991 17117623 17695587 18290716 18791381 19494064 20560865
5110 20560865 21621973 23027710 24755529 27259657 29956462 31955286 33666624 35475898
5102 35475898 36302541 35667634 33933777 31207142 28574169 26656270 25502774 24317288
5094 24317288 23385349 22610591 21775938 20982524 20444639 19737048 19092689 18724256 18197871
5085 18197871 17908416 17588481 17191388 16969750 16742369 16460126 16325405 16204519 15993993
5076 15993993 15835352 15914776 15856677 15827097 15914108 15984430 15943824 15800492 15763301 15623075 15642448
5065 15642448 15395374 15247019 15110631 14867548 14791122 14662310 14637976 14523928 14414129 14351700
5055 14351700 14218951 14042017 13989740 13775823 13810479 13757120 13749141 13816792 13813478 13830540 13917545
5044 13917545 14058320 14164762 14260342 14301484 14603616 14846824 14995238 15101124 15310445 15383269
5034 15383269 15525630 15782795 15910056 16030498 16251307 16409003 16672261 17003298 17191464
5025 17191464 17381265 17668038 17934843 18227902 18534224 18834107 19180050 19543531 19946718
5016 19946718 20275817 20732808 21234937 21704983 22240286 22701008 23156597 23822046 24499530
5007 24499530 25235577 26131419 27134956 28064965 29098111 30319857 31486400 32650906 33904903
4998 33904903 35207948 36314233 37319839 38091862 39014563 40183209 41524698 42845382
4990 42845382 44316744 46186531 48215869 50416197 52790060 55345190 58181296 61355105
4982 61355105 64390468 67275150 70056622 72201603 73785661 74879260 75452973 75595344
4974 75595344 75588134 75373976 75148862 75195715 75506517 75881678 76278793 76835035 77517630 78498291
4964 78498291 79587188 80811273 82226489 84107338 86237807 88639689 91595737 94862369
4956 94862369 98581066 102763467 107437835 112613852 118117678 123916448 130046142 135609643
4948 135609643 140741496 145124901 148419994 150348662 151118308 151009131 150157966 148953635
4940 148953635 147800487 147101536 146558384 146455772 146730314 147327244 148138598 149030182 149944349
4931 149944349 151033531 152207492 153524545 154938531 156200420 157561792 159117257 160687202
4923 160687202 162272056 164469560 166882493 169439261 172168141 174702353 176962116 178510427
4915 178510427 179193054 178586973 176574038 173115202 168575427 163206248 157467264 151542560
4907 151542560 145891275 140850688 136503524 133021973 130088081 127879415 126416782 125367480
4899 125367480 124497216 123443069 121732196 119262062 115990895 111822028 107244597 102508937
4891 102508937 97973104 93762872 90097774 86632292 83532086 80722134 78336081 76132442
4883 76132442 74130538 72417258 70781799 69543482 68431516 67392533 66555805 65720186
4875 65720186 64946773 64062880 63039752 61911480 60725592 59551084 58333347 57206461
4867 57206461 56169912 55199576 54266734 53490343 52883272 52332660 51901708 51419168 50673429
4858 50673429 50030629 49385342 48663130 47973216 47071204 46487778 45975356 45392161 44917097
4849 44917097 44414567 44031073 43621562 43101644 42689103 42117661 41593906 41106634 40327937
4840 40327937 39762566 39182494 38485763 37656695 36872195 36403403 35879322 35288880 34656883
4831 34656883 33980626 33300282 32721656 32222803 31533671 30938825 30358615 29981064 29539948
4822 29539948 29116164 28621507 28183389 27810874 27515813 27218718 26840875 26488117 26248620
4813 26248620 26001799 25761406 25538669 25199131 25016171 24960871 24779280 24490689 24382704 24208448
4803 24208448 23999657 23943394 23775957 23748340 23666945 23504816 23393618 23315016 23391341 23351649
4793 23351649 23310945 23235226 23135377 23306602 23237788 23235123 23410252 23508567 23473118 23467802 23496830
4782 23496830 23573057 23581971 23535070 23591275 23787028 23819893 23970807 24089643 24043720 24162024 24302878
4771 24302878 24318980 24236328 24265219 24458453 24591997 24586702 24536009 24546001 24527229 24393141 24456339
4760 24456339 24362479 24215767 24247735 24099257 23994286 24125454 24211547 24226299 24133952 24283514
4750 24283514 24334276 24374371 24455296 24526519 24576451 24524513 24489143 24684903 24629947 24649904 24730298
4739 24730298 24572810 24474583 24452279 24468956 24510484 24476766 24374706 24274045 24213347 24203491 24165301
4728 24165301 24156688 24175902 24112903 24025231 24137897 24229866 24182660 24186601 24429962 24476065 24406516
4717 24406516 24412331 24462079 24481167 24580123 24632892 24660565 24777238 24828164 24938395 25071522 25093419
4706 25093419 25303148 25543174 25697745 25710390 25741193 25943743 26178402 26509176 26603660 26830574
4696 26830574 27043059 27282310 27672307 28032325 28506141 28944994 29216790 29705802 30257027
4687 30257027 30728827 31186598 31607294 32072381 32564338 33025208 33536340 34257940 35036711
4678 35036711 35825660 36690641 37688273 38609406 39767855 41163854 42436009 43853686 45615811
4669 45615811 47318111 49337464 51650838 54159591 56934779 59880659 62941803 66126365
4661 66126365 69433621 72725912 76098087 79874937 84007848 88509646 93637576 99599936
4653 99599936 106227980 113659387 122465509 132746049 144683613 158587013 174756823 192857427
4645 192857427 211835196 230024192 245898693 257977420 264665737 264871969 258749448 247366313
4637 247366313 233549149 219307818 205200391 191433365 178676983 167112016 156611451
4630 156611451 147113401 138505486 130503940 123065191 116262530 110256136 104716264 99807170
4622 99807170 95601849 91468729 87496827 83667805 79717802 76157010 72828960 69662182
4614 69662182 66814402 64083443 61567920 59196464 57023095 55164690 53490452 51772377
4606 51772377 50015588 48449872 47041960 45522482 44089344 42810194 41651260 40628398
4598 40628398 39624001 38732155 37881232 37097650 36480195 35857919 35273161 34643457 34304539
4589 34304539 33810646 33058007 32385187 31815186 31249184 30721336 30393019 29872481 29206227
4580 29206227 28843127 28391927 27908282 27495137 26922469 26315915 25600592 25015592 24446632
4571 24446632 24023093 23642419 23232279 22862921 22580224 22402078 22217243 22151188 22024038 22061654
4561 22061654 21916210 21824949 21745381 21710889 21662180 21689889 21815785 21828523 21923444 22015408 22199080
4550 22199080 22300238 22498389 22682973 22802000 23302988 23739063 24334374 25023578 25869850
4541 25869850 26635277 27364902 27927171 28153337 28332278 28248688 27798723 27307294 26907259 26678177
4531 26678177 26400991 26051190 25966985 25871953 25682064 25728631 25640411 25709628 25717138 25913613 26145815
4520 26145815 26655803 27249215 27699839 28154280 28654345 29089658 29223821 28995524 28822526
4511 28822526 28634145 28098247 27629377 27158798 26784862 26173956 25785644 25368600 25015631
4502 25015631 24597015 24359688 23929368 23698813 23527673 23378423 23179356 23124439 23057277 22926599
4492 22926599 23025960 23143023 23181534 23176225 23238035 23428444 23557848 23549380 23674503 23773295 23914345
4481 23914345 23839879 23756304 23702232 23619891 23469867 23165444 22826613 22654932 22415302 22075694
4471 22075694 21630602 21150420 20788249 20381418 20133750 19743614 19399722 19105346 18900498
4462 18900498 18608472 18377638 18102606 17930354 17953149 17740124 17516617 17439256 17411648 17119573
4452 17119573 17048315 16981115 16813241 16905573 16927817 16894300 16908274 16879973 16841775 16745753 16704736
4441 16704736 16680627 16810981 17030312 17216696 17228237 17434915 17469325 17535322 17651796 17607805
4431 17607805 17612329 17428284 17160174 17054281 16936559 16876656 16752965 16536291 16506392 16422066
4421 16422066 16328784 16168844 16175933 16106116 16007006 15838115 15800408 15729956 15722642 15719842 15627355
4410 15627355 15565205 15660927 15666458 15714569 15601740 15469132 15368744 15299326 15315806 15284858 15239658
4399 15239658 15192074 15075087 15159641 15104750 15131440 15208338 15180826 15119608 15066868 15234945 15271986
4388 15271986 15278242 15382569 15458289 15460474 15505654 15592635 15703262 15810080 15880725 16169949 16294025
4377 16294025 16341266 16541973 16632565 16640521 16780607 16863096 16862434 16907365 16941202 16963846 17083912
4366 17083912 17339199 17427790 17774728 17907471 18122569 18229870 18484740 18727734 18920044 19045747
4356 19045747 19218881 19442470 19488509 19209903 19159769 19060869 19051834 19041446 18889562 18859625 18906958
4345 18906958 18966886 18964702 18937803 18912217 18916720 19058546 19167450 19285304 19336200 19338428 19348784
4334 19348784 19309931 19159229 19112827 19173204 19158038 19128729 19111089 19072641 19051186 19157735 18964771
4323 18964771 18932856 19073934 19027688 19044103 19015352 19140295 19147243 19088923 19077654 19111070 19157662
4312 19157662 19146561 19298358 19317801 19191100 19217571 19255431 19262507 19458614 19598289 19660531 19738703
4301 19738703 19823995 19910100 19978996 20062356 20069966 20272872 20482943 20379618 20589864 20784806
4291 20784806 20796393 20955682 20988515 21065172 21204604 21202654 21207077 21230395 21273886 21195348 21305638
4280 21305638 21371888 21459642 21463046 21673143 21673054 21658186 21778438 21808047 21856469 22015232 22158834
4269 22158834 22271446 22392976 22445399 22540397 22599568 22692459 22849063 22826748 22964863 23219849
4259 23219849 23363860 23420425 23519970 23624298 23693660 23904798 24055254 24167903 24305440 24471533
4249 24471533 24583544 24765760 24982023 25053904 25218900 25359110 25450929 25716310 25902442 26068348
4239 26068348 26178862 26451769 26602757 26897886 27277246 27494199 27723615 27918443 28171640
4230 28171640 28481139 28787549 29053025 29371906 29616805 30040173 30527042 31012156 31576499
4221 31576499 32102108 32615245 33240087 33854804 34624702 35446923 36078590 36808842 37748927
4212 37748927 38642428 39817900 40968909 42193589 43528463 44817140 46264585 47712758
4204 47712758 49148851 50682520 52513586 54399692 56155254 57942695 59887928 62007085
4196 62007085 64011473 66175463 68320679 70484151 72811597 75019277 77345096 79854965
4188 79854965 82249453 84441563 86934020 89362197 91559616 93722571 95748598 97795748
4180 97795748 99714014 101614704 103446328 105224697 106835317 108314555 109624574 110791537
4172 110791537 111993214 112874334 113482281 113825352 114123737 114113699 113927658 113438356 112728579
4163 112728579 112008030 111124931 110046430 108849832 107544465 106227727 104683009 103160925
4155 103160925 101464349 99372070 97259803 95114681 92879428 90609849 88309925 85821650
4147 85821650 83317126 81111765 78899966 76511495 74110499 71751952 69423737 67052789
4139 67052789 64538430 62175627 60017900 57976216 55785474 53832309 51904838 49921197
4131 49921197 48230437 46480509 44758532 43231882 41644450 40009563 38764223 37344636
4123 37344636 35930356 34867811 33765757 32665307 31651621 30788367 29729188 28855333
4115 28855333 28066696 27396262 26791689 26158065 25596473 24939958 24467535 24135541 23815001
4106 23815001 23489844 22974923 22472098 22207502 21955622 21600099 21272858 21083534 20805796
4097 20805796 20563600 20351618 20306987 20197205 19945446 19882418 19851016 19797256 19578417 19489406
4087 19489406 19506275 19476124 19472746 19388111 19333716 19287843 19206660 19137516 18901589 18896925 18842839
4076 18842839 18728977 18679916 18412224 18453197 18393097 18195069 17996702 17925957 17891066 17743710
4066 17743710 17666263 17515288 17303712 17261819 17192120 17125267 17079734 16940275 16874357 16774020
4056 16774020 16779786 16804020 16740030 16724314 16697051 16741556 16736741 16770905 16793282 16953525 16958896 16977538
4044 16977538 16923621 17009514 16956003 16875641 16850055 16868696 16941671 17190888 17422540 17441311 17438574
4033 17438574 17531206 17456124 17526485 17699937 17795309 17921354 17967949 17978469 17944433 18065702 18104296
4022 18104296 18244146 18340576 18345616 18322890 18320871 18329709 18481197 18547294 18451737 18402353 18403951 18684142
4010 18684142 18745722 18808136 18892583 19094803 19190252 19167835 19201859 19281382 19478055 19598808 19574821
3999 19574821 19587347 19688092 19571042 19647411 19792799 19861540 19944858 19979256 20122146 20274728
3989 20274728 20231877 20355252 20406519 20769650 20968237 21228000 21432004 21572556 21754083 21936528
3979 21936528 22148004 22217746 22356328 22442920 22360559 22431871 22490039 22531373 22439674 22457842 22478105
3968 22478105 22470540 22409696 22375373 22222680 22381584 22322313 21944530 21820532 21704801 21456707
3958 21456707 21096102 20890998 20778257 20639225 20439256 20162341 19932300 19875898 19773549 19807408
3948 19807408 19681799 19479786 19507047 19662172 19745544 19761687 19626830 19711570 19843536 19986491
3938 19986491 20150850 20169574 20315241 20577407 20582129 20726968 20955801 21211264 21370701 21542507
3928 21542507 21777196 22054826 22272118 22596926 22821660 23135902 23480238 23691258 24025868
3919 24025868 24254847 24609593 24918667 25307131 25656921 25863259 26183560 26481707 26751538
3910 26751538 27000249 27397990 27683505 27909320 28242891 28528654 28714685 29083294 29308862
3901 29308862 29677084 29921433 30212038 30562326 30941862 31429785 31702438 32102448 32421470
3892 32421470 32594283 32927212 33200202 33437131 33783842 34066513 34372244 34663607 35030206
3883 35030206 35458754 35746662 36107940 36650258 36985385 37398126 37818294 38409404 38964840
3874 38964840 39670102 40291106 40970893 41680149 42369073 43221495 44167003 45081105 46207568
3865 46207568 47344001 48582143 49674901 50820948 52075965 53455309 54661023 55770469
3857 55770469 56978129 58119181 59272437 60201154 61021595 61885123 62746554 63648355 64350065
3848 64350065 64901379 65559178 66040644 66408254 66731605 66807968 66832845 66927979 66727513 66467908
3838 66467908 66338208 66147691 65899075 65847362 65769629 65630771 65511443 65582712 65638222 65769486
3828 65769486 65935482 66250678 66728126 67437656 68171118 69200954 70321448 71672508 72948650
3819 72948650 74415773 75826889 77191086 78641765 80311543 82228422 84361332 86811877
3811 86811877 89379714 92089763 94966105 97874560 100835873 104060101 107128116 110226604
3803 110226604 113347062 116569838 119572540 122735968 126051574 129446150 132849561 136311896
3795 136311896 139545340 142523438 145212017 147435997 149305464 150647721 151649391 152334552
3787 152334552 152715934 152939032 152946952 152936879 153076894 153304576 153560842 153823192 154314468 155045017
3777 155045017 155818361 156609571 157699373 159046865 160307494 161702871 163262791 164841303
3769 164841303 166617864 168469744 170645554 173039324 175630026 178418728 181528810 185068892
3761 185068892 188675996 192579645 196664594 201298779 206054074 210993136 216349608 222109700
3753 222109700 228287722 234740580 241772792 249275542 257226673 265884324 274835429 283928090
3745 283928090 293225769 302249549 310456105 317505748 323403597 327695150 330289804 331265609
3737 331265609 330847611 329458085 327191139 324401026 321484445 318220729 314677851 310707000
3729 310707000 306015373 300403391 293571472 285433075 275930615 265313339 253962670 241771517
3721 241771517 229208814 216618986 204560110 193052115 182309577 172455332 163311330
3714 163311330 155001754 147477243 140579335 134098974 128242887 123046765 118364444 114092028
3706 114092028 110118225 106442766 103257292 100263884 97471544 94889916 92351528 89899639
3698 89899639 87624756 85356044 83211233 80927035 78823046 76607624 74417788 72318019
3690 72318019 70112595 68112799 66139402 64297589 62426205 60638224 58908589 57096591
3682 57096591 55409863 53774957 52102151 50518134 48869051 47394384 46092398 44862192
3674 44862192 43623944 42292082 41060913 39968814 38858620 37822428 36910520 36055501
3666 36055501 35165949 34270024 33457224 32650838 31879950 30950812 30097053 29430539 28795980
3657 28795980 28071051 27511723 26874749 26338697 25777335 25167262 24586530 24099660 23736057
3648 23736057 23143405 22599951 22035525 21575727 21096700 20814738 20445568 20085780 19675856
3639 19675856 19374679 18984550 18677380 18477828 18261619 17953249 17701651 17537888 17243242
3630 17243242 17065332 16926435 16676182 16504313 16314654 16157049 15928909 15668430 15588534 15379915
3620 15379915 15207531 15150271 15124252 15008090 14827832 14752717 14744862 14546676 14464683 14405101 14409742
3609 14409742 14257896 14351587 14293133 14245361 14112430 13938232 13851913 13774425 13742395 13637031
3599 13637031 13664559 13503775 13349244 13353852 13195322 13013901 13048178 13010779 13086942 13096438 12966138
3588 12966138 12976099 13038468 13045642 12948803 12918799 13079166 13082641 13058904 13043591 12995575 12956690 12987893
3576 12987893 13092269 13107704 13068059 13070075 13085962 13131812 13105935 13087413 13139786 13091001 13097339
3565 13097339 13153344 13180944 13140402 13180157 13129484 13056270 13044897 13068555 12995133 13010986 13126422
3554 13126422 13080232 13092735 13201623 13240065 13263762 13178296 13051751 13185795 13262864 13303198 13416072
3543 13416072 13487215 13497924 13711073 13754432 13878592 13935078 14077025 14180861 14125446 14195635
3533 14195635 14305322 14498407 14584850 14604799 14698801 14906638 14989976 15120418 15186899 15279231
3523 15279231 15568216 15793083 15838543 15963492 16182024 16363118 16551408 16773902 17040984 17164225
3513 17164225 17256744 17470696 17789650 17975110 18264230 18572727 18924486 19186101 19620960 20081959
3503 20081959 20412815 20841123 21337621 21768420 22222774 22874743 23416382 23868691 24258872
3494 24258872 24740626 25259642 25871674 26414171 27156397 27730369 28465101 29224867 30040603
3485 30040603 31052557 32039934 33145144 34197050 35414613 36775559 38254406 39826976
3477 39826976 41516990 43264645 45011896 46644986 48179447 49740537 50820601 51670745
3469 51670745 52322058 52625300 52638985 52229270 51929053 51358652 50783680 50106803 49398152 48991242
3459 48991242 48552027 48124406 47918265 47752441 47770289 47798400 47706090 47803030 48001924 48412302
3449 48412302 49006881 50056856 51282862 52574852 53559673 54292811 54819430 54901921 53882894
3440 53882894 52364360 50566851 48733451 47354456 46437020 45818458 45308655 44876918 44646292
3431 44646292 44709164 44957514 45380774 45816881 46349126 46754122 47275430 47850799 48411520 49440701
3421 49440701 50773108 52543897 54813067 57432606 60630135 64650479 69458020 74606795
3413 74606795 80096660 86519414 93740982 99131895 101648789 102884486 102986175 100140348
3405 100140348 95293746 89367622 82423766 76408433 72599845 69791741 67367529 64963377
3397 64963377 62525941 60029723 57740756 55946816 54486689 53424234 52797438 52646618
3389 52646618 53037895 54064432 55615443 58283272 62111092 67394002 73482706 78788931
3381 78788931 83109584 87374103 90472163 89491320 84939358 78339042 70731275 64220698
3373 64220698 59717334 56274058 53118434 50141903 47251272 44158429 41192233 38508128
3365 38508128 35966084 33432279 31312344 29590823 28002250 26697245 25333132 24214006
3357 24214006 23256635 22421125 21622316 20912974 20196336 19688743 19202749 18832031 18438966
3348 18438966 18012379 17625576 17307195 17028272 16627949 16278560 15926145 15522001 15296751
3339 15296751 15067884 14774851 14600021 14358825 14248657 14125275 14029946 13846449 13690924 13752901
3329 13752901 13591278 13616458 13663202 13656302 13772275 13946618 14078010 14197539 14414985 14681022
3319 14681022 14963545 15274542 15691427 16157769 16493914 16785355 17028144 17344825 17755602
3310 17755602 18159820 18642308 19268090 20183523 21118525 22171924 23281795 24635027 26398154
3301 26398154 28475357 31038373 34251561 38218817 42575838 46352179 49356390 51047462
3293 51047462 51474181 50033261 46491439 42613579 39551514 37233360 35463261 33620495
3285 33620495 31999308 30663047 29562255 28811552 28157773 27673917 27390776 27489092 27736665
3276 27736665 28206440 29091951 30435885 32092475 34264547 37190551 40775338 44498988
3268 44498988 47732516 49901493 50619183 50052629 47445098 43157245 38980564 35613584
3260 35613584 32923875 30405822 28304856 26510025 24765726 23253209 21956299 20767241
3252 20767241 19594946 18626460 17837941 17082903 16703823 16279787 15932626 15638727 15442041
3243 15442041 15427858 15498680 15609357 15659081 15811263 15886698 15820029 15512921 15136914 14672063
3233 14672063 14221115 13602852 13006816 12692044 12265329 11828438 11321486 11029250 10936448 10746176
3223 10746176 10675223 10601984 10529015 10508535 10474246 10431118 10358122 10596247 10736895 10983122 11377188
3212 11377188 11735335 12037262 12177672 12166861 12019523 11786418 11522572 10985951 10513026 10174003
3202 10174003 9970517 9836224 9542580 9344851 9207509 9021826 8848933 8688468 8526804
3193 8526804 8262294 8294505 8309422 8131556 8034178 7999143 7899658 7797001 7796481 7749214 7713971
3182 7713971 7634711 7625185 7531324 7759902 7785636 7859034 7883621 7974276 7973033 7999439 8104210
3171 8104210 8262310 8471158 8547237 8598460 8839211 8987092 9061665 9132340 9262878 9396664
3161 9396664 9573837 9721142 9906535 10092900 10038925 10247854 10415063 10509578 10691652 10830016
3151 10830016 10979429 11056769 11195460 11378378 11421769 11467360 11582483 11645011 11818909 12065017
3141 12065017 12244648 12426579 12692165 13125876 13649285 13957163 14394727 14825261 15242386
3132 15242386 15715538 16186097 16604746 16999580 17541640 17777650 17909887 17911864 17900654 17731564
3122 17731564 17482719 17100881 16800200 16590834 16498784 16521506 16537978 16323213 16327979 16461588
3112 16461588 16446636 16647006 16876013 16979510 17164416 17360406 17611684 17819718 18064591 18328753
3102 18328753 18420541 18629355 18439725 18329121 18298101 17992099 17747299 17570509 17192020 16739066
3092 16739066 16363367 15898983 15470532 14935001 14637818 14441241 14188482 13930402 13809615
3083 13809615 13796841 13625387 13515590 13406249 13263022 13081930 12983110 12845774 12494339 12240093
3073 12240093 12070073 11831368 11435996 10855543 10397731 10136900 9717459 9407285 8967472
3064 8967472 8632869 8475189 8125115 7954373 7604584 7221290 7109179 6881616 6675358 6457593
3054 6457593 6288074 6016448 5873866 5782357 5583360 5440996 5417088 5241281 5080159 4869734
3044 4869734 4769190 4788099 4619815 4412109 4300785 4080240 4017581 4063279 3926401 3829130
3034 3829130 3588845 3437281 3365503 3417069 3363188 3269366 3219683 3093000 2937677 2857781 2847495
3023 2847495 2811847 2765727 2668100 2480709 2477617 2581177 2481042 2516373 2635689 2541984 2465164
3012 2465164 2511029 2518313 2546313 2435576 2310698 2274134 2213160 2270700 2176296 2206408 2061943
3001 2061943 1988318 1945621 1938360 1944318 1850035 1929438 2033916 1752649 1583247 1654356 1649856
2990 1649856 1534734 1488478 1511853 1520094 1503417 1600704 1578507 1597064 1506709 1514127 1456209 1479590
2978 1479590 1529847 1434709 1323713 1308025 1326422 1322388 1421038 1196106 1119840 1018239 918420
2967 918420 909107 917734 868683 808580 795110 860516 910217 919865 911869 916373 845379 877592 842873
2954 842873 790955 723674 739536 751074 688648 726039 677214 687313 532782 588147 675725
2943 675725 667268 602568 595818 569816 493458 557262 533440 509967 573143 780510 777541 777145
2931 777145 623761 546245 518303 543340 574863 520466 484963 561961 547317 510805 543469
2920 543469 442109 406261 386610 418102 540770 619197 648356 513516 440079 406997 273716
2909 273716 351484 389475 383902 321146 316216 340761 366308 379858 255207 271876 449804 413526
2897 413526 333509 369792 392007 276568 274644 396235 208048 387380 407834 358351 288453
2886 288453 196849 184210 173415 248013 250402 322387 302463 368952 377506 385911 342104 254207
2874 254207 190338 247461 259437 298161 378800 223733 182572 275014 190810 145703 211560
2863 211560 225082 255178 146577 109790 156783 133728 95127 191651 275587 303045 258283
2852 258283 305842 348175 264522 196574 88281 89671 65714 169193 274839 148306 96999
2841 96999 203398 338058 275594 278377 318383 159398 210860 203102 92451 54299 70414
2830 70414 84842 247591 212679 212032 250404 136979 33647 45711 169847 135961 252874
2819 252874 52470 -99041 27844 104586 104889 -37835 -16526 135566 174252 103535 119017
2808 119017 84633 132415 235214 211839 122998 131124 134682 2669 -89662 -99566 -99052 -56585
2796 -56585 -72984 -60842 -8520 -68499 23286 5306 -48406 -33207 -61642 -29790 145409 143405
2784 143405 83158 167891 81729 -64663 -5243 40705 -47253 -24246 -28150 -43815 4123 121139
2772 121139 28951 -58000 -40381 40656 27075 -40983 -85911 7540 -12432 -41386 69646
2761 69646 136068 65923 -23548 60107 -15280 -15893 108750 32864 -35625 -14651 85581 102895
2749 102895 110926 159333 68940 -91869 -221512 -179757 -21139 -46682 -79044 -204817 -227294
2738 -227294 -135382 -23323 -1654 -61673 -50625 -247841 -254836 -180879 -103704 20399 -62124
2727 -62124 -209130 -115122 -172311 -202276 -113319 -119460 -222735 -175535 9134 61254 -86248
2716 -86248 -77521 -69891 -79016 53574 -46294 -94746 -179748 -157961 -77641 -153993 -92796 -67936
2704 -67936 -41311 -93476 -151642 -128615 -90769 -73752 -13014 -153430 -184260 -180039 -120424 -134400
2692 -134400 -65519 -114007 -238570 -59699 -40566 -146769 -101482 -96603 -251748 -219203 -51201
2681 -51201 21849 -71048 -208385 -278685 -186165 -231104 -198564 -247204 -291667 -258688 -207102 -161402
2669 -161402 -70816 -194023 -242897 -245980 -263656 -187713 -67868 -58996 -113702 -76297 -76121 -112036
2657 -112036 -134182 -206520 -132828 19485 -52128 -103782 -175669 -281413 -261929 -249273 -309507
2646 -309507 -272556 -186411 7825 -130901 -199719 -233622 -233716 -135112 -226430 -223990 -339704 -293544
2634 -293544 -252128 -276805 -105825 -100898 -208154 -192289 -87098 -70319 -170851 -258261 -230284
2623 -230284 -238098 -331639 -293114 -297301 -225548 -235951 -315743 -191136 -47864 -95028 -117684 -120624
2611 -120624 -132439 -186127 -164005 -137860 -304549 -183973 -164641 -158918 -244761 -158508 -28073
2600 -28073 -17083 66609 106418 -12908 -214 41918 79584 65182 -62080 -69908 -32878 -59468
2588 -59468 -48009 -42370 -87624 -118259 -76616 -105551 -85391 -134353 -214100 -188912 -214139 -253006
2576 -253006 -269346 -184576 -117085 -156903 -214976 -49517 -26735 -77003 -45544 -54913 -59506 -24871
2564 -24871 -96603 -184740 -218034 -146379 -51193 -106323 -140381 -129281 -103230 -37327 -211796 -243986
2552 -243986 -199992 -151343 -27088 -77186 -265815 -253882 -145719 -66380 -137653 -172594 -44792
2541 -44792 -30197 36351 -77885 -209818 -161933 -117099 -36523 -117590 -240335 -213837 -14509
2530 -14509 3474 -27436 -111930 -157397 -158001 -205875 -78187 -126606 -131998 -91383 -75970 -110792
2518 -110792 -32787 -107704 -239708 -176873 -88486 -142952 -236136 -139633 -197324 -247302 -254263 -188150
2506 -188150 -58809 -53774 -34534 -34256 -151362 -84429 -96000 -67040 -99491 -187149 -72039 -90136
2494 -90136 -138236 -70336 -120260 -75741 -36465 -33396 -11862 25396 24544 19892 -20067 -13930 -53398
2481 -53398 -100649 28894 27815 8620 -53524 -60505 -33859 -84098 -53737 -19861 -65336 -167786
2469 -167786 -10325 58138 -47891 -34270 -25087 -59558 116071 58961 -35307 55116 50589
2458 50589 40881 -48152 -91893 -63748 -71816 42356 -18168 -54548 -47821 41000 149243 111390
2446 111390 127896 114138 -30248 33326 200231 106512 203192 264585 176149 90116 151739
2435 151739 6360 -4908 78201 128877 165804 181698 216205 258871 162956 109786 142666
2424 142666 79747 4589 111999 41458 236864 351155 307287 185261 166146 102133 101960
2413 101960 14529 123306 123000 158124 147162 51283 181991 252684 244735 390493 473074 419984
2401 419984 396310 390260 377334 397868 330640 345411 431620 388368 531157 587781 643040 656150
2389 656150 512247 458516 560839 694977 657482 692042 745890 797083 796389 735761 891581
2378 891581 922105 903556 1011712 1102554 1192690 1217111 1101413 1131773 1297995 1387272 1504847
2367 1504847 1697871 1670773 1818256 1864825 2020164 2291808 2406933 2474939 2740806 2984571
2357 2984571 3289332 3571146 3904991 4102610 4484126 5039605 5578610 5930606 6326749 6700091
2347 6700091 6861430 7269091 7879590 8531557 9108298 9791080 10657233 11625765 12659322
2338 12659322 13866747 15536776 17308357 19793759 23003739 27020479 31548451 36122528
2330 36122528 39520283 41385059 42130167 41676586 37268227 31790875 27805018 24518107
2322 24518107 21957129 19650383 17653270 15792155 14403962 13259386 12170312 11109567
2314 11109567 10278513 9454703 8764720 8079617 7439953 6770879 6373182 6100783 5648209
2305 5648209 5246830 4888710 4463982 4236587 3924471 3756077 3632202 3446119 3317007 3084730
2295 3084730 2739699 2637705 2692978 2647468 2441995 2234398 2118191 2034745 1878056 1833208
2285 1833208 1686918 1712104 1697547 1460501 1424331 1462929 1319584 1279016 1210800 1080116 1081674
2274 1081674 1211872 1081118 1161799 1118373 1076188 978913 801707 849370 903989 840463 865015
2263 865015 773294 897801 835970 605187 638240 695871 554487 443624 573872 502714 436392
2252 436392 503081 508114 522423 474510 497928 495165 369345 334110 329660 361125 410953 267399
2240 267399 259772 187250 218122 420131 382081 410978 352018 301487 109851 212387 352981
2229 352981 396310 311762 201839 220636 276354 424149 545177 451196 321624 377381 382948
2218 382948 314927 334326 294344 228419 277155 372352 283233 209434 168047 225574 243114 108792
2206 108792 105853 146966 226101 191020 207677 257794 228499 218186 187788 220686 204268 222431
2194 222431 288677 199655 266339 211105 39762 165932 268584 272927 160146 15733 -70672
2183 -70672 -11877 54394 56480 -23657 32506 -35918 12716 78278 -11157 -57532 -9699 -39213
2171 -39213 -46520 58967 105591 86346 51479 71511 146410 42358 57634 79013 -33617
2160 -33617 -56979 -20486 48408 155815 122971 29505 39018 77533 211922 220804 54353 17911
2148 17911 74494 52013 124623 11148 35713 91439 71907 21585 49974 -7062 -39419 -130264
2136 -130264 18250 146368 5450 -30557 21876 -59053 -169360 -44555 -32345 48023 57456
2125 57456 -34634 -34434 147803 49054 140173 142938 -85958 -113994 -86139 -123934 -169887 -1494
2113 -1494 29192 57135 -19669 -55226 54338 19479 124869 27584 -39016 -116653 -189937 -10241
2101 -10241 29111 -106611 -114747 -7277 17631 1834 -61168 21258 -116577 -16404 72087
2090 72087 34629 33511 -121056 7692 75195 48597 78347 36240 -33939 -192596 -135803
2079 -135803 -12064 25331 42087 -30628 -11122 169537 35265 -21427 151142 14187 -71501
2068 -71501 -118181 -6663 126465 97841 185883 165058 13664 -3785 108303 228679 213375
2057 213375 96575 185366 135819 74727 141888 111057 182263 139817 43047 -75555 -26074
2046 -26074 -13776 77629 -51494 -9508 95461 -36594 -83843 -35465 98682 36158 -69108
2035 -69108 -136809 -22375 107557 -30037 -118197 27948 33982 4929 72684 90916 -76026
2024 -76026 -144572 -127739 -141458 -123289 -105772 -116564 -72928 -95885 -95701 -153220 -114884 -64028
2012 -64028 9382 -71396 -33656 32120 59980 88738 127212 56991 -4001 -57545 -38414 -10007
2000 -10007 -126138 -176294 -8524 37456 5738 -16793 -54077 38590 -925 -23495 -92805
1989 -92805 -65928 -143007 -149604 2684 30600 -156329 -232086 -91741 -11922 -41843 -105533
1978 -105533 -146446 -97163 -147422 -85731 38293 -27706 -147164 -156208 -75121 -66350 -98149 -153869
1966 -153869 -136056 -117908 -129437 -102462 -251830 -185037 -93431 -57108 -73126 -89350 -64817
1955 -64817 -69068 -86009 -123564 -228902 -106411 -100742 -99357 -56718 -143454 -110527 -89673 -73144
1943 -73144 2841 7088 -111550 -123425 -4994 -152051 -177898 -146643 -225735 -129332 -119098
1932 -119098 -255161 -259692 -138043 -142986 -151181 -115988 -77758 -98177 -47362 -113518 -89501 -11786
1920 -11786 -33692 -38151 -48346 -115211 -120297 -254123 -188723 -145642 -295836 -193106 -203334 -91847
1908 -91847 -62831 -154438 -87022 39053 53724 -32562 -33324 -119093 -34773 -17572 -105346 -156988
1896 -156988 -81505 -32083 -89306 -11665 -69352 -128087 -32608 -65045 -58783 15371 3950 -35454
1884 -35454 -31102 4351 -88190 -193435 -125156 -176685 -181309 -171637 -145769 -47584 -17621 -87968
1872 -87968 -146493 17134 -97653 -77873 -146179 -138499 -3593 -17521 14150 -106676 -37964
1861 -37964 -131930 -131226 -35618 -77934 -110310 -164319 -170431 -189263 -49900 -38773 -36071 -3118
1849 -3118 -67110 -50856 -86610 -39434 -30253 -77269 -56052 -171977 -129315 -64238 -72165 -36306
1837 -36306 -110854 -92057 3301 8058 -131269 -131078 -125823 -93062 -171295 -116283 -60847 -134497
1825 -134497 -180333 -114277 -98363 -133411 -124543 -75919 -45995 -240517 -141024 -7858 -191310
1814 -191310 -237953 -87076 -103626 -57741 -121297 -61257 -93496 -83772 -76993 -174312 -189125 -210219
1802 -210219 -125184 -139075 -130692 -168537 -150262 -30007 -32052 -34788 -52978 -124019 -97612 -75967
1790 -75967 -103965 -187802 -239408 -174766 -129957 -110761 -114890 -189272 -165007 -79799 -101802 -6026
1778 -6026 107037 83435 -57952 -217743 -226400 -195428 -151721 28772 59041 18056 -18970
1767 -18970 50042 39169 -65584 -54094 -102966 -124486 -35805 -227608 -186140 -47587 1623
1756 1623 100496 58260 -5472 -137115 -11707 16462 -3579 49739 19758 -65518 -46754 -2340
1744 -2340 11933 -8023 34925 -48884 -98277 -977 66885 -9321 -30020 -107597 -92419 -43324
1732 -43324 -48100 -68486 44145 -43538 -84653 37938 -9595 88060 27490 -13726 -9965 -15247
1720 -15247 -50587 -61789 -25572 29700 12194 16092 -103634 -130654 -19731 108125 -50817
1709 -50817 18054 90498 13847 -13625 -64870 -55912 -154469 -116395 -135652 -118534 -116016 -25402
1697 -25402 8141 9614 8490 13792 -57704 74142 28223 85078 4736 -152809 -58903 10452
1685 10452 -70298 -97740 -63210 -101090 -81895 -159308 -99061 -28380 -169968 -108355 -28334 -82826
1673 -82826 4593 -17975 -22784 -23931 -22717 -93492 -130194 -229965 -138331 -171243 -214880 -196321
1661 -196321 -182292 -126468 -103361 -66489 -14200 -130348 -112210 -63839 -9041 43864 42135 -39389
1649 -39389 -109519 -222924 -321868 -149685 -84670 -54934 38749 -42817 -30315 -44683 -180256
1638 -180256 -144394 -118185 -196224 -249579 -297218 -241390 -111390 -6765 -95025 -174752 -248842
1627 -248842 -195898 -89513 -30752 49718 -79641 32290 4939 -103125 -16019 67341 -41583
1616 -41583 -89646 24505 -40418 -123640 -147312 -100648 -1932 55140 95920 117287 72716 -14436
1604 -14436 70582 85639 40410 -33971 -32231 -38065 9555 -63914 10679 12495 48992 53001 -4181
1591 -4181 -16450 -42091 -24720 2411 7004 -33029 -111998 -232760 -216207 -69114 87182 81044
1579 81044 91879 -14418 -96616 -135302 -32637 32479 17691 -16125 16545 36153 -8048
1568 -8048 -24233 -95061 -200574 -148616 -155547 -114506 -69737 -11349 23494 -30176 -157199 -79295
1556 -79295 52840 78365 13310 -125471 -121213 -27417 -34991 -55466 -116946 -35702 70077 29711
1544 29711 -88444 -115203 22700 82826 177990 104867 -14370 -108325 -115086 -123610 68964
1533 68964 64553 41635 -71163 -39777 -15015 11292 -28199 -39625 -48083 14590 81092 -108885
1521 -108885 -95390 54493 16454 -115028 -20262 -45082 -18819 96366 -38588 -32375 92901
1510 92901 49351 83011 70922 -22376 19436 106854 -38944 -22584 109420 81449 130809
1499 130809 284704 235107 44880 -5833 -54889 24784 35839 -104718 -27427 83410 73148
1488 73148 76069 -29342 13537 46170 -91586 87411 244933 141241 9212 21986 41558
1477 41558 50079 59023 -57627 -43881 -82153 -107599 -52566 -71522 -842 -22293 41963 -96575
1465 -96575 -13855 -58372 -133100 -80485 -105395 -140360 20091 30171 70592 127447 -28706
1454 -28706 -68637 38485 43665 75163 70050 -9035 6648 20965 -63054 -78706 -35179 -43473
1442 -43473 -102471 -142479 -88866 -31431 56630 21202 -66532 -192820 -254657 -155281 -8472
1431 -8472 25274 12563 -40253 19309 58864 117435 99293 139172 -28091 4187 51267 58925
1419 58925 43182 11399 21414 -156868 -107673 -81799 -134002 -59204 -76364 18179 36179 57962
1407 57962 62927 33457 100573 154114 11208 24727 -69370 -66542 19389 -36240 -2625 -11950
1395 -11950 -89828 -123094 75409 67764 78833 29282 -45588 19481 35271 29438 37896 47947
1383 47947 51902 19907 -18590 -143630 -92066 -56476 -116610 -90763 -83546 -96052 -109492 -91614
1371 -91614 -138914 -145602 -140130 -27046 -117679 -125606 -122816 27091 68503 -34623 9668 -137013
1359 -137013 -171477 -97963 4951 -30038 -12767 -135384 -69432 8722 -2823 -23378 28957
1348 28957 -23520 -32473 63119 -40911 -133588 18503 126824 77045 68337 46597 -128892
1337 -128892 -48639 -69631 -20325 104199 5356 -35457 -138549 -101884 -46637 17983 -42077
1326 -42077 -25513 -23650 44457 39275 34963 10359 -42465 -47604 -41572 30320 137730 58503 14228
1313 14228 -32161 -42201 -6124 -126793 74547 100372 195287 37244 92987 136320 136331 158820
1301 158820 75064 -12590 -85716 960 52039 125660 -3331 14219 -1626 -14496 103289
1290 103289 134916 19828 -39137 -73942 50048 16357 73750 187687 46179 17235 89941
1279 89941 80795 2446 26574 89426 5114 177 96642 104379 66668 164020 90751 103044
1267 103044 89886 96975 4094 -6232 52488 -68547 -35019 -17449 -27026 48755 9628 -39654
1255 -39654 69259 68147 75918 57974 4986 122077 136081 52397 120140 66144 95526 189208
1243 189208 95263 107518 251013 250557 114862 71652 48355 73394 54384 135396 117942 78063
1231 78063 72177 181423 111910 2040 117067 -60964 -28342 71739 71272 -29374 28066
1220 28066 69982 156865 82056 -52880 -12978 -953 5837 -43057 -89787 -32305 -77411 52125
1208 52125 138006 94586 160007 167273 107709 36956 -124861 -44562 157353 163224 43639 -37645
1196 -37645 -21926 -96396 -17154 25465 9166 -99447 -110561 -107278 -155476 -136002 -45600 -14894
1184 -14894 -72001 65385 63465 112407 158530 60588 5676 -41633 33120 126413 108353 93119
1172 93119 20499 -217361 -166303 -91293 -76352 -9050 4209 13286 -59393 -91949 -128264 -39871
1160 -39871 16511 117884 33585 -11533 -378 -44320 18117 -4111 53124 42640 109617 69152
1148 69152 42424 21175 64262 95532 48059 5766 -66245 10197 111804 -12857 -101211
1137 -101211 -38279 7662 93675 -20749 25589 16295 26237 73544 54298 128230 48855 25350
1125 25350 -113154 -106701 -10057 -60818 -49899 -41728 -97003 -113909 -36234 -46046 -64121 -44194
1113 -44194 -102841 -970 -54554 -127011 -100058 -57402 82241 66538 -24885 127545 259824
1102 259824 165842 114375 185739 114372 -101409 -144140 -68536 -23359 -85024 -103037 -20602
1091 -20602 -13287 101014 179555 87937 -84019 -71512 -129515 -74136 -33874 -190009 -89870
1080 -89870 -49398 -97021 -11633 96714 -12186 -3283 -17755 -38400 -139781 -210936 -121605
1069 -121605 26325 6084 -45021 -130 -171440 -154463 -56525 -52932 2685 -99941 2628
1058 2628 39133 -79568 -58764 33433 16040 -34243 64464 139750 149669 83173 30130 -49538
1046 -49538 7405 74513 114297 8457 -54566 -3176 9296 53678 19679 -56219 -130316 -92502
1034 -92502 -46812 72483 67965 -31328 -20740 35985 15668 -1611 84864 59712 -30598 114312
1022 114312 -4795 -52722 -9397 -3632 -16264 -56398 -64930 -41182 93147 121497 169863 71495
1010 71495 73264 65115 -1448 43925 -151587 -243095 -55235 16408 107764 32044 46806 85771
998 85771 99565 21517 -70054 -56080 14191 67293 16686 10999 -19200 -198259 -87206 27485
986 27485 129892 85031 38721 23678 125379 121026 99833 42947 23703 24547 -3574 89393
974 89393 29649 80881 -6829 27930 85032 122086 160148 156868 24392 15856 72564 197126
962 197126 155356 152238 112402 26075 -6487 -62557 -27600 57335 57655 120142 105722 3383
950 3383 7208 84123 142472 64674 70750 62537 -21919 37604 -2594 19828 34365 -28950 -32618
937 -32618 35556 -63680 41097 114930 71894 111691 94956 182523 72469 50780 138246 -48850
925 -48850 -114211 -47597 13511 79215 34383 -14035 -97787 -139812 -92012 17171 47448 -48818
913 -48818 -121166 -79557 -113253 -89157 40203 53763 -39523 -65285 64153 50809 -31331 78639
901 78639 136800 179344 97443 50594 130580 59599 -54487 46113 139599 97601 54466 39327
889 39327 41771 11505 -62903 22090 21098 105565 112382 181239 78016 13200 19336 69245 -71694
876 -71694 -112002 -23465 -24262 -2669 -105059 -142682 -54203 58176 81244 -30761 -32569 -23636
864 -23636 54458 65370 16139 47395 31730 24725 -100987 -82213 -42799 -46437 16832 60260
852 60260 6150 42076 155207 203121 102530 103528 -19846 -66330 -82775 -26994 73990 123483
840 123483 59294 -4688 -21461 -51804 829 76603 73553 110162 29611 -30795 67465 119788
828 119788 151756 6917 28895 144303 95658 112462 71205 4880 42061 124812 170857
817 170857 64886 -14513 10829 91969 59813 -11828 131232 69548 143911 14138 -97406
806 -97406 -124140 -147118 -81650 -555 6232 -71758 -107852 -36190 17867 -6021 -56330 -80615
794 -80615 -59984 -34132 -104774 -150320 -35678 -52111 22391 28204 87778 106185 -51466 5055
782 5055 12902 83768 167578 39514 6335 -84595 -109403 -22302 135241 147397 95277 155002
770 155002 268666 218333 23838 -25814 10621 64155 -94466 -73457 -37115 -169861 -146829
759 -146829 76335 124400 15034 -3008 -27885 -14698 -158738 -123422 -91479 -18000 -13298
748 -13298 119192 211286 134065 180 -103011 21494 107190 78748 134872 173220 160686
737 160686 102769 78892 66680 134593 167167 161939 97118 27667 90181 127538 104779 83531
725 83531 81415 40828 17294 -46912 -62817 -285 69986 180161 171480 83560 44621 61482
713 61482 -9350 -71800 -4492 66318 79057 15905 23686 118056 77292 73842 101 -164605
701 -164605 -174547 -5413 5146 -101197 -55463 -62350 -283 60328 124888 -2761 -76795 -3298
689 -3298 45566 20062 92494 75815 23492 -33556 -36842 -15294 9852 136312 192066 222985
677 222985 133519 97439 78470 50531 6308 5103 11133 -21169 11641 3934 -129277 -254593
665 -254593 -197775 -107637 -100668 -107422 -70726 -65655 -140046 -74064 -25576 47423 52305 -58769
653 -58769 10745 -58091 -95342 -94088 -240269 -98556 -146639 -91195 -29457 -79174 73598 95635
641 95635 73949 15227 -49372 4232 85410 -19362 -62928 -56638 11189 64458 75209 31233
629 31233 27718 113688 58840 29562 60134 -6805 127669 110731 -6229 -60487 56450 8244
617 8244 -75860 -64784 4030 17975 15538 -30573 -52210 -18412 -58580 -49074 -17225 -9754 -61080
604 -61080 -71294 13563 -48091 11481 142017 139746 -76609 -41292 -5163 22215 90484 79016
592 79016 23720 -35702 -52545 -64099 25422 15061 187411 162051 233532 223541 52695 96517
580 96517 151090 -10459 -137319 -89480 -9645 -25830 11933 8876 61589 -11204 -31711 -66193
568 -66193 -70173 14581 -13121 -102433 -10869 84254 126230 140165 84136 14943 -52685 -60043
556 -60043 36975 107269 141246 67766 -70205 1475 43158 60999 37240 19345 65912 -24478
544 -24478 -34128 -29386 2147 -102223 -67594 44041 -41630 -19223 91254 70446 56751 153234
532 153234 23840 31543 181428 86302 69142 98792 66536 -9263 97210 113920 38409
521 38409 35238 67429 -62751 -84018 -82375 -63917 -82534 15291 73008 19668 51388 -27186
509 -27186 2189 -13343 -18563 2569 -48348 -50932 52173 -67822 -48484 -162067 -77777 -12463
497 -12463 2728 23574 129099 191015 131794 112228 94284 55476 -19494 -69865 -55097 33370
485 33370 50362 71270 23884 108942 243778 172981 56939 59413 24240 65497 -21877 -103081
473 -103081 -18386 -44357 -25488 72780 62752 -111201 2438 17374 -7502 -13974 73529 196697
461 196697 133050 19850 70010 116863 -71376 -87105 -102667 -119660 -40166 -21303 -27976 -6629
449 -6629 -107922 -96485 -73131 -54870 24830 -74607 2876 18286 -58758 -85458 -32441 -140838
437 -140838 -79690 -19760 53804 -64140 -4338 -77388 -198432 -7369 102667 86368 -16030
426 -16030 64722 34520 -71528 7415 87317 94066 67981 46687 34566 -10169 4202 -1640
414 -1640 -8418 31354 91490 -88146 -49810 -51704 115896 125695 9768 18502 -115027 -166729
402 -166729 40031 33432 57909 43374 -40889 -71154 -119019 -56015 -6767 -73389 -18344 39540
390 39540 -142006 -151715 149121 -136744 -194288 -110344 -114244 -50751 -61027 -48286 -14882 92013
378 92013 99443 6079 -77446 -142264 -40774 19806 -54355 37430 49047 41018 18538 1072
366 1072 -12829 -49555 -167267 -178685 -123052 88438 219 -71402 -34184 18382 37632 120666
354 120666 103417 -22683 25149 55457 139846 10054 -32720 18300 -24591 -11813 -30950
343 -30950 53495 56696 84536 73574 45255 -2987 48588 37886 7683 44821 -58444 -86381
331 -86381 -39282 21888 -45854 -82499 -31588 -101524 -62677 -65131 -13098 14584 -53433 -31759
319 -31759 -37974 92431 161305 137480 -18379 -127188 -217839 -157073 -11650 27279 62522
308 62522 -71371 -101733 -79987 -18300 -34484 -18287 45350 -100413 -178818 -74887 -7479
297 -7479 -11095 -18970 1966 101366 122703 159825 64852 -11978 -40230 -140965 -183788 -116782
285 -116782 -34050 -41445 -80291 -121109 -79450 -121532 -130709 -110700 -23844 -83230 -92003 -19821
273 -19821 32659 -741 -27661 76826 117752 40275 51804 33751 -15371 -30828 -23094 -56520
261 -56520 -77010 -24508 40977 101985 39537 45325 -30336 -427 -83841 -1078 60316 17854
249 17854 -61359 -37826 101018 -90250 -154815 -166447 -218743 -109229 -120848 -29807 99488
238 99488 86931 -112053 -148729 -104941 -133757 -159980 -115154 -29414 -15613 15782 -59293 -114479
226 -114479 -122319 -65953 -58950 -54592 -60584 -130149 -104749 -8169 14252 -53328 -13096 4894 -10720
213 -10720 45821 25369 79254 143564 173182 106696 9351 63248 37927 -54888 -162713 -112040
201 -112040 -60701 30383 42208 -25173 -3230 -38752 -62659 -49533 -40322 20905 66313 95179
189 95179 103088 32444 56152 28997 56934 105605 48891 -60615 -60262 39463 -29514 -99923
177 -99923 -50493 -68981 -75244 -4968 86684 -50448 -84873 -72093 3196 23916 -17958 -17970 39721
164 39721 -30613 -98341 -75877 27430 -24886 -110383 -15456 -33133 12856 13871 -44942 1222
152 1222 63749 60881 55883 -42170 -139634 -50466 73279 -108361 -106258 -28835 -65516 -34216
140 -34216 -2833 4021 -49386 -110915 -42365 -42698 -59876 -117877 -18470 -17093 18861 -15994 -60088
127 -60088 -43589 -80770 -46943 -19441 24838 897 62806 68667 164419 6075 83792 45087
115 45087 16780 19899 -111716 -95006 -50741 -25403 -75522 -23316 -33336 -38592 -84358 -72920
103 -72920 -10212 -72892 -15013 -113637 -208836 -122759 -11721 -28450 -110497 -73974 -32470 -61592
91 -61592 -136816 -119489 -12985 -69367 -40531 59470 109646 102873 69017 30363 -30626 -29515
79 -29515 -107181 -28318 -24930 -97433 -109115 -30049 -6616 14223 15690 -33344 -99083 -131173 -94513
66 -94513 -6009 21897 62637 34187 -75320 -7190 65890 30085 16507 -51344 -55463 -156985
54 -156985 -85815 -4195 100930 12235 -105812 -58227 41756 -16769 -37814 -48793 -57682 -34071
42 -34071 -50004 -14587 -31989 -13936 -65868 -57815 11839 4652 -68083 -61690 -6545 27510 -25095
29 -25095 -18149 -112990 -29755 63964 10496 -50578 -69245 -106653 -65233 -15771 74246 43160
17 43160 -19022 -10407 -48894 -17242 -14726 -34012 -45363 -74653 -71074 -62913 -30810 -30205 -97787
4 -97787 -33625 -11545 53721 -7521
0 -7521
$$ Imaginary data points
##PAGE= N=2
##DATA TABLE= (X++(I..I)), XYDATA
16383 -2434100 -2372680 -2364293 -2381472 -2282901 -2242477 -2199791 -2107474 -2036262 -2113670 -2036885 -1964287
16372 -1964287 -1963186 -1816998 -1713624 -1766565 -1766419 -1755113 -1669293 -1640218 -1616938 -1544799 -1558160
16361 -1558160 -1492340 -1366613 -1262473 -1285817 -1221980 -1166887 -1191849 -1206997 -1115599 -1064650 -1069575
16350 -1069575 -1036581 -964060 -975107 -978689 -930699 -881185 -831473 -798822 -656958 -647694 -686165
16339 -686165 -547513 -540466 -511510 -443152 -461500 -466063 -486764 -428977 -330118 -336365 -289201 -239234
16327 -239234 -132921 -160941 -90811 -88482 -173954 -14226 81932 68683 56877 202958 226519
16316 226519 263796 294078 308066 292147 320922 303754 415202 379539 301943 440973 546283
16305 546283 621789 595561 706288 635355 707154 738850 773243 794127 859841 918558 922995
16294 922995 956501 1099026 1101715 1047041 1119025 1128382 1176851 1178231 1193870 1275511 1385866 1409101
16282 1409101 1374128 1413460 1432757 1454436 1587006 1598782 1603561 1559353 1501856 1567870 1576272
16271 1576272 1695891 1838121 1789561 1761840 1753344 1870743 1893836 1810165 1781477 1915460 1995691
16260 1995691 2100171 2064035 1981038 1981925 2096978 2093507 2036194 2124989 2140727 2178384 2147055
16249 2147055 2262329 2125458 2141399 2322470 2449943 2451607 2436883 2329867 2346576 2351284 2335585
16238 2335585 2317920 2434519 2522112 2547216 2553188 2602852 2640974 2729137 2799104 2732661 2805180
16227 2805180 2792248 2725237 2836086 2894807 2878438 2919076 2969119 3104113 2999237 2983148 2898669
16216 2898669 2994873 2956937 3058918 3096021 3099760 3083461 3089502 3065136 3072102 3171397 3077448 3136567
16204 3136567 3218339 3212052 3176860 3094048 3172408 3236748 3251834 3183925 3242438 3296483 3366649
16193 3366649 3351664 3328679 3287590 3272115 3237091 3290057 3331808 3335376 3370696 3395868 3446044
16182 3446044 3522111 3471299 3353011 3391393 3262659 3389033 3562922 3536809 3420440 3541078
16172 3541078 3580696 3649487 3688374 3695262 3666228 3591506 3601505 3668040 3670625 3644962 3625000 3725217
16160 3725217 3748629 3821097 3758892 3850179 3845005 3791946 3788258 3666739 3660088 3765379 3925813
16149 3925813 3909758 3792717 3822338 3879117 3837015 3719979 3697751 3866838 3992220 3901452
16139 3901452 3781216 3917948 3883511 3933009 3853914 3876856 3780342 3865214 4047942 4007562 3933382
16128 3933382 3981228 3972396 3944927 3990896 3999722 3979268 3968785 4084561 3981508 4030315 3931313
16117 3931313 3786454 3918936 3936313 3906548 3903591 3878128 3938281 3922302 3961695 3921567 3971422
16106 3971422 3898934 3811244 3836674 3826199 3984992 4032858 4071794 4058749 3928321 3885102 4010628
16095 4010628 4042760 3984487 4014851 4078626 4040900 4089724 4029293 3927001 3992037 3980405 3943288
16084 3943288 3856056 3940565 4119765 4162494 4246728 3987075 4015468 4149620 3987640 3983213 4057056
16073 4057056 4149525 4152128 4075636 4115386 4119683 4099713 4122508 4186628 4247801 4131696 4122191 4017372
16061 4017372 4180022 4082371 4040478 4041763 4226777 4257154 4265406 4237779 4275144 4324222 4163611
16050 4163611 4123241 4072463 4116798 4081925 4032124 4113929 4237523 4147161 4170977 4088020 4180814
16039 4180814 4219386 4216815 4151918 4097922 4148008 4161398 4219797 4115240 4180672 4217948 4118898
16028 4118898 4211429 4138560 4067202 3985859 4110506 4166212 4054850 4095935 4379178 4285315 4298427
16017 4298427 4232451 4216860 4168456 4071266 4155666 4184057 4227477 4149291 4201365 4252358 4164314
16006 4164314 4140924 4106996 4041804 4090300 4100648 4206509 4210620 4150289 4084846 4163587 4146603
15995 4146603 4201161 4090516 4055532 4126146 4077531 4079275 4077715 4155414 4187260 4155462 4248420
15984 4248420 4238095 4238628 4192868 4286430 4252710 4330369 4318300 4236299 4153264 4120973 4168974 4332318
15972 4332318 4315484 4219574 4270948 4247371 4357282 4455162 4266159 4285886 4416963 4225412
15962 4225412 4270595 4220364 4172655 4073749 4155439 4106338 4192598 4235263 4218374 4142923 4161041
15951 4161041 4141405 4141521 4255665 4248662 4179241 4102030 4193123 4283106 4306807 4299481 4170788 4142652
15939 4142652 4154722 4136286 4169471 4069087 4186930 4280991 4218307 4208622 4209042 4131911 4109017
15928 4109017 4123934 4229348 4248021 4151140 4265809 4220808 4228744 4233898 4251244 4189231 4111104
15917 4111104 4255260 4295289 4265244 4168565 4056453 4071550 4154434 4255873 4248952 4209458 4159988
15906 4159988 4243893 4307283 4207987 4200805 4195883 4152965 4052858 4195666 4142835 4129365 4075005
15895 4075005 4095454 4238859 4172782 4173864 4213263 4092000 4217546 4244157 4170889 4247761 4211256
15884 4211256 4189896 4202441 4304751 4315888 4389030 4325919 4208530 4208762 4097985 4077439 4239340
15873 4239340 4244405 4190566 4196117 4211637 4083602 4174240 4248890 4173453 4249741 4236001 4256593
15862 4256593 4228769 4291194 4169433 4184920 4233754 4276704 4351981 4084127 4027284 4151239 4239862
15851 4239862 4289622 4199096 4150465 4111750 4223915 4209187 4148063 4274845 4262533 4275403 4151984
15840 4151984 4122697 4143677 4084098 4282751 4407505 4296325 4191599 4229289 4313400 4086609
15830 4086609 4082508 4102140 4205714 4362637 4309851 4295246 4242328 4289783 4369720 4363605 4339937
15819 4339937 4245558 4225472 4161035 4245585 4296463 4246470 4303163 4341591 4216311 4210162 4264729
15808 4264729 4181124 4188901 4251184 4254571 4108708 4149340 4158230 4225558 4273056 4252987 4187785 4307468
15796 4307468 4237241 4302389 4235160 4129393 4136813 4116691 4173619 4184454 4200742 4127045 4251984
15785 4251984 4459879 4445824 4302948 4255388 4140962 4200863 4350105 4383289 4321450 4394458
15775 4394458 4391277 4318395 4477696 4482106 4346495 4348822 4330907 4235188 4282237 4308316 4330566
15764 4330566 4295407 4214537 4179659 4312137 4301067 4330244 4451680 4337060 4228000 4206891
15754 4206891 4289725 4296686 4292834 4171790 4163545 4131675 4193733 4142248 4261475 4313932 4324142
15743 4324142 4403420 4381490 4347368 4333226 4274812 4225117 4140549 4291013 4379937 4386938 4177905
15732 4177905 4025143 4235124 4238072 4218111 4210534 4236835 4182514 4237197 4318796 4339563 4131333
15721 4131333 4216344 4309459 4338613 4340031 4243380 4230867 4242241 4208377 4245377 4165258 4194864
15710 4194864 4230860 4170043 4196121 4134912 4116616 4175410 4170507 4277652 4187470 4141819 4409490
15699 4409490 4487010 4415736 4282936 4316697 4353100 4401425 4314767 4347330 4487370 4351299 4270681
15688 4270681 4347901 4278637 4138047 4136518 4082488 4066236 4196753 4304502 4257609 4265796 4308042
15677 4308042 4445863 4404961 4345007 4365599 4345906 4357403 4274573 4296329 4224371 4257241 4282096
15666 4282096 4300216 4290440 4281413 4430246 4572398 4376984 4363356 4343895 4225501 4355705 4387124
15655 4387124 4359749 4319253 4253689 4222786 4287050 4466508 4336343 4224328 4321031 4341878 4344762
15644 4344762 4290907 4328670 4373589 4426405 4493197 4454303 4452927 4431804 4312000 4375984 4305263
15633 4305263 4305095 4353412 4412788 4419778 4260029 4278794 4212778 4169466 4294598 4294806 4327387 4260505
15621 4260505 4375913 4411737 4384603 4431627 4417135 4406781 4322358 4307454 4271206 4276147 4352252
15610 4352252 4356184 4432646 4430177 4445266 4341582 4317017 4483204 4435319 4486540 4418274 4477091
15599 4477091 4471329 4425478 4475727 4390527 4263629 4417902 4344902 4227178 4276734 4309175 4429372
15588 4429372 4330896 4325485 4330885 4326461 4354849 4315604 4241071 4331595 4343742 4419075 4313147 4302540
15576 4302540 4355315 4261765 4333415 4251081 4317069 4421996 4336727 4192334 4258347 4319135 4347586
15565 4347586 4394225 4450496 4463897 4517873 4563685 4493775 4457318 4435994 4284083 4307661 4289042
15554 4289042 4375289 4409437 4407337 4484255 4486292 4491818 4501432 4531318 4411706 4468573 4483931 4403127
15542 4403127 4241755 4254332 4330805 4360792 4417815 4451122 4392375 4364859 4382731 4464457 4447531
15531 4447531 4290095 4309272 4329614 4447762 4514650 4439278 4435817 4544943 4619514 4676487 4620272
15520 4620272 4385649 4279917 4318220 4270205 4345889 4460682 4502524 4515138 4356372 4249608
15510 4249608 4336474 4322817 4300739 4311376 4335191 4399053 4340424 4410930 4391896 4448909 4420282
15499 4420282 4435282 4385027 4367472 4334419 4426899 4437991 4418230 4324577 4352303 4552965 4469220
15488 4469220 4445651 4406404 4339307 4328751 4414656 4397509 4467078 4526306 4567790 4489583 4391647
15477 4391647 4356855 4346788 4365129 4393751 4451172 4405434 4448949 4463636 4491437 4451875 4475583
15466 4475583 4492466 4457993 4392103 4316786 4344564 4348106 4340442 4367327 4530270 4501488 4359000
15455 4359000 4275123 4268878 4340217 4322667 4428162 4440825 4523681 4517022 4525893 4479742 4485720 4573609
15443 4573609 4449904 4412018 4435409 4542790 4449185 4448096 4391031 4413220 4335044 4360762 4352135
15432 4352135 4474728 4531114 4469574 4533910 4452968 4414034 4541135 4457894 4369537 4331069 4284700
15421 4284700 4278134 4334852 4249323 4336187 4328174 4411926 4288358 4271402 4311205 4411260 4519242
15410 4519242 4512085 4541230 4505334 4439439 4414053 4406093 4516541 4558700 4487580 4471185 4367885
15399 4367885 4420468 4506673 4485545 4329926 4288084 4323052 4361439 4397228 4459148 4361337 4439149
15388 4439149 4465552 4468847 4432755 4478414 4454786 4471424 4415138 4371573 4368157 4318945 4301198 4381040
15376 4381040 4356269 4465598 4477374 4439028 4363427 4343550 4292095 4326447 4277916 4264455 4348901
15365 4348901 4359298 4281447 4352763 4231780 4274086 4302476 4321343 4401836 4456347 4378284 4299454
15354 4299454 4344755 4401000 4455802 4425941 4465051 4458007 4472174 4467080 4404433 4448120 4505925 4456460
15342 4456460 4471786 4439133 4429538 4360420 4451541 4414117 4297157 4270657 4199439 4338734 4515224
15331 4515224 4483294 4379372 4427680 4405389 4289659 4409048 4487581 4403617 4337963 4386732 4469494
15320 4469494 4457607 4432012 4536906 4551116 4409738 4410932 4420625 4310742 4423919 4386432 4344372
15309 4344372 4428779 4543831 4448960 4337254 4347136 4490038 4453210 4416121 4566040 4614725 4412521
15298 4412521 4460541 4385362 4381030 4463788 4613295 4463734 4333992 4428619 4474830 4451298 4404284
15287 4404284 4518218 4418068 4450999 4626199 4639836 4540026 4607584 4607193 4597973 4526289 4491010
15276 4491010 4547180 4475709 4522160 4436199 4405719 4418722 4433682 4534985 4540411 4484404 4428531
15265 4428531 4469387 4603231 4585157 4530453 4459237 4323183 4360594 4361151 4444113 4403768 4576112
15254 4576112 4498493 4515059 4622813 4482771 4443796 4360581 4523298 4614909 4597208 4611837 4574402
15243 4574402 4545587 4519496 4440816 4433729 4533147 4459848 4558510 4543631 4524227 4460322 4513508
15232 4513508 4569692 4540403 4509358 4390060 4410085 4499897 4625884 4677521 4579675 4383795 4435594
15221 4435594 4417068 4308122 4435455 4472690 4426923 4418298 4484285 4435800 4482555 4535111 4542538
15210 4542538 4524174 4572131 4701908 4549451 4458624 4475749 4516213 4567488 4535826 4420378 4400751
15199 4400751 4385011 4371619 4483935 4461967 4371459 4433972 4416156 4370012 4374493 4355624 4232448
15188 4232448 4365875 4528748 4575353 4495822 4528853 4556669 4591496 4579598 4590947 4552973 4645764
15177 4645764 4611421 4520135 4537110 4538498 4504421 4506060 4529378 4487256 4501485 4500548 4736446 4703590
15165 4703590 4798261 4768642 4736593 4550403 4531378 4604144 4493427 4479343 4474658 4421485 4484739
15154 4484739 4455722 4552995 4554932 4576271 4639862 4613226 4579868 4452337 4565267 4625092 4588167
15143 4588167 4519696 4753063 4741936 4588944 4566771 4687338 4604063 4505008 4486922 4550913 4556999
15132 4556999 4639206 4653858 4613187 4596174 4639731 4685093 4516255 4401027 4491378 4519251 4473023
15121 4473023 4494311 4561491 4550906 4562644 4475627 4415320 4570325 4736059 4657556 4386801 4513329
15110 4513329 4515703 4406532 4493526 4536882 4510593 4451293 4452983 4506907 4582991 4619940 4565512
15099 4565512 4540982 4515356 4526975 4597905 4658923 4603896 4583683 4393089 4382740 4427410 4547866
15088 4547866 4567310 4484665 4480409 4565006 4589705 4608418 4578185 4459980 4482470 4580530 4699702
15077 4699702 4637663 4632161 4582806 4531073 4555103 4614802 4598768 4578890 4616875 4536624 4591508
15066 4591508 4654121 4775966 4645910 4403366 4349572 4396684 4397049 4544368 4541235 4485755 4432227
15055 4432227 4514537 4522083 4527859 4472197 4395732 4513115 4611679 4678732 4603967 4609655 4592932 4593414
15043 4593414 4569075 4552060 4488236 4549871 4526330 4498600 4496458 4536241 4584094 4581100 4542155 4594577
15031 4594577 4616940 4469806 4576225 4459478 4450957 4597609 4588432 4608915 4548011 4532898 4514942
15020 4514942 4563966 4422856 4538179 4488831 4503617 4502453 4595738 4676422 4607178 4576661 4498611
15009 4498611 4472745 4581557 4650870 4600070 4753037 4715143 4825881 4758169 4632298 4698286
14999 4698286 4684092 4655700 4648954 4684930 4618441 4403114 4514271 4696067 4688391 4719755 4622694
14988 4622694 4643917 4643052 4755510 4677681 4646575 4502325 4491992 4662503 4650424 4504319 4513402
14977 4513402 4486917 4541032 4628791 4632899 4696279 4800006 4702262 4627586 4733400 4783582 4797962
14966 4797962 4757149 4704819 4660912 4641963 4627508 4584995 4455080 4479194 4553358 4607885 4779522
14955 4779522 4895519 4809911 4726873 4624037 4597198 4637825 4655197 4768637 4774321 4650003 4843805
14944 4843805 4787547 4775983 4742413 4624862 4579503 4629729 4768741 4758994 4637717 4603426 4638203
14933 4638203 4589276 4651845 4602631 4556422 4610022 4595769 4595988 4531766 4515730 4447088 4548131
14922 4548131 4565027 4615176 4630256 4752540 4740065 4766335 4762317 4745715 4786613 4678120 4778588
14911 4778588 4841323 4809544 4790076 4782884 4843362 4769708 4663414 4649980 4602850 4616885 4564204
14900 4564204 4705517 4730760 4732355 4790426 4677643 4652640 4676481 4616198 4568494 4653174 4688495
14889 4688495 4606347 4632629 4590309 4575423 4621521 4505593 4594332 4804516 4807633 4693257 4653754
14878 4653754 4684091 4696199 4770840 4698503 4808194 4908992 4816983 4796904 4778694 4707999 4629933
14867 4629933 4564704 4522166 4638457 4624305 4615754 4697748 4659718 4616354 4721367 4769090 4753050
14856 4753050 4712308 4680784 4669155 4685428 4701535 4671610 4600676 4545520 4614889 4679010 4638885
14845 4638885 4683528 4704343 4675470 4650481 4777401 4726471 4855669 4721640 4629941 4693335 4797199
14834 4797199 4841148 4815865 4688372 4667804 4631374 4507067 4627130 4683489 4751508 4746022 4818822
14823 4818822 4766076 4753044 4779987 4808849 4856945 4894246 4862643 4771658 4593694 4552976 4645876
14812 4645876 4731506 4629538 4783971 4774006 4801553 4763555 4675344 4620900 4749183 4773576 4742292
14801 4742292 4731515 4660759 4669574 4841479 4804320 4743311 4746643 4796182 4782815 4612495 4604328
14790 4604328 4588678 4643753 4717499 4654791 4639889 4627445 4779811 4754145 4698559 4765449 4742166
14779 4742166 4686514 4782186 4796374 4777739 4761826 4826239 4760074 4798979 4925237 4811881 4683702
$$ [...]
##END NTUPLES=NMR SPECTRUM
##END=
