##TITLE=1H_DE-80H_X3
 200.13MHz, d2o
 8 sc
 
 19ns.26.2.2025
##JCAMPDX= 6.0         $$ Bruker NMR JCAMP-DX V2.0
##DATA TYPE= NMR SPECTRUM
##DATA CLASS= NTUPLES
##ORIGIN= UXNMR, Bruker Analytische Messtechnik GmbH
##OWNER= pz
$$ XWIN-NMR		Version 3.5
$$ Tue Sep 30 10:20:32 2025 Russian Standard Time (UT+4h)  Yarkov@DPX200
##.OBSERVE FREQUENCY= 200.1313
##.OBSERVE NUCLEUS= ^1H
##.ACQUISITION MODE= SIMULTANEOUS
##.ACQUISITION SCHEME= undefined
##.AVERAGES= 8
##.DIGITISER RES= 18
##SPECTROMETER/DATA SYSTEM= spect
##.PULSE SEQUENCE= zg30
##.SOLVENT NAME= CDCl3
##.SHIFT REFERENCE= (INTERNAL, CDCl3, 0, 15.4847)
##AUDIT TRAIL= $$ (NUMBER, WHEN, WHO, WHERE, WHAT)
$$ ##TITLE= Audit trail, XWIN-NMR		Version 3.5
$$ ##JCAMPDX= 5.01
$$ ##ORIGIN= Bruker BioSpin GmbH
$$ ##OWNER= Yarkov
$$ C:/Bruker/XWIN-NMR/data/yarkov2/nmr/H-C/1/pdata/1/auditp.txt
$$ ##AUDIT TRAIL=  $$ (NUMBER, WHEN, WHO, WHERE, WHAT)
(   1,<2025-09-30 10:19:40.29 +0400>,<Yarkov>,<DPX200>,
      <created by zg, POWCHK disabled, PULCHK disabled
       configuration hash MD5:
       00 E9 B6 7A A2 85 ED C7 34 08 36 98 17 FE 4E 26
       data hash MD5: 16K
       06 0C A2 DC AB 43 9F 32 40 35 E8 8D 14 2D 04 D6>)
(   2,<2025-09-30 10:19:49.79 +0400>,<Yarkov>,<DPX200>,
      <Start of raw data processing
       efp BC_mod = 2 LB = 0.25 FT_mod = 6 PKNL = 1 PHC0 = -2078.854 PHC1 = 16.19097 SI = 16K 
       data hash MD5: 16K
       10 EC 95 2D BC 22 77 FC 5C C1 5C F9 02 6E 95 FC>)
(   3,<2025-09-30 10:19:54.28 +0400>,<Yarkov>,<DPX200>,
      <abs ABSG = 5 
       data hash MD5: 16K
       7E 69 FA AE 07 05 BA 97 E9 48 8A E1 A9 32 30 A3>)
$$ ##END=
$$ 
$$ hash MD5
$$ DD 54 C8 E3 53 93 B9 FF 33 06 E2 3E 17 0E 44 57
##$RELAX= 
##$RELAX= 
##$RELAX= 
##$RELAX= 
##$RELAX= 
##$RELAX= 
$$ Bruker specific parameters
$$ --------------------------
##$DU= <C:/Bruker/XWIN-NMR>
##$EXPNO= 1
##$NAME= <H-C>
##$PROCNO= 1
##$TYPE= <nmr>
##$USER= <yarkov2>
##$AMP= (0..31)
100 100 100 100 100 100 100 100 100 100 100 100 100 100 100 100 100 100 
100 100 100 100 100 100 100 100 100 100 100 100 100 100 
##$AQSEQ= 0
##$AQ_mod= 1
##$AUNM= <au_zg>
##$AUTOPOS= <>
##$BF1= 200.13
##$BF2= 200.13
##$BF3= 200.13
##$BF4= 200.13
##$BF5= 200.13
##$BF6= 200.13
##$BF7= 200.13
##$BF8= 200.13
##$BYTORDA= 1
##$CFDGTYP= 0
##$CFRGTYP= 5
##$CHEMSTR= <none>
##$CNST= (0..31)
1 1 145 1 1 1 1 1 1 1 1 1 1 1 1 1 1 1 1 1 1 1 1 1 1 1 1 1 1 1 1 1 
##$CPDPRG= <>
##$CPDPRG1= <>
##$CPDPRG2= <>
##$CPDPRG3= <>
##$CPDPRG4= <mlev>
##$CPDPRG5= <mlev>
##$CPDPRG6= <mlev>
##$CPDPRG7= <mlev>
##$CPDPRG8= <mlev>
##$CPDPRGB= <>
##$CPDPRGT= <>
##$D= (0..31)
0 0.7 0 0 0 0 0 0 0 0 0 0.03 0 0 0 0 0 0 0 0 0 0 0 0 0 0 0 0 0 0 0 0 
##$DATE= 1759213179
##$DBL= (0..7)
120 120 120 120 120 120 120 120 
##$DBP= (0..7)
150 150 150 150 150 150 150 150 
##$DBP07= 0
##$DBPNAM0= <>
##$DBPNAM1= <>
##$DBPNAM2= <>
##$DBPNAM3= <>
##$DBPNAM4= <>
##$DBPNAM5= <>
##$DBPNAM6= <>
##$DBPNAM7= <>
##$DBPOAL= (0..7)
0.5 0.5 0.5 0.5 0.5 0.5 0.5 0.5 
##$DBPOFFS= (0..7)
0 0 0 0 0 0 0 0 
##$DE= 6
$$ [...]
##$SUBNAM3= <"">
##$SUBNAM4= <"">
##$SUBNAM5= <"">
##$SUBNAM6= <"">
##$SUBNAM7= <"">
##$SUBNAM8= <"">
##$SUBNAM9= <"">
##$SW= 18.0517328524113
##$SWIBOX= (0..15)
0 0 2 0 0 0 0 0 0 0 0 0 0 0 0 0 
##$SW_h= 3612.71676300578
##$TD= 16384
##$TD0= 1
##$TE= 0
##$TE2= 300
##$TE3= 300
##$TEG= 300
##$TL= (0..7)
0 120 120 120 120 120 120 120 
##$TP= (0..7)
150 150 150 150 150 150 150 150 
##$TP07= 0
##$TPNAME0= <>
##$TPNAME1= <>
##$TPNAME2= <>
##$TPNAME3= <>
##$TPNAME4= <>
##$TPNAME5= <>
##$TPNAME6= <>
##$TPNAME7= <>
##$TPOAL= (0..7)
0.5 0.5 0.5 0.5 0.5 0.5 0.5 0.5 
##$TPOFFS= (0..7)
0 0 0 0 0 0 0 0 
##$TUNHIN= 0
##$TUNHOUT= 0
##$TUNXOUT= 0
##$USERA1= <user>
##$USERA2= <user>
##$USERA3= <user>
##$USERA4= <user>
##$USERA5= <user>
##$V9= 5
##$VALIST= <valist>
##$VCLIST= <CCCCCCCCCCCCCCC>
##$VD= 0
##$VDLIST= <DDDDDDDDDDDDDDD>
##$VPLIST= <PPPPPPPPPPPPPPP>
##$VTLIST= <TTTTTTTTTTTTTTT>
##$WBST= 1024
##$WBSW= 4
##$XGAIN= (0..3)
0 0 0 0 
##$XL= 0
##$YL= 0
##$YMAX_a= 270258
##$YMIN_a= -250124
##$ZGOPTNS= <>
##$ZL1= 120
##$ZL2= 120
##$ZL3= 120
##$ZL4= 120
##$ABSF1= 15.48466
##$ABSF2= -2.567189
##$ABSG= 5
##$ABSL= 3
##$ALPHA= 0
##$AQORDER= 0
##$ASSFAC= 0
##$ASSFACI= 0
##$ASSFACX= 0
##$ASSWID= 0
##$AUNMP= <proc_1d>
##$AZFE= 0.1
##$AZFW= 0.1
##$BCFW= 0
##$BC_mod= 2
##$BYTORDP= 0
##$COROFFS= 0
##$CY= -3
##$DATMOD= 1
##$DC= 0
##$DFILT= <>
##$DTYPP= 0
##$F1P= 0
##$F2P= 0
##$FCOR= 1
##$FTSIZE= 16384
##$FT_mod= 6
##$GAMMA= 0
##$GB= 0
##$INTBC= 1
##$INTSCL= 3.241238e-09
##$ISEN= 128
##$LB= 0.25
##$LEV0= 0
##$LPBIN= 0
##$MAXI= 10000
##$MC2= 0
##$MEAN= 0
##$ME_mod= 0
##$MI= 1.114404
##$NCOEF= 0
##$NC_proc= -7
##$NLEV= 6
##$NOISF1= 3.799351
##$NOISF2= 2.8
##$NSP= 0
##$NTH_PI= 0
##$NZP= 0
##$OFFSET= 15.48466
##$PC= 1
##$PHC0= -2078.854
##$PHC1= 16.19097
##$PH_mod= 1
##$PKNL= yes
##$PPARMOD= 0
##$PSCAL= 0
##$PSIGN= 0
##$REVERSE= no
##$SF= 200.130007413825
##$SI= 16384
##$SIGF1= 3
##$SIGF2= 2
##$SINO= 0.751879
##$SIOLD= 32768
##$SREGLST= <19F.Aceton>
##$SSB= 0
##$STSI= 16384
##$STSR= 0
##$SW_p= 3612.71676300578
##$SYMM= 0
##$S_DEV= 0
##$TDeff= 16384
##$TDoff= 0
##$TI= <>
##$TILT= no
##$TM1= 0
##$TM2= 0
##$TOPLEV= 0
##$USERP1= <user>
##$USERP2= <user>
##$USERP3= <user>
##$USERP4= <user>
##$USERP5= <user>
##$WDW= 1
##$XDIM= 16384
##$YMAX_p= 374473805
##$YMIN_p= -365492
$$ End of Bruker specific parameters
$$ ---------------------------------
##NTUPLES= NMR SPECTRUM
##VAR_NAME=  FREQUENCY,     SPECTRUM/REAL,   SPECTRUM/IMAG
##SYMBOL=    X,             R,               I
##VAR_TYPE=  INDEPENDENT,   DEPENDENT,       DEPENDENT
##VAR_FORM=  AFFN,          ASDF,            ASDF
##VAR_DIM=   16384,         16384,           16384
##UNITS=     HZ,            ARBITRARY UNITS, ARBITRARY UNITS
##FACTOR=    0.220516191357247, 1,           1
##FIRST=     3098.945150344, 0,              0
##LAST=      -513.771612661778, 0,           0
##MIN=       -513.771612661778, -365492,     0
##MAX=       3098.945150344, 374473805,      0
$$ Real data points
##PAGE= N=1
##DATA TABLE= (X++(R..R)), XYDATA
$$ [...]
8919 38035032 33772981 30250492 27531443 25123454 23203520 21488170 19969044 18555246
8911 18555246 17759618 17004543 16471253 16155613 15828199 15430240 15278236 15464092 15676384
8902 15676384 16230153 16775371 17383300 18324810 18929341 19343025 19517607 19373200 19046207
8893 19046207 18504339 17888132 17109114 16377841 15818204 15567324 15546090 15423427 15537866 15979606
8883 15979606 16481349 17117354 17746938 18702552 19687995 20204638 20629893 20882758 20697266
8874 20697266 20229550 19525055 18747107 18218434 17761143 17330091 16933983 16827277 16924322 17136216
8864 17136216 17361085 17969878 18784784 19769962 20751210 21684468 22715163 23356343 23686294
8855 23686294 23751239 23361525 22539447 21672138 20834634 19877608 19064985 18675062 18283295 18064722
8845 18064722 18012737 18227288 18694503 19293637 20129726 21072997 21971880 22527637 22718202 22663115
8835 22663115 22331991 21459007 20328178 19229130 18005506 16826611 15974575 14998205 14278929
8826 14278929 13655287 12917237 12324824 11832951 11278637 10908048 10733370 10319231 10033296
8817 10033296 9940710 9793949 9558322 9385760 9217680 9082864 8959537 8672006 8372151 8234356
8807 8234356 7983316 7810652 7664313 7560417 7375007 7149936 7017430 6978883 6993992 6983030
8797 6983030 6928563 6939358 6939565 7020335 6844126 6777749 6688926 6658813 6600370 6520410 6534742 6601751
8785 6601751 6551523 6508472 6548544 6760547 6646957 6630298 6662816 6571010 6435890 6358489 6492973
8774 6492973 6460780 6396932 6447035 6466919 6543687 6617896 6596621 6631752 6774892 7020016 7034234
8763 7034234 7041854 7101500 7186031 7338171 7569229 7610077 7933467 8250318 8582047 8825465
8753 8825465 9158890 9518370 9969231 10369930 10926241 11260803 11703009 12245463 12839423 13497223
8743 13497223 14208126 15013501 16125221 17367625 18612453 19978887 21340759 22329625 23060118
8734 23060118 23440770 23470185 23200424 23024258 23051270 23095960 23509506 23981116 24410901 24642253
8724 24642253 24542836 24400994 23796805 22853402 21694414 20238926 19071204 17953238 17151572
8715 17151572 16511968 15880116 15373081 14949007 14709885 14502194 14433730 14404673 14450250 14698335
8705 14698335 14803223 14950124 15245995 15611870 15934467 16400569 16920443 17645209 18692192
8696 18692192 19824222 21018429 22232899 22901368 23504277 23770266 23742256 23383907 23253226
8687 23253226 22965485 22848056 23011498 23417922 23898667 23932320 23805468 23538230 22892505 21673851
8677 21673851 20403588 19106089 17847124 16569936 15420306 14425847 13460174 12625465 12066197
8668 12066197 11466768 10811462 10398293 10046352 9695277 9441034 9012871 8679565 8485695
8659 8485695 8279318 8003552 7770806 7602522 7541041 7651466 7379014 7210188 7100254 6943885
8649 6943885 6891279 6756284 6679825 6692738 6759901 6681198 6733091 6728328 6878979 6882427 6880021 6872759
8637 6872759 6907369 6832519 6919615 6804181 6624627 6793489 6845894 6844576 6885918 7069107 7062620
8626 7062620 7094080 7038570 7152036 7421833 7621205 7497975 7599837 7767143 7862932 7963558
8616 7963558 8281618 8592274 8722100 8946693 9428489 9970316 10376123 11011351 11691561 12427146
8606 12427146 13238158 14029378 14794947 15287591 15513003 15635873 15691456 15654287 15669363 15608448
8596 15608448 15796650 16056454 16105284 16029557 16016689 16075093 15763707 15386155 14913655 14470348
8586 14470348 13879839 13421206 13009093 12695842 12490429 12320835 12071233 11775079 11713969 12225179
8576 12225179 12233741 12341460 12573966 12848372 13306622 13672092 14271657 14910144 15700234 16887421
8566 16887421 18068523 19207929 20596210 21778629 22742864 23204033 23218803 23144539 23045507
8557 23045507 22645924 22259684 22278190 22385904 22498392 22551448 22539970 22390348 22020009 21281713
8547 21281713 20301957 19112420 18007361 17058977 16038728 15165757 14370007 13762798 13130039
8538 13130039 12659202 12289739 11945079 11647854 11301962 11086984 11055547 11062371 11106068 11076122
8528 11076122 11260486 11303525 11635639 12108059 12568054 13115456 13588724 14032179 14095715 13995663
8518 13995663 13782674 13434649 13200930 13018702 12836048 12818608 12854291 12917373 12939336 12797146
8508 12797146 12479701 12117030 11523564 10889168 10305802 9638453 9024767 8576293 8095725
8499 8095725 7736502 7315178 6902525 6702430 6356605 6081900 5791567 5670027 5503244 5336934
8489 5336934 5131322 4967753 4804757 4585765 4513339 4381098 4364933 4382862 4298144 4222899
8479 4222899 4078517 3996438 3945161 3878662 3768412 3720805 3648816 3516122 3650178 3566436 3506123
8468 3506123 3415700 3335463 3324763 3348023 3322412 3213333 3004503 3016093 3049609 2985449 2859616
8457 2859616 2648924 2505413 2372431 2288499 2279331 2337163 2369500 2337903 2190379 2145205 2043340
8446 2043340 2005650 1995381 2125179 2073839 1934432 1853391 1859788 1788008 1646029 1534922 1557413
8435 1557413 1511590 1547854 1571785 1501952 1488217 1332497 1315030 1245937 1209362 1268183 1146638
8424 1146638 1159881 1090874 1110047 1164557 1189831 1250237 1209766 1110765 1148734 1112081 988451
8413 988451 941385 939708 957615 861537 850632 924458 833377 717891 729849 810213 847693 748338
8401 748338 711740 831871 740118 677334 625397 599315 717163 572519 538456 668877 646431
8390 646431 538975 694534 616184 677665 646829 624249 667259 644623 581891 579617 568714
8379 568714 458070 310889 319853 315980 310364 398209 410210 440822 546005 536451 569589 536825
8367 536825 549968 567197 505484 573290 614861 588312 644934 543603 442802 423359 471086
8356 471086 394660 376901 434092 406640 425678 414110 342348 348147 334660 362145 312015 290864
8344 290864 313262 358515 311722 356648 433042 271480 297555 377701 497987 487739 566102
8333 566102 524574 421870 329411 402808 490144 566620 390256 445207 429816 442827 513997
8322 513997 406344 396699 439710 376465 366400 361714 276375 245996 277220 414599 448569 375425
8310 375425 251672 120068 192548 340167 383615 438324 322659 290474 333396 310308 341177
8299 341177 290463 223138 212782 239211 261678 301406 264456 323619 347414 214139 219462 286364
8287 286364 323251 218606 256730 159345 99783 135716 179488 129633 191360 294673 239886
8276 239886 273075 269604 299878 291843 124678 113112 221016 160680 186122 230153 221232 168539
8264 168539 193339 203658 148444 168311 257404 210269 264775 240533 217240 152044 192144 266743
8252 266743 278416 244349 243674 102989 28107 202914 232985 136245 102962 76001 -33724
8241 -33724 41031 133473 37082 -25147 108149 62811 154978 164948 98656 119597 49524 54796
8229 54796 80896 302741 310223 73479 36303 5556 71971 -68505 -38253 101184 197706
8218 197706 106482 -63655 -146089 -22326 5161 -39078 23576 54590 75141 137207 26000
8207 26000 -23734 23345 46431 -29654 153504 277485 62044 90602 50451 151847 23479
8196 23479 22503 -50061 88137 200041 760996 611687 336515 405614 200662 197801 92847
8185 92847 106325 234847 373049 215579 123582 106005 54632 28008 97935 35073 -52420
8174 -52420 -6491 115775 128366 -23789 -55412 63536 93408 -96267 -254176 -102508 -31495
8163 -31495 63919 129397 109850 123737 54235 -102553 1623 76185 141109 111353 201229
8152 201229 270833 93488 -13247 72754 -38039 -85509 35870 35853 50778 150302 98212
8141 98212 94521 160456 51933 44688 11212 2136 72869 -101883 -87130 594 59102 65147
8129 65147 10657 -86334 -149466 -37895 -32229 -117791 -91508 -113490 -303350 -216914 -201655 -239702
8117 -239702 -155680 -140306 -241530 -154917 -47914 -99779 -124873 -179685 -221252 -109645 -140335
8106 -140335 -278068 -245690 -62104 -73687 -61954 -59389 -36998 -103374 -136469 -93855 -101132 -49000
8094 -49000 -59842 -9356 -90598 -110868 -24187 -11828 -72130 -123650 -95293 -32794 -19811 -201999
8082 -201999 -212719 -124379 -206528 -120611 -189297 -119708 -183046 -185090 -40293 26888 -18375 -8169
8070 -8169 -69843 -190397 -206164 -217184 -134141 -117393 -74092 -124638 -70458 -43995 -44132 -173129
8058 -173129 -308686 -283569 -159247 -99483 2754 -29950 -127608 -151576 -111052 -47008 62488
8047 62488 -33738 -43321 -14526 -10801 -82735 -206918 -261855 -10808 -18194 -110936 55094 79139
8035 79139 -40727 -170207 52871 119835 5023 -33940 -62285 -102599 -43721 -77631 -98783
8024 -98783 -26331 -79044 -163383 -63358 -57282 -52956 -248360 -190654 -83749 -137706 -122188 -54703
8012 -54703 -172783 -151319 -78537 -59281 84695 -71891 -199649 -325743 -108348 -44382 -95117
8001 -95117 -34434 -38551 -138799 -117556 -2783 -79403 -177645 -164254 -34056 -198313 -283464
7990 -283464 -135787 -121557 -77305 -80363 -95129 -155099 -85386 -53084 -25160 101963 104490 57444
7978 57444 77572 22492 -10637 -145850 -100904 9516 -23827 57544 26320 -143496 -103132
7967 -103132 -54478 -89831 -47179 94165 151080 -89852 -80155 31286 132188 43901 -1501
7956 -1501 69616 135510 77839 105945 113083 113619 186784 184434 207548 198629 95689 48681 8649
7943 8649 -40643 -36050 64507 20942 8188 40985 96761 159088 42977 41022 -67830 -48807
7931 -48807 22544 -28936 34492 43626 -58395 -65829 84530 99002 130777 187704 97761 74670
7919 74670 42730 61671 213803 188502 181341 257416 199377 254206 287389 244779 312622 412267
7907 412267 465174 577628 556842 576001 734941 741039 685098 672849 594224 521594 558867
7896 558867 399573 282297 255399 276111 234360 234972 213224 182812 247216 235995 207021 199127
7884 199127 88885 35769 38021 80423 -4996 63819 -29783 -216431 -95210 -118906 -64053
7873 -64053 10178 133748 144908 -92621 -148809 -33176 30523 116659 176315 204759 65703
7862 65703 92879 30510 -21808 -109202 -115992 6192 -40399 50767 -4159 -55359 44142 106609
7850 106609 41707 109381 112011 174061 216963 150632 210029 231828 208233 165858 157931 214484
7838 214484 170131 117079 200456 128144 84687 65736 32019 177789 194957 130966 142429
7827 142429 150461 74541 -70511 15450 78906 -11317 19295 35349 31063 103537 37555 61051
7815 61051 8721 87419 123327 -121204 -77142 -77783 -169167 -267054 -121625 155411 335051
7804 335051 297195 155004 103732 67724 -26066 -56730 63433 -54290 -95256 49204 126575
7793 126575 122964 179043 74918 117792 189395 55850 -21560 29052 -67833 -13604 -58971
7782 -58971 -13550 -93333 -10503 117220 86613 156741 129568 250894 324056 285602 288235 233210
7770 233210 189273 32541 -10019 106905 193550 247449 126193 93899 84049 69878 83477
7759 83477 151762 378939 387910 352838 276606 197630 -221 -185221 -115884 93672 199541
7748 199541 153587 163764 64133 84374 50271 -60151 -39719 183699 169080 83048 68557
7737 68557 63167 39419 -7378 7945 101175 -4613 -26144 14182 23262 -73173 -66034 100622
7725 100622 -7121 -171912 -66101 -24007 2508 -35145 49117 176450 175225 128150 99037
7714 99037 110596 107452 127265 27548 -30599 -4278 -25402 -97184 269 -53171 -119648 -85063
7702 -85063 65544 67952 104576 81801 -36258 79232 112 30742 163607 164337 29045
7691 29045 61524 -35745 -38842 -31269 22535 9150 -29371 169085 254877 172076 203158 29391
7679 29391 80794 158827 196006 141374 91280 157879 176116 -14932 -67935 -33792 67804
7668 67804 102220 206099 177782 -6618 11216 52954 188227 162398 262667 141096 36157
7657 36157 135598 102881 9798 200224 244390 47834 -5649 54924 110734 190510 156366
7646 156366 80555 140265 168943 -38317 -69129 70417 84157 119700 76089 139603 98594
7635 98594 147871 146627 207441 235260 83534 78743 105944 196901 176162 230953 130140 126628
7623 126628 126950 146787 33456 78916 28868 142262 126654 221181 214605 36064 -47098 25628
7611 25628 102242 42361 189619 177857 144616 226874 220946 110450 35168 -17994 -100095 -13085
7599 -13085 -20623 78825 99115 187019 176353 183669 245190 117248 59838 -5478 -36289 88247
7587 88247 188207 120881 22008 80587 140516 106651 202292 203366 146148 130522 100196 115862
7575 115862 60247 123242 183254 210464 256403 123586 134327 47332 2509 104054 178637
7564 178637 170247 149342 166808 199725 140446 164196 117596 60845 192703 208262 138994 111215
7552 111215 40766 131821 177779 74860 41560 205389 254080 174700 84517 98023 258132
7541 258132 216899 161660 138035 98808 -17902 233432 310800 190248 185664 144084 200851
7530 200851 156547 122084 196103 158646 16006 72055 118926 157432 186718 196904 184737
7519 184737 81919 -41515 104062 162650 337132 282867 135263 167969 306560 284427
7509 284427 216008 126863 79223 53837 175492 313065 312497 116626 34182 144072 -25786
7498 -25786 7544 144116 130083 157838 135808 321247 424744 330564 317732 324031 249353
7487 249353 233447 88960 85234 165798 232897 178437 140896 180572 153755 167360 122253 80600
7475 80600 226750 277862 241081 161092 195485 232094 213448 153737 161899 234058 173336 323025
7463 323025 331224 201532 147581 248762 303888 280166 345418 401877 303500 269009 294066
7452 294066 216698 215189 201781 202410 222115 118209 227075 454193 534613 464246 315346
7441 315346 162281 327370 296952 362915 289099 403159 356303 294033 344957 370561 464833
7430 464833 407108 414929 510149 382997 373385 375772 420186 411233 227284 219964 336554 484019
7418 484019 587695 523809 438621 528529 518092 407885 359344 414977 413061 416103 458174 397193
7406 397193 346245 339652 313605 463597 574627 597103 571474 628082 651739 637490 654768
7395 654768 756624 760122 775613 817989 765073 660443 733405 804888 718443 792977 828194
7384 828194 816965 780744 695372 692364 626187 532600 579695 544259 595454 624769 479521 461182
7372 461182 531799 526448 469351 479350 422572 370591 499300 578536 557411 574262 758447 780485
7360 780485 500920 441527 538404 522883 518108 499735 387827 456022 458271 420712 485302 410655
7348 410655 424978 325258 425617 517914 432734 416671 469064 475168 510577 418987 410478 427804
7336 427804 487791 503935 497033 482707 401843 465725 407303 483387 462570 375053 376628 387504
7324 387504 385321 410919 304226 154274 268881 446868 404084 328726 302126 268382 318526
7313 318526 386483 415676 412042 447662 431008 311957 325580 291147 268242 334081 411647 438732
7301 438732 410106 418302 393932 329605 430739 526097 488087 503784 591104 445416 359493
7290 359493 306181 439039 488524 463543 452860 446607 384405 448891 453161 395831 576273 608310
7278 608310 466592 498424 454759 301014 303416 365485 414580 376088 409957 498598 381908
7267 381908 285540 261097 268266 333927 300325 319902 403005 246442 318350 311506 315568 338514
7255 338514 186087 246582 234392 187510 298694 258556 321573 439342 249054 281459 394341
7244 394341 464299 432879 424364 383523 401417 390247 354723 391372 435857 404714 501873 577885
7232 577885 462784 526901 602079 500783 511674 442658 408786 490499 548550 630878 615486
7221 615486 606760 600439 533941 403010 415255 383395 320163 414101 390957 387053 397626 276921
7209 276921 228110 194087 220182 363812 347117 357084 362151 365417 467956 386428 286455 330892
7197 330892 361722 534470 532317 576295 559385 406408 311873 392894 415573 449560 375070
7186 375070 400015 418389 357772 342439 434390 496060 514239 525887 411006 389792 489223
7175 489223 452489 400839 536938 427813 293934 265237 312617 499515 509632 490531 580120
7164 580120 467413 375178 255056 361328 438611 447033 442301 394224 328412 384684 482380
7153 482380 464259 484086 372993 440596 519648 498844 451844 409463 453660 358583 365357 431305
7141 431305 463581 396875 327804 487809 411016 296158 236910 355198 452198 425209 398565
7130 398565 364528 393939 428596 479140 500723 425791 407983 488222 559184 504123 414660 374380
7118 374380 463582 483562 455936 502084 563065 590369 556294 654115 647414 715517 650957 627806
7106 627806 688660 756500 643441 693250 890493 749691 709923 768562 781956 746608 739322
7095 739322 737449 712169 753882 751606 624940 600853 619197 633597 639453 608402 577849 551936
7083 551936 604758 570638 472255 376860 341564 456202 597686 526503 423705 428283 465616
7072 465616 335993 390614 387785 409599 385729 433089 330105 289162 307415 413706 593097
7061 593097 527531 396737 432598 487637 375387 315029 409418 484708 536552 530684 405991
7050 405991 443457 295632 362426 501076 497237 364385 250623 362999 434071 425588 424320
7039 424320 519415 395374 322153 375423 375772 324438 217402 298327 370914 508890 456786
7028 456786 259649 378014 480687 415710 315787 336049 209994 266282 339719 341746 402193
7017 402193 368651 343524 303442 337224 355057 353880 265242 306579 340195 459256 427559 480214
7005 480214 436074 281622 219136 331351 451013 419982 371456 405769 362892 279108 220559
6994 220559 378653 502594 493523 303890 294208 465958 410201 439941 481570 502484 370240
6983 370240 293087 445947 566322 481283 456390 524322 325035 311711 377709 349278 327221
6972 327221 371324 417479 492811 444282 381693 343059 312136 347158 436784 393697 396074 532532
6960 532532 352465 359149 452244 352120 324642 454289 503810 514835 418698 355492 303097
6949 303097 283617 385849 431058 472891 386453 375958 403037 292512 418048 407780 380096
6938 380096 434575 444144 427284 374705 296127 281978 289463 407297 403986 474714 413796 329811
6926 329811 281195 356775 389430 475929 521139 423613 409362 304133 244688 316125 304163
6915 304163 378196 356095 324009 413648 404602 366883 360991 433404 496813 442366 305623 420423
6903 420423 540450 459142 334316 269893 236374 260840 370239 407121 368779 488903 382417
6892 382417 258766 338679 428061 371694 512712 605431 584353 450272 461273 446083 509515
6881 509515 372613 324732 438971 432120 434110 513562 434928 420314 359127 343852 414737 322333
6869 322333 367980 414733 461237 466718 463674 395893 462086 515275 399886 486326 487398 518844
6857 518844 487765 577980 554182 555659 633535 639155 542793 369876 378043 414427 412224 490749
6845 490749 375954 290159 483467 414578 347756 353995 460665 392299 485011 485231 413579 316355
6833 316355 245991 276619 367119 449767 420007 316311 352408 354628 444470 447605 590076 605873
6821 605873 541634 382011 506036 477219 461374 531299 432221 452092 578337 541814 504985
6810 504985 465556 423383 513847 566731 517129 467343 483773 579262 520598 445688 426077 287714
6798 287714 337039 438617 374967 516728 480677 515922 518933 339497 388673 479791 548062
6787 548062 514961 520380 529076 578871 517877 588385 575958 661319 633573 582375 512310 336344
6775 336344 294948 408164 556587 558591 385097 442664 458811 687318 632509 509811 472722
6764 472722 405949 425044 426576 491156 483695 542418 425760 475916 547490 371908 244517
6753 244517 274793 473688 566528 643858 692260 556675 425211 514943 478881 412089 444884
6742 444884 385330 363176 407696 564396 514635 527810 448544 326242 518535 592633 625706
6731 625706 549679 474938 372793 411097 443921 511142 543352 601879 625746 508931 514350
6720 514350 530964 347544 467068 484887 532173 683256 598088 559653 615926 517917 481982
6709 481982 467334 493266 644765 548869 442150 561201 746040 676683 555999 525078 592169
6698 592169 586848 597982 707401 662357 493734 570666 656815 672929 866075 771227 625589
6687 625589 593845 665795 711131 577577 536825 546663 656811 645851 712671 531819 511685
6676 511685 531865 538201 608439 636949 598713 720113 748196 670429 711847 553950 629788
6665 629788 677088 566426 533765 505097 524782 546394 628575 703685 598903 678924 788892
6654 788892 797586 730977 690417 719864 749001 750977 791576 821132 684745 598182 799671 886328
6642 886328 873483 816708 880858 871822 866491 916228 783046 844162 811367 813498 713687 682390
6630 682390 736836 808770 792162 717682 822299 783352 757111 832151 846937 779363 884068
6619 884068 1009623 949925 981205 997510 916708 717060 862895 884408 874893 939211 1005624
6608 1005624 958678 867927 840640 990856 1025543 1039993 1013510 1021165 921461 966981 907640
6597 907640 824330 864696 878900 906490 1008139 1087721 1079577 1125275 1027020 1123879 1036923 975942
6585 975942 1059037 1018482 1023091 1060056 1045690 1070069 1141844 1154827 1077566 1042011 981179 1057709
6573 1057709 1141261 1026248 1130985 1096753 1173726 1244828 1129783 1180883 1230292 1248942 1195874
6562 1195874 1303462 1290474 1447545 1306302 1469305 1511797 1412469 1635222 1701894 1743750
6552 1743750 1819793 1823631 1785213 1826824 1794734 1830531 2007099 1860754 1881592 1902917 1872481
6541 1872481 1818568 1827431 1863396 1750134 1714733 1690979 1615229 1568821 1594411 1502070 1672753
6530 1672753 1713719 1714288 1623691 1618484 1564679 1499844 1599213 1601711 1730250 1631369 1645473 1635415
6518 1635415 1587993 1469941 1622789 1563166 1530479 1695823 1668692 1773648 1661574 1523535
6508 1523535 1506197 1475477 1516407 1508443 1460947 1534002 1619944 1639280 1663906 1646758 1745379 1671220
6496 1671220 1698286 1703579 1927361 2013852 1892615 1894259 1903021 1937085 1861545 1812103 1743469 1668768
6484 1668768 1780951 1817779 1945457 2208301 2200800 2238799 2288149 2398961 2470885 2471138 2510831
6473 2510831 2639144 2517991 2323851 2373148 2348141 2285233 2075019 2125522 2290671 2153502
6463 2153502 2281810 2231881 2223212 2126972 2082484 2090430 2073415 2000924 1959156 1861287 1910028 1826007
6451 1826007 1746241 1717352 1677314 1770915 1633857 1538723 1515349 1466210 1545996 1539057 1495676
6440 1495676 1561562 1508256 1545915 1648423 1741931 1609389 1393744 1282291 1323896 1506956
6430 1506956 1470084 1550898 1496945 1507248 1487039 1435523 1385280 1462470 1480349 1437121 1313475
6419 1313475 1459953 1538813 1463185 1454904 1374330 1434483 1450250 1355767 1349700 1444890 1472151 1496962
6407 1496962 1435535 1400129 1385327 1419370 1568751 1391214 1371873 1357060 1399692 1409910 1369349
6396 1369349 1434742 1494352 1542199 1416278 1452935 1375382 1439440 1477061 1632580 1502987 1544180
6385 1544180 1661187 1572994 1571773 1634136 1784390 1762929 1822514 1843562 1881656 1955150 1998652
6374 1998652 2007390 1938626 1941522 2018487 2093870 2111138 2242092 2289483 2287785 2299593 2393032 2453974
6362 2453974 2530852 2570455 2579101 2687789 2747750 2764636 2869552 2884856 2885569 2814244 3013019
6351 3013019 3086888 3102808 3242345 3297673 3221191 3218875 3386295 3437273 3422094 3424700 3516930
6340 3516930 3642022 3624037 3721164 3844073 3957163 4056097 4209451 4358060 4546293 4716056
6330 4716056 5037055 5199418 5212227 5160663 5024877 4945824 4789380 4617243 4592794 4610177
6320 4610177 4473638 4534626 4569288 4607748 4742947 4837973 4977217 5269385 5356053 5515978
6310 5515978 5571675 5669400 5566808 5510672 5453725 5409106 5276916 5076635 4884241 4824263 4654022
6299 4654022 4277047 4258526 4240882 4146376 4185963 4203568 4102270 4106550 4193989 4305054 4515231
6288 4515231 4675027 4622738 4848612 5215203 5509126 5494887 5658376 5711104 5695160 5601696
6278 5601696 5427682 5414855 5254191 5138486 4994630 4847562 4819169 4730956 4789387 4656572
6268 4656572 4739076 4921888 5057038 5092769 5111252 5298521 5343352 5401694 5446125 5356922 5253536
6257 5253536 5180537 4931344 4718660 4523687 4475651 4321593 4292964 4213636 4094493 4154465
6247 4154465 4073943 4023865 3966129 4016873 3966712 3797839 3864088 3894429 3865296 3788786 3753188
6236 3753188 3721549 3787472 3764363 3566726 3325427 3293572 3283391 3377348 3258477 3199040 3125430
6225 3125430 3193309 3064812 3051953 3082060 3011308 2960672 2884824 2838958 2914137 2893844 2891645
6214 2891645 2860783 2885440 2881099 2737336 2821099 2828572 2791794 2922753 2955551 2936029 3123112
6203 3123112 3153737 3083056 2926743 3020494 2955759 2972238 3059243 3127290 3209470 3227353 3257904
6192 3257904 3303343 3539068 3531769 3440288 3505692 3479765 3611027 3644610 3696222 3613036 3632907
6181 3632907 3808611 3907682 3902777 3934602 3972496 3921716 3855369 3952257 4015291 3887857 3921093
6170 3921093 3917177 4030925 4135393 4116423 4092601 4072286 4160372 4202250 4301570 4345580 4447283
6159 4447283 4471219 4528938 4410507 4436468 4457451 4494454 4446884 4464604 4565802 4495957 4526639
6148 4526639 4463289 4404163 4461463 4554730 4604755 4525315 4451168 4495201 4507468 4582304 4450483
6137 4450483 4512027 4415651 4418079 4496101 4603520 4560170 4520360 4475291 4530340 4699859 4584161
6126 4584161 4560829 4579798 4550925 4507692 4548141 4503566 4434105 4342541 4639441 4801935 4800162
6115 4800162 4786069 4809061 4795357 4796476 4788457 4724131 4842037 4967765 4916647 4954023 4874881
6104 4874881 4965199 5002063 4970796 4992084 5060826 5191571 5209718 5331685 5452914 5413789 5548425
6093 5548425 5766609 5839599 5984224 6113413 6308774 6417120 6564024 6724498 7108536 7226461
6083 7226461 7396288 7663819 7788864 7850428 7966139 8061216 8200102 8579788 9008302 9275231
6073 9275231 9550501 9859116 10062401 10436772 10851516 11356113 11980583 12567350 13165093 13834996
6063 13834996 14741968 15593711 16600185 17791227 19119988 20525626 21996626 23328599
6055 23328599 24820554 26036659 26788500 27287499 27389904 27129776 26396998 25696391 25099715
6046 25099715 24440368 23803311 23304992 22866040 22519675 22292432 22272346 22376856 22488231 22761581
6036 22761581 23282585 23761602 24282087 25123597 26070713 27203431 28476231 29975858 31707699
6027 31707699 33709789 36196506 38768723 41297339 43511002 45402603 46541634 46861662
6019 46861662 46626932 45577633 43763976 41644708 39348429 36991687 34926251 33078197
6011 33078197 31413680 29890824 28671023 27535105 26403882 25555291 24874241 24202392 23771767
6002 23771767 23407891 23158595 23149759 23222647 23498900 23690280 24247970 24999806 25855102 26770947
5992 26770947 27761903 28764227 29507635 29901412 29753325 29358065 28468587 27284463 25780912
5983 25780912 24173081 22537909 21072469 19889553 18637324 17538353 16467021 15637187
5975 15637187 14880750 14085496 13309172 12697747 12193816 11730943 11138965 10714761 10341444
5966 10341444 10007638 9761936 9428525 9199691 9020268 8820592 8544594 8267304 8028493
5957 8028493 7734915 7461873 7325498 7133808 6827693 6620418 6493132 6507415 6303743 6222301
5947 6222301 6122348 5952024 5829791 5725295 5729316 5644897 5551284 5491865 5589324 5622023 5539280
5936 5539280 5330436 5384136 5576609 5509165 5470289 5496204 5264961 5336281 5407808 5384611 5343351
5925 5343351 5290065 5228864 5186575 5120569 5013929 4835529 4734833 4716762 4795442 4745196 4635960
5914 4635960 4721220 4732633 4597271 4585562 4733637 4802351 4760506 4654142 4605160 4519895 4414195
5903 4414195 4540365 4665023 4684591 4651900 4442168 4365880 4348179 4346877 4464150 4355839 4331849
5892 4331849 4280586 4217457 4188499 4240643 4266338 4258137 4272476 4216554 4225754 4233941 4178669 4197561
5880 4197561 4128676 4052647 4196706 4146437 4099109 4143254 4170881 4036419 3992949 4025119 4115471
5869 4115471 3909016 3762899 3794368 3794263 3879102 3856461 3864446 3765993 3600953 3671527 3592947
5858 3592947 3420483 3485570 3373416 3474782 3399151 3277750 3325975 3271966 3349096 3327508 3371028
5847 3371028 3331767 3317014 3393334 3412864 3302209 3247041 3230729 3318588 3322725 3245154 3369619
5836 3369619 3333143 3201784 3295765 3060750 3065571 3022930 3077795 3001223 2934002 2970621 2811536
5825 2811536 2777373 2896659 2963810 2906181 2854992 3049321 3132296 2840522 2606943 2681284 2791607
5814 2791607 2791837 2917116 2944531 2890599 2887843 3012839 3047651 3034616 2939350 3024306 3143290
5803 3143290 3219740 3299260 3346274 3227859 3233870 3252729 3180324 3157105 3144691 3169822 3082742
5792 3082742 3073053 3146927 3052407 2993244 3077618 3128174 3223273 3405361 3266921 3227239 3121393
5781 3121393 3176385 3150665 3152552 3139417 3107351 3039508 2928142 2941939 3039448 3107562 2977828
5770 2977828 2941196 2954382 2919188 2938287 2921435 2855253 2963042 3035409 2963463 2956271 2801499
5759 2801499 2902782 2904051 2960781 3018352 2911521 2853812 2806788 2794950 2827616 2917863 2972983
5748 2972983 3031041 2971851 3019651 3052202 3036984 3092109 3124995 3051607 3013296 2969672 2903345
5737 2903345 3011199 3044513 3065453 3107669 3124512 3255244 3228603 3173398 3122441 3173566 3100708
5726 3100708 3133660 3217696 3266281 3244404 3344082 3280109 3263516 3423976 3371928 3411721 3515283
5715 3515283 3475957 3589827 3483856 3566568 3628386 3655120 3567601 3662537 3807234 3669491 3717623
5704 3717623 3728453 3938587 3954656 4058393 4029836 3888529 3968214 4050526 4074519 3911883 3892691
5693 3892691 3822408 3863844 3919130 3911775 4024786 4036342 4062221 4153290 4272842 4283142 4153555
5682 4153555 4247390 4350116 4295431 4367966 4425266 4513006 4716004 4743279 4710937 4782684 4819583
5671 4819583 4783305 4985680 4926359 4944731 4979550 4949119 5103488 5148186 5198436 5274230 5297555
5660 5297555 5333422 5536711 5584209 5562216 5652438 5760935 5824191 5919311 6079513 6200678 6341272
5649 6341272 6597090 6696276 6928199 7153477 7245510 7405748 7652322 7833318 8045307 8305563
5639 8305563 8709750 8906435 9208585 9585171 9999880 10325468 10725899 11034494 11249141 11846586
5629 11846586 12417791 12961191 13624097 14414894 15070869 15736298 16646491 17714971 18963992
5620 18963992 20118204 21477467 22977756 24692586 26541167 28563514 30899713 33455615
5612 33455615 36257361 39424176 42955813 46651031 50634319 54818655 58970020 63296506
5604 63296506 67365532 71146020 74517927 77210397 79079665 79943252 80123496 79350650 77847178
5595 77847178 75838215 73306744 70464267 67342892 64061309 60691558 57448195 54392776
5587 54392776 51360136 48334244 45402958 42779766 40347126 38088025 35929276 34023072
5579 34023072 32255224 30570313 28980646 27519007 26087719 24821505 23767020 22671586
5571 22671586 21660669 20830342 19935721 19076582 18219892 17602057 16880661 16180462 15606171
5562 15606171 15091938 14498989 14015685 13446689 12876371 12417646 11981039 11605289 11287810
5553 11287810 10958716 10521399 10118013 9820139 9561803 9329110 9146478 8964120 8678506
5544 8678506 8534794 8444981 8285223 8155113 7873845 7644748 7569974 7549002 7490581 7355371
5534 7355371 7255337 7133516 6931507 6779525 6556306 6419145 6270823 6194908 6031728 5914209
5524 5914209 5811057 5763334 5546153 5363891 5374360 5158305 4988967 4973543 4919542 4783682
5514 4783682 4693925 4521947 4442164 4478358 4485040 4443995 4333601 4110207 4003884 4033989 4069524
5503 4069524 4162770 3982423 4028918 4066991 3943548 3887759 3823588 3789026 3675892 3563250 3448317
5492 3448317 3390332 3398524 3427841 3330489 3325093 3342378 3141840 3186747 3295999 3244599 3223221
5481 3223221 3241525 3116846 3139306 3013928 2951415 3114771 3129078 3109113 3103878 2998009 2997436
5470 2997436 2954136 2997880 2930911 2866649 2900759 2781684 2762138 2778216 2715520 2720668 2756364
5459 2756364 2595219 2478524 2512152 2699450 2634547 2603452 2689018 2640272 2662159 2730221 2691352
5448 2691352 2678912 2642199 2587056 2690075 2733976 2723528 2716150 2706856 2790290 2769663 2621818
5437 2621818 2622565 2725992 2774234 2783333 2938072 2928016 2715755 2688060 2716270 2762441 2762081 2844407
5425 2844407 2823725 2884793 2801668 2799703 2772917 2862231 2957649 2968647 2993191 2978783 2996568 2939757
5413 2939757 2891198 2850868 2827278 2863397 2771049 2622039 2619494 2707957 2853517 2709433 2723644
5402 2723644 2748582 2739929 2740096 2546263 2492816 2465695 2410815 2480987 2674172 2716687 2641679 2572764
5390 2572764 2603188 2693935 2629779 2721701 2665253 2485718 2559346 2635805 2550566 2526126 2589124
5379 2589124 2454574 2443747 2372466 2399181 2519034 2502796 2452263 2470808 2418431 2484166 2374087
5368 2374087 2413087 2486450 2526676 2632243 2561155 2552254 2531393 2542954 2629078 2647433 2601237
5357 2601237 2586613 2592570 2646866 2454585 2462936 2578459 2571845 2387710 2333932 2441332 2518394
5346 2518394 2384095 2338448 2519355 2473563 2304151 2326469 2229764 2298532 2141396 2120709 2159642
5335 2159642 2215469 2214781 2247143 2206817 2262945 2264464 2267541 2324214 2289071 2255390 2016316 2041377
5323 2041377 2180369 2239737 2192120 2126130 2189417 2297565 2421740 2446185 2360700 2272640 2139971
5312 2139971 2295443 2491064 2410201 2333710 2486621 2538409 2514681 2628523 2550938 2493254 2580981
5301 2580981 2544059 2525034 2517579 2493690 2637535 2617950 2555478 2593354 2707182 2708401 2549818
5290 2549818 2413072 2429141 2532644 2570273 2658563 2598724 2493325 2534822 2621903 2567005 2501369
5279 2501369 2580266 2720519 2760214 2899746 2715441 2573824 2594254 2535275 2567947 2728963
5269 2728963 2662544 2672735 2691109 2667186 2607565 2578410 2675359 2734381 2676829 2850127 2721520
5258 2721520 2842307 2934268 2685941 2566746 2734657 2771841 2600890 2825726 2964454 3005503
5248 3005503 3061018 2992841 2919906 2903267 3067269 3225824 3168633 2971577 3001388 3081054 3243131
5237 3243131 3302521 3286615 3312962 3331493 3498265 3707887 3596074 3555430 3595221 3608018 3681356
5226 3681356 3613804 3602344 3477807 3524685 3482847 3387629 3426712 3328335 3335307 3269331 3278862 3452198
5214 3452198 3295723 3202145 3138317 3134719 3166819 3298707 3302921 3451262 3472231 3298251 3203506
5203 3203506 3337468 3392073 3346077 3329805 3441565 3545842 3320331 3301159 3361336 3414621 3465455
5192 3465455 3458842 3383784 3332787 3461239 3363297 3374542 3268762 3195786 3237133 3326541 3427493
5181 3427493 3518397 3330826 3375642 3396878 3382335 3314910 3328095 3412517 3505578 3613227 3653196
5170 3653196 3536890 3463565 3485962 3510897 3549168 3581479 3560465 3536058 3476018 3537171 3604570
5159 3604570 3617028 3606747 3638398 3595686 3711839 3770821 3762752 3886867 3811085 3909209 3803339
5148 3803339 3896704 3972868 4128338 4150541 4077055 4125591 4381576 4391802 4403378 4336052 4409673
5137 4409673 4405046 4430236 4505868 4500102 4639873 4665260 4849315 4768834 4673801 4667639 4679257 4924005
5125 4924005 5001406 5134702 5157293 5128898 5065485 5123487 5303673 5345123 5343873 5489744 5522594
5114 5522594 5589121 5736095 5924762 6140229 6220464 6452856 6568474 6604693 6592053 6545606
5104 6545606 6813894 7129185 7253399 7591708 7824689 7954515 8298953 8373333 8420841 8498081
5094 8498081 8405217 8222443 7961856 7742004 7512104 7431722 7386809 7335540 7149311 7043858
5084 7043858 6969338 6865167 6769907 6834590 6838191 6810572 6867245 6859867 6826163 6864341 6921501 6972193
5072 6972193 6874464 6754855 6733267 6734495 6733316 6819364 6804483 6732673 6625427 6509318 6661585
5061 6661585 6614293 6650390 6543546 6501524 6531482 6613088 6593299 6664707 6511346 6478721 6544904
5050 6544904 6693927 6704470 6716400 6774511 6845150 6994773 6880476 6959072 6961809 6980496 7173335
5039 7173335 7300549 7374838 7488427 7384174 7343449 7584074 7614937 7696047 7777740 7816230 7826410
5028 7826410 7866008 7966582 8005928 8047114 8189712 8314122 8271079 8351929 8455451 8646781
5018 8646781 8794869 8747748 8870994 9096275 9262325 9421590 9620593 9804059 9852223 10114978
5008 10114978 10382360 10696767 10805561 10947762 11089750 11415631 11692248 11802000 11958805
4999 11958805 12283885 12748674 13098635 13412765 13882422 14184897 14586157 15205692 15875697
4990 15875697 16449024 16957396 17751625 18616582 19551169 20573449 21672927 22759477 23947372
4981 23947372 25230645 26629631 28252272 30036758 31914292 33949485 35962011 37904029
4973 37904029 39888224 41384098 42627874 43458656 43683179 43725235 43619902 43289375 43038688
4964 43038688 42716457 42719126 42625908 42673778 42928513 43436864 44014153 44776656 45595434 46590227
4954 46590227 47760840 49176960 50818817 52658990 54826853 57249364 59943804 63164242
4946 63164242 66935080 70893885 75012364 79379181 83553683 87252897 90653026 93112821
4938 93112821 94433252 94787387 94675296 93809457 92718827 91659971 90700395 89929982 89589332
4929 89589332 89615865 89723265 90265369 91137526 91934739 92979192 93985510 95122320 96112120
4920 96112120 97343620 98446131 99563003 100757659 102139967 103735616 105631172 107607279
4912 107607279 109421767 111258858 112731870 113373834 113240866 112138961 110274179 107489134
4904 107489134 103885908 99829661 95537557 91500869 87737939 84463237 81809991 79577643
4896 79577643 77938104 76768199 75620750 74586949 73476469 72059311 70074522 67725631
4888 67725631 64971495 61884143 58730593 55526841 52699226 50318611 48073777 46070790
4880 46070790 44289134 42682716 41316616 40140785 39134394 38264841 37402308 36798081 36316161
4871 36316161 35813292 35302814 34779369 34069505 33319462 32442578 31547335 30650233 29713877
4862 29713877 28903361 28339901 27707706 27157977 26638835 26008720 25609380 25331718 24972132
4853 24972132 24591305 24205692 23692745 23416654 23089405 22770037 22513499 22213923 21968789
4844 21968789 21899371 21855074 21585414 21481223 21269220 20920291 20551488 20189343 19793163 19402952
4834 19402952 19145519 18748254 18524491 18273685 17889898 17574374 17346767 16996205 16654207
4825 16654207 16287135 16118274 15856512 15484570 15133911 14871956 14600306 14379336 14060362
4816 14060362 13805982 13636189 13327126 13106115 12855296 12708716 12585841 12373863 12243333
4807 12243333 12159616 11986455 11810185 11508341 11481792 11393034 11296029 11061979 10961724 10954086
4797 10954086 11037749 10980032 10819577 10683249 10654100 10759535 10654342 10575314 10610200 10628964
4787 10628964 10646497 10651488 10634103 10659810 10801953 10804157 10917678 11043998 11095986 11123799 11184490
4776 11184490 11260957 11459593 11598726 11541051 11263973 11404221 11330614 11181733 11124047 11090923
4766 11090923 11148081 11103957 10855687 10713050 10837900 10853330 10954193 10787592 10719087 10868738
4756 10868738 10950820 10840111 10815127 10858943 10852384 10795652 10828902 10825047 10726145 10753790 10753585 10847324
4744 10847324 10971723 11037101 11073540 11084833 11062122 11010341 11268181 11269870 11325490 11353412 11284321
4733 11284321 11263174 11275983 11361774 11469177 11528835 11600323 11710857 11858825 11962296 11984330
4723 11984330 12222672 12311325 12334283 12806942 13134562 13317165 13518001 13936116 14365689 14761663
4713 14761663 15573458 16313971 17304841 18626937 19742309 20847165 21844035 22604197 22590873
4704 22590873 22396772 22025729 20991566 19890805 18872875 18105447 17376897 16932814 16733032
4695 16733032 16361801 16047162 15775843 15690037 15623945 15582426 15531557 15595637 15708919 15687768
4685 15687768 15612512 15770012 16053150 16189075 16374089 16750165 17169412 17402334 17710822 18245074
4675 18245074 18785530 19117075 19631968 20239188 20903694 21742406 22489871 23397100 24210146
4666 24210146 25292750 26566823 27899891 29467970 31088424 33155043 35352322 37486884
4658 37486884 39980380 42740101 45775971 49057844 52598229 56676187 61310853 66542322
4650 66542322 72622754 79738891 88326759 98564930 110242107 122101379 133498229 143860812
4642 143860812 151653740 155414554 155074126 151551368 144709569 135371907 125235989 115279072
4634 115279072 105956891 97576469 90108912 83595732 77886072 72719760 67948225 63701664
4626 63701664 59973562 56563484 53621224 50785901 48060611 45705139 43419747 41481651
4618 41481651 39488677 37762532 36186077 34602496 33160951 31704115 30465798 29181419
4610 29181419 28067488 26945071 25672415 24867225 24001604 23330252 22625345 21967113 21155682
4601 21155682 20504517 20069574 19464369 19008530 18674033 18339561 17964292 17650561 17335034
4592 17335034 16894481 16735130 16516801 16169146 16011867 15722834 15519409 15258124 15084051
4583 15084051 14984073 14926793 14739152 14518325 14313526 14255365 14076592 13651446 13315193 12994401
4573 12994401 12664790 12342558 12029851 11763861 11587979 11503049 11429438 11132614 10935578 10784944
4563 10784944 10828230 10824713 10721224 10591518 10526020 10617131 10533274 10508605 10410416 10406865 10300114
4552 10300114 10155591 10064819 9915716 9838170 9891725 9922276 9772758 9702034 9762451 9916452
4542 9916452 9938460 10028333 10124067 10188170 10421985 10597289 10595969 10717671 10964115 11058184 11167756
4531 11167756 11458850 11710141 11825495 12185149 12420606 12540070 12730815 12883011 13094426
4522 13094426 13194699 13405882 13625324 13718030 13729344 13633269 13696352 13744428 13667479 13675978 13725083
4511 13725083 13632724 13627448 13564224 13598412 13439900 13380113 13240882 13037638 12716280 12527510
4501 12527510 12423928 12097254 11960830 11757278 11752774 11745419 11590785 11431432 11362744 11218573
4491 11218573 10872630 10744662 10762962 10526228 10447420 10376463 10177130 9946277 9689906 9600767
4481 9600767 9515246 9453941 9136790 8902812 8965323 8963108 8787107 8750926 8646527 8554020 8466098
4470 8466098 8280604 8355629 8272795 8179974 8008791 7989376 8173897 8108682 7913025 7865831 7925685
4459 7925685 7947959 7901740 7715424 7518983 7458600 7450346 7333881 7128361 7013533 6990890 6946098
4448 6946098 6927987 6839712 6822068 6787207 6825133 6646782 6544095 6554778 6465388 6341546 6268165
4437 6268165 6349468 6270886 6257268 6342565 6380822 6372955 6386920 6211631 6217764 6281759 6301108 6135863
4425 6135863 6104654 6103918 6061189 6071136 6231082 6199112 6062968 6176080 6201345 6027379 6038541
4414 6038541 6072206 5955489 5986995 6030195 6030049 5916321 5790592 5573998 5574537 5520896 5572184
4403 5572184 5509627 5486773 5517906 5373828 5400392 5457314 5458802 5444971 5331499 5356314 5336390
4392 5336390 5367447 5431800 5395883 5397238 5495545 5529883 5462023 5705058 5864893 5549213 5597664
4381 5597664 5767645 5868502 5967896 6010871 6068942 5971505 6020036 6013876 6037882 5963145 6047784
4370 6047784 6182229 6210255 6236839 6281923 6230441 6230693 6245263 6275783 6331139 6463614 6527903
4359 6527903 6764751 6877477 6933033 6968183 7236721 7386902 7280813 7334313 7465071 7450984
4349 7450984 7308521 7285757 7124302 7076106 6988170 6879649 6715330 6613746 6786042 6664441
4339 6664441 6683000 6753938 6645357 6619474 6594335 6569885 6531562 6451505 6357124 6257877 6228047
4328 6228047 6287639 6145195 6076429 5970827 6050867 6070374 6097602 6040732 5971123 6086689 6083612
4317 6083612 6158751 6187559 6095899 6034115 6019189 5902812 5962530 6304519 6258017 6205737 6144863
4306 6144863 6138928 6394252 6344746 6243440 6493683 6583304 6580533 6641536 6702792 6700881 6776530
4295 6776530 6943400 6933094 6946438 7019074 7086379 7161812 7265799 7262001 7200058 7362612 7477333
4284 7477333 7428583 7451317 7538915 7629930 7573914 7699080 7786403 7793320 7905627 8002016 8191884
4273 8191884 8263977 8342483 8423903 8456461 8418819 8530313 8461360 8436177 8655608 8789607 8741765
4262 8741765 8826812 8987622 9022817 9191226 9222144 9338424 9427708 9646165 9571584 9651019 9767761
4251 9767761 10016688 10184660 10267697 10469632 10525175 10645687 10718361 11087714 11236414 11442288
4241 11442288 11760325 11957075 12088888 12376129 12715903 12996640 13340793 13737485 14062787
4232 14062787 14489492 14882383 15299598 15861015 16435568 17011817 17709106 18389890 19089221
4223 19089221 19882762 20669411 21605069 22676101 23722820 24877405 26122051 27404030 28832987
4214 28832987 30221263 31853590 33532942 35384350 37227830 39208223 41430805 43589626
4206 43589626 45762136 48082650 50548499 53115439 55767760 58347458 61212010 64206136
4198 64206136 67226880 70278707 73503176 76727066 79795932 83004366 86129568 89157516
4190 89157516 92203761 95252266 98219670 101309372 104246023 107081651 109974658 112721121
4182 112721121 115455551 118138767 120517020 122629081 124585509 126346468 127718201 128794498
4174 128794498 129881164 130745881 131199037 131628059 132075782 132273439 132170025 132029487 131554293
4165 131554293 130842625 129893790 128611458 127072175 125244736 123312518 121167952 118884561
4157 118884561 116501703 114019211 111384782 108842761 106131883 103460899 100645801 97722804
4149 97722804 94727333 91618360 88482320 85293642 82084068 78906497 75811407 72703568
4141 72703568 69770326 66756529 63880669 61129501 58530885 56010611 53498842 51042643
4133 51042643 48662058 46310937 44097703 41929536 39771798 37846242 35984364 34404147
4125 34404147 32890530 31226720 29739018 28349079 27012522 25784223 24622118 23568960
4117 23568960 22597656 21696163 20688304 19986349 19331489 18536712 17823947 17108478 16463211
4108 16463211 15977309 15531339 15147333 14745957 14370056 14061027 13733540 13325734 13077001
4099 13077001 12837302 12466900 12250353 11914689 11681918 11508758 11363746 11254839 11158372 10967989
4089 10967989 10840096 10761354 10602663 10483148 10309791 10069057 10020555 9927441 9813432 9776096
4079 9776096 9645691 9526089 9483399 9462469 9422365 9390294 9035166 9061380 9027575 8806397 8841867
4068 8841867 8781541 8702830 8616001 8519280 8474516 8322565 8210649 8241616 8225338 8266262 8232385
4057 8232385 8237041 8194625 8197388 8058194 8079086 8161989 8177676 8257995 8257236 8225564 8252988 8211561
4045 8211561 8237358 8395748 8487499 8461287 8473734 8432954 8438125 8368030 8313563 8352107 8411594
4034 8411594 8546519 8447010 8299149 8370382 8400912 8366597 8322651 8345552 8369782 8420012 8430497
4023 8430497 8401932 8351358 8309635 8288882 8273296 8325226 8243776 8205505 8111407 8179734 8249975
4012 8249975 8236479 8315397 8285664 8192230 8287989 8402012 8418040 8466579 8452842 8382977 8530143
4001 8530143 8668341 8754145 8928322 8951206 8892129 9058003 9168601 9296205 9471129 9582807
3991 9582807 9672829 9616530 9658701 9751129 9666977 9615338 9748160 9764824 9655782 9595324 9596991
3980 9596991 9667786 9641591 9735112 9620504 9595100 9447350 9376545 9368021 9332528 9307168 9267220
3969 9267220 9165814 9070052 9147659 8975332 8817579 8934250 8921857 8879068 8994052 8982119
3959 8982119 8907743 8832597 8935658 9110903 9087138 9199826 9325207 9402830 9480385 9544849 9574961
3948 9574961 9667014 9753301 9917170 10094726 10267515 10449669 10490073 10536288 10685410 10669960
3938 10669960 10741104 10825020 10804641 10951112 11045071 11285324 11321990 11324783 11379613 11423444 11535223
3927 11535223 11679433 11873797 11895657 11917065 12078902 12160989 12134437 12259718 12521161 12608940
3917 12608940 12685577 12818122 12987897 12959036 13141610 13125610 13338481 13610079 13675099 13785695
3907 13785695 14183405 14297388 14358314 14578793 14729790 14729574 14892959 15219142 15319134 15589890
3897 15589890 15803566 16098727 16287379 16412352 16644900 16891070 17118294 17374636 17612789
3888 17612789 17947516 18311047 18812568 19216325 19453262 19580712 20142017 20744818 21338376
3879 21338376 21932103 22429941 23209293 23944188 24608017 25501050 26421993 27438725 28699752
3870 28699752 29895873 30934533 32103429 33412127 34548277 35885131 37001114 38375975
3862 38375975 39638227 40875041 42154263 43430530 44695802 46012178 47338362 48637578
3854 48637578 49823345 50823968 51697319 52438906 53329286 54111738 54720113 55332787 55709356
3845 55709356 55955403 56430492 56683017 56934420 57103177 57297137 57467919 57519111 57479469 57449266
3835 57449266 57584887 57543638 57696220 57840239 58250919 58564956 58893587 59500871 60309360 61321807
3825 61321807 62342952 63732853 65375252 67237993 69378909 71780381 74446945 77549601
3817 77549601 80939430 84535759 88428251 92638149 97001231 101637520 106368800 111370077
3809 111370077 116443538 121819977 127499160 133287644 139159999 145503459 151936644 158234562
3801 158234562 164540476 170941608 176941353 182998629 188980322 194563318 199918032 205079457
3793 205079457 210030472 214663092 219140967 223178941 226816230 230048624 233122078 235836713
3785 235836713 238030438 239899353 241627922 243006750 244253923 245442025 246549791 247743848
3777 247743848 248712324 249682933 250477148 251429661 252426163 253631942 255088336 256871805 258951286
3768 258951286 261572399 264978073 268980908 274123238 280334285 287619159 296248592 306061335
3760 306061335 316644761 327447952 337972952 347954932 356615294 363779916 369017774 372394919
3752 372394919 374092355 374473805 374072106 373020731 371947103 371074244 370589400 370070605 369437832
3743 369437832 368277134 366016519 362522331 357818805 351663978 344555705 336671776 328559582
3735 328559582 320972455 313994026 308089549 303397856 299552688 296685765 294615634 292529328
3727 292529328 290417500 287960700 285245734 281854240 278050636 274078243 270199023 266333715
3719 266333715 262629842 258983393 255444545 251996705 248135052 243648203 238856184 233032544
3711 233032544 226136775 218526504 209851123 200580978 190936580 181322384 171907034 162795675
3703 162795675 154140940 146001788 138543578 131529286 125063120 119253286 114036449 109014129
3695 109014129 104396496 100133089 96124592 92515317 88934552 85489878 82348105 79381551
3687 79381551 76512131 73886687 71371902 68905442 66637432 64516515 62254409 60051685
3679 60051685 58084078 56044019 54238818 52466663 50617937 48802988 47028492 45423286
3671 45423286 43912084 42446054 41060951 39660941 38314717 37003729 35851707 34645699
3663 34645699 33552385 32573659 31622325 30847988 30044720 29328799 28584693 27933445 27126017
3654 27126017 26453832 25933213 25439085 24852376 24385000 23973548 23477291 23009828 22496390
3645 22496390 22232939 22018420 21777260 21366591 21130788 20881610 20722994 20500599 20231387
3636 20231387 20022665 19885131 19573118 19299116 19245835 19170949 19003602 18789626 18595321 18406017
3626 18406017 18292917 17981506 17976566 18057938 17948014 17858931 17786623 17669075 17641422 17536378
3616 17536378 17450266 17500878 17424079 17362031 17312629 17279428 17302628 17262452 17261609 17096537 17136673
3605 17136673 17062799 17181306 17169878 17045760 17129049 17225439 17269837 17306244 17339504 17292562 17303752
3594 17303752 17273375 17254005 17241674 17169420 17312287 17326054 17198104 17111489 17144537 17114895 17156210
3583 17156210 17191668 17245641 17281185 17306387 17361308 17313478 17270613 17185016 17206656 17231880 17225581
3572 17225581 17272082 17244365 17234008 17224972 17219539 17233417 17276914 17166405 17099846 17010073 16894509
3561 16894509 16920542 16924446 16960772 16976531 16964157 16909957 16932795 17011966 16958836 16854753 16926078
3550 16926078 16884367 16848839 16863236 16887516 16830446 16744041 16701419 16728440 16705911 16692732 16738684
3539 16738684 16740524 16652186 16520010 16494172 16433146 16364313 16374088 16265456 16283951 16290233 16287903 16334319
3527 16334319 16432521 16334288 16236567 16136000 16155754 16231627 16166350 16145073 15959796 15857160 15796839
3516 15796839 15701535 15822217 15847032 15833528 15741677 15634429 15683645 15683809 15746980 15686772 15648775
3505 15648775 15567582 15409885 15331346 15285906 15317152 15407853 15407640 15281790 15236030 15259519 15189946
3494 15189946 15232949 15326472 15209962 15064180 15051929 15015463 15000241 15030852 14897257 14939908 14851482
3483 14851482 14789677 14806853 14856251 14801627 14632085 14598360 14751277 14817573 14712449 14836257
3473 14836257 14949345 15007128 14976762 15109442 15159921 15142045 15147501 15248575 15375394 15421700 15430341
3462 15430341 15325044 15182291 15093568 15194444 15133263 15004938 14852408 14802938 14738849 14636286
3452 14636286 14540568 14374687 14222107 14038382 13751353 13623426 13502220 13400638 13240224 13128802
3442 13128802 13112122 13021595 13012539 12964883 12750291 12576528 12506866 12371304 12145211 11944908
3432 11944908 11913069 11805891 11658756 11691132 11641800 11624982 11576105 11550887 11526877 11549398 11541659
3421 11541659 11372948 11243565 11090789 11048199 10859877 10771039 10775766 10737755 10756671 10554725
3411 10554725 10290406 10038798 9954952 9819754 9713712 9451192 9205602 8923905 8696948 8503306
3401 8503306 8413720 8348374 8258136 8177719 8041218 8034618 7909932 7757962 7646208 7657829 7651108
3390 7651108 7773315 7790882 7653129 7376652 7323051 7080893 7073191 6870500 6724479 6518240
3380 6518240 6368556 6336374 6330387 6128578 6016842 5938151 5889740 5836442 5750224 5576605 5546267
3369 5546267 5463233 5344983 5202204 5273517 5314221 5286259 5362159 5176284 5074516 4922496
3359 4922496 4830434 4830039 4795140 4634451 4565602 4464916 4573813 4574153 4489872 4520846 4415808
3348 4415808 4345061 4462169 4245492 4097524 4129003 4076361 3850787 3940946 4097433 4120295
3338 4120295 4030964 3976005 3978385 3861369 3831402 3847584 3745764 3836919 3811767 3678959 3720628
3327 3720628 3648755 3656477 3621225 3627662 3724953 3543136 3534437 3500451 3465746 3488285 3513701 3541740
3315 3541740 3428384 3245424 3264298 3270135 3306148 3400419 3381470 3366429 3384293 3422682 3502126
3304 3502126 3468018 3395278 3468033 3631014 3669573 3593812 3705382 3795721 3998623 4167642 4292765
3293 4292765 4482200 4464476 4415563 4464912 4471287 4503480 4393477 4081631 3898044 3738108 3794676
3282 3794676 3598108 3440672 3455346 3378453 3318309 3311197 3305641 3231159 3347129 3291819 3292823
3271 3292823 3433366 3722006 3757226 3686548 3766153 3964845 4145512 4355265 4403067 4139124
3261 4139124 4038172 3895703 3827642 3701167 3615827 3482105 3261571 3156283 3122821 3143582
3251 3143582 2938582 2969376 2882568 2648671 2607381 2615838 2595744 2453044 2353304 2480451 2476320
3240 2476320 2386606 2358200 2302291 2330938 2223371 2185218 2335760 2294831 2336103 2271347 2104746
3229 2104746 2216671 2270233 2161296 1975266 2012450 2038857 1875752 1730750 1793341 1863677
3219 1863677 1824982 1754532 1786516 1679008 1616863 1764517 1633096 1614339 1635560 1692416 1621524
3208 1621524 1567937 1597048 1436579 1526818 1519833 1564209 1584887 1562614 1569315 1549016 1501715 1417156
3196 1417156 1402662 1331890 1322808 1266502 1241385 1222177 1294698 1399263 1304429 1322388 1400214
3185 1400214 1425955 1319072 1313322 1480260 1461026 1330871 1174440 1284715 1291837 1377837 1408426
3174 1408426 1268285 1271978 1281997 1322398 1356972 1202549 1231125 1228371 1160977 1193228 1135237
3163 1135237 1090213 1128041 1101402 1053722 1163143 1084071 971905 999180 1145302 1123212 1081814
3152 1081814 1050790 1057957 1039571 1094761 1065401 1033408 1040703 1005732 940652 1035979 1118901 988852
3140 988852 977266 1033694 1009920 868760 850893 896244 889976 918019 950537 1037628 1062477 983091
3128 983091 1014809 1164662 1135759 1061742 955561 978941 1124834 1183008 1203821 1109759 1097771
3117 1097771 1159414 1153058 1034171 1155411 1108097 1050704 1073198 977052 806918 904026 870234
3106 870234 941815 918924 853555 829709 881972 993136 936149 1117867 1205206 1130154 1117052
3095 1117052 1168796 1131538 1191448 1203723 1076095 979453 1017733 1044987 980428 1000453 1007392
3084 1007392 1001079 928445 903625 863294 812161 925478 960323 954099 824981 764095 763936 772594
3072 772594 788113 855871 863304 780118 623943 613592 686706 649417 569672 532902 550794 442731
3060 442731 590351 673918 622187 617036 555338 582723 570899 605040 543355 523490 569761 649921
3048 649921 538473 469276 371617 373535 461289 529779 461795 482437 488205 420852 412440 370275
3036 370275 333210 323053 298522 393971 370331 160168 219711 308332 330444 216743 219616
3025 219616 313195 371693 289785 272612 269231 219875 170947 188260 142960 195114 220919 325623
3013 325623 304916 283445 378822 267796 242618 129760 259494 286649 277043 213933 148221
3002 148221 110039 185984 263663 128749 144964 176095 314048 328844 156439 69993 138862
2991 138862 108437 119746 164957 299149 191584 245922 173493 65433 16793 22035 17915
2980 17915 32047 161923 168692 171215 131569 145361 153312 112714 40302 136407 160430 247491
2968 247491 217629 212490 203806 154295 90109 234538 254744 153528 143048 244696 236881 147507
2956 147507 195362 184752 294563 335501 166109 -2270 21116 201784 171592 90205 13770
2945 13770 31211 34789 -13904 54273 92667 -40151 -51017 45946 -29126 -428 57096 -103166
2933 -103166 -141100 112354 192789 125007 -15317 181500 308101 133442 149350 100932 69664
2922 69664 40588 23121 65291 98705 209026 176243 162705 223039 84932 -20312 -4362
2911 -4362 80444 84330 -66456 -180874 -180214 -61654 2729 201703 165654 96664 46835 55043
2899 55043 97401 71375 -28399 -35626 66837 53637 88496 57699 11202 -63358 -114161 -18100
2887 -18100 62164 64497 -97550 42149 96784 69859 126734 -72138 -49338 -98586 -86014
2876 -86014 -48393 58550 36218 -10969 34326 -7403 76681 -8894 -118420 -91271 -13277
2865 -13277 -1232 6271 20027 20528 77713 157377 12094 121532 139198 -43168 -27128 -59079
2853 -59079 -70249 -128989 -253297 -188104 -50004 43399 19995 64902 176744 73589 -92456
2842 -92456 -98293 -103487 -60884 85879 -3163 -136724 -140534 -30851 19201 -105036 -6658 40903
2830 40903 -107418 -114427 -165967 -15967 -211839 -212632 -134292 -1766 -9688 -90102 -49537 -48119
2818 -48119 -36156 -63791 -39923 -119639 63178 142924 124462 136521 71163 -93360 -177118
2807 -177118 -4711 23143 -86051 -186162 -196971 -183132 -283672 -204090 -200120 -147617 -189187
2796 -189187 -239540 -239696 -309421 -165045 -64593 -129242 -214933 -152682 -130924 -47765 -68619 -112994
2784 -112994 -155209 -231291 -150450 -73508 -103544 -105474 -33549 -100325 -85586 153285 108516 -79356
2772 -79356 -24280 -38684 -25170 26271 -64015 -104231 -14662 28979 56120 91831 2345 -152316
2760 -152316 -236630 -213255 -101906 -1870 -163428 -134829 -45597 -61350 -35707 16901 -6283
2749 -6283 -90874 -72892 50468 73868 -124320 -176924 -98890 -232506 -80398 -10379 -104594
2738 -104594 -29901 57763 28251 -117515 -80350 -9219 -60602 -94843 -37220 -2419 -99923
2727 -99923 -205665 -19926 -88923 -83885 -83966 -45088 -61849 -12179 -88147 -73075 -149473 -338950
2715 -338950 -317694 -132017 -80008 -193683 -180355 -85819 -81655 -19992 25512 27104 35275 12438
2703 12438 -7852 -140667 -121222 -129264 -106184 -173757 -163956 -100795 -12211 -111870 -213103 -201544
2691 -201544 -90122 -54833 4728 10548 -114802 -171156 -285538 -330279 -207706 -124137 -128110
2680 -128110 -108918 -20529 -26008 8109 -109423 -98733 -92751 -146606 -191729 -196181 -15624 19381
2668 19381 2373 -84252 -28875 15958 -58933 -139214 -72653 -26696 -42956 -102640 -146062 -122375
2656 -122375 -20124 132628 43 -24168 -139770 -159951 -75617 -142251 -35891 -105127 -88149
2645 -88149 -42474 -65401 -50095 75484 63485 91677 28478 -52500 -22675 68970 65096 -101002
2633 -101002 -55571 48858 53483 -42274 72276 76463 27727 82238 4607 91683 22309 -47531
2621 -47531 -20896 29470 -57574 -8624 18044 28885 -18341 -25670 -65083 -40276 -5438 57794
2609 57794 9648 -62478 -78016 77303 197460 127973 129539 -131393 -34994 45016 27036
2598 27036 126811 250429 206014 159525 31542 65798 189676 269442 313386 361987 276914
2587 276914 219055 304039 225019 223995 277970 135035 51926 156311 175301 197221 218538
2576 218538 204471 77835 -48434 -10434 -106007 -81235 -66814 28718 97418 147597 43233
2565 43233 58 -67708 -71039 -98937 -112075 -103311 -73765 41374 153226 174183 36198 1772
2553 1772 40265 7997 68747 78769 100934 14776 13079 -63419 -138309 -175987 -167213 -184113
2541 -184113 -189361 -63615 -111664 68612 113533 57630 -18597 -99132 -142768 -30046 -36849
2530 -36849 35938 95106 101066 151705 18967 -112935 37892 -84633 -226121 -265255 -38211
2519 -38211 81259 25625 -961 -91003 -78350 38837 139732 42441 -33516 -14926 36884
2508 36884 102146 50146 107268 135721 123289 80028 52367 47585 88499 99255 88555 95830
2496 95830 116334 81261 38871 12256 45989 91674 12379 55345 28440 24165 -28114 -25661
2484 -25661 171330 152698 23334 -3727 -46715 129115 -7260 39753 199354 203636 186440
2473 186440 190379 57414 24165 51900 -16848 127332 186843 133970 158064 13001 36996
2462 36996 42616 41789 124332 86682 -150537 -46088 99677 55931 185465 108612 260564
2451 260564 204198 223695 -52344 -18010 154533 157162 167536 208193 314389 356408 285985
2440 285985 261082 260167 95795 127877 143732 272124 242754 188464 133347 230826 366629
2429 366629 326605 144038 153355 208470 221765 324411 310382 312385 285181 409045 425036
2418 425036 351582 360075 411935 365899 301418 245077 338421 386973 378954 496602 579692 492545
2406 492545 373299 308030 444021 396736 368143 454379 500423 437488 396351 494170 609022
2395 609022 655610 671298 680041 634690 647903 618508 556420 442171 538038 677674 623976
2384 623976 534055 656983 594120 619256 833695 870555 889926 958803 1140635 1124856 1072404
2373 1072404 1053631 1058275 1133859 1275014 1277357 1221692 1238318 1335217 1402657 1405024 1666424 1708818
2361 1708818 1665811 1705168 1932696 2114479 2159438 2371268 2576122 2748410 2987148 3166248
2351 3166248 3164353 3294083 3643114 3900018 4243253 4564231 5128934 5579841 6140978 6721455
2341 6721455 7397236 8226483 8958026 9809901 10856937 11665208 12484516 13464898 14530419
2332 14530419 15662086 17293817 19413226 22015920 25438898 30348495 36138629 41327626
2324 41327626 46260136 51577166 54118676 52494731 51350071 48930476 42954685 37380466
2316 37380466 32823584 28989685 25844284 23157575 20956945 19055134 17382239 15775681
2308 15775681 14530553 13469871 12362383 11280226 10659909 9830578 8935429 8199608 7617773
2299 7617773 6949025 6539096 6120972 5666754 5328303 5051593 4610003 4271047 4101319 3880279
2289 3880279 3591868 3456107 3312705 3050134 2822314 2697201 2535784 2456430 2353575 2178229
2279 2178229 2127256 2078779 2087375 1938264 1972084 1874122 1722527 1545141 1548440 1623638 1530545
2268 1530545 1409764 1382156 1292135 1115504 1010021 1044471 1057358 1063909 1124206 1082576 935763
2257 935763 947762 1002461 824214 812755 770242 840931 875630 879799 845561 749144 713475 581561
2245 581561 558460 464589 402798 458312 396398 427685 464031 445798 515506 561833 501685 447116
2233 447116 381378 378897 399177 351057 314754 328164 307761 261837 206149 262782 230225 247568
2221 247568 242762 205254 338496 396438 204463 249221 279632 203243 221733 244080 292267
2210 292267 190424 181806 125464 133064 219649 162259 152119 124507 169882 221217 208613 172765
2198 172765 131423 145383 44243 84499 154548 116883 167225 97616 72959 62525 125812
2187 125812 89345 54623 8604 -168518 -23385 71758 -29245 -74080 56241 55162 51575
2176 51575 50219 -58368 -96009 -62135 -129443 -165905 -211291 -114905 -23746 98763 89557 -48468
2164 -48468 -98132 91659 144532 96618 95924 91825 -490 -29590 18286 3070 8809 2523 -22530
2151 -22530 13549 -50932 -53415 20498 22161 -111881 -84958 15491 -107049 -30944 79743
2140 79743 46999 -175514 -205293 -155281 -207543 -154038 -139419 -118247 -157925 -217792 -18416
2129 -18416 51436 92293 176447 79729 -571 90353 165219 72982 27876 -21922 10657 128985
2117 128985 90022 105679 174630 22767 -44176 -79108 -157810 45099 45337 62301 38539 -77523
2105 -77523 -34652 -5045 8376 9082 23085 -52470 35270 17228 -86475 -40565 136028 173035
2093 173035 63310 -45583 -104620 -57406 -66497 18401 -114613 -253448 -126976 -128857 -204003
2082 -204003 -63620 -30786 -32707 -85683 8688 -53355 -142129 -96064 4105 -38828 -15163
2071 -15163 -11057 39998 35555 -8725 52056 48779 544 15993 61722 31065 -34844 53065
2059 53065 113908 149164 12201 -17081 67777 164677 302197 165317 260312 185238 138676
2048 138676 159666 238183 112796 39049 15372 -23295 3865 57394 -24013 55075 -56530
2037 -56530 -9536 24711 -33263 30935 -21709 52914 31248 -7339 -70196 -120750 4290 -24364
2025 -24364 -23962 24910 -78419 34848 10280 -22227 58452 6156 -44199 -175788 -96202 11253
2013 11253 -37048 -86813 -109776 -54130 -79154 -84207 -35894 34530 157168 -34166 -56176 10737
2001 10737 99450 166999 104829 -6569 -238598 -103107 -62142 -19743 100286 97578 -95888
1990 -95888 -117976 -23336 -102836 -18926 -44085 -38416 -71146 -86217 -32933 2890 82165 16904
1978 16904 101577 -59567 -152129 -174575 -107730 -31163 -9280 -61197 -228832 -141762 -169149
1967 -169149 -308866 -217971 -46320 -42288 -18985 -32866 -112766 -19498 -77792 -75441 -150171 -93332
1955 -93332 -41060 56810 111558 48909 -87615 -190980 -365492 -184690 -36556 -11810 -55196
1944 -55196 -45911 -54439 -111316 -72230 -112036 6337 865 -5922 -33570 -70534 -82525 -163575
1932 -163575 -166479 -40055 -25576 -53515 68109 171580 61171 215297 66474 -30287 -35619
1921 -35619 -35776 -83574 -76177 37474 118109 86969 13748 -20390 -52548 -165710 -60998 -159356
1909 -159356 -146561 -24544 1151 85040 86260 138807 25732 -57078 48371 124308 90640
1898 90640 41535 3153 81062 1848 -68005 -67358 -60484 26238 70656 -17140 -162042 -153899
1886 -153899 -48477 64966 51817 -12288 43993 -11682 68378 53571 16128 -62502 -21074
1875 -21074 -1123 72640 118739 -56374 1714 23666 -92449 -257990 -108676 -79506 -4918
1864 -4918 29645 -130428 -223021 -302375 -208279 -56056 -31063 -105290 -160250 -125196 -27192 -76959
1852 -76959 -90317 112109 84046 -66293 -77157 -136292 -28076 -18381 8401 40719 -37705
1841 -37705 10433 -140009 -159238 -113458 71556 101732 102036 37803 38470 -92819 -144719 -132241
1829 -132241 -149431 -67596 -169819 -173750 -139594 -6492 -70958 -24368 90641 -2589 -177444
1818 -177444 -80693 -95695 -107460 -136195 -26544 98753 146632 17753 -44391 27596 31421
1807 31421 131005 89161 130839 85482 -47365 -136363 -97596 -47511 -44853 -115356 -84426 66646
1795 66646 63436 64105 48040 -48146 -79123 -149563 -217168 -104996 -57600 -123326 -60175 -123951
1783 -123951 -52617 126632 121712 79862 123392 100826 46409 -6239 10256 46866 53833 -95300
1771 -95300 -169170 -324010 -252251 -195222 -137990 -83617 -73652 96936 153018 247322 95363
1760 95363 -8835 -1147 27752 40921 75204 39054 10716 -76439 -89861 -147070 -238154 -277712
1748 -277712 -249660 -70397 81466 75185 92804 -33771 -134659 -135516 -30000 -137425 -45389
1737 -45389 -36783 -90588 -129588 -57887 -60707 -116486 -32014 53340 -44691 -90684 -53377 -32836
1725 -32836 -11554 -12384 -210780 -139288 -34143 -138309 -144205 -23370 13795 -16456 76869 56845
1713 56845 37329 13 -105265 -66679 -96220 -62057 -21022 -62394 -119196 -165174 -226862 -102207
1701 -102207 -137136 -296083 -171072 -71252 -96051 -207333 -214484 -132889 -141861 -139209 -46714 -55662
1689 -55662 35298 9489 5836 -102840 -65418 -135995 -12588 157636 187194 -50588 6002
1678 6002 -40792 -22723 -33832 70343 -9025 37027 82447 -18336 4297 2735 -48118 -96066
1666 -96066 -43514 -38460 -16986 -21071 -45153 -96988 -2940 74862 -130266 -172280 -68830 -146528
1654 -146528 -100522 48997 -98923 -48592 11000 -76376 22675 118798 38219 -35176 -47093
1643 -47093 -69203 -11500 -30041 -65180 -58363 -98985 -9432 79027 45869 83084 28220 41480
1631 41480 32442 -181516 -120357 -98907 -61702 -96151 -133539 -143340 -30380 73380 -120978
1620 -120978 -140413 -98034 -219962 -149886 -160023 -120493 52542 -23519 -5869 -40221 -4888
1609 -4888 -104536 59224 148069 164969 146281 45531 -48523 -46448 -21210 36296 100325 139578
1597 139578 71075 50977 73681 72053 34349 -57063 -47700 46821 40239 74321 96666 -246
1585 -246 -43388 11049 -108069 -153296 -64415 -29574 -25437 -10208 -50427 -42580 9957 -111637
1573 -111637 -105346 -5924 -85485 7419 132602 152992 9006 -51896 -85022 -145017 -101176
1562 -101176 -26469 -37458 -34414 -112665 -176999 -133166 11073 -119142 -105365 -38668 188538
1551 188538 149523 2954 -51088 9 79371 -9770 -51343 -56714 -47059 -197879 -124050 34049
1539 34049 33020 -25418 -115304 -114185 -69572 -16920 -48037 -130851 -50101 2930 -40263 145649
1527 145649 246373 166973 57995 3560 40500 107273 166631 85726 93951 -14425 -13696 -82419
1515 -82419 -96568 -26102 4215 77964 122780 71327 75161 41428 -23691 -21405 34642 -38006
1503 -38006 -85071 -62053 -19699 -75030 -60590 -4549 -96477 -6648 -128923 -185840 -34689
1492 -34689 -58389 66324 216757 66694 -155101 -74552 -72483 69590 -33727 176438 77908
1481 77908 -25114 -17831 18057 42588 34269 10063 35232 18585 -41990 64252 -55110 -152219
1469 -152219 -17248 36170 11216 -87368 -54396 -55274 -169139 -2703 80931 -9770 -45297
1458 -45297 -56830 -66459 9535 70164 -178 -72965 -72434 -8157 -82091 -131988 -44050 9810
1446 9810 -50235 -87283 71830 76109 61478 74563 71707 -48502 -79845 -38433 -86798 -166570
1434 -166570 -172952 -19151 -68424 -41867 -60615 79718 91002 -35232 978 -78698 8937
1423 8937 2999 -35838 13623 61427 -55548 -56060 -19628 31976 47207 41953 -64462 -44617
1411 -44617 -1469 45464 31718 71842 80030 46922 -14266 -8204 -91087 -97453 -51929 -82252
1399 -82252 -119931 -54515 -41663 81838 204146 60467 -26700 16581 21387 178102 115706
1388 115706 79251 19821 2161 8523 32086 67257 -153137 -243400 -132445 -68586 -40783
1377 -40783 -39869 -70458 86124 79845 -66565 -109220 -104422 -3518 80207 91240 -21421 -76994
1365 -76994 -24287 -33456 -101933 -95058 -12589 47946 -81355 -116131 -60273 -60957 21823 78925
1353 78925 92282 130486 164411 120207 90015 33830 36343 10948 72498 7710 35773 80017
1341 80017 -36643 59351 74925 19823 105971 -36218 -21620 -77134 95517 97388 133586
1330 133586 76573 20056 -5728 -154358 -148868 -54112 62576 -21970 48141 110139 -1160
1319 -1160 22495 -45512 -23965 12524 -90792 -71635 -87623 -29883 -131110 -54869 -3215 89498
1307 89498 154256 144373 166832 -27049 -87210 -158178 -185598 -61451 -33060 54201 39000 64547
1295 64547 94215 -54306 -48770 -27656 -138172 -65870 -83194 -44869 54525 -11752 7141 187144
1283 187144 86835 53435 79073 -46959 -69318 87027 136186 13789 64709 -3276 19424
1272 19424 65298 57260 72929 34041 85604 163041 -14836 43488 64216 105086 123251 105325
1260 105325 125735 163345 21361 -35454 85895 -96253 -196074 -247868 -236041 -238171 -2840
1249 -2840 25296 -208360 -100599 -27798 -18686 14944 -129379 -98327 -129134 29911 -1432
1238 -1432 -20408 123323 17958 -33339 80682 58845 57816 -33875 -79536 113515 62871
1227 62871 17314 109611 192105 89337 75673 137293 174181 66984 70796 18395 16654 7503
1215 7503 35037 9536 -83040 84041 244265 190724 240485 213999 218837 163445 160574 26320
1203 26320 -89721 -35169 3957 125162 104396 31567 64389 34814 66491 174367 6637
1192 6637 -23182 164773 74448 46657 61670 -14556 -104123 9753 45184 36758 112190 -16962
1180 -16962 1189 15995 21145 46426 55477 -44749 31607 29345 -6545 -10796 51918 53001 -45791
1167 -45791 -19494 -31363 33279 78239 110274 -16145 -180223 -162137 -77515 -28780 7574
1156 7574 -117175 -69357 -58903 13678 -3524 -52658 -5756 -79134 -78300 -144372 -63440 -34042
1144 -34042 16173 11790 97303 108036 108650 79416 106195 4493 -86492 -23062 -22457 -248 63146
1131 63146 -92587 -69592 -51280 -79967 -74384 -83093 -31168 -23052 -108541 -63416 72184 154149
1119 154149 51707 -111341 -70508 68439 94973 54864 92959 -11355 35133 78020 -62700
1108 -62700 -57504 -84028 -117223 -114590 -128386 -118111 11467 -87937 -95243 -4455 65567 94902
1096 94902 132403 8715 -98845 128802 105943 -16303 -61392 -85467 -90181 -56271 -65383
1085 -65383 -24580 100257 -30078 14907 -75051 -106399 -105268 -51436 -13707 4791 45855 -61762
1073 -61762 -11763 97472 -41206 -93282 31821 -9983 112124 93104 159067 77974 20274
1062 20274 188475 267413 44918 46760 -11243 43781 20859 54052 37714 52899 -18462 16059
1050 16059 98137 5215 12259 29440 8985 118902 112092 62748 42782 37446 29272 162119
1038 162119 236443 113518 19039 49671 47341 2330 5771 -2922 -19149 -127431 54596 78219
1026 78219 -105574 -127230 -42304 677 -84720 -22586 38363 -46017 13240 23837 21895 163269
1014 163269 108692 -42278 -26093 30393 82907 59052 71639 65820 64074 26588 -57917 -13095
1002 -13095 -82428 -157858 -239840 -81859 -51908 -57782 -46449 11656 90972 91086 -25461 -26046
990 -26046 59845 59043 379 -45571 -43925 -63175 28634 40195 80684 38402 112642 83570 -35404
977 -35404 -142066 -144190 -49215 63280 221530 100891 -67721 -59795 -105167 -125225 -82627
966 -82627 -3220 35358 84810 160820 165347 75645 57881 -8584 15618 -53264 22298 103424
954 103424 87669 -74189 87053 59381 -28824 18991 77558 178770 61784 37585 123090
943 123090 119130 103464 -12222 46741 104558 18881 -105154 -1940 -16306 -31615 -1485
932 -1485 17038 82525 118776 37091 8339 -136990 -199146 -168600 -161915 -209253 -157053 9945
920 9945 -1797 74371 92248 38076 -66398 17619 98857 201153 134243 101749 -42379 -128594
908 -128594 -120478 -99403 -291080 -81754 8899 -118160 -73707 -31341 28290 27238 147455
897 147455 91795 114496 123330 128334 56188 68445 -10618 42051 216592 66769 33041 79419
885 79419 63605 4008 4249 35702 110863 -38883 -96202 62106 176517 66067 -6775 85783
873 85783 30999 -534 222893 209736 85449 -48579 -111471 -26246 83300 -89999 -96992
862 -96992 -34977 34091 40141 7420 -74222 75027 127204 105071 100302 -49052 100827 95621
850 95621 7861 116073 74828 9930 151034 104088 48508 79371 99224 26889 -18804 -134412
838 -134412 -5383 50042 6959 84701 -39188 10566 64599 11234 656 -3479 71692 -10208
826 -10208 -35925 -57479 9637 44780 63927 110713 78246 36962 96501 56116 5849 -16472
814 -16472 -34701 -189059 -196785 -133934 -172024 -89104 -166581 -137693 -75157 -122110 -51571 106861
802 106861 128148 165534 97221 76134 3545 57034 21788 -47575 46731 59361 116428 131259
790 131259 41500 100069 38486 31644 27413 -33660 -34240 -24836 -30083 -171746 -170776 -76589 6758
777 6758 61788 37152 -4828 61855 -4439 75789 117500 -8525 -46899 -55162 -11669 -28503
765 -28503 -3713 29655 33230 54024 142109 9758 -135192 85703 115009 12366 -48566
754 -48566 100855 -1118 -56500 -27816 32374 41033 -23100 -43291 7698 83567 130912 90720
742 90720 75327 -55220 -46077 27310 65483 15838 -64390 -57743 165 -17449 -111924 -89372
730 -89372 -13487 12012 4930 -100045 -93539 -59959 6996 47867 -48499 -84443 -104264 15861
718 15861 6043 -18996 -8439 70019 33155 17248 13620 -92293 -157842 -50317 22213 5435
706 5435 -119809 -44950 39934 38617 26727 115214 174847 57108 -70752 -38470 -82271 -25092
694 -25092 2349 11049 -38524 -62448 -119894 -29726 -33265 5199 85158 1600 -27740 59896
682 59896 125425 192931 162108 22181 -30578 -180094 -171402 -13748 132522 -31642 -163186
671 -163186 -97987 -2418 -157931 -78625 -65951 -64302 17137 -69497 -33039 105334 52798 -101292
659 -101292 -68850 112382 143333 -47365 -117646 -117052 -22693 -59415 -177528 -159420 -208061 -180567
647 -180567 -100933 -33214 88046 116190 165106 149650 92036 86432 68926 143218 306980 205367
635 205367 9828 22046 55077 48928 -20605 3493 -104526 -169750 -152283 -38609 -96208
624 -96208 -137013 -52050 -21097 -8413 -19425 -17068 21590 95049 -1487 13244 -20371 -68846
612 -68846 -21972 78541 -39003 -18009 65118 -23243 -150523 -118599 -36062 -13924 44018
601 44018 81191 7189 -133292 -170906 -53370 -13576 -131980 -47797 25568 32449 10380 -31297
589 -31297 63880 103597 99730 100856 3166 6247 -20239 -10003 -78861 -71917 -48906 -3960 -12897
576 -12897 14683 108686 -18307 -32064 17912 37606 110585 80482 78387 100999 127494 105775
564 105775 34663 -154268 -125439 -53194 -38531 -31126 -11771 -52169 -107287 38682 33045 63188
552 63188 73702 -125853 -95042 -7734 80856 104031 10950 79734 97023 -49105 -40929 33062
540 33062 20925 97721 107400 60447 69811 152732 -51207 -167416 -195452 -102951 -105995 -56346
528 -56346 45579 3535 -166637 -169396 -169311 -133896 -99023 -89284 -146287 -42157 41318 49434 133577
515 133577 116931 110479 -34784 -107624 1352 181906 21771 47861 95649 37768 98182
504 98182 229181 106732 -74778 -26995 -19882 138418 72207 114175 -32286 -113382 -84723
493 -84723 -171682 -168309 -131281 -72655 -157130 -182519 -11615 87483 -128924 -109095 -55842 133963
481 133963 35208 77285 202647 172282 104378 -26553 50948 34534 79266 99738 90830 45120
469 45120 28444 119285 52657 69381 137475 100667 121240 101760 -23598 -89243 -40726 -32705
457 -32705 -123425 -19654 -48731 -157650 -108180 -18551 -119273 -164761 -193037 -166801 -106832
446 -106832 -154523 -62623 -59256 26653 64186 119788 179424 150939 215384 50747 53154 97498
434 97498 87870 54392 136961 157852 84946 16848 4039 -2624 -122910 -130899 -88387 -66079
422 -66079 -58707 128548 7721 -11251 -57411 -476 592 -20375 -9160 5809 -63248 -3993
410 -3993 39215 71706 81460 5438 -73147 109100 43847 -121327 -130148 -154317 -72357 -76077
398 -76077 100944 191846 154390 59413 -10471 -44457 10596 43560 3360 -104484 -147987 -160216
386 -160216 -276111 -248297 -206308 -110968 -56711 -135558 -128414 -34136 -45440 -48001 -60654 -47850
374 -47850 85389 -69046 -183062 -150707 47102 13283 17168 -42778 113259 219885 164246
363 164246 -54221 -91905 -49842 -52381 -56842 -48103 -89252 -165752 -181144 -214840 -182053 -107397
351 -107397 32296 1395 -90044 -5313 -13562 -43895 -60472 39876 -15988 -49064 -59194 -153581
339 -153581 -86529 -131554 -208975 -198402 -39955 137447 104530 8800 20605 -7739 51206
328 51206 -24431 -36618 -138823 -26715 -74502 -167974 46786 179635 108237 111150 -42669
317 -42669 -23180 -24670 -66805 94349 -17283 -48665 97097 60273 1540 -306 -70424 -125311
305 -125311 -86594 -212916 -152078 -82041 -17481 -80031 -60104 -45690 9844 65407 142833 185355
293 185355 -13068 8160 -32450 -45251 16783 72553 -4702 34699 8570 -87902 -89463 -1728
281 -1728 34364 -175 11215 6854 -14539 69874 84697 15417 -51807 -159408 -53821 85528
269 85528 54766 -58882 -134586 -199750 -7035 -69298 -56748 -45326 -170417 -65322 5310
258 5310 19824 -113942 -81691 -30648 -69170 -33167 -76604 35010 114598 23046 54834 37602
246 37602 -47894 -48994 64137 12083 -61979 -133260 -132810 -170791 77005 55960 38630 21462
234 21462 52091 47880 -98653 -235320 -83224 -152601 -164227 -91233 -171632 -169558 -118045 -39338
222 -39338 -39409 -87064 -81205 18734 -119017 172 4297 -45549 -81195 -12334 13249 -18412 54040
209 54040 103740 91187 34365 26719 -73796 -53443 -31478 -152780 -207871 -186459 -90627 -62319
197 -62319 -46986 -98272 -78390 -69850 -128476 -91000 -36273 -47568 -67650 -127513 -94034 -134942
185 -134942 -154955 -160973 -64326 82759 55121 -111518 -73407 -25583 -106799 -71405 -28658 -24415
173 -24415 145867 114161 3789 -4557 -51725 -44816 -173431 -55772 23233 14531 30592 -308
161 -308 -10788 26387 46824 88051 125933 118195 58143 -10085 -23265 59183 5260 34477 38815
148 38815 31132 30820 -35835 -93560 -35032 9264 -9074 -38424 -124828 -111873 -108467 -121462 -71171
135 -71171 -99143 54649 78864 -7291 -81727 -89430 -40637 -140873 13593 19483 35378 14546
123 14546 -31509 13281 50738 -57054 -123613 -126412 -153001 -155034 -65007 -100440 -89089 -86115
111 -86115 -50874 -76433 -94567 -17816 -51923 -26547 72371 60775 96343 32686 -56074 -3355
99 -3355 -27215 54449 -4625 -39601 -64862 51346 84796 -20003 -62897 -77836 15557 -126640
87 -126640 -152816 -135739 -112888 -15324 72912 86545 1293 49360 22823 -16876 -140384 -47561
75 -47561 32820 -92464 -60806 -102944 49504 -49030 -183076 -27738 12248 25227 60189
64 60189 30586 79904 33977 -3249 -30245 -25938 -73919 -2205 16427 -115996 -150681 -164670
52 -164670 -131063 -106644 -21134 55617 -44564 -149527 -49519 -73686 -111675 -47733 21691
41 21691 -93840 -142913 -117643 11760 65938 41610 22438 96269 23030 29972 1503 -49110
29 -49110 -10971 109525 68565 53808 58312 -59355 -106220 -150428 -152759 -120722 -23945 669
17 669 -73796 -73287 -88586 17815 -1084 -21695 -9522 -4518 12789 -24229 -50450 -88163 -151439
4 -151439 -57381 6154 13177 32343
0 32343
$$ Imaginary data points
##PAGE= N=2
##DATA TABLE= (X++(I..I)), XYDATA
16383 -1810250 -1786018 -1683372 -1733181 -1777134 -1687723 -1675450 -1612556 -1670515 -1735127 -1574360 -1466402
16372 -1466402 -1453776 -1543750 -1468709 -1374304 -1314751 -1280302 -1256613 -1261237 -1229462 -1223260 -1294420 -1283158
16360 -1283158 -1192881 -1045239 -1107412 -1101091 -1026072 -987889 -960782 -1002382 -961065 -855534 -817644
16349 -817644 -815337 -793841 -746064 -742173 -835473 -803895 -700260 -589988 -522336 -599011 -614021
16338 -614021 -619831 -609532 -520178 -474667 -494293 -379908 -347969 -283309 -220783 -242145 -324031
16327 -324031 -351177 -263626 -255012 -246133 -223583 -224173 -93972 -78571 -157943 -73954 -48755 12246
16315 12246 27385 53116 80615 62113 47407 33854 72867 125619 158065 270600 278912 286393
16303 286393 391741 422504 463622 410686 408276 439946 438513 431969 430383 496650 530973 552741
16291 552741 627522 568351 647411 687341 616596 758253 799793 694998 637722 610899 684807
16280 684807 854572 892949 726238 782519 930027 1001863 873311 890322 926847 968199 949057
16269 949057 876161 853783 922877 935773 986296 1148709 1138780 1193188 1247793 1288990 1322463
16258 1322463 1379428 1340472 1389556 1416896 1463692 1354715 1289341 1269332 1492249 1607054 1474105
16247 1474105 1447140 1538510 1502823 1541959 1655383 1570846 1523512 1529511 1561801 1473783 1557177
16236 1557177 1624683 1681367 1590719 1502601 1649618 1664230 1604875 1593554 1601037 1650684 1719230
16225 1719230 1835641 1874489 1849597 1740037 1725752 1790424 1859347 1951981 1909715 1985157 2000637
16214 2000637 1941593 1844458 1902945 1952571 1904868 1919370 1948249 2016245 1972141 2029390 1949316
16203 1949316 1951826 2063751 2000770 1947842 2010235 2076210 2135515 2145355 2115842 2129450 2129803 2029336
16191 2029336 2029569 2098999 2189570 2240449 2198379 2227781 2279054 2226046 2079416 2152230 2263363
16180 2263363 2393982 2371685 2263444 2293530 2258779 2258398 2304255 2277943 2233705 2326289 2351763
16169 2351763 2331501 2283097 2286097 2366462 2448586 2342917 2318726 2364091 2324264 2301923 2432521
16158 2432521 2515613 2347086 2306733 2305986 2337171 2409502 2400018 2459639 2400834 2495479 2538452 2387773
16146 2387773 2376764 2381508 2439606 2474492 2547800 2370631 2397110 2561861 2602819 2512979 2517080
16135 2517080 2482361 2433223 2456396 2463669 2452309 2450952 2335512 2307858 2421453 2552759 2565434
16124 2565434 2606328 2583187 2507157 2481386 2545801 2487688 2575884 2564202 2537423 2545703 2455099
16113 2455099 2558957 2667025 2716542 2544694 2538470 2592642 2580245 2463958 2505268 2624667
16103 2624667 2606260 2598266 2636199 2686269 2576973 2550304 2682955 2714512 2666254 2494781 2415616
16092 2415616 2539887 2615204 2689855 2744698 2668133 2619186 2663638 2697949 2630314 2744231 2706087
16081 2706087 2599223 2568628 2648614 2618031 2753718 2701199 2573884 2616723 2629878 2708981 2722663
16070 2722663 2653569 2628993 2667615 2655532 2613280 2675305 2705289 2558792 2547294 2480980 2435443
16059 2435443 2566581 2671348 2535015 2619012 2725604 2712061 2735312 2710933 2733067 2672753
16049 2672753 2777623 2686274 2748970 2714961 2703723 2804783 2636212 2531895 2613599 2672058
16039 2672058 2719626 2784282 2615495 2663960 2733950 2834864 2854506 2801932 2779024 2746168 2771291
16028 2771291 2713624 2703412 2671246 2673064 2614797 2633806 2683806 2772359 2776906 2623932 2647226
16017 2647226 2711413 2623702 2591811 2700490 2825399 2776965 2706962 2792713 2783028 2658228 2720114
16006 2720114 2802510 2742934 2751623 2676150 2642425 2766791 2801746 2659684 2669094 2790797 2715092
15995 2715092 2688566 2608505 2663804 2702033 2613063 2659039 2695338 2790731 2706189 2712440 2570064
15984 2570064 2639617 2802194 2730521 2671270 2648094 2684591 2816327 2639280 2586996 2656881 2748239
15973 2748239 2786890 2755036 2769799 2620373 2528678 2545189 2507013 2570971 2638602 2653012 2570782
15962 2570782 2620809 2611284 2591804 2624099 2715123 2546353 2601741 2733006 2636070 2618671 2603150
15951 2603150 2570050 2585921 2759947 2905123 2946621 2867332 2720003 2541531 2733208 2695156
15941 2695156 2747448 2743574 2710120 2571196 2645551 2624638 2726922 2802879 2680672 2791181 2711604
15930 2711604 2690263 2744188 2809344 2714359 2559384 2605095 2630333 2663385 2703334 2770069 2836071
15919 2836071 2694921 2617791 2719347 2751854 2589695 2638148 2780893 2637836 2578644 2549339
15909 2549339 2636792 2670272 2660517 2773834 2833287 2695875 2608234 2640362 2661120 2729248 2527614
15898 2527614 2581063 2665085 2667252 2736339 2762273 2843121 2784167 2792247 2775949 2662383 2708110
15887 2708110 2675003 2599012 2663126 2614520 2728039 2833110 2777406 2751211 2780492 2802569 2722664
15876 2722664 2702496 2762009 2720642 2833219 2731491 2571282 2814041 2872505 2827356 2831332 2859157
15865 2859157 2710517 2698493 2720094 2759800 2661311 2551331 2612196 2722134 2730361 2810020 2827109
15854 2827109 2636940 2638465 2655430 2870016 2907509 2762767 2676907 2661231 2605911 2616794 2607058
15843 2607058 2740669 2774604 2811965 2738020 2704428 2707887 2735664 2771567 2732013 2653227 2622917
15832 2622917 2689986 2831318 2956995 2986761 2786334 2722191 2849617 2754595 2764790 2683667
15822 2683667 2830481 2850577 2808331 2840362 2708763 2682592 2730324 2694016 2749225 2804230 2758029
15811 2758029 2852596 2862214 2689593 2697411 2647096 2606467 2608853 2618937 2709893 2627217 2636994 2564789
15799 2564789 2702503 2765493 2590536 2708339 2711299 2803977 2727986 2805678 2734258 2681161 2777470
15788 2777470 2822569 2761392 2663114 2750105 2780280 2670192 2742933 2704972 2716689 2697224 2697774
15777 2697774 2582334 2565439 2721060 2750529 2784710 2762544 2603351 2626914 2673233 2654120 2764019
15766 2764019 2694154 2695631 2527010 2607792 2696670 2624762 2628560 2660924 2709064 2717578 2650032 2665118
15754 2665118 2726559 2726075 2842723 2795791 2770110 2750681 2845907 2882160 2834717 2684210 2692083
15743 2692083 2812623 2767185 2805824 2716372 2646397 2587174 2729832 2778336 2806532 2736789 2743318
15732 2743318 2923273 2965766 2792000 2726517 2839735 2897505 2756479 2711558 2696215 2637008
15722 2637008 2660555 2769724 2948713 2891068 2666843 2768559 2821954 2814502 2767271 2802008 2761294
15711 2761294 2695720 2705294 2609166 2778221 2871435 2755244 2745295 2686549 2650668 2779996 2975869
15700 2975869 2889614 2723878 2723161 2848217 2844860 2628405 2675390 2743348 2735291 2794109 2826819
15689 2826819 2752745 2868489 2722127 2697487 2833768 2648435 2795166 2769591 2845097 2843998
15679 2843998 2860261 2814860 2729987 2783756 2703347 2757088 2779562 2701210 2676771 2619116 2668036
15668 2668036 2914880 2842618 2868090 2787099 2809449 2849345 2777015 2820646 2709596 2740538 2671488
15657 2671488 2721448 2796782 2826688 2662543 2595425 2783967 2814551 2797446 2779347 2781365 2720355
15646 2720355 2726093 2767720 2703658 2739709 2816635 2839021 2905304 2786756 2742964 2804590 2921610
15635 2921610 2955289 2860249 2670782 2834570 2822344 2874913 2856618 2807369 2769392 2684483 2658480
15624 2658480 2568919 2599213 2716512 2688813 2759179 2826676 2744702 2621726 2725572 2791817 2888719
15613 2888719 2879226 2805400 2858084 2933031 3013457 2875392 2795605 2724425 2649784 2680285 2775507
15602 2775507 2744914 2747991 2712698 2876804 2892265 2826362 2854474 2726830 2808888 2729718 2741932
15591 2741932 2926318 2928433 2967293 2945623 2906074 2846370 2823095 2758991 2813550 2884381 2863483
15580 2863483 2787732 2737976 2747386 2721121 2681030 2732294 2717677 2657522 2722131 2826288 2787788
15569 2787788 2732137 2712725 2671308 2731800 2665055 2683694 2792275 2802997 2891257 2918798 2872880
15558 2872880 2773386 2843298 2775250 2794651 2833017 2915056 2808371 2863829 2829417 2726745 2766938
15547 2766938 2826563 2814723 2762210 2887713 2853192 2844793 2881398 2871100 2771382 2784900 2829103
15536 2829103 2746213 2782714 2832161 2735209 2755368 2849996 2925188 2921667 2856715 2896182 2857627
15525 2857627 2773493 2780445 2827101 2818550 2719585 2706906 2662269 2760677 2720945 2797497 2843614 2686237
15513 2686237 2733438 2838379 2836196 2794260 2823932 2811011 2853515 2945186 2872651 2920460 2961456
15502 2961456 2965537 2888111 2880089 2786295 2792037 2926318 2908349 2898370 2939132 2995184 2871282 2813993
15490 2813993 2742964 2714732 2823513 2826450 2905451 3060863 2946058 2718041 2765002 2766776 2823612
15479 2823612 2916433 2947661 2821574 2696217 2694419 2713821 2839691 2930549 2950428 2890139 2823336
15468 2823336 2796955 2878343 2908434 2833835 2818945 2874189 2853247 2796812 2737332 2854151 2867362
15457 2867362 2933137 2987827 2955767 2861025 2948419 2873984 2661925 2745422 2699388 2711636 2822510
15446 2822510 2789672 2727568 2688595 2790507 2955970 2987828 2922885 2798141 2824091 2880441 2740565
15435 2740565 2774283 2749247 2757234 2848777 2852803 2805219 2878722 2894844 2811994 2782412 2741070 2912251
15423 2912251 2937610 2880475 2838009 2865519 2917465 2916164 2849927 2962994 3020135 2925759 2693260
15412 2693260 2483448 2589280 2675407 2694693 2741938 2836096 2849753 2899164 2754286 2805689 2941681
15401 2941681 2905774 2826823 2880550 2940338 2897245 3012060 2848836 2873643 2953919 2829617 2768849
15390 2768849 2844731 2841867 3016633 2943399 2934882 2934326 2856012 2775248 2802622 2860374 2901410 2981152
15378 2981152 2825575 2807345 2872821 2859616 2841934 2775575 2767439 2879680 2830964 2850027 2872395
15367 2872395 2907737 2834801 2833465 2955395 3029384 2967457 2913450 2807694 2813803 2841221 2788508
15356 2788508 2986661 3042140 3066691 3001327 3015649 2953469 2844119 2873701 2904573 2854905 2882148
15345 2882148 2912302 2891300 2851558 2779809 2819520 2742916 2746659 2891673 2805573 2803837 2825532
15334 2825532 2804853 2663966 2688261 2937421 2895936 2797115 2831019 2875986 2901216 2860832 2686924
15323 2686924 2780353 2806068 2896519 2897313 2889227 2792294 2768208 2844286 2869499 2819163 2953954 2886530
15311 2886530 2869449 2848655 2902354 2944473 2946532 2807795 2864982 2913806 2819040 2848792 2917000
15300 2917000 2887842 2793058 2863220 2863320 2857345 2981736 2887530 2735378 2890978 2912460 2860309
15289 2860309 2760934 2815662 2848904 2785892 2839537 2871294 2830927 2787429 2875414 2889090 2870717
15278 2870717 2950582 2858926 2891975 2878269 2949965 2791754 2861793 2922356 2871406 2875745 2848835
15267 2848835 2883720 2888735 2881332 2841501 2826969 2887182 2890135 2912891 2936406 2937910 2940042 2951988
15255 2951988 2861392 2875655 2912546 2971943 3004471 2988363 2911130 2803290 2789821 2801868 2907858
15244 2907858 2924723 2829000 2944634 2991262 2962622 2847282 2862980 2986627 3010755 2914458 2938291
15233 2938291 3057489 2874169 2861661 2911326 2848031 2878605 2963681 2951181 2917845 2961534 2941941
15222 2941941 2884499 2789849 2763572 2852931 2900993 2912667 2980269 2946464 2933997 2806299 2902197
15211 2902197 2890210 2808109 3057800 3079570 2994834 2985979 2898611 2755971 2896223 2893327 2837814
15200 2837814 2832611 2851945 2946896 2941597 2825800 2976971 2986692 2904287 2926309 2924797 2858618 2814540
15188 2814540 2902366 2844517 2825675 2942313 3047366 2992008 2996000 3107031 3055862 3028032 3034102
15177 3034102 3083257 3029397 2946417 2921507 3063407 3005180 2857908 2779266 2846858 2807164 2987079
15166 2987079 2972831 2827148 2815736 2905042 2883505 2953900 3037692 2996442 2913637 2866565 2868814
15155 2868814 2873889 2873613 2787621 2889387 2882594 2977910 2986293 2994149 3021565 2920923 2844253 2878788
15143 2878788 2903927 2948852 2862416 2840047 3015224 2936626 2894930 2907847 2920006 3062260 3002074
15132 3002074 2966423 3032897 2887045 2868283 2894103 2909030 2837182 2741064 2797801 2861354 2930260
15121 2930260 2876420 2844848 2850873 2924536 2894131 3089410 3053640 2942768 2931105 2973966 2894695
15110 2894695 2807434 2830573 2885964 2786586 2897027 2961957 2826298 2908866 2980513 3057608 2928242
15099 2928242 2881236 2853426 2849292 2917997 2874692 2906310 2868279 3104277 3099202 2958360 2989037
15088 2989037 2903799 2915138 2906143 2920273 2916651 2765172 2889932 2896607 2800101 2851652 2920217
15077 2920217 3043584 2899631 2862094 3010003 2984419 2816884 2856758 2935046 2945374 2901296
15067 2901296 2846945 3018976 3172251 3016636 2873140 2980574 3002980 2979159 2967031 2903478
15057 2903478 2904610 2880793 2895467 2865279 2861515 2822735 2894128 2880821 2839914 2925004 2942430 2813568
15045 2813568 2840440 2906898 2917449 2999419 2956851 3021651 3035540 3099879 3065178 2973207 2905437
15034 2905437 2821432 2865449 2911052 3095518 3140996 2941447 2847099 2891096 3014904 3175793
15024 3175793 3101805 3022021 3048660 3079565 2926697 2883173 2868439 2883823 2819365 2829166 2890537
15013 2890537 2964466 3143166 2957866 2814451 2995425 2975511 2948832 2973670 2845768 2811810
15003 2811810 2769965 2921874 2937073 2910628 2910319 2745976 2710433 2863701 2817559 2835499 2948649
14992 2948649 2920591 2965866 2996067 2937189 2933755 2962887 2922517 2893377 2785965 2754517 2827304
14981 2827304 2924120 2929049 2796639 2747984 2870913 2924482 2894896 2976930 3003585 3020505 2971403
14970 2971403 2921906 2886495 2863077 2914098 2988089 3080748 3027451 2978299 2955992 3027980 3029406
14959 3029406 3166875 3019879 3014141 3082859 2896816 2964417 2978288 2907441 2891620 2948047 2976395
14948 2976395 2871032 2792421 2816195 3058930 3174687 3071429 3041791 3027936 2971831 2868219
14938 2868219 3000133 3122847 3164720 3013494 2959295 2910589 2884107 2945266 2963844 2934627 2976834
14927 2976834 2967035 2828945 2916970 3033956 3031932 2930005 2835776 2859512 2871055 3096492 3145517
14916 3145517 3027477 2955075 2961558 3120968 3027053 2964147 2966632 2735240 2730853 2935684 2952143
14905 2952143 2924755 2876530 3003571 3106367 3062232 3075612 3063969 2765711 2663195 2971393
14895 2971393 3055818 3165897 3078843 2881703 2776612 2808466 2969848 3064183 2964813 2986304
14885 2986304 2945203 2898405 2902696 2934535 3146191 3066712 3009524 3005117 3070163 3002557 2903720
14874 2903720 2903351 3095049 3052065 2925033 3041517 3019670 3136453 3014560 2913573 3000529
14864 3000529 2956714 2947306 2855198 2891288 2988367 2986417 2959677 2943066 2866791 2868381 3018223 3033484
14852 3033484 3102702 3119331 3150502 3072860 3121057 3128589 3018524 2979232 2980794 3011376 2977077
14841 2977077 2959021 2955414 3057394 3107787 3036753 3014414 3010606 3027425 2929327 2869784 2901545
14830 2901545 2876319 2924123 3066249 3053625 2974331 3041758 2980630 3040156 3000672 3112707 3129711
14819 3129711 3037561 3087457 2972887 2901024 2948513 2973910 3005961 2821517 2879772 3071409 2934448
14808 2934448 2905092 3009821 3053108 3049021 3018536 3090400 3040440 3124794 3160930 3128815 3019672
14797 3019672 2910286 2948455 2996015 3012558 2985655 3105312 3033798 3058294 3073632 3136090 3046665
14786 3046665 2972423 3022154 2948923 3010037 3016342 2907461 2989168 3000819 2992559 2972471 3053911
14775 3053911 3018337 3033453 3037044 2974348 2955277 2969524 3034744 3111656 3049048 2896027 2934059
14764 2934059 2832110 3060564 3101773 3159938 3045004 3056579 3069166 2916030 3053274 3182513
14754 3182513 3138497 3099772 3128103 3123426 3018822 2998505 3042066 3061578 3042964 2961661 2954780
14743 2954780 2932484 3008422 3095676 3080884 2954913 2851325 2966767 2971768 2992038 2973963 2951466
14732 2951466 3010199 3076491 3022003 2982692 3057629 2976314 3067791 3123265 3132804 3002633 2981216
14721 2981216 3049868 3113865 3196051 3095238 3031189 3102929 3120016 3103923 3020868 3210257 3115996
14710 3115996 3052441 3034008 3118710 3072949 2968668 3113697 3204477 3152562 3205607 3240054 3064415
14699 3064415 2975037 3008653 2963974 3041867 2991863 3086033 3111350 3006203 3035337 3005912 3100157
14688 3100157 2997299 2951687 2875916 2956165 2928359 3017660 2959204 2903756 2982011 3049508 3026956
14677 3026956 3012873 3056197 2992850 3077137 3117061 2990966 3083737 3126746 3091913 3188289 3172378
14666 3172378 3140491 3034005 3018792 2973748 2954300 2993596 3076580 3072777 3171835 3133094 3086756
$$ [...]
##END NTUPLES=NMR SPECTRUM
##END=
