##TITLE=1H_DE-80H_X3
 200.13MHz, d2o
 8 sc
 
 19ns.26.2.2025
##JCAMPDX= 6.0         $$ Bruker NMR JCAMP-DX V2.0
##DATA TYPE= NMR SPECTRUM
##DATA CLASS= NTUPLES
##ORIGIN= UXNMR, Bruker Analytische Messtechnik GmbH
##OWNER= pz
$$ XWIN-NMR		Version 3.5
$$ Tue Sep 30 10:15:19 2025 Russian Standard Time (UT+4h)  Yarkov@DPX200
##.OBSERVE FREQUENCY= 200.1313
##.OBSERVE NUCLEUS= ^1H
##.ACQUISITION MODE= SIMULTANEOUS
##.ACQUISITION SCHEME= undefined
##.AVERAGES= 8
##.DIGITISER RES= 18
##SPECTROMETER/DATA SYSTEM= spect
##.PULSE SEQUENCE= zg30
##.SOLVENT NAME= CDCl3
##.SHIFT REFERENCE= (INTERNAL, CDCl3, 0, 15.4847)
##AUDIT TRAIL= $$ (NUMBER, WHEN, WHO, WHERE, WHAT)
$$ ##TITLE= Audit trail, XWIN-NMR		Version 3.5
$$ ##JCAMPDX= 5.01
$$ ##ORIGIN= Bruker BioSpin GmbH
$$ ##OWNER= Yarkov
$$ C:/Bruker/XWIN-NMR/data/yarkov2/nmr/H-C/1/pdata/1/auditp.txt
$$ ##AUDIT TRAIL=  $$ (NUMBER, WHEN, WHO, WHERE, WHAT)
(   1,<2025-09-30 10:14:18.42 +0400>,<Yarkov>,<DPX200>,
      <created by zg, POWCHK disabled, PULCHK disabled
       configuration hash MD5:
       00 E9 B6 7A A2 85 ED C7 34 08 36 98 17 FE 4E 26
       data hash MD5: 16K
       FB 27 B7 5B 57 1B 65 0E 09 BB D6 A3 EC 42 DD 5A>)
(   2,<2025-09-30 10:14:36.53 +0400>,<Yarkov>,<DPX200>,
      <Start of raw data processing
       efp BC_mod = 2 LB = 0.25 FT_mod = 6 PKNL = 1 PHC0 = -2078.854 PHC1 = 16.19097 SI = 16K 
       data hash MD5: 16K
       29 79 D6 21 34 C7 10 BA A2 7C 1F D3 4C D7 BA 5D>)
(   3,<2025-09-30 10:14:41.15 +0400>,<Yarkov>,<DPX200>,
      <abs ABSG = 5 
       data hash MD5: 16K
       34 9F C3 60 50 02 7B BE 2C 4D 64 CE 8C 78 DF 6D>)
$$ ##END=
$$ 
$$ hash MD5
$$ 8E 16 5D A9 5E 67 74 A1 86 BD C7 BA B9 57 40 D3
##$RELAX= 
##$RELAX= 
##$RELAX= 
##$RELAX= 
##$RELAX= 
##$RELAX= 
$$ Bruker specific parameters
$$ --------------------------
##$DU= <C:/Bruker/XWIN-NMR>
##$EXPNO= 1
##$NAME= <H-C>
##$PROCNO= 1
##$TYPE= <nmr>
##$USER= <yarkov2>
##$AMP= (0..31)
100 100 100 100 100 100 100 100 100 100 100 100 100 100 100 100 100 100 
100 100 100 100 100 100 100 100 100 100 100 100 100 100 
##$AQSEQ= 0
##$AQ_mod= 1
##$AUNM= <au_zg>
##$AUTOPOS= <>
##$BF1= 200.13
##$BF2= 200.13
##$BF3= 200.13
##$BF4= 200.13
##$BF5= 200.13
##$BF6= 200.13
##$BF7= 200.13
##$BF8= 200.13
##$BYTORDA= 1
##$CFDGTYP= 0
##$CFRGTYP= 5
##$CHEMSTR= <none>
##$CNST= (0..31)
1 1 145 1 1 1 1 1 1 1 1 1 1 1 1 1 1 1 1 1 1 1 1 1 1 1 1 1 1 1 1 1 
##$CPDPRG= <>
##$CPDPRG1= <>
##$CPDPRG2= <>
##$CPDPRG3= <>
##$CPDPRG4= <mlev>
##$CPDPRG5= <mlev>
##$CPDPRG6= <mlev>
##$CPDPRG7= <mlev>
##$CPDPRG8= <mlev>
##$CPDPRGB= <>
##$CPDPRGT= <>
##$D= (0..31)
0 0.7 0 0 0 0 0 0 0 0 0 0.03 0 0 0 0 0 0 0 0 0 0 0 0 0 0 0 0 0 0 0 0 
##$DATE= 1759212858
##$DBL= (0..7)
120 120 120 120 120 120 120 120 
##$DBP= (0..7)
150 150 150 150 150 150 150 150 
##$DBP07= 0
##$DBPNAM0= <>
##$DBPNAM1= <>
##$DBPNAM2= <>
##$DBPNAM3= <>
##$DBPNAM4= <>
##$DBPNAM5= <>
##$DBPNAM6= <>
##$DBPNAM7= <>
##$DBPOAL= (0..7)
0.5 0.5 0.5 0.5 0.5 0.5 0.5 0.5 
##$DBPOFFS= (0..7)
0 0 0 0 0 0 0 0 
##$DE= 6
$$ [...]
##$SUBNAM3= <"">
##$SUBNAM4= <"">
##$SUBNAM5= <"">
##$SUBNAM6= <"">
##$SUBNAM7= <"">
##$SUBNAM8= <"">
##$SUBNAM9= <"">
##$SW= 18.0517328524113
##$SWIBOX= (0..15)
0 0 2 0 0 0 0 0 0 0 0 0 0 0 0 0 
##$SW_h= 3612.71676300578
##$TD= 16384
##$TD0= 1
##$TE= 0
##$TE2= 300
##$TE3= 300
##$TEG= 300
##$TL= (0..7)
0 120 120 120 120 120 120 120 
##$TP= (0..7)
150 150 150 150 150 150 150 150 
##$TP07= 0
##$TPNAME0= <>
##$TPNAME1= <>
##$TPNAME2= <>
##$TPNAME3= <>
##$TPNAME4= <>
##$TPNAME5= <>
##$TPNAME6= <>
##$TPNAME7= <>
##$TPOAL= (0..7)
0.5 0.5 0.5 0.5 0.5 0.5 0.5 0.5 
##$TPOFFS= (0..7)
0 0 0 0 0 0 0 0 
##$TUNHIN= 0
##$TUNHOUT= 0
##$TUNXOUT= 0
##$USERA1= <user>
##$USERA2= <user>
##$USERA3= <user>
##$USERA4= <user>
##$USERA5= <user>
##$V9= 5
##$VALIST= <valist>
##$VCLIST= <CCCCCCCCCCCCCCC>
##$VD= 0
##$VDLIST= <DDDDDDDDDDDDDDD>
##$VPLIST= <PPPPPPPPPPPPPPP>
##$VTLIST= <TTTTTTTTTTTTTTT>
##$WBST= 1024
##$WBSW= 4
##$XGAIN= (0..3)
0 0 0 0 
##$XL= 0
##$YL= 0
##$YMAX_a= 442371
##$YMIN_a= -366208
##$ZGOPTNS= <>
##$ZL1= 120
##$ZL2= 120
##$ZL3= 120
##$ZL4= 120
##$ABSF1= 15.49899
##$ABSF2= -2.552859
##$ABSG= 5
##$ABSL= 3
##$ALPHA= 0
##$AQORDER= 0
##$ASSFAC= 0
##$ASSFACI= 0
##$ASSFACX= 0
##$ASSWID= 0
##$AUNMP= <proc_1d>
##$AZFE= 0.1
##$AZFW= 0.1
##$BCFW= 0
##$BC_mod= 2
##$BYTORDP= 0
##$COROFFS= 0
##$CY= -3
##$DATMOD= 1
##$DC= 0
##$DFILT= <>
##$DTYPP= 0
##$F1P= 0
##$F2P= 0
##$FCOR= 1
##$FTSIZE= 16384
##$FT_mod= 6
##$GAMMA= 0
##$GB= 0
##$INTBC= 1
##$INTSCL= 3.241238e-09
##$ISEN= 128
##$LB= 0.25
##$LEV0= 0
##$LPBIN= 0
##$MAXI= 10000
##$MC2= 0
##$MEAN= 0
##$ME_mod= 0
##$MI= 1.114404
##$NCOEF= 0
##$NC_proc= -7
##$NLEV= 6
##$NOISF1= 3.799351
##$NOISF2= 2.8
##$NSP= 0
##$NTH_PI= 0
##$NZP= 0
##$OFFSET= 15.48466
##$PC= 1
##$PHC0= -2078.854
##$PHC1= 16.19097
##$PH_mod= 1
##$PKNL= yes
##$PPARMOD= 0
##$PSCAL= 0
##$PSIGN= 0
##$REVERSE= no
##$SF= 200.130007413907
##$SI= 16384
##$SIGF1= 3
##$SIGF2= 2
##$SINO= 0.751879
##$SIOLD= 32768
##$SREGLST= <19F.Aceton>
##$SSB= 0
##$STSI= 16384
##$STSR= 0
##$SW_p= 3612.71676300578
##$SYMM= 0
##$S_DEV= 0
##$TDeff= 16384
##$TDoff= 0
##$TI= <>
##$TILT= no
##$TM1= 0
##$TM2= 0
##$TOPLEV= 0
##$USERP1= <user>
##$USERP2= <user>
##$USERP3= <user>
##$USERP4= <user>
##$USERP5= <user>
##$WDW= 1
##$XDIM= 16384
##$YMAX_p= 452220807
##$YMIN_p= -522465
$$ End of Bruker specific parameters
$$ ---------------------------------
##NTUPLES= NMR SPECTRUM
##VAR_NAME=  FREQUENCY,     SPECTRUM/REAL,   SPECTRUM/IMAG
##SYMBOL=    X,             R,               I
##VAR_TYPE=  INDEPENDENT,   DEPENDENT,       DEPENDENT
##VAR_FORM=  AFFN,          ASDF,            ASDF
##VAR_DIM=   16384,         16384,           16384
##UNITS=     HZ,            ARBITRARY UNITS, ARBITRARY UNITS
##FACTOR=    0.220516191357247, 1,           1
##FIRST=     3098.94515034527, 0,            0
##LAST=      -513.771612660508, 0,           0
##MIN=       -513.771612660508, -522465,     0
##MAX=       3098.94515034527, 452220807,    0
$$ Real data points
##PAGE= N=1
##DATA TABLE= (X++(R..R)), XYDATA
$$ [...]
$$ plain form
6459 3711251 3670497 3464624 3333961 3398388 3250059 3240576 3071057 3046381 3030681 3046027 3063233
6448 3063233 3061415 2981292 2871796 2875191 2633983 2656603 2741962 2731249 2706764 2750318 2728789
6437 2728789 2744994 2651511 2658661 2410885 2238606 2440274 2614054 2651711 2491941 2493271 2507111
6426 2507111 2498439 2552628 2430820 2414197 2474313 2503764 2413922 2515018 2685362 2643218 2628765
6415 2628765 2548936 2585163 2554680 2419984 2462808 2484673 2400591 2535185 2632677 2656858 2639495
6404 2639495 2612909 2548969 2506423 2557251 2615366 2615507 2621318 2478812 2556104 2659909 2696756 2657463
6392 2657463 2585355 2506188 2505840 2627378 2507191 2584991 2672269 2626825 2742085 2633774 2469737
6381 2469737 2622094 2684068 2722284 2684350 2737025 2789980 2765768 2666871 2593076 2791679 2824175
$$ packed form
6459C711251m0754k05873j30663O4427j48329r483j69519k4676j5700J5346J7206
6448C063233j818q0123j09496L395k41208K2620Q5359j0713k4485M3554k1529
6437B728789J6205r3483P150k47776j72279K01668J73780L7657j59770J330J3840
6426B507111q672N4189j21808j6623O0116K9451q9842J01096J70344m2144j4453
6415B628765p9829L6227l0483j34696M2824K1865q4082J34594R7492K4181j7363
6404B639495k6586o3940m2546N0828N8115J41N811j42506P7292J03805L6847l9293
6392B657463p2108p9167l48J21538j20187P7800Q7278m5444J15260j08311j64037
6381B469737J52357O1974L8216l7934N2675N2955k4212r8897p3795J98603L2496
$$ plain form
6370 2824175 2810559 2879546 2872816 2867654 2878157 2855485 2889189 2894974 2919907 3011366 3001453 2996645
6358 2996645 3044063 3067559 3012110 3125109 3183014 3140414 3261412 3367642 3430226 3694083 3578086
6347 3578086 3601077 3531425 3515958 3508044 3641293 3803329 3711345 3806184 3889465 3918428 3899046
6336 3899046 3908563 3887451 4122823 4309200 4276769 4256270 4363286 4311286 4264802 4338495 4444200
6325 4444200 4636220 4740814 4721306 4699399 4768513 5007525 5067473 5158938 5326340 5476327
6315 5476327 5388811 5505890 5561889 5382008 5160492 5049322 4910591 4968265 5040249 5156740
6305 5156740 5291345 5303611 5150859 5235252 5390873 5652354 5914577 5920212 6066918 6092200
6295 6092200 6078134 5968754 6102324 6081761 5862509 5836502 5729777 5572198 5629009 5599580
$$ packed form
6370B824175j3616O8987o730n162J0503k2672L3704N785K4933R1459r913m808
6358B996645M7418K3496n5449J12999N7905m2600J20998J06230O2584K63857j15997
6347C578086K2991o9652j5467p914J33249J62036r1984R4839Q3281K8963j9382
6336C899046R517k1112K35372J86377l2431k0499J07016n2000m6484P3693J05705
6325D444200J92020J04594j9508k1907O9114K39012N9948R1465J67402J49987
6315E476327q7516J17079N5999j79881k21516j11170j38731N7674P1984J16491
6305E156740J34605J2266j52752Q4393J55621K61481K62223N635J46706K5282
6295F092200j4066j09380J33570k0563k19252k6007j06725j57579N6811k9429
$$ plain form
6285 5599580 5411513 5229905 5198862 5184776 5166017 5171879 5208348 5284649 5509928 5625998 5542344
6274 5542344 5581587 5856378 6020862 6063936 6153370 6354235 6540982 6699398 7051380 7292099
6264 7292099 7502797 7778368 7905654 8191269 8238553 8331876 8281635 8213707 8079480 7950320
6254 7950320 7861142 7679189 7620318 7508131 7497285 7578445 7610463 7613936 7709143 7853570 7935671
6243 7935671 7890671 7866650 8018910 8410835 8431848 8559729 8628289 8661447 8679013 8574276 8733216
6232 8733216 8878296 9023722 9251592 9527181 9750087 9851009 9853393 9930638 9844751 9573098
6222 9573098 9301325 9001069 8777191 8649337 8396180 8239034 8227726 8076898 7940417 7797654
6212 7797654 7885319 7839081 7823477 7850172 7898748 7915342 8025991 8206569 8252660 8362989 8531685
$$ packed form
6285E599580j88067j81608l1043j4086j8759N862L6469P6301K25279J16070q3654
6274E542344L9243K74791J64484M3074Q9434K00865J86747J58416L51982K40719
6264G292099K10698K75571J27286K85615M7284R3323n0241o7928j34227j29160
6254G950320q9178j81953n8871j12187j0846Q1160L2018L473R5207J44427Q2101
6243G935671m5000k4021J52260L91925K1013J27881O8560L3158J7566j04737J58940
6232H733216J45080J45426K27870K75589K22906J00922K384P7245q5887k71653
6222I573098k71773l00256k23878j27854k53157j57146j1308j50828j36481j42763
6212G797654Q7665m6238j5604K6695M8576J6594J10649J80578M6091J10329J68696
$$ plain form
6201 8531685 8866578 8988453 9213624 9349280 9528996 9722508 9961960 10148450 10243845 10278430
6191 10278430 10432186 10590058 10615252 10789093 10908704 11029171 11434442 11702079 11779132 11968827
6181 11968827 12088334 12240046 12209316 12311273 12325377 12322161 12515538 12613467 12589700 12727123
6171 12727123 12720447 12660043 12661717 12765850 12906992 12972759 13097190 13069146 13123521 13052352 12870960
6160 12870960 12995710 13290787 13450819 13363305 13418203 13439410 13501557 13626116 13820052 14039284
6150 14039284 14019225 13917128 13982904 14186358 14217602 14454658 14514626 14698597 14894313 14996132
6140 14996132 14858484 14577322 14671017 14562727 14277009 14066203 13925501 13743557 13516953 13242655
6130 13242655 13292267 13267033 13178939 13135706 13176184 13213381 13315649 13706192 13975291 14120503
$$ packed form
6201H531685L34893J21875K25171J35656J79716J93512K39452J86490R5395L4585
6191A0278430J53756J57872K5194J73841J19611J20467M05271K67637P7053J89695
6181A1968827J19507J51712l0730J01957J4104l216J93377R7929k3767J37423
6171A2727123o676o0404J674J04133J41142O5767J24431k8044N4375p1169j81392
6160A2870960J24750K95077J60032q7514N4898K1207O2147J24559J93936K19232
6150A4039284k0059j02097O5776K03454L1244K37056N9968J83971J95716J01819
6140A4996132j37648k81162R3695j08290k85718k10806j40702j81944k26604k74298
6130A3242655M9612k5234q8094m3233M0478L7197J02268L90543K69099J45212
$$ plain form
6120 14120503 14445006 14796470 15254896 15779907 16355633 16990186 17738815 18359043 19135107
6111 19135107 19960473 20664747 21316348 21725021 21912083 21858149 21660509 21262633 21015650 20690514
6101 20690514 20523698 20576494 20582386 20552388 20807484 20981152 21313164 21805572 22396948 23034085
6091 23034085 23878133 24887853 25830365 27102182 28302936 29779511 31389027 32897282
6083 32897282 34620608 36042049 37215856 37881934 38197501 37798024 36871636 36009234 35264850
6074 35264850 34670107 34478708 34461959 34562645 34828255 35225271 35929793 36784340 37833768
6065 37833768 39173683 40736876 42708787 44883129 47290246 49878554 52792916 55853926
6057 55853926 58834250 61677362 64294514 66540780 68048642 68659624 68343854 66806588
$$ packed form
6120A4120503L24503L51464M58426N25011N75726O34553P48629O20228P76064
6111A9135107Q25366P04274O51601M08673J87062n3934j97640l97876k46983l25136
6101B0690514j66816N2796N892k9998K55096J73668L32012M92408N91376O37137
6091B3034085Q44048J009720R42512J271817J200754J476575J609516J508255
6083C2897282J723326J421441J173807O66078L15567l99477r26388q62402p44384
6074C5264850n94743j91399j6749J00686K65610L97016P04522Q54547J049428
6065C7833768J339915J563193J971911K174342K407117K588308K914362L061010
6057E5853926K980324K843112K617152K246266J507862O10982l15770j537266
$$ plain form
6049 66806588 64573232 62390497 60125286 58003233 56121952 54640055 53281817 52471044
6041 52471044 51765517 51554564 51583927 51863952 52524709 53496877 54568097 55966528 57905446
6032 57905446 60090888 62704080 65686226 68993661 72666392 76629803 80703861 84963534
6024 84963534 89125919 92646053 95480972 97361851 97648050 96284929 93352526 89168289
6016 89168289 84453834 79416797 74451488 70034726 66272136 62801251 59662235 57068952
6008 57068952 54761092 52790261 51208796 49978103 49007675 48098784 47611962 47379835 47429913
5999 47429913 47814149 48436895 49619598 50796029 52117715 53650199 55192657 56772615
5991 56772615 58002855 59057410 59387205 59009547 57792776 55546323 52792397 49598244
$$ packed form
6049F6806588k233356k182735k265211k122053j881281j481897j358238q10773
6041E2471044p05527k10953K9363K80025O60757R72168J071220J398431J938918
6032E7905446K185442K613192K982146L307435L672731L963411M074058M259673
6024H4963534M162385L520134K834919J880879K86199j363121k932403m184237
6016H9168289m714455n037037m965309m416762l762590l470885l139016k593283
6008E7068952k307860j970831j581465j230693r70428r08891m86822k32127N0078
5999D7429913L84236O22746J182703J176431J321686J532484J542458J579958
5991E6772615J230240J054555L29795l77658j216771k246453k753926l194153
$$ plain form
5983 49598244 46505820 43541250 40731448 38173622 35667435 33536637 31599282 29831154
5975 29831154 28186898 26846466 25698267 24660324 23877231 23253658 22709853 22035145 21669852
5966 21669852 21327618 21197998 20985357 20703665 20394208 19999609 19658026 19263239 18656544
5957 18656544 18013610 17325477 16729702 16108867 15518410 15065258 14602322 14248875 13790384
5948 13790384 13387379 13087503 12858862 12516944 12262448 11985221 11782041 11701450 11612583 11613123
5938 11613123 11485514 11437685 11231304 11123992 11016144 11013381 10921601 10808569 10839974 10565547
5928 10565547 10445199 10414056 10357968 10258907 10156330 10046821 10016991 9936543 9808927 9892028
5918 9892028 9893033 9797499 9748422 9694957 9714353 9723022 9790909 10052807 10184687 10152600 10092256
$$ packed form
5983D9598244l092424k964570k809802k557826k506187k130798j937355j768128
5975B9831154j644256j340432j148199j037943p83093o23573n43805o74708l65293
5966B1669852l42234j29620k12641k81692l09457l94599l41583l94787o06695
5957A8656544o42934o88133n95775o20835n90457m53152m62936l53447m58491
5948A3790384m03005k99876k28641l41918k54496k77227k03180q0591q8867N40
5938A1613123j27609m7829k06381j07312j07848k763r1780j13032L1405k74427
5928A0565547j20348l1143n6088r9061j02577j09509k9830q0448j27616Q3101
5918I892028J005r5534m9077n3465J9396Q669O7887K61898J31880l2087o0344
$$ plain form
5907 10092256 10076244 10211996 10151697 10340675 10505136 10358510 10322469 10364767 10373536 10305508 10257906
5896 10257906 10022492 9925704 9786638 9589237 9377712 9210827 9195224 9119306 8924589 8908853
5886 8908853 8821623 8637570 8690339 8815718 8819480 8798613 8845079 8905417 8980501 8994114 8794214
5875 8794214 8670195 8563902 8643805 8647692 8552994 8475120 8477828 8477980 8457779 8448459 8369462 8264856
5863 8264856 8163305 8127388 7875872 7714142 7571694 7467046 7354773 7387036 7434624 7319287
5853 7319287 7133741 6979695 6884480 6774378 6768724 6788407 6820548 6773706 6644318 6592903 6509587
5842 6509587 6530060 6539726 6475823 6279874 6187340 6116336 6053614 5948053 5924363 5826034 5810032
5831 5810032 5849543 5708245 5714692 5679346 5645081 5651451 5666480 5703201 5562307 5601452 5634825
$$ packed form
5907A0092256j6012J35752o0299J88978J64461j46626l6041M2298Q769o8028m7602
5896A0257906k35414r6788j39066j97401k11525j66885j5603p5918j94717j5736
5886H908853q7230j84053N2769J25379L762k0867M6466O0338P5084J3613j99900
5875H794214j24019j06293P9903L887r4698p7874K708J52k0201r320p8997j04606
5863H264856j01551l5917k51516j61730j42448j04648j12273L2263M7588j15337
5853G319287j85546j54046r5215j10102n654J9683L2141m6842j29388n1415q3316
5842F509587K0473R666o3903j95949r2534p1004o2722j05561k3690r8329j6002
5831E810032L9511j41298O447l5346l4265O370J5029L6721j40894L9145L3373
$$ plain form
5820 5634825 5734535 5718092 5782332 5745150 5724667 5871394 5947162 5867166 5774649 5753756 5675025
5809 5675025 5690507 5684529 5680164 5575831 5532898 5581192 5533035 5380081 5435124 5527940 5432270
5798 5432270 5338185 5304073 5437222 5415181 5355051 5420954 5593781 5472926 5451243 5468740 5567276
5787 5567276 5546614 5379169 5518921 5450080 5290438 5386040 5420591 5404278 5514196 5605841 5635191
5776 5635191 5610348 5696560 5609539 5605058 5527488 5621766 5764955 5817420 5790086 5757637 5718666
5765 5718666 5782599 5860221 5967039 5941187 5878062 5919471 5973648 5975901 6054496 6004039 6181098
5754 6181098 6119403 6097044 6226292 6369725 6413869 6469417 6509957 6678418 6711681 6639328 6719606
5743 6719606 6926216 6912631 6987185 7103628 6987879 7028664 7138906 7110448 7144502 7340266
$$ packed form
5820E634825R9710j6443O4240l7182k0483J46727P5768p9996r2517k0893p8731
5809E675025J5482n978m365j04333m2933M8294m8157j52954N5043R2816r5670
5798E432270r4085l4112J33149k2041o0130O5903J72827j20855k1683J7497R8536
5787E567276k0662j67445J39752o8841j59642R5602L4551j6313J09918R1645K9350
5776E635191k4843Q6212q7021m481p7570R4278J43189N2465k7334l2449l8971
5765E718666O3933P7622J06818k5852o3125M1409N4177K253P8595n0457J77059
5754F181098o1695k2359J29248J43433M4144N5548M0540J68461L3263p2353Q0278
5743F719606K06610j3585P4554J16443j15749M0785J10242k8458L4054J95764
$$ plain form
5733 7340266 7262576 7200249 7244966 7334361 7368038 7414390 7437576 7524093 7494922 7609320 7684364
5722 7684364 7622500 7712007 7879300 8048597 8246231 8332114 8477922 8701760 8779647 8940247
5712 8940247 9175974 9146989 9314675 9520224 9656045 9857479 10080920 10362946 10543253 10633587
5702 10633587 10848265 10928783 11128076 11191804 11139704 11053450 11152757 11091294 11026532 11092736 11205504
5691 11205504 11313476 11161684 11206551 11417182 11522091 11612698 11747103 11762120 11686224 11908445
5681 11908445 12062239 12255285 12476781 12856536 13219369 13671934 13979040 14176770 14654051
5672 14654051 15187871 15509946 15794241 16158942 16197664 16151418 16193670 16295660 16214879 16215720 16304343
5661 16304343 16450177 16669860 16846378 17045037 17324765 17619758 17953937 18187298 18559082
$$ packed form
5733G340266p7690o2327M4717Q9395L3677M6352K3186Q6517k9171J14398P5044
5722G684364o1864Q9507J67293J69297J97634Q5883J45808K23838P7887J60600
5712H940247K35727k8985J67686K05549J35821K01434K23441K82026J80307R0334
5702A0633587K14678Q0518J99293O3728n2100q6254R9307o1463o4762O6204J12768
5691A1205504J07972j51792M4867K10631J04909R0607J34405J5017p5896K22221
5681A1908445J53794J93046K21496L79755L62833M52565L07106J97730M77281
5672A4654051N33820L22075K84295L64701L8722m6246M2252J01990q0781Q41Q8623
5661A6304343J45834K19683J76518J98659K79728K94993L34179K33361L71784
$$ plain form
5652 18559082 19103690 19552274 20142916 20847541 21545584 22469823 23189632 24086024 25056504
5643 25056504 26129451 27162834 28054960 29190066 30295449 31377527 32708860 34127247
5635 34127247 35557104 37202391 39095987 40925615 43015268 45325032 47975873 50666797
5627 50666797 53491145 56354617 59397597 62467579 65562177 68561999 71722177 75123967
5619 75123967 78987482 83741764 88960324 94897661 101619949 109074184 117163981 125936738
5611 125936738 135265656 145312335 155579608 166126538 176520372 186370218 195592995
5604 195592995 203674447 210605478 216172764 219721483 220817107 219423228 215654090 209646723
5596 209646723 202037712 192915798 183045760 172860637 162479094 152241525 142287910 133010321
$$ packed form
5652A8559082N44608M48584N90642P04625O98043R24239P19809Q96392R70480
5643B5056504J072947J033383Q92126J135106J105383J082078J331333J418387
5635C4127247J429857J645287J893596J829628K089653K309764K650841K690924
5627E0666797K824348K863472L042980L069982L094598K999822L160178L401790
5619G5123967L863515M754282N218560N937337O722288P454235Q089797Q772757
5611A25936738R328918J0046679J0267273J0546930J0393834R849846R222777
5604A95592995Q081452O931031N567286L548719J095624j393879l769138o007367
5596B09646723p609011r121914r870038j0185123j0381543j0237569r953615r277589
$$ plain form
5588 133010321 124157472 116069805 108723937 102004607 95927256 90492083 85433241 80832512
5580 80832512 76694380 72871131 69366659 66193012 63296786 60460223 57977895 55504793
5572 55504793 53207517 51060883 48887007 46854145 44538292 42047272 39747330 37237480
5564 37237480 34862491 32836740 31150721 29665917 28214060 26707445 25367418 24198516
5556 24198516 23177069 22272863 21435687 20312407 19413349 18819926 18423211 17952793 17267517
5547 17267517 16640105 16118775 15671230 15188207 14808524 14427850 14090955 13666988 13248653
5538 13248653 12867309 12520390 12328806 12047763 11800771 11606480 11377299 11110248 11027911 10777462
5528 10777462 10324111 10149421 10022335 9852171 9653058 9530047 9236999 9165679 8914879 8724947
$$ packed form
5588A33010321q852849q087667p345868o719330o077351n435173n058842m600729
5580H0832512m138132l823249l504472l173647k896226k836563k482328k473102
5572E5504793k297276k146634k173876k032862k315853k491020k299942k509850
5564C7237480k374989k025751j686019j484804j451857j506615j340027j168902
5556B4198516j021447r04206q37176j123280q99058n93423l96715m70418o85276
5547A7267517o27412n21330m47545m83023l79683l80674l36895m23967m18335
5538A3248653l81344l46919j91584k81043k46992j94291k29181k67051q2337k50449
5528A0777462m53351j74690j27086j70164j99113j23011k93048p1320k50800j89932
$$ plain form
5518 8724947 8617511 8445262 8370558 8256225 8144419 8121546 7929004 7880235 7843079 7801084
5508 7801084 7779503 7736140 7747284 7653928 7723859 7837266 7845640 7956597 8049455 8117775 8144260
5497 8144260 8195195 8256911 8184033 8055225 7869527 7636344 7490359 7494887 7517000 7495963 7371979
5486 7371979 7288699 7340018 7507124 7576031 7468810 7520208 7729410 7962560 8170261 8329559
5476 8329559 8599633 8859051 9128836 9475540 9829404 10293385 10600839 10692624 10504116 10199107
5466 10199107 9725368 9403856 9178152 8869243 8530914 8118631 8006142 8020521 7996449 7978909
5456 7978909 7943600 8010188 8031099 8153789 8351140 8600160 8867222 9215593 9599399 9894990
5446 9894990 10455067 10954476 11427933 11845964 12002883 11970593 11869094 11369853 10821590 10065996
$$ packed form
5518H724947j07436j72249p4704j14333j11806k2873j92542m8769l7156m1995
5508G801084k1581m3363J1144r3356O9931J13407Q374J10957R2858O8320K6485
5497H144260N0935O1716p2878j28808j85698k33183j45985M528K2113k1037j23984
5486G371979q3280N1319J67106O8907j07221N1398K09202K33150K07701J59298
5476H329559K70074K59418K69785L46704L53864M63981L07454R1785j88508l05009
5466A0199107m73739l21512k25704l08909l38329m12283j12489J4379k4072j7540
5456G978909l5309O6588K0911J22690J97351K49020K67062L48371L83806K95591
5446I894990N60077M99409M73457M18031J56919l2290j01499m99241n48263p55594
$$ plain form
5436 10065996 9423199 8916428 8505459 8234706 8049991 7921226 7683535 7464766 7431262 7435148
5426 7435148 7407669 7430070 7591383 7630236 7915893 8194547 8337526 8644815 8931530 9243545
5416 9243545 9390157 9639796 9995010 9987066 9487893 9041918 8501759 8048566 7639699 7423561
5406 7423561 7261247 6914516 6713710 6428386 6392722 6318834 6107927 5981961 5890099 5911324
5396 5911324 5910087 5915922 6095985 6201741 6190258 6375728 6367490 6390733 6532605 6624662 6490910
5385 6490910 6220105 6070003 5803343 5584570 5409390 5296458 5109160 4936541 4715574 4530114
5375 4530114 4289554 4174495 4174230 4170576 4149102 4081990 4119407 4164916 4209928 4145127 4051997 3996878
5363 3996878 3904643 4057091 4043671 4084790 4172784 4058696 4105656 4091592 4061417 3954024 3937099
$$ packed form
5436A0065996o42797n06771m10969k70753j84715j28765k37691k18769l3504L886
5426G435148k7479K2401J61313L8853K85657K78654J42979L07289K86715L12015
5416I243545J46612K49639L55214p944m99173m45975n40159m53193m08867k16138
5406G423561j62314l46731k00806k85324l5664p3888k10907j25966r1862K1225
5396E911324j237N835J80063J05756j1483J85470q238K3243J41872R2057j33752
5385F490910k70805j50102k66660k18773j75180j12932j87298j72619k20967j85460
5375D530114k40560j15059k65l654k1474o7112L7417M5509M5012o4801r3130n5119
5363C996878r2235J52448j3420M1119Q7994j14088M6960j4064l0175j07393j6925
$$ plain form
5352 3937099 3837650 3855561 3788723 3725300 3605241 3634230 3699135 3644074 3632296 3540293 3472124
5341 3472124 3570138 3673491 3591403 3594186 3664320 3527140 3542230 3497005 3519320 3513263 3509320 3738008
5329 3738008 3730793 3552993 3552143 3596264 3552414 3576798 3636131 3602135 3721816 3633441 3608976 3674507
5317 3674507 3745879 3863541 3880682 3823578 3934960 3881988 3721093 3848780 3869095 4154023
5307 4154023 4229853 4293669 4293246 4209933 4259690 4482963 4478818 4407036 4528708 4505174 4485602 4611218
5295 4611218 4658021 4693047 4719758 4655018 4629743 4547296 4686807 4749434 4810221 4783560 4562286
5284 4562286 4509355 4532407 4705979 4652700 4558046 4615228 4721221 4816238 4793163 4815156 4728931
5273 4728931 4533658 4576979 4590636 4624215 4630484 4670031 4658591 4603025 4597583 4526113 4604001 4605880
$$ packed form
5352C937099r9449J7911o6838o3423j20059K8989O4905n5061j1778r2003o8169
5341C472124R8014J03353q2088K783P0134j37180J5090m5225K2315o057l943K28688
5329C738008p215j77800q50M4121m3850K4384N9333l3996J19681q8375k4465O5531
5317C674507P1372J17662J7141n7104J11382n2972j60895J27687K0315K84928
5307D154023P5830O3816m23q3313M9757K23273m145p1782J21672k3534j9572J25616
5295D611218M6803L5026K6711o4740k5275q2447J39511O2627O0787k6661k21274
5284D562286n2931K3052J73572n3279r4654N7182J05993R5017k3075K1993q6225
5273D728931j95273M3321J3657L3579O269L9547j1440n5566n442p1470P7888J879
$$ plain form
5261 4605880 4711237 4819619 4796461 4990402 4848166 4756413 4760438 4777487 4827434 4855164 4970311
5250 4970311 4914176 4958609 5040874 4862551 5025187 5106211 5155947 5229152 5249074 5265848 5241401
5239 5241401 5366898 5317796 5323853 5297492 5388418 5305688 5395468 5328384 5467839 5515105 5403483
5228 5403483 5588957 5731607 5647085 5633839 5732971 5752390 5766569 5631723 5688190 5619524 5681467
5217 5681467 5726132 5837890 5791107 5752290 5732309 5720546 5766128 5745773 5977604 5965831 5897273
5206 5897273 5998807 5998355 6016564 5989593 6031190 6128761 6167945 6394980 6374574 6252701 6184571
5195 6184571 6254434 6268151 6356734 6221509 6248919 6333743 6324188 6355808 6406588 6465558 6476235
5184 6476235 6619205 6618178 6466193 6596550 6752033 6913680 6989377 6968474 7173023 7187683
$$ packed form
5261D605880J05357J08382k3158J93941j42236r1753M025J7049M9947K7730J15147
5250D970311n6135M4433Q2265j78323J62636Q1024M9736P3205J9922J6774k4447
5239E241401J25497m9102O057k6361R0926q2730Q9780o7084J39455M7266j11622
5228E403483J85474J42650q4522j3246R9132J9419J4179j34846N6467o8666O1943
5217E681467M4665J11758m6783l8817j9981j1763M5582k0355K31831j1773o8558
5206E897273J01534m52J8209k6971M1597R7571L9184K27035k0406j21873o8130
5195F184571O9863J3717Q8583j35225K7410Q4824r555L1620N0780N8970J0677
5184F476235J42970j027j51985J30357J55483J61647P5697k0903K04549J4660
$$ plain form
5174 7187683 7226195 7367838 7515341 7607331 7661068 7714425 7996345 8078055 8165193 8398804 8513896
5163 8513896 8741115 8904327 8979199 9165638 9225726 9374231 9463083 9452634 9418140 9617629
5153 9617629 9527573 9518454 9541678 9531978 9760557 9698728 9679004 9804030 9897331 10107246 10425901
5142 10425901 10633706 10959573 11191141 11615425 12022514 12536817 12922483 13504239 14066068
5133 14066068 14301358 14518159 14595141 14592497 14403658 14152328 13903000 13619270 13516063 13601084
5123 13601084 13481355 13454919 13446608 13479823 13666505 13940798 14125984 14191820 14303029 14275127
5113 14275127 14192781 14336598 14483308 14309001 14108326 14192051 14167009 14124441 14223367 14315748
5103 14315748 14333612 14342343 14435201 14521337 14644522 14676829 14659977 14691440 14677837 14834065 14811846
$$ packed form
5174G187683L8512J41643J47503R1990N3737N3357K81920Q1710Q7138K33611J15092
5163H513896K27219J63212P4872J86439O0088J48505Q8852j0449l4494J99489
5153I617629r0056r119K3224r700K28579o1829j9724J25026R3301K09915L18655
5142A0425901K07805L25867K31568M24284M07089N14303L85666N81756N61829
5133A4066068K35290K16801P6982k644j88839k51330k49328k83730j03207Q5021
5123A3601084j19729k6436q311L3215J86682K74293J85186O5836J11209k7902
5113A4275127q2346J43817J46710j74307k00675Q3725k5042m2568R8926R2381
5103A4315748J7864Q731R2858Q6136J23185L2307j6852L1463j3603J56228k2219
$$ plain form
5092 14811846 14778632 14626560 14593135 14754318 14987762 15087464 15011439 14983804 15037981 15127108 15146937
5081 15146937 15192800 15262074 15089818 15140216 15203603 15221239 15416067 15569397 15688424 15908949
5071 15908949 15943399 15970772 16128502 15961400 15910528 15950782 15914968 15767554 15549271 15449652
5061 15449652 15341940 15033838 14801627 14666832 14601061 14544392 14546955 14396021 14489496 14607998
5051 14607998 14486099 14374387 14312126 14234629 14326473 14368725 14463850 14601640 14755762 14873514
5041 14873514 15045794 15034130 15206921 15384094 15517396 15538059 15785401 15991980 16384511 16783179
5031 16783179 16904888 16969078 17351274 17559283 17620807 17881479 18199741 18534468 18923670 19406864
5021 19406864 19633386 19889865 20337545 20767098 21035790 21598689 22104371 22714220 23402198
$$ packed form
5092A4811846l3214j52072l3425J61183K33444R9702p6025k7635N4177Q9127J9829
5081A5146937M5863O9274j72256N0398O3387J7636J94828J53330J19027K20525
5071A5908949L4450K7373J57730j67102n0872M0254l5814j47414k18283r9619
5061A5449652j07712l08102k32211j34795o5771n6669K563j50934R3475J18502
5051A4607998j21899j11712o2261p7497R1844M2252R5125J37790J54122J17752
5041A4873514J72280j1664J72791J77173J33302K0663K47342K06579L92531L98668
5031A6783179J21709O4190L82196K08009O1524K60672L18262L34727L89202M83194
5021A9406864K26522K56479M47680M29553K68692N62899N05682O09849O87978
$$ plain form
5012 23402198 23794329 24246563 24932690 25584587 26242973 26965886 27776316 28599633 29337849
5003 29337849 30254749 31184453 32085561 33327141 34450347 35542663 36873567 38167702 39371766
4994 39371766 40992819 42656755 44513874 46372271 48421369 50745721 53046580 55405758
4986 55405758 57946183 60974864 64145710 67444812 71008847 74776375 78643087 82715749
4978 82715749 86987440 90992310 94991146 98605435 101836439 104437771 106413892 107454414
4970 107454414 107975601 107968084 107809226 107554401 107656863 107896479 108547183 109427549 110497110
4961 110497110 112016527 113805638 116008878 118638350 121861091 125524828 129446553 133923543
4953 133923543 138866737 144425851 150538975 157123704 164265137 171620771 179318697 187136271
$$ packed form
5012B3402198L92131M52234O86127O51897O58386P22913Q10430Q23317P38216
5003B9337849R16900R29704R01108J241580J123206J092316J330904J294135J204064
4994C9371766J621053J663936J857119J858397K049098K324352K300859K359178
4986E5405758K540425L028681L170846L299102L564035L767528L866712M072662
4978H2715749M271691M004870L998836L614289L231004K601332J976121J040522
4970A07454414N21187p517j58858k54825J02462K39616O50704Q80366J069561
4961A10497110J519417J789111K203240K629472L222741L663737L921725M476990
4953A33923543M943194N559114O113124O584729P141433P355634P697926P817574
$$ plain form
4945 187136271 194746009 201887891 208399903 213670159 217689755 219945377 220474304 219502453
4937 219502453 217578689 215333196 213065249 211213701 210147870 209552083 209497947 209859524 210603900
4928 210603900 211411888 212438442 213538419 214739520 215719605 216695305 217591434 218602360 219763492
4919 219763492 221085574 222819642 224762065 227261811 230336191 233484759 236601110 239298249
4911 239298249 241371191 242485184 242075870 239803215 235571252 229527298 221924436 213624940
4903 213624940 205184886 197016706 189568919 182994262 177293012 172847385 169127226 166052027
4895 166052027 163727436 161706208 159655928 157268038 154283990 150189911 144917404 138660938
4887 138660938 131961331 125077023 118480037 112153747 106511390 101433832 96834920 92845260
$$ packed form
4945A87136271P609738P141882O512012N270256M019596K255622N28927r71851
4937B19502453j923764k245493k267947j851548j065831n95787n4136L61577P44376
4928B10603900Q07988J026554J099977J201101R80085R75700Q96129J010926J161132
4919B19763492J322082J734068J942423K499746L074380L148568L116351K697139
4911B39298249K072942J113993m09314k272655m231963o043954p602862q299496
4903B13624940q440054q168180p447787o574657n701250m445627l720159l075199
4895A66052027k324591k021228k050280k387890k984048m094079n272507o256466
4887A38660938o699607o884308o596986o326290n642357n077558m598912l989660
$$ plain form
4879 92845260 89398879 86370453 83812331 81624758 79830642 78258039 76789814 75622461
4871 75622461 74489994 73277184 71913689 70689742 69122259 67573668 65913452 64170015
4863 64170015 62384805 60818553 59355625 58043033 56861437 55718159 54597918 53614959
4855 53614959 52861047 52058027 51037257 49861133 48809177 47681471 46513535 45373383
4847 45373383 44202961 42999767 41866687 40665038 39792112 38813383 38014658 37022784 36130700
4838 36130700 35270492 34263793 33371994 32664894 32242401 31688886 30976944 30185014 29466236
4829 29466236 28948601 28553432 28122269 27515075 26817124 26316886 25935306 25625030 25099251
4820 25099251 24629085 24262189 23979678 23596122 23377020 23076939 22887949 22561940 22171243
$$ packed form
4879I2845260l446381l028426k558122k187573j794116j572603j468225j167353
4871G5622461j132467j212810j363495j223947j567483j548591j660216j743437
4863F4170015j785210j566252j462928j312592j181596j143278j120241r82959
4855E3614959p53912q03020j020770j176124j051956j127706j167936j140152
4847D5373383j170422j203194j133080j201649q72926r78729p98725r91874q92084
4838C6130700q60208j006699q91799p07100m22493n53515p11942p91930p18778
4829B9466236n17635l95169m31163o07194o97951n00238l81580l10276n25779
4820B5099251m70166l66896k82511l83556k19102l00081j88990l26009l90697
$$ plain form
4811 22171243 21918654 21890059 21767457 21655033 21574345 21410008 21404683 21282540 21206993 21115375
4801 21115375 20997105 20980142 20914575 20879826 20915867 20914335 20896383 20897425 21036880 21270868 21385546
4790 21385546 21467349 21744067 21825786 21934595 22299058 22305142 22452996 22701597 22875104 23133383
4780 23133383 23268339 23420901 23607448 23767518 23928264 24115345 24287529 24458423 24530004 24498269
4770 24498269 24691220 24943670 25107248 25226809 25247133 25341234 25423729 25574832 25788194 25906257
4760 25906257 25813350 25766564 25904214 25905574 26093234 26202529 26384093 26472564 26443300 26586084
4750 26586084 26529602 26597078 26646595 26821569 26970017 27111879 27371584 27533797 27657624 27655013
4740 27655013 27753233 27828622 27821700 27750461 27610765 27679109 27458483 27325663 27314913 27255699 27262699
$$ packed form
4811B2171243k52589k8595j22602j12424q0688j64337n325j22143p5547r1618
4801B1115375j18270j6963o5567l4749L6041j532j7952J042J39455K33988J14678
4790B1385546Q1803K76718Q1719J08809L64463O084J47854K48601J73507K58279
4780B3133383J34956J52562J86547J60070J60746J87081J72184J70894P1581l1735
4770B4498269J92951K52450J63578J19561K0324R4101Q2495J51103K13362J18063
4760B5906257r2907m6786J37650J360J87660J09295J81564Q8471k9264J42784
4750B6586084n6482O7476M9517J74974J48448J41862K59705J62213J23827k611
4740B7655013R8220P5389o922p1239j39696O8344k20626j32820j0750n9214P000
$$ plain form
4729 27262699 27155080 26824077 26785494 26848106 26868043 26930207 26882495 26823919 26871396 26981909 27119301
4718 27119301 27122102 27165625 27415792 27644560 27752688 27854645 28211742 28439816 28675251 29066407
4708 29066407 29532416 29940898 30522759 31087787 31750281 32508456 33152389 33773333 34575648
4699 34575648 35644133 36715594 37612621 38598155 39549692 40303897 40720746 40486949 40092921
4690 40092921 39853519 39750266 40012586 40316262 40820868 41441492 42021009 42892272 43527674
4681 43527674 44364207 45313173 46341757 47763388 49013508 50443995 52243622 54012112
4673 54012112 55900691 57959113 60342221 62920218 65526814 68625037 71901929 75624304
4665 75624304 79668387 84032489 89047924 94460273 100642276 107466168 115062238 123228389
$$ packed form
4729B7262699j07619l31003l8583O2612J9937O2164m7712n8576M7477J10513J37392
4718B7119301K801M3523K50167K28768J08128J01957L57097K28074K35435L91156
4708B9066407M66009M08482N81861N65028O62494P58175O43933O20944Q02315
4699C4575648J068485J071461Q97027R85534R51537P54205M16849k33797l94028
4690D0092921k39402j03253K62320L03676N04606O20624N79517Q71263O35402
4681D3527674Q36533R48966J028584J421631J250120J430487J799627J768490
4673E4012112J888579K058422K383108K577997K606596L098223L276892L722375
4665G5624304M044083M364102N015435N412349O182003O823892P596070Q166151
$$ plain form
4657 123228389 132162841 141956321 152957389 165514656 179861986 196105800 214149167
4650 214149167 234067201 255515425 278064253 301527581 324240941 344814622 361714464
4643 361714464 372699422 375540493 368439076 353459539 334582319 314275551 293754778
4636 293754778 272881959 251900355 231647834 213135698 196391548 181234438 167443625
4629 167443625 154952860 143666121 133398372 124169711 115781316 108642710 102218538 96536578
4621 96536578 91372720 86656795 82143074 77818624 73759407 69502628 65543595 61972838
4613 61972838 58770766 55751261 53173533 50823545 48698866 46543292 44582521 42672641
4605 42672641 40765494 39085507 37549709 36151462 34681275 33491008 32270960 31115849
$$ packed form
4657A23228389Q934452R793480J1001068J2557267J4347330J6243814J8043367
4650B14149167J9918034K1448224K2548828K3463328K2713360K0573681J6899842
4643C61714464J0984958K841071p101417j4979537j8877220k0306768k0520773
4636B93754778k0872819k0981604k0252521j8512136j6744150j5157110j3790813
4629A67443625j2490765j1286739j0267749r228661q388395p138606o424172n681960
4621I6536578n163858m715925m513721m324450m059217m256779l959033l570757
4613F1972838l202072l019505k577728k349988k124679k155574j960771j909880
4605D2672641j907147j679987j535798j398247j470187j190267j220048j155111
$$ plain form
4597 31115849 30204223 29448712 28715405 27880451 26998172 26446371 25896538 25357342 24795163
4588 24795163 24274210 23732198 23419197 22877120 22445597 22017486 21509429 21120397 20863321
4579 20863321 20645983 20323980 19972922 19614441 19391835 19305667 19082696 18612915 18346745 18174525
4569 18174525 17781261 17587328 17442341 17349572 17142085 16914773 16765287 16784317 16718614 16743611
4559 16743611 16881191 17020617 17058254 17141637 17395863 17631870 17873987 18205036 18491215 18790113
4549 18790113 19225339 19778863 20442440 21129342 21924308 22903181 24182344 25288179 26480683
4540 26480683 27761868 29006847 30041182 30913340 31275201 30877080 30068376 28999525 28071652
4531 28071652 27344480 26538060 26042121 25487335 25050755 24725961 24528866 24459207 24248475 24328631
$$ packed form
4597C1115849r11626p55511p33307q34954q82279n51801n49833n39196n62179
4588B4795163n20953n42012l13001n42077m31523m28111n08057l89032k57076
4579B0863321k17338l22003l51058l58481k22606q6168k22971m69781k66170j72220
4569A8174525l93264j93933j44987r2769k07487k27312j49486J9030o5703K4997
4559A6743611J37580J39426L7637Q3383K54226K36007K42117L31049K86179K98898
4549A8790113M35226N53524O63577O86902P94966R78873J279163J105835J192504
4540B6480683J281185J244979J034335Q72158L61861l98121q08704j068851r27873
4531B8071652p27172q06420m95939n54786m36580l24794j97095o9659k10732Q0156
$$ plain form
4521 24328631 24556519 24723303 24921458 25228873 25552627 25656212 25732684 25751964 25519436 24946483
4511 24946483 24249260 23704178 23143786 22611464 22028152 21386560 20987789 20659456 20319268
4502 20319268 20011939 19566985 19237409 19163044 19067175 18924334 18935825 19081801 19155251 19298221
4492 19298221 19533391 19646366 19891785 20078862 20306016 20762188 20758552 20633463 20494805 20318893
4482 20318893 19948719 19649060 19251321 18874623 18561175 18029625 17575982 17228763 16562502
4473 16562502 15891084 15529401 15230797 14598527 14090420 13826911 13571204 13298415 12999016
4464 12999016 12494065 12311049 12113259 11956741 11669116 11482785 11461821 11310039 11031047 10772835
4454 10772835 10892893 10925919 10967509 10784967 10685273 10611465 10570939 10626208 10612166 10546733 10495216
$$ packed form
4521B4328631K27888J66784J98155L07415L23754J03585P6472J9280k32528n72953
4511B4946483o97223n45082n60392n32322n83312o41592l98771l28333l40188
4502B0319268l07329m44954l29576p4365r5869j42841J1491J45976P3450J42970
4492A9298221K35170J12975K45419J87077K27154M56172l636j25089j38658j75912
4482B0318893l70174k99659l97739l76698l13448n31550m53643l47219o66261
4473A6562502o71418l61683k98604o32270n08107k63509k55707k72789k99399
4464A2999016n04951j83016j97790j56518k87625j86331k0964j51782k78992k58212
4454A0772835J20058L3026M1590j82542r9694p3808m0526N5269j4042o5433n1517
$$ plain form
4443 10495216 10560152 10621865 10647787 10650360 10691681 10746680 10766401 10677650 10556910 10493945 10280946
4432 10280946 10225378 10140536 9966503 9600065 9540211 9481510 9250736 9240945 9186397 9124627 9038888
4421 9038888 8794643 8811815 8783087 8563584 8491042 8483027 8531240 8495313 8322815 8276489 8304540
4410 8304540 8199572 8063318 8113456 7991161 7981959 7970589 7969002 8013378 7962739 7818987 7690159
4399 7690159 7663546 7708000 7814953 7955395 7937606 8011146 7995672 8056479 7956889 7953934 8044435
4388 8044435 8045369 8066502 8056841 8186820 8227813 8203687 8408770 8447587 8446442 8513245 8621153 8743175
4376 8743175 8907759 8912349 8918657 8867792 8803285 8889611 8782273 8677255 8621377 8629631 8494133
4365 8494133 8494387 8411443 8525052 8695890 8588488 8576796 8569127 8718394 8793335 8837907 9013396
$$ packed form
4443A0495216O4936O1713K5922K573M1321N4999J9721q8751j20740o2965k12999
4432A0280946n5568q4842j74033l66438n9854n8701k30774r791n4548o1770q5739
4421I038888k44245J7172k8728k19503p2542q015M8213l5927j72498m6326K8051
4410H304540j04968j36254N0138j22295r202j1370j587M4376n0639j43752j28828
4399G690159k6613M4454J06953J40442j7789P3540j5474O0807r9590k955R0501
4388H044435R34K1133r661J29979M0993k4126K05083L8817j145O6803J07908J22022
4376H743175J64584M590O308n0865o4507Q6326j07338j05018n5878Q254j35498
4365H494133K54q2944J13609J70838j07402j1692p669J49267P4941M4572J75489
$$ plain form
4354 9013396 8984603 9018278 9124026 9187987 9246826 9325137 9346485 9602354 9629716 9648169 9953158
4343 9953158 10046062 10252157 10520926 10517225 10440897 10435457 10592693 10704196 10749515 10697978 10522314
4332 10522314 10431515 10472176 10582145 10558949 10359064 10369468 10366356 10392948 10311802 10387702 10397523
4321 10397523 10343793 10427353 10535554 10386362 10439570 10426483 10548771 10534264 10475040 10431544 10582226
4310 10582226 10671530 10631519 10775758 11033328 11151475 11141530 11264034 11324001 11441687 11505186
4300 11505186 11495313 11551493 11690527 11611690 11716742 11824431 11925101 12064813 12189687 12437887
4290 12437887 12541252 12661314 12686933 12514401 12679658 12684939 12844408 13133816 13327408 13334816
4280 13334816 13263339 13310747 13460566 13655788 13825088 13974605 14104977 14115129 14225246 14254301
$$ packed form
4354I013396k8793L3675J05748O3961N8839P8311K1348K55869K7362J8453L04989
4343I953158R2904K06095K68769l701p6328n440J57236J11503M5319n1537j75664
4332A0522314r0799M0661J09969k3196j99885J0404l112K6592q1146P5900R821
4321A0397523n3730Q3560J08201j49192N3208j3087J22288j4507n9224m3496J50682
4310A0582226Q9304m0011J44239K57570J18147r945J22504N9967J17686O3499
4300A1505186r873N6180J39034p8837J05052J07689J00670J39712J24874K48200
4290A2437887J03365J20062K5619j72532J65257N281J59469K89408J93592P408
4280A3334816p1477M7408J49819J95222J69300J49517J30372J0152J10117K9055
$$ plain form
4270 14254301 14412570 14554584 14734513 15003221 15052172 15226638 15453821 15567540 15685206 15821193
4260 15821193 15978470 16210034 16415090 16509037 16553777 16705246 16882570 17023999 17237914 17418969
4250 17418969 17442621 17760678 17940673 18161878 18469477 18565446 18784499 19148526 19381548 19561953
4240 19561953 19859374 20286149 20736896 21074594 21365048 21603853 22060154 22328240 22803428
4231 22803428 23262504 23610753 24109890 24629021 25166924 25816280 26404237 27114615 27809646
4222 27809646 28461575 29335722 30237726 31236119 32258846 33446553 34667429 35858433 37262715
4213 37262715 38739131 40300306 41889218 43538067 45367912 47258650 49314199 51503438
4205 51503438 53811671 56104317 58625432 61311101 64016057 67059369 70054901 73040274
$$ packed form
4270A4254301J58269J42014J79929K68708M8951J74466K27183J13719J17666J35987
4260A5821193J57277K31564K05056R3947M4740J51469J77324J41429K13915J81055
4250A7418969K3652L18057J79995K21205L07599R5969K19053L64027K33022J80405
4240A9561953K97421M26775M50747L37698K90454K38805M56301K68086M75188
4231B2803428M59076L48249M99137N19131N37903O49356N87957P10378O95031
4222B7809646O51929Q74147R02004R98393J022727J187707J220876J191004J404282
4213C7262715J476416J561175J588912J648849J829845J890738K055549K189239
4205E1503438K308233K292646K521115K685669K704956L043312K995532K985373
$$ plain form
4197 73040274 76144644 79479774 82686198 85869125 89253024 92664931 96295108 99828382
4189 99828382 103514411 107166277 110697777 114426948 118132012 121662641 125254192 128613785
4181 128613785 131674950 134720539 137475469 139935253 142516681 144886577 146975493 149134715
4173 149134715 150867639 152392251 153709929 154548549 155315709 155845195 155811125 155557562 155094669
4164 155094669 154392102 153090174 151539709 149904533 148026407 145844652 143626732 141297050
4156 141297050 138670969 135926626 132954952 129840354 126549300 123106845 119373011 115724436
4148 115724436 111941381 108180554 104474491 100802509 97143274 93319920 89830585 86379476
4140 86379476 82930113 79627746 76121274 72812585 69601648 66381831 63315333 60223615
$$ packed form
4197G3040274L104370L335130L206424L182927L383899L411907L630177L533274
4189I9828382L686029L651866L531500L729171L705064L530629L591551L359593
4181A28613785L061165L045589K754930K459784K581428K369896K088916K159222
4173A49134715J732924J524612J317678Q38620P67160N29486l4070k53563m62893
4164A55094669p02567j301928j550465j635176j878126k181755k217920k329682
4156A41297050k626081k744343k971674l114598l291054l442455l733834l648575
4148A15724436l783055l760827l706063l671982l659235l823354l489335l451109
4140H6379476l449363l302367l506472l308689l210937l219817l066498l091718
$$ plain form
4132 60223615 57296875 54614338 52084286 49622209 47286202 45129109 42958356 40943172
4124 40943172 39039453 37117228 35424460 33868527 32111939 30532314 29297547 27984792
4116 27984792 26780237 25850646 24739006 23812207 22982866 22174912 21483911 20864194 20298348
4107 20298348 19808212 19219305 18878638 18367406 17809297 17525490 17373585 16950844 16712272
4098 16712272 16494788 16232116 15984851 15780327 15562375 15324283 15198433 15064861 14962124
4089 14962124 14912848 14920719 14682070 14601203 14331756 14173367 14231142 14072388 13988737 14070406 13967815
4078 13967815 13752216 13806312 13737298 13546528 13531985 13522614 13360774 13147664 13077767 12929795
4068 12929795 12867153 12767952 12749257 12556086 12464693 12355529 12314427 12244406 12148952 12160277 12058958
$$ packed form
4132F0223615k926740k682537k530052k462077k336007k157093k170753k015184
4124D0943172j903719j922225j692768j555933j756588j579625j234767j312755
4116B7984792j204555r29591j111640r26799q29341q07954o91001o19717n65846
4107B0298348m90136n88907l40667n11232n58109k83807j51905m22741k38572
4098A6712272k17484k62672k47265k04524k17952k38092j25850j33572j02737
4089A4962124m9276P871k38649q0867k69447j58389N7775j58754q3651Q1669j02591
4078A3967815k15599N4096o9014j90770j4543r371j61840k13110o9897j47972
4068A2929795o2642r9201j8695j93171r1393j09164m1102p0021r5454J1325j01319
$$ plain form
4057 12058958 11973946 11991623 12033749 11937165 11951087 12098874 12065556 12148953 12006543 11954988 12005587
4046 12005587 12244007 12329726 12212138 12304949 12391112 12369475 12363675 12382439 12663320 12759846 12889446
4035 12889446 12893004 12891454 13050356 13070042 13171534 13327376 13338334 13443181 13478171 13572500 13774647
4024 13774647 13891789 14016744 14068805 14342050 14497358 14733056 14731747 14778750 15035793 15086198
4014 15086198 15197968 15247940 15482246 15722753 15711420 15891559 16098134 16193994 16079669 16195401
4004 16195401 16418702 16513470 16434408 16401112 16365501 16442109 16411509 16432398 16475741 16381173 16243165
3993 16243165 16153335 16214738 16179312 16145910 16194654 16091084 16085729 16041878 16056443 16136771 16183146
3982 16183146 16218162 16377772 16447288 16772443 17053842 17333775 17625057 17860238 18122645 18341531
$$ packed form
4057A2058958q5012J7677M2126r6584J3922J47787l3318Q3397j42410n1555N0599
4046A2005587K38420Q5719j17588R2811Q6163k1637n800J8764K80881R6526J29600
4035A2889446L558j550J58902J9686J01492J55842J0958J04847L4990R4329K02147
4024A3774647J17142J24955N2061K73245J55308K35698j309M7003K57043N0405
4014A5086198J11770M9972K34306K40507j1333J80139K06575R5860j14325J15732
4004A6195401K23301R4768p9062l3296l5611P6608l0600K0889M3343r4568j38008
3993A6243165q9830O1403l5426l3402M8744j03570n355m3851J4565Q0328M6375
3982A6183146L5016J59610O9516L25155K81399K79933K91282K35181K62407K18886
$$ plain form
3972 18341531 18561399 18819440 18932558 18971934 19101686 19219527 19250577 19413735 19519713 19650733
3962 19650733 19796668 19852437 20049727 20168712 20336086 20255175 20275698 20261076 20270627 20213790 20094556
3951 20094556 20071301 20024869 19909485 19952342 19921030 20013977 20095609 20104612 20265125 20343677 20610533
3940 20610533 20803287 20877434 21121181 21382798 21612147 21760442 21974693 22312917 22592411 22773519
3930 22773519 23040628 23318591 23523068 23756895 24036197 24343940 24701767 24858895 25195892
3921 25195892 25498851 25770410 25904178 26182736 26496095 26676457 26905587 27092990 27412327
3912 27412327 27675342 27917762 28051309 28181429 28321682 28676618 28965217 29227524 29572048
3903 29572048 29790716 30003085 30165201 30335647 30554744 30857887 31385297 31779179 31965273
$$ packed form
3972A8341531K19868K58041J13118L9376J29752J17841L1050J63158J05978J31020
3962A9650733J45935N5769J97290J18985J67374q0911K0523j4622R551n6837j19234
3951B0094556k3255m6432j15384M2857l1312R2947Q1632R003J60513P8552K66856
3940B0610533J92754P4147K43747K61617K29349J48295K14251L38224K79494J81108
3930B2773519K67109K77963K04477K33827K79302L07743L57827J57128L36997
3921B5195892L02959K71559J33768K78558L13359J80362K29130J87403L19337
3912B7412327K63015K42420J33547J30120J40253L54936K88599K62307L44524
3903B9572048K18668K12369J62116J70446K19097L03143N27410L93882J86094
$$ plain form
3894 31965273 32170874 32548382 32918381 33182388 33671600 34194284 34518284 34978442 35480534
3885 35480534 35930259 36437982 37099073 37832791 38437628 39283637 39974399 40661974 41571678
3876 41571678 42563948 43706825 44846656 45895899 47168133 48477255 49749263 51203924
3868 51203924 52818714 54532098 56118199 57613448 59465174 61323013 63211296 65099021
3860 65099021 66889954 68484831 70256573 72184646 73818942 75300652 76701817 78220052
3852 78220052 79557713 80844621 81956570 83058427 84011167 84902934 85539865 86103281 86424845
3843 86424845 86582120 86720944 86538776 86482250 86353778 86279256 86101984 85799541 85597439 85576431
3833 85576431 85406802 85309140 85439169 85505480 85790731 86033089 86620918 87269179 88215504 89280034
$$ packed form
3894C1965273K05601L77508L69999K64007M89212N22684L24000M60158N02092
3885C5480534M49725N07723O61091P33718O04837Q46009O90762O87575R09704
3876D1571678R92270J142877J139831J049243J272234J309122J272008J454661
3868E1203924J614790J713384J586101J495249J851726J857839J888283J887725
3860F5099021J790933J594877J771742J928073J634296J481710J401165J518235
3852G8220052J337661J286908J111949J101857R52740Q91767O36931N63416L21564
3843H6424845J57275J38824j82168n6526j28472p4522j77272l02443k02102k1008
3833H5576431j69629r7662J30029O6311K85251K42358N87829O48261R46325J064530
$$ plain form
3823 89280034 90609204 92173631 93990969 96156365 98448889 101004564 103598772 106489917
3815 106489917 109622037 113140947 117063075 121073636 125425834 130144006 135103994 140131829
3807 140131829 145320084 150581859 155978352 161135829 166341847 171582100 176618181 181484905
3799 181484905 186259848 190948737 195444245 199770221 203813132 207643860 211025551 213978348
3791 213978348 216470109 218335281 219655325 220476923 221046263 221350043 221593300 221602621 221598627
3782 221598627 221607207 221601009 221603062 221632634 221823659 222130860 222667114 223398180 224504589 225634473
3772 225634473 226864542 228495841 230433285 232572828 235116198 237785921 240726993 243855411
3764 243855411 247488544 251405644 255632746 259962022 264692815 269411346 274095896 278649930
$$ packed form
3823H9280034J329170J564427J817338K165396K292524K555675K594208K891145
3815A06489917L132120L518910L922128M010561M352198M718172M959988N027835
3807A40131829N188255N261775N396493N157477N206018N240253N036081M866724
3799A81484905M774943M688889M495508M325976M042911L830728L381691K952797
3791B13978348K491761J865172J320044Q21598N69340L03780K43257R321l994
3782B21598627Q580o198K053K9572J91025L07201N36254P31066J106409J129884
3772B25634473J230069J631299J937444K139543K543370K669723K941072L128418
3764B43855411L633133L917100M227102M329276M730793M718531M684550M554034
$$ plain form
3756 278649930 282939752 286949334 290571389 294018810 297420129 300419723 303549488 306783740
3748 306783740 310201452 313919485 318223689 322936074 328083755 333914035 340457667 347719338
3740 347719338 355582966 364428449 374331038 384666386 395429831 406489041 417239843
3733 417239843 427286045 436161834 443232010 448319024 451419608 452220807 451429103 449274937
3725 449274937 446120748 442385536 438280547 433795758 429049193 423773476 417631330 410233986
3717 410233986 401248411 390556042 377922162 363469505 347356590 329786247 311550304
3710 311550304 293262494 275396996 258187065 241958625 227046361 213457815 201017138
3703 201017138 189615871 179238974 169890346 161174308 153284588 146172994 139643160 133433895
$$ packed form
3756B78649930M289822M009582L622055L447421L401319K999594L129765L234252
3748C06783740L417712L718033M304204M712385N147681N830280O543632P261671
3740C47719338P863628Q845483R902589J0335348J0763445J1059210J0750802
3733D17239843J0046202Q875789P070176N087014L100584Q01199p91704k154166
3725D49274937l154189l735212m104989m484789m746565n275717o142146p397344
3717D10233986q985575j0692369j2633880j4452657j6112915j7570343j8235943
3710C11550304j8287810j7865498j7209931j6228440j4912264j3588546j2440677
3703B01017138j1401267j0376897r348628q716038p889720p111594o529834o209265
$$ plain form
3695 133433895 127679227 122163216 117038440 112223894 107609069 103385262 99291767 95425798
3687 95425798 91847782 88253102 85023825 81794273 78629821 75725136 72946740 70190654
3679 70190654 67597567 65014786 62622503 60409942 58050189 55999085 54133060 52287320
3671 52287320 50591800 48934046 47540770 46094350 44709232 43486279 42191198 41210399
3663 41210399 40127504 39184288 38356751 37479516 36594089 35711126 34907691 33903630 33151319
3654 33151319 32529075 31729136 30948409 30252498 29575485 28936999 28220011 27452261 26870797
3645 26870797 26182557 25498616 25029940 24445462 23953622 23383010 22632142 22135301 21638326
3636 21638326 21240077 20801341 20415437 20151073 19821913 19434377 19144994 18843346 18614112
$$ packed form
3695A33433895n754668n516011n124776m814546m614825m223807m093495l865969
3687I5425798l578016l594680l229277l229552l164452k904685k778396k756086
3679G0190654k593087k582781k392283k212561k359753k051104j866025j845740
3671E2287320j695520j657754j393276j446420j385118j222953j295081r80799
3663D1210399j082895r43216q27537q77235q85427q82963q03435j004061p52311
3654C3151319o22244p99939p80727o95911o77013o38486p16988p67750n81464
3645B6870797o88240o83941m68676n84478m91840n70612p50868m96841m96975
3636B1638326l98249m38736l85904k64364l29160l87536k89383l01648k29234
$$ plain form
3627 18614112 18387401 18000623 17875030 17626594 17546494 17450522 17350199 17234028 16972324 16990828
3617 16990828 16918420 16800655 16872026 16767491 16696663 16654727 16590340 16720277 16697202 16536341
3607 16536341 16534600 16570628 16622144 16545316 16421896 16548710 16510868 16544791 16388541 16428924 16416721
3596 16416721 16372253 16276535 16207624 16152551 16001416 15890085 15624505 15548018 15475661 15372486
3586 15372486 15423984 15509923 15480188 15586708 15676560 15703971 15674523 15669111 15877201 15714162 15647014
3575 15647014 15681488 15612285 15550290 15693783 15686428 15719766 15886439 15909704 15731573 15546390 15429308
3564 15429308 15282314 15102758 14903273 14817139 14695715 14669956 14778279 14626506 14627585 14720838
3554 14720838 14737447 14645583 14601171 14582243 14645777 14646152 14522219 14610166 14787793 14804857 14841694
$$ packed form
3627A8614112k26711l86778j25593k48436q0100r5972j00323j16171k61704J8504
3617A6990828p2408j17765P1371j04535p0828m1936o4387J29937k3075j60861
3607A6536341j741L6028N1516p6828j23420J26814l7842L3923j56250M0383j2203
3596A6416721m4468r5718o8911n5073j51135j11331k65580p6487p2357j03175
3586A5372486N1498Q5939k9735J06520Q9852K7411k9448n412K08090j63039o7148
3575A5647014L4474o9203o1995J43493p355L3338J66673K3265j78131j85183j17082
3564A5429308j46994j79556j99485q6134j21424k5759J08323j51773J079R3253
3554A4720838J6609r1864m4412j8928O3534L75j23933Q7947J77627J7064L6837
$$ plain form
3543 14841694 14833138 14769390 14903358 15060584 14994994 15101765 15262005 15256388 15396316 15467596 15484523
3532 15484523 15449404 15535938 15698209 15906775 15982042 16070868 16264483 16451697 16672804 16914537
3522 16914537 17023195 17263095 17380432 17544993 17849166 18048628 18103272 18389231 18651251 18800901
3512 18800901 19000306 19348361 19628527 19888334 20227782 20403871 20501576 20803933 21272800 21755011
3502 21755011 22129875 22675680 22918433 23319326 23922156 24399044 24967085 25466383 25923257
3493 25923257 26544789 27317960 28048562 28721578 29585191 30586974 31478608 32510218 33604189
3484 33604189 34729314 36016034 37287642 38719524 40241620 41752443 43463988 45120619
3476 45120619 46631435 48205010 49633343 50825420 51582187 52025062 52206332 52118029 52069613
$$ packed form
3543A4841694q556o3748J33968J57226o5590J06771J60240n617J39928P1280J6927
3532A5484523l5119Q6534J62271K08566P5267Q8826J93615J87214K21107K41733
3522A6914537J08658K39900J17337J64561L04173J99462N4644K85959K62020J49650
3512A8800901J99405L48055K80166K59807L39448J76089R7705L02357M68867M82211
3502B1755011L74864N45805K42753M00893O02830M76888N68041M99298M56874
3493B5923257O21532P73171P30602O73016Q63613J001783Q91634J031610J093971
3484C3604189J125125J286720J271608J431882J522096J510823J711545J656631
3476D5120619J510816J573575J428333J192077P56767M42875J81270q8303m8416
$$ plain form
3467 52069613 51636806 50833756 50045713 49380138 48885112 48615875 48227855 47882707 47752154
3458 47752154 47715373 47613194 47615893 47834901 47873276 47640189 47242471 46937838 46846423 46837602 46725432
3447 46725432 46580554 46213322 45473504 44707947 43627639 42558175 41542539 40857090 40293901
3438 40293901 39650143 39038677 38485836 38134445 37804817 37682087 37272301 36980922 37001236 37089250
3428 37089250 37155277 36985327 36763438 36319124 35784941 35258215 34840072 34456385 34169928 33761907
3418 33761907 33099093 32233267 31481860 30665726 29874778 29078496 28262449 27741197 27268987
3409 27268987 26815772 26361857 26127634 26031924 26018565 26120192 26240070 26239365 26157075 26178510 26003592
3398 26003592 25463264 24893535 24396724 23905091 23199878 22396171 21787161 21415011 21065403
$$ packed form
3467E2069613m32807q03050p88043o65575m95026k69237l88020l45148j30553
3458D7752154l6781j02179K699K19008L8375k33087l97718l04633r1415q821j12170
3447D6725432j44878l67232p39818p65557j080308j069464j015636o85449n63189
3438D0293901o43758o11466n52841l51391l29628j22730m09786k91379K0314Q8014
3428C7089250O6027j69950k21889m44314n34183n26726m18143l83687k86457m08021
3418C3761907o62814q65826p51407q16134p90948p96282q16047n21252m72210
3409B7268987m53215m53915k34223r5710j3359J01627J19878p05q2290K1435j74918
3398B6003592n40328n69729m96811m91633p05213q03707o09010l72150l49608
$$ plain form
3389 21065403 20645590 20305923 19975339 19763373 19688561 19525485 19466249 19458257 19486554 19538693
3379 19538693 19762406 19890357 20017741 20392640 20649523 21134953 21459936 21554097 21489847 21284011
3369 21284011 20909760 20209219 19681933 19168630 18485115 18066819 17646779 17257606 16833828
3360 16833828 16528015 16298960 16040133 15902316 15850488 15731277 15572191 15446442 15287672 15190981
3350 15190981 15109105 15100488 15175309 15183574 14969737 14907213 14815574 14869726 14974233 14932737 14879518
3339 14879518 14793917 14818167 14943908 15081324 15174260 15247675 15388168 15682883 15910284 15936304
3329 15936304 16088859 16482970 16758930 16978255 17350895 17632284 17984477 18346710 18808286
3320 18808286 19380745 20005860 20511414 21166364 21946117 22896152 23886403 24983921 26283685
$$ packed form
3389B1065403m19813l39667l30584k11966p4812j63076n9236p992K8297N2139
3379A9538693K23713J27951J27384L74899K56883M85430L24983R4161o4250k05836
3369B1284011l74251p00541n27286n13303o83515m18296m20040l89173m23778
3360A6833828l05813k29055k58827j37817n1828j19211j59086j25749j58770r6691
3350A5190981q1876q617P4821Q265k13837o2524r1639N4152J04507m1496n3219
3339A4879518q5601K4250J25741J37416R2936P3415J40493K94715K27401K6020
3329A5936304J52555L94111K75960K19325L72640K81389L52193L62233M61576
3320A8808286N72459O25115N05554O54950P79753R50035R90251J097518J299764
$$ plain form
3311 26283685 27644691 29271752 30861211 32585616 34493180 36697484 39365010 42732208
3303 42732208 46746158 51119846 55590075 60578256 66196878 71533992 76409811 80750108
3295 80750108 83665908 84104994 80723483 74259112 67520427 62035363 57652286 54242912
3287 54242912 51602026 49547967 47819513 46409318 45325149 44583275 44212824 44188907 44619580
3278 44619580 45725789 47445834 49751814 52637305 56025884 59742240 64099425 68636065
3270 68636065 72861891 76636578 79792979 81287757 79769257 74464894 67092852 60144624
3262 60144624 54214721 49386424 45414523 41968173 38715339 35899374 33439655 31182150
3254 31182150 29286963 27487679 25758288 24532085 23315471 22443926 21622712 21042500 20374013
$$ packed form
3311B6283685J361006J627061J589459J724405J907564K204304K667526L367198
3303D2732208M013950M373688M470229M988181N618622N337114M875819M340297
3295H0750108K915800M39086l381511o464371o738685n485064m383077l409374
3287E4242912k640886k054059j728454j410195j084169p41874l70451k3917M30673
3278D4619580J106209J720045K305980K885491L388579L716356M357185M536640
3270F8636065M225826L774687L156401J494778j518500n304363p372042o948228
3262F0144624n929903m828297l971901l446350l252834k815965k459719k257505
3254C1182150j895187j799284j729391j226203j216614q71545q21214n80212o68487
$$ plain form
3245 20374013 19800530 19423853 19115503 18830637 18538613 18211424 17965554 17603258 17178513
3236 17178513 16797096 16325880 15830828 15285963 14810218 14462965 14064675 13817303 13718213 13399937
3226 13399937 13084316 12911097 12837373 12719777 12610100 12568554 12508940 12545773 12536954 12547246 12595602
3215 12595602 12642227 12719399 12749370 12764012 12780492 12827182 12684136 12387030 12096759 11892221
3205 11892221 11487377 11261958 11066545 10989529 10732914 10427823 10129176 10054989 9919984 9820419
3195 9820419 9643336 9515478 9456081 9316368 9219497 9136846 9284196 9273788 9298239 9259588 9262881
3184 9262881 9237496 9165640 9098469 9082439 9164933 9293492 9317116 9199107 9340906 9347532 9285949
3173 9285949 9484156 9664456 9721071 9524955 9468519 9668995 9942574 10040762 10162804 10375913
$$ packed form
3245B0374013n73483l76677l08350k84866k92024l27189k45870l62296m24745
3236A7178513l81417m71216m95052n44865m75745l47253l98290k47372r9090l18276
3226A3399937l15621j73219p3724j17596j09677m1546n9614L6833q819J0292M8356
3215A2595602M6625P7172K9971J4642J6480M6690j43046k97106k90271k04538
3205A1892221m04844k25419j95413p7016k56615l05091k98647p4187j35005r9565
3195I820419j77083j27858n9397j39713r6871q2651J47350j0408K4451l8651L293
3184I262881k5385p1856o7171j6030Q2494J28559K3624j18009J41799O626o1583
3173I285949J98207J80300N6615j96116n6436K00476K73579R8188J22042K13109
$$ plain form
3163 10375913 10425891 10533281 10810289 10789396 10878029 10999075 11056918 11176481 11279337 11375511
3153 11375511 11426607 11473040 11636122 11758368 11970403 12188078 12370911 12443604 12616548 12760607
3143 12760607 12929573 13210929 13263444 13471651 13835380 14200202 14382055 14605007 14966966 15420670
3133 15420670 15719000 15957009 16224635 16472931 16682953 16688854 16652544 16542265 16426323 16370852
3123 16370852 16104355 15908574 15707190 15646466 15497862 15442448 15331013 15345536 15562796 15669083
3113 15669083 15677393 15799806 15878802 16124812 16278797 16475468 16769769 16829596 16953884 17039897
3103 17039897 17007730 16961709 16931370 16804264 16809160 16476076 16008200 15850527 15539832 15114416
3093 15114416 14709929 14393348 13907663 13551536 13483538 13317529 13175902 13048841 12971551 12699480
$$ packed form
3163A0375913M9978J07390K77008k0893Q8633J21046N7843J19563J02856R6174
3153A1375511N1096M6433J63082J22246K12035K17675J82833P2693J72944J44059
3143A2760607J68966K81356N2515K08207L63729L64822J81853K22952L61959M53704
3133A5420670K98330K38009K67626K48296K10022N901l6310j10279j15942n5471
3123A6370852k66497j95781k01384o0724j48604n5414j11435J4523K17260J06287
3113A5669083Q310J22413P8996K46010J53985J96671K94301N9827J24288Q6013
3103A7039897l2167m6021l0339j27106M896l33084m67876j57673l10695m25416
3093A5114416m04487l16581m85685l56127o7998j66009j41627j27061p7290k72071
$$ plain form
3083 12699480 12600981 12581048 12359838 12269123 12226415 12041639 11949611 11723083 11348150 11062039
3073 11062039 10810071 10422625 10158126 9925035 9536284 9124200 8772432 8526338 8252129
3064 8252129 7938834 7719737 7663949 7380450 7141884 7050284 6781398 6619055 6505511 6278109
3054 6278109 6249453 6089347 5999321 5716473 5448481 5341353 5296598 5256475 5295072 5232514 4973637
3043 4973637 4823949 4741460 4652052 4522715 4495940 4393880 4362399 4115038 3929702 3993066
3033 3993066 3916564 3886296 3848691 3718925 3728055 3788079 3694956 3669090 3434191 3342048 3297759
3022 3297759 3194456 3201013 3033173 3207731 3301387 3376967 3362821 3295135 3139255 3233801 3197308
3011 3197308 3199584 3233834 3216463 3121008 2987451 2906696 2788250 2732647 2872309 2797010 2677931
$$ packed form
3083A2699480r8499j9933k21210r0715m2708j84776r2028k26528l74933k86111
3073A1062039k51968l87446k64499k33091l88751m12084l51768k46094k74209
3064H252129l13295k19097n5788k83499k38566r1600k68886j62343j13544k27402
3054F278109k8656j60106r0026k82848k67992j07128m4755m0123L8597o2558k58877
3043D973637j49688q2489q9408j29337k6775j02060l1481k47361j85336O3364
3033C993066p6502l0268l7605j29766R130O0024r3123k5866k34899r2143m4289
3022C297759j03303O557j67840J74558R3656P5580j4146o7686j55880R4546l6493
3011C197308K276L4250j7371r5455j33557q0755j18446n5603J39662p5299j19079
$$ plain form
3000 2677931 2706297 2636563 2554049 2508813 2447108 2581154 2476876 2496970 2486363 2539951 2619919
2989 2619919 2496426 2512643 2442770 2448139 2517894 2499200 2460863 2518930 2374529 2303314 2206523
2978 2206523 2190605 2128344 2168855 2220503 2207165 2148713 1862795 1936489 2026935 2004158 1936177
2967 1936177 1825330 1724377 1651866 1660458 1589590 1618757 1512063 1391800 1448093 1472944 1552348
2956 1552348 1548029 1460203 1597625 1540138 1489438 1434043 1430857 1571379 1503525 1414273 1517364
2945 1517364 1542084 1480970 1460612 1390018 1243501 1296299 1365549 1314887 1216552 1273405 1348391
2934 1348391 1291585 1303081 1204616 1175233 1243398 1158262 1143441 1228222 1283907 1317129 1234380
2923 1234380 1098427 1172740 1110630 1044020 1111645 1102994 980095 1054317 1039276 1136174 1184150
$$ packed form
3000B677931K8366o9734q2514m5236o1705J34046j04278K0094j0607N3588P9968
2989B619919j23493J6217o9873N369O9755j8694l8337N8067j44401p1215r6791
2978B206523j5918o2261M0511N1648j3338n8452k85918P3694R0446k2777o7981
2967A936177j10847j00953p2511Q592p0868K9167j06694j20263N6293K4851P9404
2956A552348m319q7826J37422n7487n0700n5395l186J40522o7854q9252J03091
2945A517364K4720o1114k0358p0594j46517N2798O9250n0662r8335N6853P4986
2934A348391n6806J1496r8465k9383O8165q5136j4821Q4781N5685L3222q2749
2923A234380j35953P4313o2110o6610O7625q651j22899P4222j5041R6898M7976
$$ plain form
2912 1184150 1279002 1127908 1110105 1056574 952449 918331 941858 966087 1002724 977902 904787
2901 904787 920175 912217 883758 927231 936679 915921 934377 850551 811174 781645 753955 727117
2889 727117 909414 957103 872199 901133 840085 757268 750865 718353 800207 811500 706275
2878 706275 656031 667642 710675 747161 685504 636993 679504 674766 716686 691098 600560 562658
2866 562658 645770 693704 734382 790251 694301 730752 811951 767002 662841 614536 754684
2855 754684 617791 598967 788787 708834 774893 716810 731079 668518 643124 650401 805425
2844 805425 712017 759391 822777 751074 626362 722696 813203 691802 657425 731224 683273
2833 683273 755082 833161 875563 822314 700412 591101 669045 579829 540377 547975 536723
$$ packed form
2912A184150R4852j51094j7803n3531j04125l4118K3527K4229L6637k4822p3115
2901I04787J5388p958k8459M3473R448k0758J8456q3826l9377k9529k7690k6838
2889G27117J82297M7689q4904K8934o1048q2817o403l2512Q1854J1293j05225
2878G06275n0244J1611M3033L6486o1657m8511M2511m738M1920k5588r0538l7902
2866E62658Q3112M7934M0678N5869r5950L6451Q1199m4949j04161m8305J40148
2855G54684j36893j8824J89820p9953O6059n8083J4269o2561k5394P277J55024
2844H05425r3408M7374O3386p1703j24712R6334R0507j21401l4377P3799m7951
2833F83273P1809P8079M2402n3249j21902j09311P7944q9216l9452P598j1252
$$ plain form
2822 536723 483756 539015 605649 650604 677970 559944 530245 645513 793548 642533 521879
2811 521879 483940 495645 545790 558340 611445 604402 609666 495833 448614 430455 534404 613959
2799 613959 575296 643952 672250 707575 653447 577338 509223 579252 529098 485715 496761 427404
2787 427404 341070 378706 398961 532170 304460 318792 372923 427166 487545 464477 532935
2776 532935 403561 335871 371452 338944 151969 240551 397897 424445 397142 394936 353560
2765 353560 237407 234453 461933 607169 351363 262781 349530 339254 330712 441650 296025
2754 296025 401046 414178 410169 387249 371041 250456 296329 265399 386433 465802 258990
2743 258990 245921 507634 391690 228536 213499 243314 302817 331016 389878 419984 447837
$$ packed form
2822E36723n2967N5259O6634M4955K7366j18026k9699J15268J48035j51015j20654
2811E21879l7939J1705N0145J2550N3105p043N264j13833m7219j8159J03949P9555
2799F13959l8663O8656K8298L5325n4128p6109o8115P0029n0154m3383J1046o9357
2787D27404q6334L7636K0255J33209k27710J4332N4131N4243O0379k3068O8458
2776E32935j29374o7690L5581l2508j86975Q8582J57346K6548k7303k206m1376
2765C53560j16153k954K27480J45236k55806q8582Q6749j0276q542J10938j45625
2754B96025J05021J3132m009k2920j6208j20585M5873l0930J21034P9369k06812
2743B58990j3069K61713j15944j63154j5037K9815N9503K8199N8862L0106K7853
$$ plain form
2732 447837 468690 454136 283273 315727 207900 281924 362973 246500 284953 378047 268857
2721 268857 245799 187633 323409 316131 285943 223915 288740 323432 266635 229018 241279 242911
2709 242911 211067 233013 207695 119196 160582 164437 132741 41027 207646 265907 381664
2698 381664 344040 166320 233184 90585 218679 194034 221997 152177 142426 225728 213715
2687 213715 236367 147772 203360 151568 168621 120509 121053 229499 189385 231042 138456 143662
2675 143662 190766 196909 290472 160870 61090 116308 284323 331612 328475 212770 135239
2664 135239 204909 301690 397998 273719 269379 223503 143752 72833 89297 88126 37479 776
2652 776 -40298 -4893 242809 224325 231208 162762 138066 141124 140392 223182 113277 83023 -38863
$$ packed form
2732D47837K0853j4554j70863L2454j07827P4024Q1049j16473L8453R3094j09190
2721B68857k3058n8166J35776p278l0188o2028O4825L4692n6797l7617J2261J632
2709B42911l1844K1946k5318q8499M1386L855l1696r1714J66619N8261J15757
2698C81664l7624j77720O6864j42599J28094k4645K7963o9820r751Q3302j2013
2687B13715K2652q8595N5588n1792J7053m8112N44J08446m0114M1657r2586N206
2675A43662M7104O143R3563j29602r9780N5218J68015M7289l137j15705p7531
2664A35239O9670R6781R6308j24279m340m5876p9751p0919J6464j171n0647l6703
2652G76m1074L5405K47702j8484O883o8446k4696L058p32Q2790j09905l0254j21886
$$ plain form
2639 -38863 16899 89108 69399 133451 58872 68632 122814 113195 183709 94104 100739 137184
2627 137184 183657 205387 81508 -9622 -69486 -46108 103611 163232 166498 163843 151346 136826
2615 136826 148896 217382 175052 138745 135949 178625 176846 108987 150184 252850 329570 296704
2603 296704 354158 308578 198695 226436 354403 418991 416730 317040 365608 338695 272729
2592 272729 202895 86157 335058 282928 28829 -26505 85362 198019 230103 68230
2582 68230 138824 152548 134931 123883 31727 -19563 59970 69499 -70644 87432 162561 80908
2570 80908 125432 205539 152320 106517 20010 43295 160522 128983 75773 285540 93034
2559 93034 13179 16591 83718 185213 144258 36522 12079 77601 167906 -2807 -62288
$$ packed form
2639c8863N5762P2209j9709O4052p4579R760N4182r619P0514q9605O635L6445
2627A37184M6473K1730j23879r1130n9864K3378J49719N9621L266k655j2497j4520
2615A36826J2070O8486m2330l6307k796M2676j779o7859M1197J02666P6720l2866
2603B96704N7454m5580j09883K7741J27967O4588k261r9690M8568k6913o5966
2592B72729o9834j16738K48901n2130k54099n5334J11867J12657L2084j61873
2582F8230P0594J3724j7617j1048r2156n1290P9533R529j40143J58076P5129q1653
2570H0908M4524Q0107n3219m5803q6507K3285J17227l1539n3210K09767j92506
2559I3034p9855L412O7127J01495m0955j07736k4443O5522R0305j70713n9481
$$ plain form
2548 -62288 31707 103278 108141 93371 106712 48270 43867 24374 -103048 -74334 73539 21851
2536 21851 -73799 -113024 37395 96938 -24468 -126176 11534 -36408 1522 49802 164558
2525 164558 32778 14158 143732 152620 181049 194228 106108 77067 871 -1473 22545 68147
2513 68147 -6818 14547 -8221 3767 215784 95545 138870 99604 -13173 -44175 -13169
2502 -13169 113182 156066 27225 41262 124706 18712 -3313 108296 128055 28851 -7401
2491 -7401 155328 248734 116841 -84412 -95216 -75687 46761 133059 149882 116522 46802
2480 46802 40610 501 74266 -10883 58228 29743 -141628 -108602 -14830 90048 -71015
2469 -71015 -18944 104390 90311 121830 116248 174329 248936 114683 83330 237661 116255
$$ packed form
2548f2288R3995P1571M863j4770J3341n8442m403j9493j27422K8714J47873n1688
2536B1851r5650l9225J50419N9543j21406j01708J37710m7942L7930M8280J14756
2525A64558j31780j8620J29574Q888K8429J3179q8120k9041p6196k344K4018M5602
2513F8147p4965K1365k2768J1988K12017j20239M3325l9266j12777l1002L1006
2502a3169J26351M2884j28841J4037Q3444j05994k2025J11609J9759r9204l6252
2491g401J62729R3406j31893k01253j0804J9529J22448Q6298J6823l3360o9720
2480D6802o192m0109P3765q5149O9111k8485j71371L3026R3772J04878j61063
2469g1015N2071J23334j4079L1519n582N8081P4607j34253l1353J54331j21406
$$ plain form
2458 116255 142554 123554 73639 39294 -48014 -12412 44303 28980 92785 240947 83678
2447 83678 -103966 -38387 -2878 120456 199799 256576 400511 368833 230541 227650 209780
2436 209780 151820 126717 220538 170397 146840 251670 323111 229447 245426 256333 273204
2425 273204 366893 334280 431492 544789 492787 391210 454837 413845 351819 410728 504861
2414 504861 396274 420830 438677 280807 168288 329953 340662 479177 608402 556980
2404 556980 533038 453685 533456 501435 521681 591772 675848 600055 566824 615608 636904 623351
2392 623351 774453 856896 888884 986645 819013 930364 1026423 989175 1008569 1003605 1104073
2381 1104073 1211466 1248559 1338273 1424383 1522630 1565254 1682172 1684589 1821698 2001671 1940081
$$ packed form
2458A16255K6299j9000m9915l4345q7308L5602N6715j5323O3805J48162j57269
2447H3678j87644O5579L5509J23334P9343N6777J43935l1678j38292k891j7870
2436B09780n7960k5103R3821n0141k3557J04830P1441r3664J5979J0907J6871
2425B73204R3689l2613R7212J13297n2002j01577O3627m0992o2026N8909R4133
2414E04861j08587K4556J7847j57870j12519J61665J0709J38515J29225n1422
2404E56980k3942p9353P9771l2021K0246P0091Q4076p5793l3231M8784K1296j3553
2392F23351J51102Q2443L1988R7761j67632J11351R6059l7248J9394m964J00468
2381A104073J07393L7093Q9714Q6110R8247M2624J16918K417J37109J79973o1590
$$ plain form
2370 1940081 1990722 2180866 2462058 2722373 2667485 2750575 2991703 3124444 3370645 3632941
2360 3632941 3791371 4154770 4300409 4544652 4880029 5288272 5756328 6313561 6893227 7415604
2350 7415604 8126543 8815993 9641153 10691224 11762395 12658669 13889009 15061421 16113767
2341 16113767 17533316 19314539 21914280 24902572 28085261 31270016 35009327 39175986
2333 39175986 42853815 46183101 48952698 50513293 49758396 45667471 39263488 33636740
2325 33636740 29329086 26116226 23356196 20885242 18797504 16969583 15127262 13602538
2317 13602538 12439722 11422738 10355291 9453181 8567742 7679555 7112165 6610060 6086438
2308 6086438 5540544 5141096 4715736 4407025 4085967 3816267 3493346 3277622 3111565 3074081
$$ packed form
2370A940081N0641J90144K81192K60315n4888Q3090K41128J32741K46201K62296
2360C632941J58430L63399J45639K44243L35377M08243M68056N57233N79666N22377
2350G415604P10939O89450Q25160J050071J071171Q96274J230340J172412J052346
2341A6113767J419549J781223K599741K988292L182689L184755L739311M166659
2333C9175986L677829L329286K769597J560595p54897m090925o403983n626748
2325C3636740m307654l212860k760030k470954k087738j827921j842321j524724
2317A3602538j162816j016984j067447r02110q85439q88187n67390n02105n23622
2308F086438n45894l99448m25360l08711l21058k69700l22921k15724j66057l7484
$$ plain form
2298 3074081 2936605 2677313 2565996 2539307 2469627 2241414 2076391 1877385 1789720 1558293
2288 1558293 1546040 1639464 1457396 1358269 1384735 1252533 1129206 1107088 1079717 1105339 1043616
2277 1043616 1002865 1161622 1100579 1036031 916009 875425 987719 950165 1059917 968875 852150
2266 852150 838462 865280 876068 922155 846745 767831 667649 603564 669088 681914 631195
2255 631195 591646 449477 493512 533469 463310 396280 309156 461480 459006 383833 227769
2244 227769 226205 338516 265641 176449 141281 220904 177372 118270 216989 219158 161143 143075
2232 143075 185102 129354 173777 164628 192901 114147 58929 90400 270439 192324 72661
2221 72661 56149 95024 39963 144886 270684 83586 111354 218632 135259 62471 159532
$$ packed form
2298C074081j37476k59292j11317k6689o9680k28213j65023j99006q7665k31427
2288A558293j2253R3424j82068r9127K6466j32202j23327k2118k7371K5622o1723
2277A043616m0751J58757o1043o4548j20022m0584J12294l7554J09752r1042j16725
2266H52150j3688K6818J0788M6087p5410p8914j00182o4085O5524J2826n0719
2255F31195l9549j42169M4035L9957p0159o7030q7124J52324k474p5173j56064
2244B27769j564J12311p2875q9192l5168P9623m3532n9102R8719K169n8015j8068
2232A43075M2027n5748M4423r149K8273p8754n5218L1471J80039p8115j19663
2221G2661j6512L8875n5061J04923J25798j87098K7768J07278q3373p2788R7061
$$ plain form
2210 159532 118274 158946 88680 194255 307985 146756 113744 125524 -30384 -53119 60040
2199 60040 -99149 -64755 129586 67629 38834 3389 54135 49504 160928 64723 47500
2188 47500 14376 112134 184307 257852 214664 53373 -27890 17175 75437 63295 92051 151971
2176 151971 96684 -136519 -213287 -109665 -238712 -244615 -139434 -107956 4965 -72357 -10400
2165 -10400 52641 35827 -77566 -151330 -101143 -94055 -185859 -148910 -102842 -102951 -204584 -291966
2153 -291966 -117858 -93192 -267427 -369157 -295078 -101027 -121674 -83118 -11370 -51080 -131108
2142 -131108 -188909 -145123 -178838 -102466 -193003 -260669 -202334 -214631 -162465 -71362 -149351 -196259
2130 -196259 -92879 -5610 2110 -96491 -120451 -139894 -49893 -51783 -56740 -55739 -34393 -169055
$$ packed form
2210A59532m1258M0672p0266J05575J13730j61229l3012J1780j55908k2735J13159
2199F0040j59189L4394J94341o1957k8795l5445N0746m631J11424r6205j7223
2188D7500l3124R7758P2173P3545m3188j61291q1263M5065N8262j2142K8756N9920
2176A51971n5287k33203p6768J03622j29047n903J05181L1478J12921p7322O1957
2165a0400O3041j6814j13393p3764N0187P088r1804L6949M6068j09j01633q7382
2153b91966J74108K4666j74235j01730P4079J94051k0647L8556P1748l9710q0028
2142a31108n7801M3786l3715P6372r0537o7666N8335j2297N2166R1103p7989m6908
2130a96259J03380Q7269P720r8601k3960j9443R0001j890m957J001K1346j34662
$$ plain form
2118 -169055 -148822 -100801 -59717 -56368 -83762 -97209 -80225 -161338 -184548 -133921 -184076 -126914
2106 -126914 -236249 -152650 -182835 -195817 -154676 -87046 -122042 -68130 -41934 -106046 -37600
2095 -37600 -135824 -187257 -92554 47103 -17963 -199460 -199891 -84781 -65037 -30075 -62876 -94363
2083 -94363 -74490 -23231 -69172 -12490 -2404 -7076 -99817 -112282 -79051 -171022 -246168 -59466
2071 -59466 54215 141808 226328 121483 85599 81964 184812 188744 169859 266626 219419 234354
2059 234354 246538 369664 384233 102416 137386 59479 15621 -14764 114762 55323 -73370
2048 -73370 -152544 -191538 -101030 -285229 -307008 93133 40485 -48813 -43424 -7599 -70325 -141004
2036 -141004 -121378 -270319 -169995 -152119 -212663 -127504 -92564 -92458 -138259 -129464 -49021 -123700
$$ packed form
2118a69055K0233M8021M1084L349k7394j3447J6984q1113k3210N0627n0155N7162
2106a26914j09335Q3599l0185j2982M1141O7630l4996N3912K6196o4112O8446
2095c7600r8224n1433R4703J39657o5066j81497m31J15110J9744L4962l2801l1487
2083i4363J9873N1259m5941N6682J0086m672r2741j2465L3231r1971p5146J86702
2071e9466J13681Q7593Q4520j04845l5884l635J02848L932j8885R6767m7207J4935
2059B34354J2184J23126J4569k81817L4970p7907m3858l0385J29526n9439j28693
2048g3370p9174l8994R0508j84199k1779M00141n2648q9298N389L5825o2726p0679
2036a41004J9626j48941J00324J7876o0544Q5159L4940J06m5801Q795Q0443p4679
$$ plain form
2024 -123700 -70483 -116093 -174614 -116087 -60509 -89705 -221457 -86577 -34665 -169768 -98164
2013 -98164 -207271 -176722 -210159 -171267 -163055 -104463 -61686 -49480 -36568 -5948 -4162 38358
2001 38358 43216 44440 91583 -23315 -121498 -139793 -147295 -162004 -54756 -41159 -194042 17053
1989 17053 28713 -46837 -89527 -120651 39988 -27245 -129938 -161769 -102184 -153156 -51576
1978 -51576 -169559 -255467 -134633 -66843 -111598 -93963 -113937 -43946 -54212 -113871 -162930
1967 -162930 -85888 -120767 -145836 -124049 -47214 -47353 57392 -50824 -158127 -191069 -232559
1956 -232559 -255921 -233993 -250758 -206826 -162167 -122080 -254880 -319608 -197484 -236749 -155318
1945 -155318 -84734 -49035 -100571 -90365 -201568 -285742 -188888 -204928 -267134 -161475 -126044
$$ packed form
2024a23700N3217m5610n8521N8527N5578k9196j31752J34880N1912j35103P1604
2013i8164j09107L0549l3437L8892Q212N8592M2777J2206J2912L0620J786M2520
2001C8358M858J224M7143j14898r8183j8295p502j4709J07248J3597j52883K11095
1989A7053J1660p5550m2690l1124J60639o7233j02693l1831N9585n0972J01580
1978e1576j17983q5908J20834O7790m4755J7635j9974O9991j0266n9659m9059
1967a62930P7042l4879k5069K1787P6835j39J04745j08216j07303l2942m1490
1956b32559k3362K1928j6765M3932M4659M0087j32800o4728J22124l9265Q1431
1945a55318P0584L5699n1536J0206j11203q4174R6854j6040o2206J05659L5431
$$ plain form
1934 -126044 -157214 -85849 -19361 16729 -106497 -171705 -12391 -134285 -118555 -145759 -277916
1923 -277916 -161451 -191908 -152576 14092 -13419 -131018 -105490 -60846 -64483 150903 -65129
1912 -65129 -43339 -74002 -137055 -93241 -70330 -55496 -44779 -119607 -109434 -149110 -125414 -71542
1900 -71542 -30436 -48005 -87097 -207382 -220348 -231338 -270712 -169045 -115042 -131443 -237758
1889 -237758 -253069 -221613 -157274 -8384 -4426 -85432 -89572 -136487 -195850 -210699 -131916 -329205
1877 -329205 -280335 -182556 -68407 51352 -48283 -120934 -87371 -107988 -4242 9306 -74910
1866 -74910 -126124 5811 83118 90710 -14112 -87664 -85786 -38822 -81034 -94586 -106657 -105196
1854 -105196 -99919 -248161 -159447 -203740 -202820 -109900 -2583 -14054 -91863 -103019 -138251 -246668
$$ packed form
1934a26044l1170P1365O6488L6090j23226o5208J59314j21894J5730k7204j32157
1923b77916J16465l0457L9332J66668k7511j17599K5528M4644l637K15386k16032
1912f5129K1790l0663o3053M3814K2911J4834J0717p4828J0173l9676K3696N3872
1900g1542M1106j7569l9092j20285j2966j0990l9374J01667N4003j6401j06315
1889b37758j5311L1456O4339J48890L958q1006m140m6915n9363j4849P8783j97289
1877c29205M8870R7779J14149J19759r9635p2651L3563k0617J03746J3548q4216
1866g4910n1214J31935P7307P592j04822p3552J878M6964m2212j3552j2071J461
1854a05196N277j48242Q8714m4293R20R2920J07317j1471p7809j1156l5232j08417
$$ plain form
1842 -246668 -190680 -105678 -97857 42340 -85425 -105508 -56908 -64650 40008 79488 -52567
1831 -52567 -102438 -155396 -134284 -102401 1719 -145489 -160408 -132216 -164020 -13953 -88880
1820 -88880 -60978 108777 41275 -124237 -83202 -101134 -117953 -249249 -263291 -161653 -139504
1809 -139504 -224476 -218674 -203425 -136238 -225693 -251171 -228974 -232937 -160906 -91886 -42434 -161149
1797 -161149 -173594 -86222 -102835 -233049 -292324 -210932 -148205 -153964 -108333 3815 -37387
1786 -37387 -129386 -183958 -195003 -173251 -134674 -34600 9710 28491 32735 -44578 -32943 32738
1774 32738 71104 71123 -129554 -58970 -47290 -155536 -143417 -22394 -85543 -122562 -55486 12532
1762 12532 -12190 -197961 -186469 -213804 -75962 88024 -140012 -262502 -182978 -81489 38358
$$ packed form
1842b46668N5988Q5002P821J40197j27765k0083M8600p742J04658L9480j32055
1831e2567m9871n2958K1112L1883J04120j47208j4919K8192l1804J50067p4927
1820h8880K7902J69755o7502j65512M1035j7932j6819j31296j4042J01638K2149
1809a39504q4972N802J5249O7187q9455k5478K2197l963P2031O9020M9452j18715
1797a61149j2445Q7372j6613j30214n9275Q1392O2727n759M5631J12148m1202
1786c7387r1999n4572j1045K1752L8577J00074M4310J8781M244p7313J1635O5681
1774C2738L8366J9k00677P0584J1680j08246J2119J21023o3149l7019O7076O8018
1762A2532k4722j85771J1492k7335J37842J63986k28036j22490P9524J01489J19847
$$ plain form
1751 38358 -5755 -71255 -136432 -183668 -80424 -62692 -69932 -15789 -44962 -133240 -223861 -112624
1739 -112624 -116030 -167845 -192754 -67927 -49747 -91241 -108815 -66903 -109639 -109796 -55432 -81276
1727 -81276 -65488 -69136 -96676 -181482 -74222 -131467 -205676 -152518 -122107 -86684 -165961 -264392
1715 -264392 -184066 -29702 26552 -43119 -59467 -67105 -188845 -112285 -99013 -42334 -27842
1704 -27842 -74624 -174675 -101294 40898 -82056 -137682 -59406 -27664 -135071 -109592 -146231
1693 -146231 -68669 -144125 -162430 -209833 -205855 -101448 -86076 -176833 -241602 -128750 -67649
1682 -67649 -136587 -121220 -79615 -132679 -266448 -175143 -132127 -178268 18216 -136712 -239828
1671 -239828 -147614 -228292 -268605 -276920 -280884 -234783 -197652 -8352 3711 -117573 -164418 -42276
$$ packed form
1751C8358m4113o5500o5177m7236J03244J7732p240N4143k9173q8278r0621J11237
1739a12624l406n1815k4909J24827J8180m1494j7574M1912m2736j57N4364k5844
1727h1276J5788l648k7540q4806J07260n7245p4209N3158L0411L5423p9277r8431
1715b64392Q0326J54364N6254o9671j6348p638j21740P6560J3272N6679J4492
1704b7842m6782j00051P3381J42192j22954n5626P8276L1742j07407K5479l6639
1693a46231P7562p5456j8305m7403L978J04407J5372r0757o4769J12852O1101
1682f7649o8938J5367M1605n3064j33769R1305M3016m6141J96484j54928j03116
1671b39828R2214q0678m0313q315l964M6101L7131J89300J2063j21284m6845J22142
$$ plain form
1659 -42276 3777 16155 23062 36382 -148325 -209063 -130218 -179507 -98334 -136667 -170051 -189109
1647 -189109 -183317 6904 -27239 -61021 -157635 -225197 -104433 -166068 -246306 -256313 -262426 -261780
1635 -261780 -309405 -196967 -139104 -128072 -59290 46315 -30185 -101219 69548 44874 53465
1624 53465 -59588 -26397 -72167 -97630 76845 66732 16078 -54308 -52003 -75432 -41220 -162169
1612 -162169 -248906 -51726 -66142 99106 -22620 -43923 44959 -69208 -75671 -65553 146767
1601 146767 175436 -41548 32181 -25849 -28174 -45034 -100003 -110661 -69502 -110460 -42843 -49238
1589 -49238 -110002 12986 78282 14288 -77322 -151633 -110556 -4205 -161731 -154558 -33276
1578 -33276 -35415 9224 125854 87626 -4908 -49256 7871 -10481 5503 -88388 -181303 -156630
$$ packed form
1659d2276M6053J2378O907J3320j84707o0738P8845m9289Q1173l8333l3384j9058
1647a89109N792J90221l4143l3782r6614o7562J20764o1635q0238j0007o113O46
1635b61780m7625J12438N7863J1032O8782J05605p6500p1034J70767k4674Q591
1624E3465j13053L3191m5770k5463J74475j0113n0654p0386K305k3429L4212j20949
1612a62169q6737J97180j4416J65248j21726k1303Q8882j14167o463J0118K12320
1601A46767K8669k16984P3729n8030k325j6860n4969j0658M1159m0958O7617o395
1589d9238o0764J22988O5296o3994r1610p4311M1077J06351j57526P173J21282
1578c3276k139M4639J16630l8228r2534m4348N7127j8352J5984r3891r2915K4673
$$ plain form
1566 -156630 -47545 -154766 -81119 -101372 47475 118369 17602 -15198 21734 -69892 -94538
1555 -94538 20115 -109884 -153330 -1181 -22939 -153441 -94026 -55108 -60823 -97787 93206
1544 93206 46188 -4735 38847 -99745 -234297 -233427 -207714 -84111 -118756 -48346 21843 -52404
1532 -52404 -107618 -25874 -80073 -83292 -38989 -118520 -139921 -22653 -15244 -42690 -59038 -7112
1520 -7112 -34553 -141591 -41370 110491 98667 -209992 -135477 -59980 -73425 -29489 -64856
1509 -64856 -122981 -136695 -107483 -105710 -64413 -17989 -15173 142367 -66173 -51574 -39891 -98397
1497 -98397 -60140 -175190 -182774 -62832 -65330 -100309 -175995 -176385 -181158 -199446 -151910 -106128
1485 -106128 40393 -64845 -78651 -17111 -59671 -20391 -87389 -146986 -41326 -150097 -234419
$$ packed form
1566a56630J09085j07221P3647k0253J48847P0894j00767l2800L6932r1626k4646
1555i4538J14653j29999m3446J52149k1758j30502N9415L8918n715l6964J90993
1544I3206m7018n0923M3582j38592j34552Q70K5713J23603l4645P0410P0189p4247
1532e2404n5214Q1744n4199l219M4303p9531k1401J17268P409k7446j6348N1926
1520g112k7441j07038J00221J51861j1824l08659P4515P5497j3445M3936l5367
1509f4856n8125j3714K9212J773M1297M6424K816J57540k08540J4599J1683n8506
1497i8397L8257j15050p584J19942k498l4979p5686l90m773j8288M7536M5782
1485a06128J46521j05238j3806O1540m2560L9280o6998n9597J05660j08771q4322
$$ plain form
1474 -234419 -144256 -96333 -71915 13983 4783 -29172 11280 -5917 36644 -13258 -123029 -169361
1462 -169361 -181149 -181945 -67763 76400 140799 194904 141447 9066 52596 38527 -17616
1451 -17616 12376 14889 16635 -37362 -161643 -186641 -87767 -88849 -60605 -148551 -128903 -97821
1439 -97821 3025 -137909 -259060 -147716 -164356 -101005 27486 -21394 -21161 40883 5459
1428 5459 -78726 7375 57452 75253 163086 84432 76617 41718 -52847 -146306 -238018 -119899
1416 -119899 80012 194473 12843 -34477 -61262 -182169 -197250 -115103 -120801 -183902 -134985
1405 -134985 -89806 29074 70275 17773 -79268 16432 -2275 -90457 -67382 -108388 -43454
1394 -43454 4249 -10196 533 47722 -51084 -6859 18018 49802 -30339 -109776 -89302 9588
$$ packed form
1474b34419R0163M7923K4418Q5898r200l3955M0452j7197M2561m9902j09771m6332
1462a69361j1788p96J14182J44163O4399N4105n3457j32381M3530j4069n6143
1451a7616K9992K513J746n3997j24281k4998R8874j082K8244q7946J9648L1082
1439i7821J00846j40934j21151J11344j6640O3351J28491m8880K33O2044l5424
1428E459q4185Q6101N0077J7801Q7833p8654p815l4899r4565r3459r1712J18119
1416a19899J99911J14461j81630m7320k6785j20907j5081Q2147n698o3101M8917
1405a34985M5179J18880M1201n2502r7041R5700j8707q8182K3075m1006O4934
1394d3454M7703j4445J0729M7189r8806M4225K4877L1784q0141p9437K0474R8890
$$ plain form
1382 9588 -49818 -108728 -1612 64422 121015 34656 -31499 -58815 9219 -12925 -15807 -54821
1370 -54821 -5316 -33117 -224578 -223408 -103889 -80306 -37611 -59377 16852 61460 77818 65731
1358 65731 -78734 -155224 11630 -6446 -43442 59725 36732 1341 39793 -36792 -61165
1347 -61165 -89702 48529 120670 223237 131228 -48985 116893 183505 81338 -13997 -53191
1336 -53191 -19006 -13378 -20357 -39265 -23874 -93398 51537 -73827 -227655 -182744 -240014 -125093
1324 -125093 -109073 -118752 -51917 99053 -28520 -157817 -55909 -78149 93109 148953 78781
1313 78781 -54201 -11607 91490 -98671 -50284 -126398 -63916 -126713 84528 46590 -39358
1302 -39358 16238 -37667 -113002 -154413 -83449 -14996 34906 51619 60725 13554 25902 205376
$$ packed form
1382I588n9406n8910J07116O6034N6593q6359o6155k7316O8034k2144k882l9014
1370e4821M9505k7801j91461J170J19519K3583M2695k1766P6229M4608J6358j2087
1358F5731j44465p6490J66854j8076l6996J03167k2993l5391L8452p6585k4373
1347f1165k8537J38231P2141J02567r2009j80213J65878O6612j02167r5335l9194
1336e3191L4185N628o979j8908J5391o9524J44935j25364j53828M4911n7270J14921
1324a25093J6020r679O6835J50970j27573j29297J01908k2240J71258N5844p0172
1313G8781j32982M2594J03097j90161M8387p6114O2482o2797K11241l7938q5948
1302c9358N5596n3905p5335m1411P0964O8453M9902J6713R106m7171J2348J79474
$$ plain form
1290 205376 153995 -41306 -75370 35839 -9288 16185 -16169 63811 -4514 -143135 -80736
1279 -80736 -6399 35752 150012 90985 -20184 44912 65586 42034 154524 219363 127908
1268 127908 13798 -71617 -113115 -134105 14327 -25647 10672 -5388 109829 29368 -51636
1257 -51636 152034 211449 143964 157839 44209 74633 74214 143470 57248 20511 -20370 29616
1245 29616 55582 56056 -47265 -187079 -162824 -44264 59433 10660 -59750 -23458 -123538
1234 -123538 -11319 -31276 -35906 -58718 -89273 -46769 -21507 86192 -59583 -65063 32703
1223 32703 163879 99519 69626 81714 15753 49264 168733 103762 183462 110678 84146
1212 84146 84217 -38869 -182452 -113786 62675 92852 -25098 -85509 -62343 31258 52999 10239
$$ packed form
1290B05376n1381j95301l4064J11209m5127K5473l2354P9980o8325j38621O2399
1279h0736P4337M2151J14260n9027j11169O5096K0674k3552J12490O4839r1455
1268A27908j14110q5415m1498k0990J48432l9974L6319j6060J15217q0461q1004
1257e1636K03670N9415o7485J3875j13630L0424m19O9256q6222l6737m0881M9986
1245B9616K5966M74j03321j39814K4255J18560J03697m8773p0410L6292j00080
1234a23538J12219j9957m630k2812l0555M2504K5262J07699j45775n480R7766
1223C2703J31176o4360k9893J2088o5961L3511J19469o4971P9700p2784k6532
1212H4146P1j23086j43583O8666J76461L0177j17950o0411K3166R3601K1741m2760
$$ plain form
1200 10239 -2789 -97211 -44612 49439 68819 -15411 13800 21770 1011 18695 -44527 7469
1188 7469 72353 146571 10025 -46038 -182340 -192205 -24316 -22924 -109682 36810 107106 20443
1176 20443 -6723 -3525 -53709 -25277 -5253 -46985 -73176 28885 43406 -85471 -4164 26490
1164 26490 128680 101781 59443 155494 112498 108781 121238 -41321 -41868 -2644 -7525 -131453
1152 -131453 -69493 26900 -73484 -57897 -76230 -26858 128546 73331 31826 -161670 -190611
1141 -190611 -104901 -83372 -113799 -99634 -13263 -22442 -45657 -31357 75237 112603 -84362
1130 -84362 -67345 47307 -41432 25115 145012 145038 60105 70596 75209 143682 59364 -21038
1118 -21038 -153400 -139463 -86579 -48284 -10287 -6376 -48782 -55456 28935 -86049 -19307 10410
$$ packed form
1200A0239j3028r4422N2599R4051J9380q4230K9211P970k0759J7684o3222N1996
1188G469O4884P4218j36546n6063j36302r865J67889J392q6758J46492P0296q6663
1176B0443k7166L198n0184K8432K0024m1732k6191J02061J4521j28877Q1307L0654
1164B6490J02190k6899m2338R6051m2996l717J2457j62559n47L9224m881j23928
1152a31453O1960R6393j00384J5587j8333M9372J55404n5215m1505j93496k8941
1141a90611Q5710K1529l0427J4165Q6371r179k3215J4300J06594L7366j96965
1130h4362J7017J14652q8739O6547J19897K6q4933J0491M613O8473q4318q0402
1118b1038j32362J3937N2884L8295L7997L911m2406o674Q4391j14984O6742K9717
$$ plain form
1106 10410 -76362 25098 41485 -5988 -56772 -119532 -180601 -175490 -62432 -12452 10001 -127799
1094 -127799 -95403 -5388 -84123 -84689 17715 -51412 -16728 6538 -37247 66310 25720 -10059
1082 -10059 32714 -75063 -122343 -202177 -98245 96854 32288 117789 141143 -21524 -64715
1071 -64715 61612 127275 36098 -23013 -86878 -108536 6963 -30215 -186248 19991 73206
1060 73206 -110004 -270063 -124761 -19637 -60713 38129 -7819 -17893 -45590 -1345 -63450
1049 -63450 -88868 -82891 -50907 -116185 -18450 -17726 16826 25661 24819 36086 27630 178694 247198
1036 247198 164202 60032 174199 147993 18457 132914 139335 87296 39862 11791 -82438
1025 -82438 10891 58991 35756 -51465 28117 181196 174966 81836 -41857 22321 63882 170333
$$ packed form
1106A0410q6772J01460J6387m7473n0784o2760o1069N111J13058M9980K2453j37800
1094a27799L2396R0015p8735n66J02404o9127L4684K3266m3785J03557m0590l5779
1082a0059M2773j07777m7280p9834J03932J95099o4566Q5501K3354j62667m3191
1071f4715J26327O5663r1177n9111o3865k1658J15499l7178j56033K06239N3215
1060G3206j83210j60059J45302J05124m1076R8842m5948j0074k7697M4245o2105
1049f3450k5418N977L1984o5278R7735P24L4552Q835q42J1267q456J51064O8504
1036B47198q2996j04170J14167k6206j29536J14457O421n2039m7434k8071r4229
1025h2438R3329M8100k3235q7221P9582J53079o230r3130j23693O4178M1561J06451
$$ plain form
1013 170333 148440 176996 15729 63332 -9047 -9640 -140903 -87904 42419 51873 6217 -9897
1001 -9897 -93446 -143016 12915 74151 88960 104566 -113724 -213190 -204676 -132948 -90878 -148179
989 -148179 -53988 -75191 53635 38902 45489 91372 32717 367 -68522 -49005 -148260 -29534
977 -29534 -25592 4160 -106184 -148104 -41668 158346 -84305 -106860 -111500 -232106 -95237
966 -95237 -164569 -26538 -100578 -65951 14760 96671 1818 7863 50993 144078 -10864 89427
954 89427 -12692 -25474 60570 108743 54900 89856 72321 -166532 -95311 4751 -17696
943 -17696 30322 14903 24899 77386 145114 140286 18010 -66278 69647 6111 59305 61957
931 61957 25980 43502 -9476 -16930 92237 72653 28852 52381 68476 57733 38585 178270
$$ packed form
1013A70333k1893K8556j61267M7603p2379n93j31263N2999J30323R454m5656j6114
1001i897q3549m9570J55931O1236J4809J5606k18290r9466Q514P1728M2070n7301
989a48179R4191k1203J28826j4733O587M5883n8655l2350o8889J9517r9255J18726
977b9534L942K9752j10344m1920J06436K00014k42651k2555m640j20606J36869
966i5237o9332J38031p4040L4627Q0711Q1911r4853O045M3130R3085j54942J00291
954H9427j02119j2782Q6044M8173n3843L4956j7535k38853P1221J00062k2447
943a7696M8018j5419R996N2487O7728m828j22276q4288J35925o3536N3194K652
931F1957l5977J7522n2978p454J09167j9584m3801K3529J6095j0743j9148J39685
$$ plain form
919 178270 93224 31208 -25048 5224 186496 187316 84808 -43739 -46295 -46913 3582 62935
907 62935 128781 121811 12455 -16982 -40020 71954 16530 -75356 -95394 -88500 -130482 -111074
895 -111074 73236 154085 91959 25688 -1999 65018 62812 2699 -24236 31354 -73354 -54380
883 -54380 -151232 -9238 5624 -53895 -84254 -101994 -28003 30110 115193 164539 33726 13977
871 13977 70033 80290 32129 284085 217233 51089 3067 27401 123042 108161 70685 46748
859 46748 41525 -42431 -51548 -48246 -41997 -104421 -172112 -199118 -25498 -9306 98359 120523
847 120523 101382 116282 46750 -9719 -15160 -94709 -174796 52441 95563 115329 119821 -21926
835 -21926 37186 69365 46 66161 131278 39149 -96971 -170714 -137264 -46338 85681 2808
$$ packed form
919A78270q5046o2016n6256L0272J81272Q20j02508j28547k556o18N0495N9353
907F2935O5846o970j09356k9437k3038J11974n5424r1886k0038O894m1982J9408
895a11074J84310Q0849o2126o6271k7687O7017k206o0113k6935N5590j04708J8974
883e4380r6852J41994J4862n9519l0359j7740P3991N8113Q5083M9346j30813j9749
871A3977N6056J0257m8161K51956o6852j66144m8022K4334R5641j4881l7476k3937
859D6748n223q3956r117L302O249o2424o7691k7006J73620J6192J07665K2164
847A20523j9141J4900o9532n6469n441p9549q0087K27237M3122J9766M492j41747
835b1926N9112L2179o9319O6115O5117r2129j36120p3743L3450R0926J32019q2873
$$ plain form
823 2808 66777 87761 123667 110124 116672 100354 23765 -23997 -42235 26834 -5437 -85481
811 -85481 -106445 -41082 53727 103119 19515 -15926 68684 26776 -114841 -75234 -13488 114678
799 114678 167694 109940 24970 -81625 10122 56670 124556 24518 -10883 -9545 27815 134763
787 134763 170851 -3043 -33469 -9698 -109990 -16428 16959 23832 -2559 -104326 -121012
776 -121012 47105 -84423 -48053 45253 55206 83772 35750 -11400 -4810 43000 132185 159198
764 159198 131232 65972 -34453 -139669 -38386 -109156 -131143 -31129 -52098 -12422 -49367
753 -49367 -153871 -97825 55375 57252 20528 59358 84842 17082 1683 -161665 -179021 -149892
741 -149892 -20822 68579 22687 167965 118286 -93345 -70983 34 79870 -6839 114130
$$ packed form
823B808O3969K0984L5906j3543O548j6318p6589m7762j8238O9069l2271q0044
811h5481k0964O5363R4809M9392q3604l5441Q4610m1908j41617L9607O1746J28166
799A14678N3016n7754q4970j06595R1747M6548O7886j00038l5401J338L7360J06948
787A34763L6088j73894l0426K3771j00292R3562L3387O873k6391j01767j6686
776a21012J68117j31528L6370R3306R953K8566m8022m7150O590M7810Q9185K7013
764A59198k7966o5260j00425j05216J01283p0770k1987J00014k0969L9676l6945
753d9367j04504N6046J53200J877l6724L8830K5484o7760j5399j63348j7356K9129
741a49892J29070Q9401m5892J45278m9679k11631K2362P1017P9836q6709J20969
$$ plain form
730 114130 102770 46709 65873 18691 18889 47596 40254 145801 124975 -110789 -69934 34871
718 34871 -108947 -131608 -140162 -68201 135908 48668 24050 5391 150585 75515 -25659
707 -25659 -6853 -81606 -93632 -49278 -32139 -61025 -23882 29423 9543 106891 109501 125195
695 125195 111044 133303 63799 56600 73183 238751 180517 32628 61420 -82462 -96539
684 -96539 -51494 74773 -2372 1933 87681 87478 133844 49436 94906 39703 -107682 14512
672 14512 39361 117646 76110 -10220 108741 141132 -50629 -55209 -57317 -5197 -4199 -62084
660 -62084 -60770 33352 -55982 -72733 31861 38255 4135 -22949 57692 64262 -6190 -125473
648 -125473 -82776 2877 66013 146366 -24555 -66130 -42340 7766 -48438 37403 247330
$$ packed form
730A14130j1360n6061J9164m7182J98K8707p342J05547k0826k35764M0855J04805
718C4871j43818k2661q554P1961K04109q7240k4618j8659J45194p5070j01174
707b5659J8806p4753j2026M4354J7139k8886L7143N3305j9880R7348K610J5694
695A25195j4151K2259o9504p199J6583J65568n8234j47889K8792j43882j4077
684i6539M5045J26267p7145M305Q5748k03M6366q4408M5470n5203j47385J22194
672A4512K4849P8285m1536q6330J18961L2391j91761m580k108N2120R98n7885
660f2084J314R4122q9334j6751J04594O394l4120k7084Q0641O570p0452j19283
648a25473M2697Q5653O3136Q0353j70921m1575K3790N0106n6204Q5841K09927
$$ plain form
637 247330 227273 90295 -11189 -119122 -160451 -69438 1528 -53459 -53096 144158 145997 40353
$$ packed form
637B47330k0057j36978j01484j07933m1329R1013P0966n4987L63J97254J839j05644
$$ [...]
##END NTUPLES=NMR SPECTRUM
##END=
