##TITLE=1H_DE-80H_X3
 200.13MHz, d2o
 8 sc
 
 19ns.26.2.2025
##JCAMPDX= 6.0         $$ Bruker NMR JCAMP-DX V2.0
##DATA TYPE= NMR SPECTRUM
##DATA CLASS= NTUPLES
##ORIGIN= UXNMR, Bruker Analytische Messtechnik GmbH
##OWNER= pz
$$ XWIN-NMR		Version 3.5
$$ Mon Sep 29 13:24:04 2025 Russian Standard Time (UT+4h)  Yarkov@DPX200
##.OBSERVE FREQUENCY= 200.1313
##.OBSERVE NUCLEUS= ^1H
##.ACQUISITION MODE= SIMULTANEOUS
##.ACQUISITION SCHEME= undefined
##.AVERAGES= 8
##.DIGITISER RES= 18
##SPECTROMETER/DATA SYSTEM= spect
##.PULSE SEQUENCE= zg30
##.SOLVENT NAME= CDCl3
##.SHIFT REFERENCE= (INTERNAL, CDCl3, 0, 15.4957)
##AUDIT TRAIL= $$ (NUMBER, WHEN, WHO, WHERE, WHAT)
$$ ##TITLE= Audit trail, XWIN-NMR		Version 3.5
$$ ##JCAMPDX= 5.01
$$ ##ORIGIN= Bruker BioSpin GmbH
$$ ##OWNER= Yarkov
$$ C:/Bruker/XWIN-NMR/data/yarkov2/nmr/H-C/1/pdata/1/auditp.txt
$$ ##AUDIT TRAIL=  $$ (NUMBER, WHEN, WHO, WHERE, WHAT)
(   1,<2025-09-29 13:22:54.76 +0400>,<Yarkov>,<DPX200>,
      <created by zg, POWCHK disabled, PULCHK disabled
       configuration hash MD5:
       00 E9 B6 7A A2 85 ED C7 34 08 36 98 17 FE 4E 26
       data hash MD5: 16K
       D2 A9 F0 BF 5D 59 D4 D0 40 3A 9B 93 43 B4 9A B3>)
(   2,<2025-09-29 13:23:01.09 +0400>,<Yarkov>,<DPX200>,
      <Start of raw data processing
       efp BC_mod = 2 LB = 0.25 FT_mod = 6 PKNL = 1 PHC0 = -2080.447 PHC1 = 31.99097 SI = 16K 
       data hash MD5: 16K
       FD F3 3F EA 6E 54 61 27 34 28 D2 4B 9B FF EE B4>)
(   3,<2025-09-29 13:23:23.98 +0400>,<Yarkov>,<DPX200>,
      <pk PHC0 = 6.214343 PHC1 = -12.2 
       data hash MD5: 16K
       70 71 DF E4 17 E9 1A 51 72 28 50 11 B6 8D BE 9D>)
(   4,<2025-09-29 13:23:27.96 +0400>,<Yarkov>,<DPX200>,
      <abs ABSG = 5 
       data hash MD5: 16K
       F8 CC 65 61 1F E2 A4 E5 22 A6 33 64 46 82 18 38>)
$$ ##END=
$$ 
$$ hash MD5
$$ 26 64 4D 82 0F 74 1A E2 24 1A 8A 37 7B 85 3E 35
##$RELAX= 
##$RELAX= 
##$RELAX= 
##$RELAX= 
##$RELAX= 
##$RELAX= 
$$ Bruker specific parameters
$$ --------------------------
##$DU= <C:/Bruker/XWIN-NMR>
##$EXPNO= 1
##$NAME= <H-C>
##$PROCNO= 1
##$TYPE= <nmr>
##$USER= <yarkov2>
##$AMP= (0..31)
100 100 100 100 100 100 100 100 100 100 100 100 100 100 100 100 100 100 
100 100 100 100 100 100 100 100 100 100 100 100 100 100 
##$AQSEQ= 0
##$AQ_mod= 1
##$AUNM= <au_zg>
##$AUTOPOS= <>
##$BF1= 200.13
##$BF2= 200.13
##$BF3= 200.13
##$BF4= 200.13
##$BF5= 200.13
##$BF6= 200.13
##$BF7= 200.13
##$BF8= 200.13
##$BYTORDA= 1
##$CFDGTYP= 0
##$CFRGTYP= 5
##$CHEMSTR= <none>
##$CNST= (0..31)
1 1 145 1 1 1 1 1 1 1 1 1 1 1 1 1 1 1 1 1 1 1 1 1 1 1 1 1 1 1 1 1 
##$CPDPRG= <>
##$CPDPRG1= <>
##$CPDPRG2= <>
##$CPDPRG3= <>
##$CPDPRG4= <mlev>
##$CPDPRG5= <mlev>
##$CPDPRG6= <mlev>
##$CPDPRG7= <mlev>
##$CPDPRG8= <mlev>
##$CPDPRGB= <>
##$CPDPRGT= <>
##$D= (0..31)
0 0.7 0 0 0 0 0 0 0 0 0 0.03 0 0 0 0 0 0 0 0 0 0 0 0 0 0 0 0 0 0 0 0 
##$DATE= 1759137774
##$DBL= (0..7)
120 120 120 120 120 120 120 120 
##$DBP= (0..7)
150 150 150 150 150 150 150 150 
##$DBP07= 0
##$DBPNAM0= <>
##$DBPNAM1= <>
$$ [...]
##$SUBNAM3= <"">
##$SUBNAM4= <"">
##$SUBNAM5= <"">
##$SUBNAM6= <"">
##$SUBNAM7= <"">
##$SUBNAM8= <"">
##$SUBNAM9= <"">
##$SW= 18.0517328524113
##$SWIBOX= (0..15)
0 0 2 0 0 0 0 0 0 0 0 0 0 0 0 0 
##$SW_h= 3612.71676300578
##$TD= 16384
##$TD0= 1
##$TE= 0
##$TE2= 300
##$TE3= 300
##$TEG= 300
##$TL= (0..7)
0 120 120 120 120 120 120 120 
##$TP= (0..7)
150 150 150 150 150 150 150 150 
##$TP07= 0
##$TPNAME0= <>
##$TPNAME1= <>
##$TPNAME2= <>
##$TPNAME3= <>
##$TPNAME4= <>
##$TPNAME5= <>
##$TPNAME6= <>
##$TPNAME7= <>
##$TPOAL= (0..7)
0.5 0.5 0.5 0.5 0.5 0.5 0.5 0.5 
##$TPOFFS= (0..7)
0 0 0 0 0 0 0 0 
##$TUNHIN= 0
##$TUNHOUT= 0
##$TUNXOUT= 0
##$USERA1= <user>
##$USERA2= <user>
##$USERA3= <user>
##$USERA4= <user>
##$USERA5= <user>
##$V9= 5
##$VALIST= <valist>
##$VCLIST= <CCCCCCCCCCCCCCC>
##$VD= 0
##$VDLIST= <DDDDDDDDDDDDDDD>
##$VPLIST= <PPPPPPPPPPPPPPP>
##$VTLIST= <TTTTTTTTTTTTTTT>
##$WBST= 1024
##$WBSW= 4
##$XGAIN= (0..3)
0 0 0 0 
##$XL= 0
##$YL= 0
##$YMAX_a= 307192
##$YMIN_a= -281485
##$ZGOPTNS= <>
##$ZL1= 120
##$ZL2= 120
##$ZL3= 120
##$ZL4= 120
##$ABSF1= 15.41194
##$ABSF2= -2.639908
##$ABSG= 5
##$ABSL= 3
##$ALPHA= 0
##$AQORDER= 0
##$ASSFAC= 0
##$ASSFACI= 0
##$ASSFACX= 0
##$ASSWID= 0
##$AUNMP= <proc_1d>
##$AZFE= 0.1
##$AZFW= 0.1
##$BCFW= 0
##$BC_mod= 2
##$BYTORDP= 0
##$COROFFS= 0
##$CY= -3
##$DATMOD= 1
##$DC= 0
##$DFILT= <>
##$DTYPP= 0
##$F1P= 0
##$F2P= 0
##$FCOR= 1
##$FTSIZE= 16384
##$FT_mod= 6
##$GAMMA= 0
##$GB= 0
##$INTBC= 1
##$INTSCL= 3.241238e-09
##$ISEN= 128
##$LB= 0.25
##$LEV0= 0
##$LPBIN= 0
##$MAXI= 10000
##$MC2= 0
##$MEAN= 0
##$ME_mod= 0
##$MI= 1.114404
##$NCOEF= 0
##$NC_proc= -7
##$NLEV= 6
##$NOISF1= 3.799351
##$NOISF2= 2.8
##$NSP= 0
##$NTH_PI= 0
##$NZP= 0
##$OFFSET= 15.49568
##$PC= 1
##$PHC0= -2074.233
##$PHC1= 19.79097
##$PH_mod= 1
##$PKNL= yes
##$PPARMOD= 0
##$PSCAL= 0
##$PSIGN= 0
##$REVERSE= no
##$SF= 200.130005207787
##$SI= 16384
##$SIGF1= 3
##$SIGF2= 2
##$SINO= 0.751879
##$SIOLD= 32768
##$SREGLST= <19F.Aceton>
##$SSB= 0
##$STSI= 16384
##$STSR= 0
##$SW_p= 3612.71676300578
##$SYMM= 0
##$S_DEV= 0
##$TDeff= 16384
##$TDoff= 0
##$TI= <>
##$TILT= no
##$TM1= 0
##$TM2= 0
##$TOPLEV= 0
##$USERP1= <user>
##$USERP2= <user>
##$USERP3= <user>
##$USERP4= <user>
##$USERP5= <user>
##$WDW= 1
##$XDIM= 16384
##$YMAX_p= 389624649
##$YMIN_p= -788857
$$ End of Bruker specific parameters
$$ ---------------------------------
##NTUPLES= NMR SPECTRUM
##VAR_NAME=  FREQUENCY,     SPECTRUM/REAL,   SPECTRUM/IMAG
##SYMBOL=    X,             R,               I
##VAR_TYPE=  INDEPENDENT,   DEPENDENT,       DEPENDENT
##VAR_FORM=  AFFN,          ASDF,            ASDF
##VAR_DIM=   16384,         16384,           16384
##UNITS=     HZ,            ARBITRARY UNITS, ARBITRARY UNITS
##FACTOR=    0.220516191357247, 1,           1
##FIRST=     3101.15049014873, 0,            0
##LAST=      -511.566272857049, 0,           0
##MIN=       -511.566272857049, -788857,     0
##MAX=       3101.15049014873, 389624649,    0
$$ Real data points
##PAGE= N=1
##DATA TABLE= (X++(R..R)), XYDATA
$$ [...]
6608e38626j2886j94882O5909j5484n5365Q2309q0932p566J22006J2286J11523
6597e11708Q3982j8658q379R2726q954j51024J05766l2946k22480o2359K55671
6586d78363n6935j0302Q6862j05745P5437R7442m1901J99866l3584r8814M8462
6575c17575j8994k268Q3098j01987L9151J92434j1996j1907q2695M6855Q0586
6564a05298J7945j5724K8997p2226M6109J26101J39550J18277J3490J00845O6888
6553D64954N7594P1881J87246J97030J52512K22383J79467r0053M0228R1917j25580
6542A449579N3987k7305j54306P0376j33838j67085j10133j15688o045l0557N9592
6531H88577l0658p0238L1755P3453L4055J3336j00449o3834J02321R5011p1310
$$ plain form
6608 -538626 -551512 -746394 -680485 -695969 -751334 -669025 -749957 -757523 -635517 -623231 -511708
6597 -511708 -427726 -446384 -454763 -362037 -370991 -522015 -416249 -449195 -671675 -734034 -478363
6586 -478363 -535298 -545600 -458738 -564483 -489046 -391604 -433505 -233639 -267223 -366037 -317575
6575 -317575 -336569 -338837 -255739 -357726 -318575 -126141 -138137 -150044 -232739 -185884 -105298
6564 -105298 -87353 -103077 -74080 -146306 -100197 25904 165454 283731 297221 398066 464954
6553 464954 522548 594429 781675 978705 1131217 1353600 1533067 1443014 1483242 1575159 1449579
6542 1449579 1503566 1476261 1321955 1392331 1258493 1091408 981275 865587 859542 828985 888577
6531 888577 857919 787681 819436 892889 926944 940280 839831 775997 878318 973329 902019
6520I02019r9924j02401l916q3108l7594j231k7220N0932p6786R7903o7626n9027
6508D92021M9023l482Q3797M9125l1552j0239n1649l9996K20010L9084J60551
6497I56693J39144n5366K38372N2803O6616q7891j435L9020p7329j56885o2040
6486A051702p8849m7472k3121p9837j34834l8868J6188l7833L7315L1251J7548
6475G13190M2270j02246j10894j14555R8186n0933j22536N4275k2536o8222q8718
6464B27281O8173R2723Q9589n7494K831R8739j15161r1665J520L4666J14832p7749
6452C88285j99723l0523j3075j28211k6691J24723j51280j61491L6970M4187j5564
6441a32393P5820j22087L6796k9854r3887J33755O55o1536J16575N9657q2805
$$ plain form
6520 902019 802095 699694 695778 612670 575076 573845 546625 597557 520771 618674 551048 492021
6508 492021 541044 537562 621359 670484 638932 628693 577044 537048 757058 796142 956693
6497 956693 1095837 1040471 1278843 1331646 1398262 1310371 1308936 1347956 1270627 1113742 1051702
6486 1051702 972853 925381 902260 822423 687589 648721 664909 627076 664391 695642 713190
6475 713190 755460 653214 542320 427765 525951 475018 352482 406757 384221 315999 227281
6464 227281 295454 388177 477766 420272 423103 521842 406681 315016 316536 351202 466034 388285
6452 388285 188562 158039 144964 16753 -9938 114785 -36495 -197986 -161016 -116829 -132393
6441 -132393 -56573 -178660 -141864 -171718 -265605 -131850 -131195 -192731 -76156 -16499 -99304
6430i9304j05774q2640J4884O2354P3508r3067q9904n5370P229O6066Q3728r1679
6418c09969j3874j5233R7715J2787j23335j03501R4883M2240j08380j29181K9614
6407e26234p5628P1455R9761M1703L8018J6321n5510j00555N1023K4233n8311
6396d73724P813K964K0553m4539R4436o79J3839j0893P187l2715j14062k746Q6829
6383d45737Q508N9413p776O0139P4825r3008o7160M9158k3345k0711l1885O6713
6371c70866k2188n8340l389J01332p055Q6847n2389k1355J06196j2660p2265r7547
6359d23679N8020J69998K8271j70016j837l5407p0082m7178J89775M9040N4132
6348a98963n8499L0215J5481k01984j0738j6057j6913J1348n2838p396k0659K142
$$ plain form
6430 -99304 -205078 -287718 -272834 -210480 -136972 -230039 -319943 -375313 -368084 -302018 -218290 -309969
6418 -309969 -323843 -339076 -241361 -228574 -351909 -455410 -360527 -318287 -426667 -555848 -526234
6407 -526234 -601862 -530407 -430646 -388943 -350925 -334604 -390114 -490669 -439646 -415413 -473724
6396 -473724 -465911 -462947 -442394 -486933 -392497 -393176 -379337 -390230 -383043 -415758 -529820 -532566 -445737
6383 -445737 -437229 -377816 -385592 -325453 -250628 -343636 -410796 -361638 -384983 -405694 -437579 -370866
6371 -370866 -393054 -451394 -454783 -353451 -360506 -273659 -326048 -347403 -241207 -253867 -326132 -423679
6359 -423679 -365659 -195661 -167390 -337406 -339243 -374650 -444732 -491910 -302135 -253095 -198963
6348 -198963 -257462 -227247 -211766 -413750 -424488 -440545 -457458 -446110 -498948 -506344 -527003 -524861
6336e24861M1655l9040K8314R3007j26606J95251J58651q6642n0924M2316j1507
6325b80386J41684j33600J2078M0200m7614L3429k33656O7016N2352j7508j15054
6314d81059j31488J91293q434K3121M1244K0188n4327Q1349P0536L9189p0008
6303b78396P6786M2979o4279o8633j2133k6763O6683k1611J06986J50289r1095
6292a19187m7851j40042K7281l729r7456M0737K8843M5735O3186l442l9771K6091
6280b19605m8884R3955L3753P946J51987J8531K0605M5125Q2813J1027L4196O2077
6268B93526L710J00682R4081j08525r9872q2574J72052q8653k14533k0498P7908
6257A27304M6895R386k5005K6418N0474O4244K9183r6690k352J603J7211L8379
$$ plain form
6336 -524861 -483206 -522246 -493932 -400925 -527531 -332280 -173629 -260271 -311195 -268879 -280386
6325 -280386 -138702 -272302 -260224 -220024 -267638 -234209 -467865 -400849 -348497 -366005 -481059
6314 -481059 -612547 -421254 -429688 -406567 -365323 -345135 -399462 -318113 -247577 -208388 -278396
6303 -278396 -201610 -158631 -222910 -291543 -303676 -330439 -263756 -285367 -178381 -28092 -119187
6292 -119187 -167038 -307080 -279799 -283528 -380984 -340247 -311404 -265669 -202483 -205925 -245696 -219605
6280 -219605 -268489 -174534 -140781 -132835 19152 37683 58288 103413 186226 197253 231449 293526
6268 293526 297236 397918 491999 383474 283602 201028 373080 284427 69894 49396 127304
6257 127304 174199 183585 158580 184998 235472 299716 328899 232209 229857 231460 248671 287050
6245B87050M1520M057J44044L8465P1196Q646L9108J39027J96920o5673j08870
6234G95490m5124j62721J14495J19448p9183n481q7851l0931L4539j07329k372
6223E42980j51858p1494M3083O3224M2748K2553k4512M4171L8870m0414R11M9264
6211E59526r2780N1257P3661J58078j15654J10450N6398K87163O7474m6039M074
6200A113608j15799N0647J9550q8610L9841j0293Q6329K83616o2827P0448K09666
6189A596176J26018n0419r963R1005j3779J69961K03860q7780j2247J45472R239
6178B167543k7808l3220Q8789Q8824K9620n3166N2832J36002j10496j829J38702
6167B475793j30645p0574Q3572L3061O983K4583Q6248p336O4965J37240j2712
$$ plain form
6245 287050 328570 332627 476671 515136 586332 594978 634086 773113 970033 904360 795490
6234 795490 750366 587645 702140 821588 742405 736924 649073 618142 652681 545352 542980
6223 542980 391122 319628 362711 425935 468683 491236 466724 510895 549765 509351 510262 559526
6211 559526 466746 518003 591664 749742 634088 744538 800936 1088099 1155573 1109534 1113608
6200 1113608 997809 1048456 1068006 979396 1019237 1008944 1095273 1378889 1316062 1386510 1596176
6189 1596176 1722194 1671775 1661812 1752817 1739038 1908999 2112859 2025079 2012832 2158304 2167543
6178 2167543 2139735 2106515 2195304 2284128 2313748 2260582 2313414 2449416 2338920 2337091 2475793
6167 2475793 2345148 2274574 2358146 2391207 2398190 2422773 2509021 2501685 2566650 2703890 2691178
6156B691178l4707O5878Q3014K8452l7393L1183j29555J29938P0822P8670k7087
6145B950393j0642J83567O8595j35873o2457j00956n9612n2608j86625l8466j4812
6134B540504l2523p7422M3672o9864j5119Q0590n7163o2932L4505m6100l8818
6123B299330J22409m1275J50507M8972N8126J6301K14220J08278N1539K07278
6113C235685K20553K10553K02641O7299J67749J03175K4185Q5697j09576j28544
6103D079417J6665K6007j14722J22103q5296j40299J92212J47817l1642J77550
6093D389812K15549J11856J47730K16275K73430L64096K55312M47210M41609N78009
6083G440888M42791M25396N34369L05881K41903L2r3262p1145k3494j51015o108
$$ plain form
6156 2691178 2656471 2722349 2805363 2833815 2796422 2827605 2698050 2827988 2898810 2977480 2950393
6145 2950393 2939751 3123318 3191913 3056040 2993583 2892627 2833015 2780407 2593782 2555316 2540504
6134 2540504 2507981 2430559 2474231 2404367 2389248 2469838 2412675 2349743 2384248 2338148 2299330
6123 2299330 2421739 2380464 2530971 2579943 2638069 2654370 2868590 2976868 3028407 3235685
6113 3235685 3456238 3666791 3869432 3936731 4104480 4207655 4231840 4317537 4207961 4079417
6103 4079417 4096082 4122089 4007367 4129470 4044174 3903875 4096087 4243904 4212262 4389812
6093 4389812 4605361 4717217 4864947 5081222 5354652 5718748 5974060 6421270 6862879 7440888
6083 7440888 7883679 8309075 8843444 9149325 9391228 9391260 9297998 9226853 9203359 9052344 9046236
6072I046236J04707K42793K56373K56607K39783L69266N03260M17271N94733P73403
6062A2804432Q16794J101965J209259J137477J309624J438200J505936J513178
6054B2836865J320852J283041J001747O53742K02497m9398l32305o52607o74260
6045B5590174o55190o67366n80954j93778l09397l01572k17925j47525J91185
6036B2707652J80266K32889M53490M90964O99457R56811J080458J246524J538301
6027B9586812J844812J848603K010240K345092K307570K291542J923254J404055
6019D5561980R85964K28092o55944j098128j403265j996210j977285j868320j806228
6010C5970656j716684j583051j193337j162842j040492q94804p15547n73877m96876
$$ plain form
6072 9046236 9150943 9393736 9650109 9906716 10146499 10515765 11019025 11436296 12031029 12804432
6062 12804432 13621226 14723191 15932450 17069927 18379551 19817751 21323687 22836865
6054 22836865 24157717 25440758 26442505 27096247 27298744 27249346 26917041 26264434 25590174
6045 25590174 24934984 24267618 23686664 23492886 23183489 22881917 22663992 22516467 22707652
6036 22707652 22887918 23120807 23574297 24065261 24764718 25721529 26801987 28048511 29586812
6027 29586812 31431624 33280227 35290467 37635559 39943129 42234671 44157925 45561980
6019 45561980 46547944 46776036 46120092 45021964 43618699 41622489 39645204 37776884 35970656
6010 35970656 34253972 32670921 31477584 30314742 29274250 28379446 27663899 27090022 26593146
6001B6593146n08017k08686k30814j01124O4454J79267O01525N70130O22340Q41668
5991B8423889P18441O70919P73298M68912J19226j97272o20244q20317r94276
5982B8542576j017312j211499j129248r91026q88379r23535p90131n77218n60679
5973B0453549m97023o66368o96037p82683p35370o53555o10764l42325l31607
5964A5137817k94161l17603l82558l18873k55959l23882l05172l68557j93828
5955A2377224j96926k04718l349j60724J55890K80594K733K49697L84095P9756
5945A2964272J47001k7970l66193n60141p07784l32275l3722k00869k35042j90063
5935A0457214k57934k49307l48942l09765k07411k78481j20049m1889j46450Q3058
$$ plain form
6001 26593146 26085129 25876443 25645629 25544505 25608959 25788226 26389751 26959881 27582221 28423889
5991 28423889 29142330 29813249 30586547 31055459 31174685 30977413 30357169 29536852 28542576
5982 28542576 27525264 26313765 25184517 24193491 23305112 22381577 21591446 21014228 20453549
5973 20453549 19956526 19290158 18594121 17811438 17076068 16422513 15811749 15469424 15137817
5964 15137817 14843656 14526053 14143495 13824622 13568663 13244781 12939609 12571052 12377224
5955 12377224 12180298 11975580 11972231 11811507 11967397 12247991 12250724 12500421 12884516 12964272
5945 12964272 13111273 13083303 12717110 12156969 11449185 11116910 11083188 10882319 10647277 10457214
5935 10457214 10199280 9949973 9601031 9291266 9083855 8805374 8685325 8643436 8496986 8580044
5925H580044J04180J09677R3653K35718J42867J13244K46401J63984L3389o3602
5915I759555j63035m68043m87576j86965r5609j01706l3746j88253k77606l22297
5905G434719j63399p9151j10515k25399o3763r6604J7705j37418q1041K7877l4267
5894F488744l8435Q0858l1649P1213j41919j48823n5560n1802j44516k36190k16873
5883E575048k0385r523q782j23143l31356l3633j12167j56921j61493j52840k3270
5872D441535j54935Q9988q1156k18415l8284K2654J0240k53151q7712O8696j46313
5861C653147L1096N7137j40370r0866p0608q9262p9955L1687k9754j14884j48647
5850C008721M415j31355j60102j47402m7944l204R1859l2897j41079r2273l075
$$ plain form
5925 8580044 8684224 8793901 8887554 9123272 9266139 9379383 9625784 9789768 9823157 9759555
5915 9759555 9596520 9128477 8640901 8453936 8358327 8256621 8222875 8034622 7757016 7434719
5905 7434719 7271320 7192169 7081654 6856255 6792492 6695888 6713593 6576175 6495134 6523011 6488744
5894 6488744 6450309 6531167 6499518 6570731 6428812 6279989 6224429 6172627 6028111 5791921 5575048
5883 5575048 5554663 5545140 5536358 5413215 5081859 5048226 4936059 4779138 4617645 4464805 4441535
5872 4441535 4286600 4376588 4295432 4077017 4038733 4061387 4071627 3818476 3730764 3799460 3653147
5861 3653147 3684243 3741380 3601010 3510144 3439536 3350274 3270319 3302006 3272252 3157368 3008721
5850 3008721 3013136 2881781 2721679 2574277 2526333 2523129 2614988 2582091 2441012 2348739 2345664
5839B345664j5422m4550j42599R9145q2337m8986n3950q8760Q851M590M2003M7862
5827B071511J9775j26761j04858j12167J44941N8602j25037n2173O764p3117l0756
5816A676724j41961j32601J24405O5662M4200M7118N720j20690j44558j43718
5806A280301J2609k8461o8846J45492K5165J9519J5564n599L6008k1401P8538
5795A488889l667K3033n0014n3396p312Q2200J02787q9246M4612P0543l3307m9810
5783A525312J6356N5608k9061J72198J14664N6426m125J55180J12037j85470K7382
5772B016507j4644R5977J26240j5676q9414m7599K2540R2181J55278k3284R76
5761B319082j867N432K13201p0261k25136K7771J96242J13823L5677Q3794M5060
$$ plain form
5839 2345664 2330242 2285692 2143093 2242238 2159901 2110915 2056965 1968205 1977056 1981646 2023649 2071511
5827 2071511 2091286 1964525 1859667 1747500 1892441 1951043 1826006 1773833 1780597 1707480 1676724
5816 1676724 1534763 1402162 1526567 1592229 1636429 1683547 1689267 1568577 1424019 1280301
5806 1280301 1292910 1264449 1195603 1341095 1366260 1385779 1401343 1395744 1431752 1410351 1488889
5795 1488889 1485222 1508255 1458241 1404845 1397533 1479733 1582520 1493274 1537886 1608429 1575122 1525312
5783 1525312 1541668 1597276 1568215 1740413 1855077 1911503 1907378 2062558 2174595 1989125 2016507
5772 2016507 2001863 2097840 2224080 2208404 2118990 2071391 2093931 2186112 2341390 2318106 2319082
5761 2319082 2317215 2322647 2535848 2465587 2240451 2268222 2464464 2578287 2613964 2697758 2742818
5750B742818P6715J91729j52746j14905m9517m5099J18715j07596j10159J35317
5740B685272J24234n6472j39159N349O1404M4234l9021Q4722n5857j33534M0396
5729B621568J609Q9602j58976J5873q191M1470m8890J9355N418k9625M6211j37879
5717B457545l4439J4797O8354R9469N7442q4780K8191L3184O6950l6892L0784
5706B700605J21444P89J05725q0074p6477p772M3558J18204j03801J09432n3091
5695B878542j35390n0091L9478J241p9929P3163Q960o6578J39702R0344M0350
5684B939792M7657N9938J13218Q9854O9955P7718J89634L6965J3322l6079O2784
5673C664758J58849K51516R566J19474J62375J76420J94437M4423J48903J08932
$$ plain form
5750 2742818 2819533 3011262 2858516 2743611 2694094 2648995 2767710 2660114 2549955 2685272
5740 2685272 2809506 2753034 2613875 2619224 2680628 2724862 2685841 2770563 2714706 2581172 2621568
5729 2621568 2623177 2712779 2553803 2569676 2561485 2602955 2554065 2573420 2578838 2549213 2595424 2457545
5717 2457545 2423106 2437903 2506257 2605726 2663168 2578388 2606579 2639763 2706713 2669821 2700605
5706 2700605 2822049 2822838 2928563 2848489 2772012 2764240 2807798 2926002 2822201 2931633 2878542
5695 2878542 2743152 2693061 2732539 2733780 2653851 2727014 2735974 2669396 2809098 2899442 2939792
5684 2939792 2987449 3047387 3160605 3250459 3320414 3398132 3587766 3624731 3638053 3601974 3664758
5673 3664758 3823607 4075123 4084689 4204163 4366538 4542958 4737395 4781818 4930721 5039653
5663E039653K25608P4678j48577k73364J4819r6273q2650J41106K30052P891J08567
5652E241510P3749p4237M8745o6917R5181O5438J913J02514K26536K64329J89720
5641F168481L39603P7572J28371N82145N21884L97548O88464N18519N39516M81340
5631A0443443N33231M84482L33491M90237L90986P58791Q99206Q31022R07888
5622A6072777R30598J054062R46895P43386J194576J070209J198476J579614J849850
5613B6640443J947672K452633K878015L071682L538316L988573M329791M654828
5605E3501953M895089N114229N204368M960391M661375M288586L904207K936312
5597H9466510K108526J201766j26211r98673j868445k507123l047698l423632
$$ plain form
5663 5039653 5265261 5339939 5191362 4917998 4932817 4836544 4753894 4895000 5125052 5132943 5241510
5652 5241510 5315259 5241022 5289767 5222850 5318031 5383469 5385382 5487896 5714432 5978761 6168481
5641 6168481 6508084 6585656 6714027 7296172 7818056 8215604 8904068 9422587 9962103 10443443
5631 10443443 10976674 11461156 11794647 12284884 12675870 13434661 14333867 15164889 16072777
5622 16072777 17003375 18057437 19004332 19747718 20942294 22012503 23210979 24790593 26640443
5613 26640443 28588115 31040748 33918763 36990445 40528761 44517334 48847125 53501953
5605 53501953 58397042 63511271 68715639 73676030 78337405 82625991 86530198 89466510
5597 89466510 91575036 92776802 92650591 91651918 89783473 87276350 84228652 80805020
5589H0805020l676129l879172l699365l798507l652149l488854l379586k972557
5581E2258701k791677k412025k223068k062197j912756j710847j526009j511194
5573C6108928j454429j158375j042230j079919j191925j146428r53008q94980
5565B7187634j069224j112769r63791j119021j124881j110400j030248p67615
5557A8889685q81603p47242q62953o67168n70187m71624p49011o72068n09444
5548A2758385n00555m78530l90180l75326k76673k19865m76856j98934l10467
5539I530999l34489l29495k61878k47224k71170k11533j34400k03596q2348k43486
5529G211380j98029j67700j69458k22116j90657p6864o783j95216j26232j77456
$$ plain form
5589 80805020 77128891 73249719 69550354 65751847 62099698 58610844 55231258 52258701
5581 52258701 49467024 47054999 44831931 42769734 40856978 39146131 37620122 36108928
5573 36108928 34654499 33496124 32453894 31373975 30182050 29035622 28082614 27187634
5565 27187634 26118410 25005641 24041850 22922829 21797948 20687548 19657300 18889685
5557 18889685 18008082 17260840 16397887 15730719 15160532 14688908 13939897 13267829 12758385
5548 12758385 12257830 11779300 11389120 11013794 10737121 10517256 10040400 9841466 9530999
5539 9530999 9196510 8867015 8605137 8357913 8086743 7875210 7740810 7537214 7454866 7211380
5529 7211380 7013351 6845651 6676193 6454077 6263420 6186556 6179773 5984557 5858325 5680869
5519E680869k18773k43535p2082j39386j01747J2913j34438l5172j09813j60842
5509D477994k7876j17517j20627j89414j01598j07531O3578j12313o9274n0608
5499C644814j48239o4195N1539K33565r039k26599j04434o2327j16463N764k0325
5488C184061P8300n0151j90410j12850L8292j09969m2833P7260k5264r9847l7176
5477B709413n3276J977J40333Q6051O4420K1210J40257M9096k0661J19407R673
5466C267900J18711q8030p9674o7232r9991p1025n2422n6772j64762j32304m3003
5455B531396J29058k248N3607q1218o3064J30043l87k1269O7108J40314J61534
5444C044874p898K37382J40558P1742K44134J37339M9518O6707L6188j8829n1434
$$ plain form
5519 5680869 5462096 5218561 5146479 5007093 4905346 4918259 4783821 4748649 4638836 4477994
5509 4477994 4450118 4332601 4211974 4022560 3920962 3813431 3877009 3764696 3695422 3644814
5499 3644814 3496575 3432380 3483919 3717484 3708445 3481846 3377412 3315085 3198622 3204386 3184061
5488 3184061 3262361 3212210 3021800 2908950 2947242 2837273 2794440 2871700 2846436 2746589 2709413
5477 2709413 2656137 2658114 2798447 2884498 2948918 2970128 3110385 3159481 3138820 3258227 3267900
5466 3267900 3386611 3298581 3218907 3151675 3051684 2980659 2928237 2871465 2706703 2574399 2531396
5455 2531396 2660454 2658206 2711813 2630595 2567531 2697574 2697187 2675918 2743026 2883340 3044874
5444 3044874 3036976 3274358 3414916 3486658 3730792 3868131 3917649 3984356 4020544 4001715 3950281
5433C950281j26974k8248j1494N1810J2359P8039J14164m7261J12437K32667Q3646
5422D421426J38304J12915M20500N25593P62290P40397O75806M77961L68875L49705
5412H993772K54174l02295p09592m32567n24144n46628k29384j47814N2809J80062
5402F588393L2572j85364j84387l31849l59571k21661l53116l63126k34114l41598
5392D046179l56298k04106k07275k31909m0365j18905j94867k9465o7540k6346
5382B569103j79102j25444q2619k36019k02573j0153k3195k7034O9387j74138
5372A578213o7089p9167j6476j06673j27933Q791l5055Q024Q1738m7977j82842
5361A013554O5088r0677J786r935J3116j8119o4984N1150m8183j07013p7969q4193
$$ plain form
5433 3950281 3823307 3795059 3783565 3835375 3847734 3925773 4039937 3992676 4105113 4337780 4421426
5422 4421426 4559730 4672645 5093145 5618738 6381028 7121425 7797231 8275192 8644067 8993772
5412 8993772 9247946 8945651 8236059 7803492 7279348 6732720 6503336 6355522 6408331 6588393
5402 6588393 6620965 6435601 6251214 5919365 5559794 5338133 4985017 4621891 4387777 4046179
5392 4046179 3689881 3485775 3278500 3046591 3006226 2887321 2692454 2662989 2595449 2569103
5382 2569103 2390001 2264557 2181938 1945919 1743346 1733193 1709998 1682964 1752351 1578213
5372 1578213 1511124 1431957 1415481 1308808 1180875 1189666 1154611 1162635 1244373 1196396 1013554
5361 1013554 1078642 987965 989751 979816 992932 974813 909829 960979 912796 805783 727814 643621
5349F43621J5357p3945N0077j15984q6537m1430L8481O4916R5780K5587l7047
5338E78876j25354j0957l2417j68580l4012j2108J00482J5635j91852n1859P1836
5327A39690P172J2195o8290Q3072O8497k8392j26623J2265p0442R1342Q2307K9429
5315B32222M364L8432p84J9570j7313j9232m5465J6533m5478k3703j0893p5169
5303G3084J09320J2745p4056J20576J5516j29842L6675M8984O9126l7404O6876
5292C11600j14913j849O101Q7191p0152o8855L4641n6946k5577P598r116m3970
5280E5753q460O4555n0639N3394k3619l8192Q2199l9422m0350R6238n4251J7391
5268A14597r7505m0631J23005Q5626m0152j1594o5219o5852J20294M4479K6285
$$ plain form
5349 643621 658978 585033 635110 519126 432589 391159 429640 494556 590336 615923 578876
5338 578876 453522 442565 410148 241568 207556 195448 295930 311565 119713 67854 139690
5327 139690 146862 159057 90767 173839 242336 213944 87321 99586 29144 120486 202793 232222
5315 232222 236586 275018 274234 293804 276491 257259 211794 228327 182849 159146 148253 73084
5303 73084 182404 195149 121093 241669 257185 127343 164018 213002 282128 244724 311600
5292 311600 196687 194838 200939 288130 217978 149123 183764 126818 101241 108839 99723 55753
5280 55753 47293 111848 61209 114603 90984 52792 134991 95569 55219 151457 97206 114597
5268 114597 17092 -23539 99466 185092 144940 133346 68127 2275 122569 167048 193333
5257A93333l0j03791J629l5010k08898O3741Q4808M596M7258J30542n9190j40859
5245b1871j23682J36760J00730J50240J3925j06495M8690j15039P8177J9093J2453
5234A92981N2864j50700j6285J00422P0030j9672j2465j5127J43383m545l4407
5223C06479n7785n3776J9119m6532l6967N8498l4293k4659o3512o7691J26332
5212A25213n2663q6703J7285p3901N7793J04757p9019m5795j986Q0553J39808
5201A85342r1468k630L3993j9403M4215L291K7677P2251p3242j11726r5417M8936
5189B1819j5309j12180o8284M5195J40421N1194n997Q1325J0404m3324R541M3154
5177A57959J9001L1897m8118k9670M966p167l8906m2889P598o225Q3966k7635
$$ plain form
5257 193333 193303 89512 91141 56131 -152767 -89026 -4218 378 47636 178178 118988 -21871
5245 -21871 -145553 -8793 91937 242177 256102 149607 198297 83258 161435 180528 192981
5234 192981 245845 95145 78860 179282 249312 229640 217175 202048 345431 340886 306479
5223 306479 248694 194918 214037 167505 130538 189036 154743 130084 66572 -1119 125213
5212 125213 72550 -14153 3132 -70769 -12976 91781 12762 -33033 -35019 45534 185342
5201 185342 93874 91244 125237 105834 150049 153340 181017 253268 180026 68300 -27117 21819
5189 21819 6510 -105670 -173954 -128759 11662 62856 56859 138184 148588 105264 114805 157959
5177 157959 176960 208857 160739 131069 136035 128868 89962 47073 54671 48446 132412 104777
5165A04777j0538l9359k6692R5820L4357K232m8894p5253J0840M4849K2347q28
5153A13658j40421O5000J46430L3526l1474J72164j4732M9829m7945l1293J53231
5142D67973o5105J9265J34701n8262m2933K87108J18572J02692O2192k235P986
5131A031954M0730M0023K5297K9432l9233P5747k5575N8709N4277j6974R8849
5120A373236j28803N3140L9313N3326L1285J04538r283J64618L4168m5867J2933
5109A682604K27109o5857K6230J44367R347P7123J10144K6947N9762L040r8647
5098B202169L3497O8648M7764M5372J01525l5540J17483j34478l2613m9823M1475
5087B405479M8771k41700Q7916o3163Q8846j36704Q0666Q4194j37798l8747j56055
$$ plain form
5165 104777 94239 54880 28188 124008 158365 160597 111703 36450 47290 92139 114486 113658
5153 113658 -26763 38237 184667 218193 186719 358883 344151 393980 346035 314742 467973
5142 467973 402868 422133 556834 498572 455639 742747 861319 964011 1026203 1023968 1031954
5131 1031954 1072684 1112707 1138004 1167436 1128203 1203950 1178375 1237084 1291361 1274387 1373236
5120 1373236 1244433 1297573 1336886 1390212 1421497 1526035 1516752 1681370 1715538 1669671 1682604
5109 1682604 1909713 1843856 1870086 2014453 2023800 2100923 2211067 2238014 2297776 2300816 2202169
5098 2202169 2235666 2304314 2352078 2397450 2498975 2463435 2580918 2446440 2413827 2364004 2405479
5087 2405479 2454250 2212550 2300466 2237303 2326149 2189445 2270111 2354305 2216507 2177760 2021705
5076B021705P5552J32936Q097J0644n1889K8253R6654j14611J2686M1592R400
5065B271019k3340K6379p4142o7629k4631j19828q2173J05545J519j70374L5925
5054A878270j89347j6970j09162l4249J09106k5589O2701j20177K7467j00448
5044A481602m1820M1630Q2482Q937K9111K8541m3151M7918n0723L3832n8844O302
5032A565817O5481K6476j005J23955o3974j6539Q8733M2213J47157q856N1091
5021B020549j5148K8282M9875R6301N8866J14197J53659K38677J64204P5604J0920
5010B995986J25958M2181R4641N8565J29818Q4138K95737J53062K58302K71832
5000D510220L36933K53977L04131J15602K74615L43577L14420N03678M60452L01924
$$ plain form
5076 2021705 2097257 2230193 2238290 2248934 2197045 2225298 2321952 2207341 2220027 2261619 2271019
5065 2271019 2247679 2274058 2199916 2132287 2107656 1987828 1905655 2011200 2012719 1842345 1878270
5054 1878270 1688923 1671953 1562791 1528542 1637648 1612059 1674760 1554583 1582050 1481602
5044 1481602 1439782 1481412 1563894 1572831 1601942 1630483 1587332 1635250 1584527 1618359 1559515 1565817
5032 1565817 1631298 1657774 1656769 1780724 1716750 1700211 1788944 1831157 1978314 1969458 2020549
5021 2020549 2005401 2033683 2083558 2179859 2238725 2352922 2506581 2745258 2909462 2985066 2995986
5010 2995986 3121944 3164125 3258766 3317331 3447149 3531287 3827024 3980086 4238388 4510220
5000 4510220 4847153 5101130 5405261 5520863 5795478 6139055 6453475 6957153 7417605 7719529
4990G719529N57337N11117O01193O70024P22142O90046P94231R99762J133920
4981A4399301J223489J228147J296486J524427J700512J721249K060599J914641
4973B7068851K106695J894303J896983J644309J481033J153029O99723R5480J8948
4964C8059354l4909j61852j94678l1889j8917O8220K72678L96726N46801P22258
4954C9623792P89264J096626J282590J407688J699921K054191K248325K700808
4946E2903205L061651L395345L740581M026921M220770M292033M250579M093865
4938H3984950L480871K659463K009918J009794K09073l63425n98528o27057o24462
4929I1140597l30595m1555J51689L35261O02381O12630P47484J008796R55160
$$ plain form
4990 7719529 8276866 8787983 9389176 10059200 10781342 11471388 12265619 13265381 14399301
4981 14399301 15622790 16850937 18147423 19671850 21372362 23093611 25154210 27068851
4973 27068851 29175546 31069849 32966832 34611141 36092174 37245203 37944926 38040406 38059354
4964 38059354 38024445 37862593 37667915 37636026 37617109 37685329 37958007 38354733 38901534 39623792
4954 39623792 40413056 41509682 42792272 44199960 45899881 47954072 50202397 52903205
4946 52903205 55964856 59360201 63100782 67127703 71348473 75640506 79891085 83984950
4938 83984950 87465821 90125284 92135202 93144996 93354069 92990644 92392116 91765059 91140597
4929 91140597 90810002 90768447 90920136 91255397 91857778 92470408 93217892 94226688 95181848
4920I5181848R43860Q48629Q92329J173677J058695J100442J182593J333456J626099
4911A05341628J664259J711817J666986J416667J014875K17557m67831j345268
4903A11220690k254066k880743l374264l472139l469206l257442k822876k324095
4895H7365859j844712j452378j084070p82480p83185r77347j266503j763039k276409
4886G5135736k567033k920599l017818k984684k767492k563553k252790j967888
4878E4093879j667642j499838j136918j093762r11272q26301o74898m24984m65619
4869D5392645n23590p00896p88895q68927p33922r43604r64204r89551j019658
4860C7859398q13336o26497m86086o04534n09290l66589l90427n02915n51927
$$ plain form
4920 95181848 96125708 96974337 97866666 99040343 100099038 101199480 102382073 103715529 105341628
4911 105341628 107005887 108717704 110384690 111801357 112816232 113033789 112565958 111220690
4903 111220690 108966624 106085881 102711617 99239478 95770272 92512830 89689954 87365859
4895 87365859 85521147 84068769 82984699 82202219 81419034 80441687 79175184 77412145 75135736
4886 75135736 72568703 69648104 66630286 63645602 60878110 58314557 56061767 54093879
4878 54093879 52426237 50926399 49789481 48695719 47784447 46958146 46283248 45858264 45392645
4869 45392645 44869055 44168159 43379264 42510337 41776415 40832811 39868607 38879056 37859398
4860 37859398 37046062 36419565 35933479 35328945 34819655 34453066 34062639 33559724 33007797
4851C3007797m39592n52214p20261p56850p00693o30248n59695p02930o76179
4842B7269135m89064n08828o74019n59072n40948o62247o49567n89837p20701
4833B1874852o49544l66381n79054m64692o00883n94094l30803l58294m55430
4824A7475677m55744l53016l36671m64449l08225l54319m99904l27558k41057
4815A4134734k99240m71572l38795l06909k10370j49004j72972j81715j31559
4806A1872598J9061k26713k41001r6905j88516k3706r1764j29661k5116l5222
4796A0833055p6499j23227j12746j24651l212j47295j06140P1448m304M3077j68483
4785A0081023J7898R0451J9646M7680j31848L5811r7467p7149J09989L8721k7719
$$ plain form
4851 33007797 32568205 32015991 31295730 30538880 29838187 29207939 28648244 27945314 27269135
4842 27269135 26780071 26271243 25597224 25038152 24497204 23834957 23185390 22595553 21874852
4833 21874852 21225308 20858927 20279873 19815181 19214298 18620204 18289401 17931107 17475677
4824 17475677 17019933 16666917 16330246 15865797 15557572 15203253 14703349 14375791 14134734
4815 14134734 13835494 13363922 13025127 12718218 12507848 12358844 12185872 12004157 11872598
4806 11872598 11891659 11664946 11423945 11327040 11138524 11114818 11023054 10893393 10868277 10833055
4796 10833055 10756556 10633329 10520583 10395932 10392720 10245425 10139285 10210733 10206429 10249506 10081023
4785 10081023 10098921 10189372 10209018 10256698 10124850 10160661 10063194 9986045 10096034 10134755 10107036
4774A0107036k579k5236L0278R1997m0539K7425N1508n8755n869K7108o4210m3707
4762A0094457J47694J7963j35094j45948j0763p5949L7519J38855j23649j88130
4752I756955j5027J2273n0L4797k6779p4633J10420o1257m3415O8588n6269P8003
4740I783606P960K6775n5200m0761o9795j55767q0500j29173k6459j17800J871
4729I144757k1223p7902p1783j0761m0092j41790j01716o3158k1216j17084N8036
4718H536068Q8766o7244j08337J9730J3143k8009j45419k2264j03351r6439O5978
4707H152622M5754j1765p301m2389J91479N1086q899L3081j79957K0786M1423
4696H285920L700K8492j1865R8833J27948j6609L7235J57536J37763J4012K06296
$$ plain form
4774 10107036 10104457 10079221 10109499 10201496 10160957 10188382 10239890 10181135 10175266 10202374 10138164 10094457
4762 10094457 10242151 10260114 10125020 9979072 9968309 9892360 9929879 10068734 9945085 9756955
4752 9756955 9741928 9754201 9754151 9788948 9762169 9687536 9797956 9736699 9693284 9761872 9705603 9783606
4740 9783606 9791566 9818341 9763141 9722380 9652585 9496818 9416318 9287145 9260686 9142886 9144757
4729 9144757 9123534 9045632 8973849 8963088 8922996 8781206 8679490 8616332 8595116 8478032 8536068
4718 8536068 8624834 8557590 8449253 8468983 8482126 8454117 8308698 8286434 8183083 8086644 8152622
4707 8152622 8198376 8186611 8179310 8136921 8328400 8379486 8370587 8403668 8223711 8244497 8285920
4696 8285920 8289620 8318112 8306247 8405080 8533028 8516419 8553654 8711190 8848953 8862965 9069261
4685I069261J72438J20699K27857K73969J99218J54397K48297L73404L71958K42664
4675A1454162L75472L90051M38624K65208M47062O28671N38214M51352O33687
4666A5622503O94815Q60651Q15634Q13453R85949R27860J202474J348447J509034
4657B4780820J606356J791643K140184K247333K777448L087612L373073L970829
4649D5775298M367531M772276N728490O715107P872256R078293J0398480J1164255
4641A05871986J1195711J1409081J1127200R796321P171875L513139n22896l997406
4633A55565011n899746o776920p522777p721144p284111o600923o093725n465249
4625A02200416m932979m845792m381935m135432l913113l555071l745430l889699
$$ plain form
4685 9069261 9241699 9362398 9590255 9864224 10063442 10217839 10466136 10839540 11211498 11454162
4675 11454162 11829634 12219685 12658309 12923517 13370579 13999250 14537464 14988816 15622503
4666 15622503 16317318 17177969 17993603 18807056 19793005 20720865 21923339 23271786 24780820
4657 24780820 26387176 28178819 30319003 32566336 35343784 38431396 41804469 45775298
4649 45775298 50142829 54915105 60643595 67358702 75230958 84309251 94707731 105871986
4641 105871986 117067697 128476778 139603978 149400299 156572174 160085313 159562417 155565011
4633 155565011 149665265 142888345 135365568 127644424 120360313 113759390 107665665 102200416
4625 102200416 97267437 92421645 88039710 83904278 79991165 76436094 72690664 68800965
4617F8800965l819981l700331l532006l275650l101070k739153k612449k391452
4609D3628873k255573k036117k074914j724436j599435j399985j413346j161747
4601B9963320j043757j178602j101487r28933q56717q79142q40118o91703o19068
4592B1823793p45338n10039n72696n30034l71856l95591l59757m90460m22483
4583A7425539l79069l29763k91143l58162k94810l25239k61856l26455l65436
4574A4493606l38490k00523l48834k75734j71960j82793k79268k43253j58543
4565A2294208k13538k11133j00322k4875k94437j29654P4635j84262m5557j5422
4555A1149643j36619j22804M061R2163j30953n601l8466j46956J1608K03761N4174
$$ plain form
4617 68800965 64980984 61280653 57748647 54472997 51371927 48632774 46020325 43628873
4609 43628873 41373300 39337183 37262269 35537833 33938398 32538413 31125067 29963320
4601 29963320 28919563 27740961 26639474 25710541 24853824 23974682 23134564 22442861 21823793
4592 21823793 21078455 20568416 19995720 19465686 19093830 18698239 18338482 17848022 17425539
4583 17425539 17046470 16716707 16425564 16067402 15772592 15447353 15185497 14859042 14493606
4574 14493606 14155116 13954593 13605759 13330025 13158065 12975272 12696004 12452751 12294208
4565 12294208 12080670 11869537 11769215 11744340 11449903 11320249 11394884 11210622 11165065 11149643
4555 11149643 11013024 10890220 10894281 10986444 10855491 10849890 10811424 10664468 10676076 10879837 10934011
4544A0934011J49533J62343M15974L54163J60630K57688J81549K38208K96892
4535A3150991N7503j01489r6190p8076m2857k22798n9088j33082j70538p3066
4525A2231310M3187q6491J12438n0303j7555J32206L67Q4211J5152J00420J93273
4514A2758215J78336J03940j9139k1862L6567q3125k70662j07230j84818k75878
4504A2114344r2408j89924k94980j54013k34805l25192j33588j20626k08214j17057
4494A0243537j2714L5650j37426N0989P0014l1323J5665M722J5495J48531q3692
4483A0319448j66604K627j47411j54935p1859j39902l08757j13526k53261j67066
4473H798754j01628l46395j04356j48477j72981j96216j77564n5221j48324k5843
$$ plain form
4544 10934011 11083544 11245887 11661861 12016024 12176654 12434342 12615891 12854099 13150991
4535 13150991 13208494 13107005 13010815 12932739 12889882 12667084 12607996 12474914 12304376 12231310
4525 12231310 12274497 12188006 12300444 12250141 12232586 12364792 12365159 12449370 12464522 12564942 12758215
4514 12758215 12936551 13040491 13021352 12999490 13036057 12952932 12682270 12575040 12390222 12114344
4504 12114344 12021936 11832012 11537032 11383019 11148214 10823022 10689434 10568808 10360594 10243537
4494 10243537 10230823 10266473 10129047 10180036 10250050 10218727 10234392 10239114 10254609 10403140 10319448
4483 10319448 10152844 10155471 10008060 9853125 9781266 9641364 9332607 9219081 8965820 8798754
4473 8798754 8697126 8350731 8246375 8097898 7924917 7728701 7551137 7495916 7347592 7321749
4463G321749k10582j87618j3169j16129L0887j51986j99764k4074q3768j0042
4453F355504j34401k41753o7201j30353j45125Q8651j06391q0195p3397j58394
4443E306945p7191r780m3615j2755K9709J1144o1059J1210j99505q7924k7769
4432D839410K5855Q1076j6632r1146j78208O5719j01758J06769j1922o3877O540
4421D661826o0178j7595p1836L505k1409j40872k8915J54369O2416j5476r5892
4410D429943K496l8844p5545r1387L3698N0718o7317K7656J4689k42850m4046
4399C999211L0930j77861L0403l4956p6302o0935l1034j2266j01632k4783L5349
4388C576124Q5625M1699j44035J0634p1086K7992P4541j7528N651m7652j5940
$$ plain form
4463 7321749 7111167 6923549 6910380 6794251 6825138 6673152 6473388 6449314 6365546 6355504
4453 6355504 6221103 5979350 5912149 5781796 5636671 5725322 5618931 5538736 5465339 5306945
4443 5306945 5229754 5219974 5176359 5163604 5193313 5204457 5143398 5154608 4955103 4867179 4839410
4432 4839410 4865265 4946341 4929709 4838563 4660355 4726074 4624316 4731085 4719163 4655286 4661826
4421 4661826 4601648 4584053 4512217 4515722 4494313 4353441 4324526 4478895 4541311 4525835 4429943
4410 4429943 4432439 4393595 4318050 4226663 4260361 4311079 4243762 4271418 4286107 4043257 3999211
4399 3999211 4030141 3852280 3882683 3847727 3771425 3710490 3679456 3667190 3565558 3540775 3576124
4388 3576124 3661749 3703448 3559413 3570047 3498961 3526953 3601494 3583966 3589617 3541965 3526025
4377C526025K32348J25559j5213J72833J25465J44244P6272j03361m893J16771
4367D396050R0380J02393J4098q4439k5730j1510L0428r17M3429r5524j32692
4356D325966Q4244O1174r580j96141O0040k3785k83279j89465L7247m9149p0795
4345C746477m3999j0204j90841o6273k862j01972J4611r292r4542O6977r734n5008
4333C243338O2439J2159r4954L2884j14625p9104o1082M438k2036j54409m5135
4322B783913m5946K17075j6308j71622j68380J00838Q727k30469k5769R1642J6484
4311B560185M6669Q6857M0144j90402l8752k3147O8787O789L5954J38345r6243
4300B635186N9470j11318j37444N8865O0475P6231Q5915O5187j33175J00929J51877
$$ plain form
4377 3526025 3758373 3883932 3868719 4041552 4167017 4311261 4387533 4284172 4279279 4396050
4367 4396050 4486430 4588823 4602921 4518482 4492752 4481242 4511670 4510753 4554182 4458658 4325966
4356 4325966 4410210 4471384 4461804 4265663 4325703 4301918 4018639 3829174 3866421 3817272 3746477
4345 3746477 3702478 3692274 3501433 3435160 3432298 3330326 3344937 3335645 3241103 3308080 3298346 3243338
4333 3243338 3305777 3317936 3222982 3255866 3141241 3062137 3001055 3005493 2983457 2829048 2783913
4322 2783913 2737967 2955042 2938734 2767112 2598732 2699570 2708297 2477828 2452059 2543701 2560185
4311 2560185 2606854 2693711 2733855 2543453 2504701 2481554 2550341 2557130 2593084 2731429 2635186
4300 2635186 2694656 2583338 2445894 2504759 2565234 2641465 2727380 2792567 2659392 2760321 2912198
4289B912198k0776K4915P7809q5764r6401J11739j8843j03680l7527M9391M5266
4278B858327K0533n9809M0611J57197K8955p7868o3601J73270p1322O1962P3504
4267C141759k0543J6643O6431J51621q2138l7586k3904J0478J28849N1031r0001
4256C312640O8749P4186k3921o0091K46079O3559j62592J30474Q2238J20004N5044
4245C906369J52431N9325K8118J10278J64791M3817O8234L11808J24586J64082
4235E133839J56760M19620K62123J55909J91437J71284M30764N00268M80659L87658
4225H290321M42688M66601O54085O23926N14361P15457Q78397Q64101J011998
4216A4461935R36921J122401J219075J148907J360340J663229J491077J615510
$$ plain form
4289 2912198 2891422 2916337 2994146 2908382 2811981 2923720 2904877 2801197 2763670 2813061 2858327
4278 2858327 2878860 2819051 2859662 3016859 3045814 2967946 2904345 3077615 3006293 3068255 3141759
4267 3141759 3121216 3137859 3204290 3355911 3273773 3236187 3212283 3222761 3351610 3402641 3312640
4256 3312640 3381389 3455575 3431654 3371563 3617642 3681201 3518609 3649083 3731321 3851325 3906369
4245 3906369 4058800 4118125 4146243 4256521 4421312 4465129 4533363 4845171 4969757 5133839
4235 5133839 5290599 5710219 5972342 6128251 6319688 6490972 6921736 7422004 7902663 8290321
4225 8290321 8733009 9199610 9853695 10477621 10991982 11707439 12585836 13449937 14461935
4216 14461935 15398856 16521257 17740332 18889239 20249579 21912808 23403885 25019395
4208B5019395J818784J804936K027541K195724K214889K233368K261124K517486
4200D2093247K705300K718010K623093L000237L114100K936726L140098L102908
4192F5433719L263724L367115L368830L198608L349700L255877L401312L231740
4184I1870625L041404L122003L291692L068490L053754K945577K750395K535804
4176A15679744K439413K275961J944297J627337J541998J438996J052061Q62735
4168A28862542Q44512N84663N16313J68191j29051k47856n66034r80981j083017
4159A27969282j242342j554322j873981j861522k031457k226820k169105k436938
4151A12572795k456396k645370k549614k850932l006314l082183k928650l071677
$$ plain form
4208 25019395 26838179 28643115 30670656 32866380 35081269 37314637 39575761 42093247
4200 42093247 44798547 47516557 50139650 53139887 56253987 59190713 62330811 65433719
4192 65433719 68697443 72064558 75433388 78631996 81981696 85237573 88638885 91870625
4184 91870625 94912029 98034032 101325724 104394214 107447968 110393545 113143940 115679744
4176 115679744 118119157 120395118 122339415 123966752 125508750 126947746 127999807 128862542
4168 128862542 129707054 130291717 130808030 130976221 130847170 130599314 130033280 129052299 127969282
4159 127969282 126726940 125172618 123298637 121437115 119405658 117178838 115009733 112572795
4151 112572795 110116399 107471029 104921415 102070483 99064169 95981986 93053336 89981659
4143H9981659l317340l211312l021796k983540k992132k867052k886387k765079
4135F5937021k809790k608004k705576k542697k450864k281536k364292k391237
4127D5783025k154572j944797j731699j982550j829420j641858j585048j448373
4119C1464708j393666j343074j110531j359521j121827r17816j030586j020078
4111B2167609p09839q08517q11655p28356o14016o82029n13038n60007o45089
4102A6095063l54052l95549m27039l87267m20682l25095l09394k98925k39110
4093A2937950k69541l10344j48009k70182o7244j39909l00226j38553k45201k68321
4083A0780420q7789l4688j26723k32127j8996j52601l54545n8436j18832k04708
$$ plain form
4143 89981659 86664319 83453007 80431211 77447671 74455539 71588487 68702100 65937021
4135 65937021 63127231 60519227 57813651 55270954 52820090 50538554 48174262 45783025
4127 45783025 43628453 41683656 39951957 37969407 36139987 34498129 32913081 31464708
4119 31464708 30071042 28727968 27617437 26257916 25136089 24218273 23187687 22167609
4111 22167609 21457770 20649253 19837598 19109242 18495226 17813197 17300159 16740152 16095063
4102 16095063 15741011 15345462 14918423 14531156 14110474 13785379 13475985 13177060 12937950
4093 12937950 12668409 12358065 12210056 11939874 11872630 11732721 11432495 11293942 11048741 10780420
4083 10780420 10692631 10657943 10531220 10299093 10280097 10127496 9772951 9714515 9595683 9390975
4073I390975k1818j7388k34791j03713r5777k14537k39977P8724j33518j58765
4063H249415j63099p3241r127j74057j8760k58376q1690k0666j31775j2763j22171
4052G183690n5196R0543p5469j24636J0778J4048J36064j07931J02059n2375j3615
4041G107960R6286J03276j16619p6683K526l9575J12136K6296j66294k6391p011
4030G015907k2182k7842O0992R2273j40731O5807r4943J10230K1462o5885P931
4019G023019R138P075p8958j4115J5168j09948L3376R7328M7315j17235J33463
4008G045626J25975p1610j36599O5050O9748o1391n9840r159J62588N4215R1315
3997G275918J25843K8820q7431L1645J046K10065J16484K418R3523j42263j75832
$$ plain form
4073 9390975 9369157 9351769 9116978 9013265 8917488 8702951 8462974 8541698 8408180 8249415
4063 8249415 8086316 8013075 8003948 7829891 7811131 7552755 7471065 7450399 7318624 7305861 7183690
4052 7183690 7128494 7219037 7143568 7018932 7029710 7043758 7179822 7071891 7173950 7121575 7107960
4041 7107960 7204246 7307522 7190903 7114220 7116746 7077171 7189307 7215603 7049309 7022918 7015907
4030 7015907 6993725 6965883 7026875 7119148 6978417 7044224 6949281 7059511 7080973 7015088 7023019
4019 7023019 7032157 7039232 6960274 6946159 6961327 6851379 6884755 6982083 7029398 6912163 7045626
4008 7045626 7171601 7099991 6963392 7028442 7098190 7036799 6976959 6967800 7130388 7184603 7275918
3997 7275918 7401761 7430581 7343150 7374795 7375841 7585906 7702390 7704808 7798331 7656068 7480236
3986G480236M1166q1427m0598m7525J59170Q8573r6736j5108Q0127j38440p9391
3975G350047r8744J274J6895j45520p9491p2950m0752q6950m1589j4582k6232
3964F761406j11332o8385j59523k2740N5149R0648K966q3670l4367j08711o6006
3953F255435O5087P0186r4458N1618J42731P7735J10223J16756L708p437J44632
3942F936216J54819J11601J23609J68068M0828Q4682J36602K8774l1926K02314
3932G955587K32310L4718J81864Q3669p6404J01684J91178Q4475J20298Q6458
3922H995837J29078J90994j3826J13910N4029M0038J86997K5473P8929J74149
3912I975608j4507P5016K2142J79694j0898n1363J01222K09812J19253M5952J23473
$$ plain form
3986 7480236 7521402 7439975 7399377 7351852 7511022 7599595 7502859 7487751 7567878 7429438 7350047
3975 7350047 7251303 7252577 7269472 7123952 7044461 6971511 6930759 6843809 6802220 6787638 6761406
3964 6761406 6650074 6581689 6422166 6399426 6454575 6545223 6548189 6464519 6430152 6321441 6255435
3953 6255435 6320522 6390708 6296250 6347868 6490599 6568334 6678557 6795313 6799021 6791584 6936216
3942 6936216 7091035 7202636 7326245 7494313 7535141 7619823 7756425 7785199 7753273 7955587
3932 7955587 8187897 8222615 8404479 8488148 8411744 8513428 8704606 8789081 8909379 8995837
3922 8995837 9124915 9315909 9302083 9415993 9470022 9510060 9697057 9722530 9801459 9975608
3912 9975608 9961101 10036117 10058259 10237953 10227055 10175692 10276914 10486726 10605979 10651931 10775404
3901A0775404K8268J14741K8540N0818L62284K05675q004J32481J39133Q8833
3891A1918173J46244K31130K01184K55638J72076K52585K83937K82149K52027
3882A3995143K84644M90356L26949N24125N00193N47644N46368O34484P70459
3873A8620365N44261Q39921Q15039R67569J004321J084976R98160R88084J117946
3864B6980642J294725J280891J271761J196169J256015J279160J188031J210764
3856C6958158J301267J364664J278129J275871J112778J053637J035164R41109
3848D6320777Q44536O33085P03460O66672L80520M44475M20398L25135Q9557K15309
3838E1043924J50149N819j48108o1813j14106j09940o9057K5610m6180N487J53061
$$ plain form
3901 10775404 10803672 10918413 10946953 10997771 11360055 11565730 11557726 11690207 11829340 11918173
3891 11918173 12064417 12295547 12496731 12752369 12924445 13177030 13460967 13743116 13995143
3882 13995143 14279787 14770143 15097092 15621217 16121410 16669054 17215422 17849906 18620365
3873 18620365 19164626 20004547 20819586 21787155 22791476 23876452 24874612 25862696 26980642
3864 26980642 28275367 29556258 30828019 32024188 33280203 34559363 35747394 36958158
3856 36958158 38259425 39624089 40902218 42178089 43290867 44344504 45379668 46320777
3848 46320777 47165313 47798398 48501858 49168530 49549050 49993525 50413923 50739058 50828615 51043924
3838 51043924 51194073 51199892 51051784 50989971 50875865 50765925 50696868 50722478 50676298 50681785 50834846
3827E0834846K90347M70268M36170M89827Q64358J172778J427254J666130J742735
3818E9394713K204449K613272K745337L123176L425820L716431L760055M191272
3810H5174525M421291M499517M796620M934004N411405N594366N715703N981716
3802A26529147O230918O205944O383185O360981O508301O502252O247976O225782
3794A77194486O018898N737436N604712N530621N195010M924486M576105M226604
3786B19008358L944855L503108L154643K956563K500875K148643J918920J623676
3778B40759641J721919J573159J428171J179729J361520J188033J405554J519735
3770B52137461J456853J663067K072282K545507K923794L456737M240374N092754
$$ plain form
3827 50834846 51125193 51595461 52031631 52521458 53385816 54558594 55985848 57651978 59394713
3818 59394713 61599162 64212434 66957771 70080947 73506767 77223198 80983253 85174525
3810 85174525 89595816 94095333 98891953 103825957 109237362 114831728 120547431 126529147
3802 126529147 132760065 138966009 145349194 151710175 158218476 164720728 170968704 177194486
3794 177194486 183213384 188950820 194555532 200086153 205281163 210205649 214781754 219008358
3786 219008358 222953213 226456321 229610964 232567527 235068402 237217045 239135965 240759641
3778 240759641 242481560 244054719 245482890 246662619 248024139 249212172 250617726 252137461
3770 252137461 253594314 255257381 257329663 259875170 262798964 266255701 270496075 275588829
3762B75588829N911153O833924Q083841R033464R789516J0371118J0449855J0105930
3754C46167630R552867Q628487P296307N730440M062352K819390J962441J227677
3746C87447591Q13356N13151L35822L02272K12457j24187q20530j607874k676935
3737C84395123l679788m576967n346986n418032n476470n141900m561576m121988
3729C46071416l400527k879178k384835k559538k547424k649328l166823l484005
3721C22999758l717068l737061l668213l647391l642228l519787l424542l600719
3713B94042749m034592m582142n455549o238453p041670p963704q812793r392926
3705B40520920r517520r569205r366752q966893q650690q291894p892621p336437
$$ plain form
3762 275588829 281499982 288333906 296417747 305451211 315240727 325611845 336061700 346167630
3754 346167630 355720497 364348984 371645291 377375731 381438083 384257473 386219914 387447591
3746 387447591 388260947 388774098 389109920 389412192 389624649 389500462 388679932 387072058 384395123
3737 384395123 380715335 376138368 370791382 365373350 359896880 354754980 350193404 346071416
3729 346071416 342670889 339791711 337406876 334847338 332299914 329650586 326483763 322999758
3721 322999758 319282690 315545629 311877416 308230025 304587797 301068010 297643468 294042749
3713 294042749 290008157 285426015 279970466 273732013 266690343 258726639 249913846 240520920
3705 240520920 231003400 221434195 212067443 203100550 194449860 186157966 178265345 170928908
3697A70928908o592130o327210n871720n467557n155389m863486m672021m286920
3689A27692475l961648l989543l613475l619162l306718l213067k900914k952358
3681A00135590k698289k531245k469635k306112k284377k185502k183623k233545
3673H1243262k044371j885769j956508j841956j727208j590979j676008j672612
3665F6847851j627685j403653j351905j436656j364877j416677j138512j121846
3657E5986040j129921j133686j236806r10480j035523j090711q21158q04401j032503
3648D6790851r15001o87851p53090o99622o03042q18917n22844n15528n47868
3639D0727088q26309p28645m97164n59368m94639n06975o01875n22621l21543
$$ plain form
3697 170928908 164336778 158009568 152137848 146670291 141514902 136651416 131979395 127692475
3689 127692475 123730827 119741284 116127809 112508647 109201929 105988862 103087948 100135590
3681 100135590 97437301 94906056 92436421 90130309 87845932 85660430 83476807 81243262
3673 81243262 79198891 77313122 75356614 73514658 71787450 70196471 68520463 66847851
3665 66847851 65220166 63816513 62464608 61027952 59663075 58246398 57107886 55986040
3657 55986040 54856119 53722433 52485627 51575147 50539624 49448913 48627755 47823354 46790851
3648 46790851 45875850 45187999 44434909 43735287 43132245 42313328 41790484 41274956 40727088
3639 40727088 39900779 39172134 38674970 38115602 37620963 37113988 36512113 35989492 35667949
3630C5667949m86213o10756l89735l90776n72485l34010k45569k90053l18331
3621C2030021m82275m86747l47357k69051k33323l94652l52219j47475k59732
3612B9057190m06447l98557k63917k03031k52757k74407j70210l40454k12794
3603B6534616l05059k01734j17950j57049j41616l28986k24935k18953j74877
3594B4663457j78506l78767j05127k28594j60461q3057k62374j26808k95325k79993
3584B2564445r4910j79607k48539j24503q0613k24892j76027o2083N290j28226
3574B1250335k02262j19132j01203k98644l1746p4660L0112j18549j81341k0093
3564B0132817j35382j01737j30591k13512k10278o5604j58924j21125k23475l9474
$$ plain form
3630 35667949 35181736 34570980 34181245 33790469 33217984 32883974 32638405 32348352 32030021
3621 32030021 31547746 31060999 30713642 30444591 30211268 29816616 29464397 29316922 29057190
3612 29057190 28650743 28252186 27988269 27785238 27532481 27258074 27087864 26747410 26534616
3603 26534616 26229557 26027823 25909873 25752824 25611208 25282222 25057287 24838334 24663457
3594 24663457 24484951 24106184 24001057 23772463 23612002 23528945 23266571 23139763 22844438 22564445
3584 22564445 22469535 22289928 22041389 21916886 21836273 21611381 21435354 21373271 21378561 21250335
3574 21250335 21048073 20928941 20827738 20529094 20497348 20422688 20452800 20334251 20152910 20132817
3564 20132817 19997435 19895698 19765107 19551595 19341317 19275713 19116789 18995664 18772189 18732715
3554A8732715n8000m010j92304j39090j51227k29073J65837m6262q3047j98230
3544A7797309o4792j55645j53985p5768r3790j41934k42773k1057j19047j05302
3534A6623216N2411n9537r0897o7933l6614j40678j3034Q8172j71645k7076R8
3523A6156483l4262j98493l2112M949n9302l817K0055L2331p0851o7227L4186
3512A5781940m0045N869Q9551P6153j39003O1435j7581l0830J93180j11678m8670
3501A5820321M4367p0244J52513P7323M6809J8570P3926o5978M9146K36924J10891
3490A6494568j4635P1274M005J49578J10559J4232J02794K64617K37986J03631
3480A7538609L15214M98739J71963J61425L03067L48347M69577N13938N10443
$$ plain form
3554 18732715 18674715 18670705 18478401 18339311 18188084 17959011 18124848 18078586 17995539 17797309
3544 17797309 17732517 17576872 17422887 17347119 17253329 17111395 16868622 16847565 16728518 16623216
3534 16623216 16675627 16616090 16525193 16457260 16420646 16279968 16266934 16355106 16183461 16156385 16156483
3523 16156483 16122221 15923728 15891616 15896565 15837263 15833446 15853501 15885832 15814981 15747754 15781940
3512 15781940 15741895 15747764 15837315 15913468 15774465 15835900 15818319 15787489 15980669 15868991 15820321
3501 15820321 15864688 15794444 15946957 16024280 16071089 16089659 16163585 16097607 16146753 16383677 16494568
3490 16494568 16479933 16551207 16555212 16704790 16815349 16829581 16932375 17196992 17434978 17538609
3480 17538609 17853823 18352562 18524525 18685950 18989017 19337364 19806941 20320879 20831322
3471B0831322N41661M41249N91543O28312O00760N56993M14594M85800M22997
3462B5515231M64668K95814J68246K24994K59624J70146k5781P1517K33212J03194
3452B7480865J17057J17577K06543J96557K4301K0522n0708k20193m458J12378
3442B8000441j7745n8798J7331J29402M0989n4333R115m9268K36132K9236K69295
3431B8551797L69836N16791O25124Q29062J166488J129561J425939J672623K138400
3422C8425621K552862K753291K756917L237282L554551L852626N158431N057958
3414F7349539M337403M636611N961476N364159L588982O43388m086173n515928
3406H2279457m091791k851470k020473k410660l270896l200327k608805k219161
$$ plain form
3471 20831322 21372983 21814232 22405775 23034087 23634847 24191840 24606434 25092234 25515231
3462 25515231 25979899 26275713 26443959 26668953 26928577 27098723 27072942 27144459 27377671 27480865
3452 27480865 27597922 27715499 27922042 28118599 28142900 28163422 28112714 27892521 27888063 28000441
3442 28000441 27982696 27923898 27941229 28070631 28111620 28057287 28066402 28017134 28253266 28282502 28551797
3431 28551797 28921633 29438424 30063548 30892610 32059098 33188659 34614598 36287221 38425621
3422 38425621 40978483 43731774 46488691 49725973 53280524 57133150 62291581 67349539
3414 67349539 71686942 76323553 82285029 87649188 91238170 91881558 87795385 82279457
3406 82279457 78187666 75336196 73315723 70905063 67634167 64433840 61825035 59605874
3398E9605874j816011j583921r99202q28202J4393O24671R62339J352451J735815
3389E9068207K807793M242070M302533L782636M150456M962408L980821K133050
3381H9429974j089598n437989n762469m222786k888538k612982l280830l777803
3373F0356979l779254l704938l216235l006656k745395k648309k371013k151824
3365C6733355j930281j743901j400018j299498j174624j209801j266436q74165
3357B5834631q06908j023984r45858o42742o07876q17828o09893n76013n22046
3348A9281483l60205l99053l62089k65801l73989k65875l63414j60971k70998
3339A6459088k54045k48747k02913j86152k96865k93275j21800r8717k83520k88653
$$ plain form
3398 59605874 57789863 56205942 55206740 54378538 54392931 55017602 55979941 57332392 59068207
3389 59068207 61876000 66118070 70420603 74203239 78353695 83316103 87296924 89429974
3381 89429974 88340376 82902387 77139918 72917132 70028594 67415612 64134782 60356979
3373 60356979 56577725 52872787 49656552 46649896 43904501 41256192 38885179 36733355
3365 36733355 34803074 33059173 31659155 30359657 29185033 27975232 26708796 25834631
3357 25834631 25027723 24003739 23057881 22415139 21807263 20989435 20379542 19803529 19281483
3348 19281483 18921278 18522225 18160136 17894335 17520346 17254471 16891057 16730086 16459088
3339 16459088 16205043 15956296 15753383 15567231 15270366 14977091 14855291 14756574 14473054 14184401
3329A4184401j75989p7479j77488j2732j09854j03586Q648j94018j07975j28121
3319A3105807j42485q3713M7260O9930j96640M0074O8263M8287L6144Q0911P9373
3308A3153211J84213O7741O6756K90012J88029J77038M29615M80982N33000M38808
3298A6009405Q41439Q83657J102149J430006J347787J528943J547787J489742
3290B6180915J251001O33019k07099q34376j240228j235412j202172j066776r56569
3281B1322303q68614n59161m06876l23473n23320k75280k34958j13898J00191
3272A8116914J28373L48018N52422O84011J052244J053008J046060J273673J311644
3263B5566367R97683Q14715L42609o03241j278302j279490j403383j295625j094552
$$ plain form
3329 14184401 14008412 13930933 13753445 13740713 13630859 13527273 13535921 13341903 13233928 13105807
3319 13105807 12963322 12879609 12926869 12996799 12800159 12840233 12908496 12956783 12992927 13073838 13153211
3308 13153211 13337424 13405165 13471921 13761933 13949962 14127000 14556615 15037597 15570597 16009405
3298 16009405 16850844 17734501 18836650 20266656 21614443 23143386 24691173 26180915
3290 26180915 27431916 28064935 27857836 27023460 25783232 24547820 23345648 22278872 21322303
3281 21322303 20453689 19894528 19487652 19164179 18640859 18365579 18130621 18016723 18116914
3272 18116914 18245287 18593305 19145727 19829738 20881982 21934990 22981050 24254723 25566367
3263 25566367 26564050 27378765 27721374 27118133 25839831 24560341 23156958 21861333 20766781
3254B0766781j036084r82152q79436o38875o68662p67042n11722n45317n53774
3245A4183717m08769l29886l34824k85416k10017k15808m34321j85459j58205
3236A1621012k89288K8335p3365j90882j97653j08671j51629m4533j45644j24476
3226A0323206k10947j67223j85324J7295j35905r314j24100j97301k4559n6484
3216I229344r3780n9805J20038r2173l3730J19890o7181n5650j82062l6549m2246
3205H806096q178j7584O1813J19604k31403j72341l4423j01662P8861l0477J7167
3194H487473l022m0625k04306j67559r4277k04K2597O3688p9223r7186j29707
3183G757649O1405n3827j34557j07498k7238j17908j14334J21349J3717K6485
$$ plain form
3254 20766781 19730697 18748545 17869109 17230234 16561572 15794530 15282808 14737491 14183717
3245 14183717 13774948 13445062 13110238 12824822 12614805 12398997 11964676 11779217 11621012
3236 11621012 11331724 11360059 11286694 11095812 10898159 10789488 10637859 10593326 10447682 10323206
3226 10323206 10112259 9945036 9759712 9777007 9641102 9631788 9507688 9310387 9285828 9229344
3216 9229344 9135564 9075759 9195797 9103624 9069894 9189784 9122603 9066953 8884891 8848342 8806096
3205 8806096 8797918 8780334 8842147 8961751 8730348 8558007 8523584 8421922 8500783 8470306 8487473
3194 8487473 8484451 8443826 8239520 8071961 7977684 7977480 8000077 8063765 7984542 7887356 7757649
3183 7757649 7819054 7765227 7630670 7523172 7495934 7378026 7263692 7385041 7398758 7425243
3173G425243J04113r9298j45113k7706j3958J74364k5756J5816j34566J33956
3163G407095J38827J0720J1588j18389r7336K6739J20832J9313n2073J16409P4938
3152G658663j4796J1988N2890l0877P9075q2690K3276O6679J7072n7010J30200
3141G854470r8403q9088N243Q9016m154R5287P4269K73508Q6297p6472L5350J05670
3129H350993J48395K08360R4627J21462J78457O7536O7981J23810J40954L7468
3119I540043M1074j18182J59611L1497j48089j69163k17999j2514J7426K1042
3109I144746l5074j23862J1102p5976P4019N2226O1850l1867N6870K03397O6249
3098I403680N2736K25097k7939r6559J12103J09979l9276R61j04873J06061l0586
$$ plain form
3173 7425243 7529356 7430058 7284945 7257239 7243281 7417645 7391889 7407705 7273139 7407095
3163 7407095 7545922 7556642 7568230 7449841 7352505 7379244 7500076 7519389 7467316 7583725 7658663
3152 7658663 7643867 7655855 7708745 7677868 7756943 7674253 7697529 7764208 7781280 7724270 7854470
3141 7854470 7756067 7666979 7672222 7761238 7757084 7852371 7926640 8200148 8286445 8209973 8245323 8350993
3129 8350993 8499388 8707748 8802375 8923837 9102294 9169830 9237811 9361621 9502575 9540043
3119 9540043 9581117 9462935 9622546 9654043 9505954 9336791 9118792 9106278 9123704 9144746
3109 9144746 9109672 8985810 8996912 8920936 8994955 9047181 9109031 9077164 9134034 9337431 9403680
3098 9403680 9456416 9681513 9653574 9557015 9669118 9779097 9739821 9740782 9635909 9741970 9711384
3087I711384j57106o4486k32009k20872j99844J73R809j19792j68834j35743R350
3076H432030o3234r0693M1563j0371j26392k0525O8365j06174r9537p8704m378
3065G941950q7056j81077j01504l0193R1579k28455j80221j40207j20173o1882
3055F902761k04268p1294P7965q0074j29765j2764j10809p9249o446j84955j21629
3044E979473k4213k9414k7932m4618r1894L9182m0194j43183N7264j52279k1213
3033E500979p980l1388j00424m1771j82029m6044M0045O5230q673L547q500j11814
3021E071178J30878R348j79306o9593L8285q4212m0047N3057N3768j4119K600
3010D971837r6547j07228O4485L3577p018L7526o0343j60210M4148J22000K1668
$$ plain form
3087 9711384 9554278 9489792 9257783 9036911 8837067 8837240 8847049 8727257 8558423 8422680 8432030
3076 8432030 8368796 8278103 8319666 8309295 8182903 8162378 8230743 8124569 8025032 7946328 7941950
3065 7941950 7854894 7673817 7572313 7542120 7633699 7405244 7225023 7084816 6964643 6902761
3055 6902761 6698493 6627199 6705164 6625090 6495325 6482561 6371752 6292503 6286057 6101102 5979473
3044 5979473 5955260 5925846 5897914 5853296 5761402 5800584 5760390 5617207 5674471 5522192 5500979
3033 5500979 5492999 5461611 5361187 5319416 5137387 5091343 5131388 5196618 5187945 5191492 5182992 5071178
3021 5071178 5202056 5211404 5032098 4962505 5000790 4916578 4876531 4929588 4983356 4969237 4971837
3010 4971837 4875290 4768062 4832547 4866124 4859106 4896632 4836289 4676079 4720227 4842227 4863895
2999D863895P8667j00586j69514n4977l7956q3646K8916K2224j04123r2861j5
2988D350024m0272Q8885k0462q2753L6431l3230j8819J16930J10042r7881P030
2977D415925m3464j64336j1606n964M4353P8747O7373k02404j83669L0639L3020
2966D058614O2272l6698j44416J67110J2282m1552j27626j50623Q8834K0065R8190
2955D006452L5842r9990N9917N5995j625j39118k8622O4140J0777N5520j33394
2944C885894k6314l7447l6690l0075M00m9534O8830j64686O1659J11772m1137
2933C742672M7127k40280R2621P6665o6514n2553j3757L4089j0064j26315q228
2922C475463L366j2105P4417r0746M3504o353N6447J11228q2879j5205K274L9460
$$ plain form
2999 4863895 4942562 4841976 4672462 4617485 4579529 4495883 4524799 4547023 4442900 4350039 4350024
2988 4350024 4309752 4398637 4378175 4295422 4331853 4298623 4279804 4396734 4506776 4408895 4415925
2977 4415925 4372461 4208125 4196519 4190555 4234908 4313655 4381028 4178624 3994955 4025594 4058614
2966 4058614 4120886 4084188 3939772 4106882 4119164 4077612 3949986 3799363 3888197 3908262 4006452
2955 4006452 4042294 3942304 4002221 4058216 4056591 3917473 3888851 3952991 3963768 4019288 3885894
2944 3885894 3859580 3822133 3785443 3755368 3755768 3706234 3775064 3610378 3672037 3783809 3742672
2933 3742672 3789799 3549519 3642140 3718805 3652291 3599738 3585981 3620070 3610006 3483691 3475463
2922 3475463 3478829 3466724 3541141 3450395 3493899 3487546 3543993 3655221 3572342 3557137 3559411 3598871
2910C598871J0095p9136m4294K5902k6944n8690Q0885j3639J66373o3145j15113
2899C481165j8958r720k9116q4788l1829M9007P7761q2502J8366Q8616l6242q1867
2887C339893r9032P8060L9141j0058K2526M5507j9011j27987N2871K0299j61336
2876C180873m3432J28442Q5803j0463n2613p5495R3747o0168n95L8626N4308o2970
2864C276063l0213j14765Q7001J32595m20P1268j14477k6166Q419J36062k10994
2853C214373j0262L0735j40737N552n987K6849j9205o825P2941P1947q3649L0690
2841C186422n0353m5081j1029m6203O4448K8427l6857n2722R6656k37851j02040
2830B793817J7121Q8730J31907j63239M8472R3263R6476N497j27310J05967m7436
$$ plain form
2910 3598871 3608966 3529830 3485536 3511438 3484494 3425804 3506689 3493050 3659423 3596278 3481165
2899 3481165 3462207 3452487 3423371 3338583 3306754 3355761 3433522 3351020 3369386 3458002 3421760 3339893
2887 3339893 3240861 3318921 3358062 3348004 3370530 3416037 3397026 3269039 3321910 3342209 3180873
2876 3180873 3137441 3265883 3351686 3341223 3288610 3213115 3306862 3246694 3246099 3284725 3339033 3276063
2864 3276063 3245850 3131085 3218086 3350681 3350261 3421529 3307052 3280886 3289305 3425367 3214373
2853 3214373 3204111 3234846 3094109 3099661 3093674 3120523 3101318 3094493 3167434 3239381 3155732 3186422
2841 3186422 3136069 3090988 3079959 3033756 3098204 3126631 3089774 3037052 3133708 2895857 2793817
2830 2793817 2810938 2899668 3031575 2868336 2916808 3010071 3106547 3112044 2984734 3090701 3043265
2819C043265k460Q309K6432K343o5481m8037n9749K1779N688L8883J7223n5962
2807B932233m458j48321o0866J20343M4560Q6373k135m2148J9303n0637j0789
2796B883458J12543l1592k52073J07023J10599L2879j16284q3213R2147o4661
2786B790826L3201J5918m1079k0040n4837O0840J00255q0244J8238k892j41477
2775B678709m8914P5289j11613M6310R0585l0754J0594J01797J8377j09394M9595
2764B770581l8705P5791o8307J1900J01713r6585r7327m8351J06938N2878p8938
2753B691588q9360q159m4872L1422J00749r9008K2732j0152Q3216R0117k08467
2742B559806j21813R0093J50341J74275j07061p641n5623j89650N6488l2286O4314
$$ plain form
2819 3043265 3040805 3049114 3075546 3077889 3012408 2964371 2904622 2926401 2932089 2970972 2988195 2932233
2807 2932233 2927775 2779454 2718588 2838931 2883491 2969864 2967729 2925581 2944884 2894247 2883458
2796 2883458 2996001 2964409 2712336 2819359 2929958 2962837 2846553 2763340 2855487 2790826
2786 2790826 2824027 2839945 2798866 2778826 2723989 2784829 2885084 2804840 2823078 2820186 2678709
2775 2678709 2629795 2705084 2593471 2639781 2730366 2699612 2710206 2812003 2830380 2720986 2770581
2764 2770581 2731876 2807667 2739360 2751260 2852973 2756388 2659061 2610710 2717648 2770526 2691588
2753 2691588 2602228 2594069 2549197 2580619 2681368 2582360 2605092 2594940 2678156 2768273 2559806
2742 2559806 2437993 2528086 2678427 2852702 2745641 2738000 2682377 2492727 2549215 2516929 2581243
2731B581243l4120q4725Q5487j00898q9138J56638P6168j16136o9264J94120K1045
2720B620420j27125R78o0840k6417L2662n55O8278n6479M5980j5298l4900J02272
2708B548976P7802L4869m1335P1408j6065n0125P0785j18263j84478j7499l7933
2697B338142M9431J0660J7954J23860m0650L715j75757N5298J36981L7160p0583
2686B486211o3878Q7772j1997j17389K6612L9571J3120n2404p5572M5034Q0136
2675B457216o9144j64361K2062J04610P7764K5757m2145j11664J12417O0503k06799
2664B266216k193P7204J1681k054p8815N3454R9635j24872M2522m0374R5288J53522
2652B551214j13373k5265l2922O1896j00430M983l3282Q7155K9049q3658p1062
$$ plain form
2731 2581243 2547123 2462398 2547885 2446987 2357849 2514487 2590655 2474519 2405255 2599375 2620420
2720 2620420 2493295 2494273 2433433 2407016 2439678 2439123 2507401 2450922 2496902 2481604 2446704 2548976
2708 2548976 2626778 2661647 2620312 2691720 2675655 2625530 2696315 2578052 2393574 2376075 2338142
2697 2338142 2387573 2398233 2416187 2540047 2499397 2503112 2327355 2382653 2519634 2556794 2486211
2686 2486211 2422333 2510105 2498108 2380719 2407331 2446902 2460022 2407618 2332046 2377080 2457216
2675 2457216 2388072 2223711 2245773 2350383 2428147 2453904 2411759 2300095 2412512 2473015 2266216
2664 2266216 2264023 2341227 2352908 2350854 2272039 2325493 2425128 2300256 2342778 2302404 2397692 2551214
2652 2551214 2437841 2412576 2379654 2441550 2341120 2346103 2312821 2399976 2429025 2345367 2274305
2641B274305m7412K4332K5438k5601m2996N2974N2245J0910j37152J9071K3490
2630B229604J53541l3505q2310Q2649j44725r5079J15562r5199O0830n9297j2300
2619B119771O0447Q9165o7265j6957J88276j09138l3254l4631r9859L713J58162
2608B258430j9281r7042P2569N8850p5720k1689m5413P9096n7342L9067O0479
2597B252004k4097M5590j0825j55945j7460O4380J51834Q6313J58389n0816j04980
2586B394387J7796k5327L7099J699M2743o3577j40501P8542N5127j91192m6928
2575B159868j3057j0652j22647M9617k690m981J0392m3062j5483m0193K2307O7465
2563B056884J09138m4880q6190K9603M8885j39305K9756Q2387l799p8069K3409
$$ plain form
2641 2274305 2226893 2251225 2276663 2251062 2208066 2261040 2313285 2324195 2187043 2206114 2229604
2630 2229604 2383145 2349640 2267330 2349979 2205254 2110175 2225737 2130538 2191368 2132071 2119771
2619 2119771 2180218 2269383 2202118 2185161 2373437 2264299 2231045 2196414 2096555 2100268 2258430
2608 2258430 2239149 2142107 2214676 2273526 2197806 2176117 2130704 2209800 2152458 2191525 2252004
2597 2252004 2227907 2273497 2262672 2106727 2089267 2153647 2305481 2391794 2550183 2499367 2394387
2586 2394387 2412183 2386856 2423955 2425654 2468397 2404820 2264319 2342861 2397988 2206796 2159868
2575 2159868 2146811 2136159 2013512 2063129 2060439 2055458 2065850 2022788 2007305 1967112 1989419 2056884
2563 2056884 2166022 2121142 2034952 2064555 2113440 1974135 2003891 2086278 2082479 2004410 2027819
2552B027819j3215P9684k9425J20M0480m2034o2091j7823k7109p1409M6107k3098
2540A908006l8163J31867K4003j78098q7191L8535J42920m3969j5565N1803k6658
2529A907490J4266N0877k3168q1891L1166o7434l1793K5258P0450k7173j8749
2518A849299N0908j0279Q244j09244o7035q5961L9381J30876L317m57o6347n872
2506A736830M3452L2305l4488q4680k285J16899J95154j292j62763r5454J5167
2495A758845K9056M4924R1207l4152r7029J14799K4051K0074j07998M692m6046
2484A802423m9646M8636J1k5199Q367m3614J41603J0161L44q1631m860L8546N6516
2471A901657j13499k466J02631n2594k2294p2744m0380r479N3720j27061r629
$$ plain form
2552 2027819 2014604 2094288 2064863 2064983 2105463 2063429 2001338 1983515 1956406 1884997 1931104 1908006
2540 1908006 1869843 2001710 2025713 1847615 1760424 1798959 1941879 1897910 1882345 1934148 1907490
2529 1907490 1921756 1972633 1949465 1867574 1898740 1831306 1799513 1824771 1895221 1868048 1849299
2518 1849299 1900207 1889928 1898172 1788928 1721893 1635932 1675313 1806189 1809506 1809049 1742702 1736830
2506 1736830 1780282 1812587 1778099 1693419 1691134 1808033 2003187 2001895 1839132 1743678 1758845
2495 1758845 1787901 1832825 1924032 1889880 1792851 1907650 1931701 1951775 1843777 1848469 1802423
2484 1802423 1752777 1801413 1801424 1776225 1784592 1740978 1882581 1892742 1893086 1811455 1806595 1845141 1901657
2471 1901657 1788158 1785692 1888323 1835729 1813435 1740691 1700311 1690832 1744552 1617491 1607862
2460A607862j0894O1229Q0887K0603n023o5960K7281J3558j14282O234K6819J5339
2448A663653O9279o0826j0200O9598j83365J512J73962k6720r6413j15664M2741
2437A527557N1990p236k437q5044N7296Q5406P7620l3267j37823l4826J8990M9503
2425A567729J17007j2519m8652j0798j39468R2127N7668n8942n6998K1195O3403
2414A591752q7157p380N8505R4571m1774M7088N8318k9538k1489l2957M9937p8744
2402A601132O611L8644m1457K061o674q466P9370p6530p3019Q0768j17860L8764
2390A523344J93609l3423p0602k9205L3910N3661L303L3852J3409J64886j16059
2379A770685m9667Q1882Q012l1782P8003K24q3713J5543n149J43055K0638M4095
$$ plain form
2460 1607862 1596968 1658197 1739084 1759687 1754664 1688704 1715985 1729543 1615261 1621495 1648314 1663653
2448 1663653 1732932 1672106 1661906 1731504 1548139 1549651 1723613 1696893 1600480 1484816 1527557
2437 1527557 1579547 1572311 1569874 1484830 1542126 1627532 1705152 1671885 1534062 1499236 1518226 1567729
2425 1567729 1684736 1672217 1623565 1612767 1473299 1565426 1623094 1564152 1507154 1528349 1591752
2414 1591752 1504595 1497215 1555720 1650291 1608517 1655605 1713923 1684385 1662896 1629939 1679876 1601132
2402 1601132 1607743 1646387 1604930 1606991 1600317 1591851 1671221 1594691 1521672 1602440 1484580 1523344
2390 1523344 1716953 1683530 1612928 1583723 1617633 1671294 1674597 1708449 1721858 1886744 1770685
2379 1770685 1721018 1802900 1810912 1779130 1857133 1857357 1773644 1789187 1784038 1927093 1947731 1991826
2367A991826M7749l2569J83423J04417n3207J15992r0119J64214J31774K8043
2357B591543J75942O7412M1366n444K76016R1523J49094K11717L59988K31405
2347D190562K16475K48559K31427J74930L99063M43884N83837N79279M49606Q05337
2337H322959O36230P35966R11821J073838J048235J230553J211009J605154K092453
2328A8868218K694697L785137M813869M979583M433681M826902M528581L067326
2320E1997994J605349q13377k964218m985686m871912l695148l768905l032993
2312B9471104k529066k054214j652969j631981j601549j402354j125291j007631
2304A6466049j040656j071206r02912p41369r62424q25209p38597p06341n30159
$$ plain form
2367 1991826 2039575 2007006 2190429 2294846 2241639 2357631 2267512 2431726 2563500 2591543
2357 2591543 2767485 2834897 2876263 2870819 3146835 3238358 3387452 3599169 3959157 4190562
2347 4190562 4407037 4655596 4887023 5061953 5461016 5904900 6488737 7068016 7517622 8322959
2337 8322959 8959189 9695155 10606976 11680814 12729049 13959602 15170611 16775765 18868218
2328 18868218 21562915 25348052 30161921 35141504 39575185 44402087 48930668 51997994
2320 51997994 53603343 52789966 49825748 44840062 39968150 36273002 32504097 29471104
2312 29471104 26942038 24887824 23234855 21602874 20001325 18598971 17473680 16466049
2304 16466049 15425393 14354187 13451275 12709906 11747482 10922273 10183676 9477335 8947176
2295H947176m38593l08687l88364m21696l68575j96537k60943j67328k07174j27428
2285F061851j82248k46722j82194j03371q0991k11888j22459o6676j42200j19056
2275D604046m2790q5538n5885r7349p9346l8004j3610j74555j17001o551j05675
2264C787742j25237l0628o8251m6441l0575Q821j99992J2719l3636r2028P0528
2253C253022o214O324M0144k59317r2638J14714j39556N5515L0787m4404j06576
2242B851801L4790N2605j05125j04565j06114K0207O0307J4298j09436j51203
2232B457565N8075J14414j61305o627J26275j35684P0368j16741P809l3413k2942
2221B357794N6954o9480k2592M3541o8403r4767L2575o989k7713O2187K3493N0997
$$ plain form
2295 8947176 8508583 8199896 7811532 7389836 7021261 6824724 6563781 6396453 6189279 6061851
2285 6061851 5879603 5632881 5450687 5347316 5266325 5054437 4931978 4865302 4723102 4604046
2275 4604046 4561256 4475718 4419833 4322484 4243138 4205134 4191524 4016969 3899968 3893417 3787742
2264 3787742 3662505 3631877 3563626 3517185 3486610 3495431 3295439 3308158 3274522 3182494 3253022
2253 3253022 3246808 3253132 3293276 3033959 2941321 3056035 2916479 2971994 3002781 2958377 2851801
2242 2851801 2886591 2939196 2834071 2729506 2623392 2643599 2703906 2718204 2608768 2457565
2232 2457565 2515640 2630054 2468749 2462122 2588397 2452713 2523081 2406340 2414149 2380736 2357794
2221 2357794 2414748 2345268 2322676 2366217 2297814 2203047 2235622 2228633 2200920 2263107 2286600 2337597
2209B337597j5764K1499j24804l3646k2496n8107j18555K4562Q0647J00504j75629
2198B015808M6264K55355j66492k7411o6951m1496n1894K6253P0735L1727m3821
2187B048077J4817o7469n7468n0410J15580j4860J05626r4265m1895L8136o6835
2176A929034M9704q0402J1480k7846o9752q05P4968L9597M3850M1723j8096P044
2164B000499q8811j10844Q2947P0698j5109o8520n6140n5370N4407k0918m5870
2153A746969J05736n0897J0207J1070p3138J23678o89n1107K2765M7091o7177
2142A824508M362J00788M9535k7836j65783j38783P2540o2478O55m588M4545m8570
2130A648895j2355L8668j9183m8925J3810J84442p448k1684n3701M3111P6389
$$ plain form
2209 2337597 2321833 2343332 2218528 2184882 2162386 2104279 1985724 2010286 2090933 2191437 2015808
2198 2015808 2062072 2317427 2150935 2123524 2056573 2015077 1963183 1989436 2060171 2091898 2048077
2187 2048077 2062894 1995425 1937957 1887547 2003127 1988267 2093893 1999628 1957733 1995869 1929034
2176 1929034 1978738 1898336 1909816 1881970 1812218 1811413 1886381 1925978 1969828 2011551 1993455 2000499
2164 2000499 1911688 1800844 1883791 1954489 1939380 1870860 1814720 1759350 1813757 1792839 1746969
2153 1746969 1852705 1801808 1812015 1823085 1749947 1873625 1872936 1821829 1844594 1891685 1824508
2142 1824508 1828870 1929658 1979193 1951357 1785574 1646791 1719331 1656853 1657508 1652920 1697465 1648895
2130 1648895 1636540 1675208 1656025 1607100 1620910 1805352 1797904 1776220 1722519 1765630 1842019
2119A842019m5927q9888J28436o6182q0860m1479p9914k3233m161J2587M3317
2108A594715j9717M4889J1031O4206o8433L1002M0487j26460O7934L7473j51239
2097A525888K4920k5001J46936j77600o6565J08354j9246J49141p6384O843L6399
2086A633685l8663K3119O2719j5810l6548R6152q0022j91891q8095Q0335j26540
2075A318441J18129J16868J30229M8463q6941o0011m0439l4743L3014P9309r0572
2064A531747j0715J8181N3147p9297k0524N3260O6996N0142O8443L4364m3679
2053A722065q5276L491J30566Q0712q9111j1143n2272M9507N2352k3170j55086
2042A622635j8194O201J190j64065K6418m0985K7242R0340j11003p9358J36848
$$ plain form
2119 1842019 1796092 1706204 1834640 1768458 1687598 1646119 1566205 1542972 1538811 1551398 1594715
2108 1594715 1574998 1619887 1630918 1695124 1626691 1657693 1698180 1571720 1639654 1677127 1525888
2097 1525888 1550808 1525807 1672743 1495143 1428578 1536932 1517686 1666827 1590443 1597286 1633685
2086 1633685 1595022 1618141 1680860 1665050 1628502 1724654 1644632 1452741 1364646 1444981 1318441
2075 1318441 1436570 1553438 1683667 1732130 1645189 1585178 1544739 1509996 1543010 1622319 1531747
2064 1531747 1521032 1539213 1592360 1513063 1492539 1545799 1612795 1662937 1731380 1765744 1722065
2053 1722065 1636789 1640280 1770846 1851558 1762447 1751304 1699032 1748539 1800891 1777721 1622635
2042 1622635 1604441 1610642 1611832 1447767 1474185 1433200 1460442 1550782 1439779 1360421 1497269
2031A497269O0782m6842l4612L3002r37K7016N2665K7281j23563r3302l7930L2539
2019A393368M2204r558N2582l4528k3041P7593M2640k5397p6268q2056j0977n0928
2007A295634N3607M6855m3164J17518J04112K8152j97035r4763P1489l7298M0780
1996A385887O6399K6991r6427J8081O4133j01583R3752R2902j07332j81271N2693
1985A314225o6826q5584J45692J70458m1541j08367j345J22522p7433k8811n2419
1974A290571r2054N5032O5437J18236p9107M2063K3469p5177n8534P8551L9462
1963A407949o3561p6968J21440p8467l8906j4310O6530J02200o1697l2235j96797
1952A135178q12K3098J19897N0499r716J8697q9951R7390n5239J37962n2076m1015
$$ plain form
2031 1497269 1558051 1511209 1476597 1509599 1508662 1535678 1588343 1615624 1492061 1398759 1360829 1393368
2019 1393368 1435572 1426014 1478596 1444068 1421027 1498620 1541260 1515863 1439595 1357539 1346562 1295634
2007 1295634 1349241 1396096 1352932 1470450 1574562 1602714 1405679 1310916 1382405 1345107 1385887
1996 1385887 1452286 1479277 1382850 1400931 1465064 1363481 1457233 1550135 1442803 1261532 1314225
1985 1314225 1247399 1161815 1307507 1477965 1436424 1328057 1326712 1449234 1371801 1342990 1290571
1974 1290571 1198517 1253549 1318986 1437222 1358115 1400178 1423647 1348470 1289936 1368487 1407949
1963 1407949 1344388 1267420 1388860 1310393 1271487 1257177 1323707 1425907 1364210 1331975 1135178
1952 1135178 1134366 1157464 1277361 1327860 1318144 1336841 1246890 1344280 1289041 1427003 1374927 1333912
1940A333912K765m031P4151j21440j43763P0291k102o5746q112J43503q67K0368
1928A298929p732M2800q7556M925j5674O6637Q962k1237j890M6641j78904O2663
1916A218564O6148m0360j6505o3860L7521J8025K2894J6201k5496j47Q8627K8715
1904A350327j6270q104m7595j11610j41631M2480q6250O6360M1916m0540Q2357
1893A131440k8896R923o0264M2845j9938R0018O993J17986j10157J5979j16287
1882A079642r1586J59471N1859r0436K2554N6777M3778j5769N6219j95873M5734
1871A122370J5299L2328p7312P2856J11934j8228l6002K9779p5855j19119m789
1860A053261p0335P6410O4959l5974J76985j15023J18900n4435j9089j29736j4126
$$ plain form
1940 1333912 1336677 1332646 1406797 1285357 1141594 1211885 1209783 1144037 1135925 1279428 1278561 1298929
1928 1298929 1291197 1333997 1246441 1251366 1235692 1302329 1311291 1290054 1288164 1334805 1155901 1218564
1916 1218564 1284712 1244352 1227847 1163987 1201508 1219533 1242427 1258628 1233132 1232985 1321612 1350327
1904 1350327 1334057 1325953 1278358 1166748 1025117 1067597 981347 1047707 1089623 1049083 1131440
1893 1131440 1102544 1112467 1052203 1095048 1075110 1165128 1172121 1290107 1179950 1195929 1079642
1882 1079642 988056 1147527 1199386 1108950 1131504 1188281 1232059 1216290 1272509 1076636 1122370
1871 1122370 1137669 1169997 1092685 1165541 1277475 1259247 1223245 1253024 1177169 1058050 1053261
1860 1053261 982926 1059336 1124295 1088321 1265306 1150283 1269183 1214748 1195659 1065923 1051797
1849A051797J89321r1463j5663j53621j6005K2948M8875L95p4670j30899J56040
1838I87055O0457J09290p3359J03638j46719l6337M4286n963J0956j0783M8823
1827A091344k9561j7679p802L7802J30380K4861q1119p2260k5477J3346j3254
1816A050581k5188P591p9624M0994J50757M6608p9067m3494O2303k27488N5615
1805I59588J06538M7904o4931J09699m8132n0578j9630k4447K3228N7238K6623
1794A123100j28355J56634M0281p4667j70977q370N2808R2586k3493J402K4999
1783A085948O182p2698M3107k3438j5886R1452L2514l2723p4263j7323P753N5599
1771A086224J7379L9260K8575j26789p8431l8395J68864j83187l1918J18241n9562
$$ plain form
1849 1051797 1241118 1149655 1133992 980371 964366 987314 1036189 1036584 961914 831015 987055
1838 987055 1047512 1156802 1083443 1187081 1040362 1004025 1048311 1042348 1053304 1042521 1091344
1827 1091344 1061783 1044104 1036302 1074104 1204484 1229345 1148226 1075966 1050489 1063835 1050581
1816 1050581 1025393 1032984 953360 994354 1145111 1191719 1112652 1069158 1131461 903973 959588
1805 959588 1066126 1114030 1049099 1158798 1110666 1060088 1040458 1016011 1039239 1096477 1123100
1794 1123100 994745 1151379 1191660 1116993 946016 937646 990454 1083040 1059547 1060949 1085948
1783 1085948 1092130 1019432 1062539 1039101 1023215 1114667 1147181 1114458 1040195 1022872 1030625 1086224
1771 1086224 1103603 1142863 1171438 1044649 966218 927823 1096687 913500 881582 999823 940261
1760I40261J12678p7988O1391J349n0786j6565p310R119j4162r043o1738P1519
1748I58725J47963o0489P1032q2060j53738N1257J30001R3048m9668q3108K3940
1737A046903O1524n8648J8511p4333o8106j09728Q6987M6672n5144J88729k9336
1726A054031p5493k0668J450n3749k4679J1701o6049j2242k6181P4666m855M6241
1714I04173L6125o1265o0819J6788K06780p499J2507q2475r8807R602r5816p8574
1702G00720J9405N0748L7219J8464q7827O7053M5238k9800J2051J17578J16942
1691A067791j07177j259J09319K5014j27419N480M1216p4274l6640j29924J50942
1680I23069J34557j7156j44496n8077Q0885K4873O5075o3886p411k7594L1041
$$ plain form
1760 940261 1052939 974951 1036342 1037691 986905 970340 963030 972149 957987 948944 887206 958725
1748 958725 1106688 1046199 1117231 1035171 881433 932690 1062691 1155739 1106071 1022963 1046903
1737 1046903 1108427 1049779 1068290 993957 925851 816123 903110 949782 894638 1083367 1054031
1726 1054031 978538 957870 959320 905571 880892 892593 826544 814302 788121 862787 857932 904173
1714 904173 940298 879033 818214 835002 1041782 1034283 1046790 964315 865508 875110 779294 700720
1702 700720 720125 770873 808092 826556 738729 805782 851020 821220 833271 950849 1067791
1691 1067791 960614 959355 1068674 1093688 966269 971749 1012965 938691 902051 772127 923069
1680 923069 1057626 1040470 895974 837897 918782 943655 1008730 944844 937433 909839 940880
1669I40880J5100j19641O04N1683P6410O201o1438l7479q5908P7231l0431N2037
1657H85249p876m3610j05624N1092p8812Q7570O0561j33472n1667J17203M7755
1646H28369j130N2957K2598l9611r1574p1169K29038P1733p2770k2801r9143p6234
1634G30263K8418P3026o6630Q85p4315P4283m8023M7856K578P3744m0271M6195
1622H48009j1201q4690O6552O78q3119J39270P3238r1367q9114k6781m6867J16314
1610H10922R6751K3489M2575j25334J9433r2362K4781p0520q45j9577M5710k8197
1598G26826P7112j2239j4088J07695j28231J1040q301j56949M8884J49356L7022
1587H38127o2512j45808J10402J61950k0984p0579k6321K500M1657q8665L4103
$$ plain form
1669 940880 955980 836339 836943 888626 965036 971237 909799 872320 786412 863643 833212 885249
1657 885249 877373 833763 728139 779231 700419 787989 848550 715078 663411 780614 828369
1646 828369 827239 880196 902794 863183 771609 700440 929478 1001211 928441 905640 806497 730263
1634 730263 758681 831707 765077 765962 691647 765930 717907 765763 768341 842085 801814 848009
1622 848009 836808 752118 818670 819348 736229 875499 948737 857370 768256 741475 694608 810922
1610 810922 907673 931162 973737 848403 867836 775474 800255 729735 728890 709313 755023 726826
1598 726826 803938 791699 777611 885306 757075 768115 759814 602865 651749 801105 838127
1587 838127 775615 629807 740209 902159 881175 810596 784275 786775 828432 739767 773870
1576G73870L487Q376k4921K6674k6257J37604j29695q3033M7643J28170j74857
1565F87061J7656j6679m2508J3763L8756o1901L1267J37171O5986q9542J6406
1554G97436L6701m5424R3672n8734r0078K1163J0167p2840P2214L5763O0483p4577
1542G85946m7886o8477R6538j20514k6553K7880J18033o3176p2954Q362J23797
1531G60996O0617n8071j29858P9582l320o6854K07190l1214r4142L6523j3631
1520G47818l4550L5861P6493l5850j59360r8916m1526q954J15715L3253o0326
1509E69658o159L0800p587K2974j7019k965j8562M5610o8366l5863J31972R2883
1497G37376r9377k6536J35266N9617O056m5433p5664L4615J5031j07607l8662
$$ plain form
1576 773870 777357 785733 760812 787486 761229 898833 769138 686105 733748 861918 687061
1565 687061 704717 688038 645530 659293 698049 636148 667415 804586 870572 781030 797436
1554 797436 834137 788713 882385 823651 733573 754736 764903 692063 764277 800040 860523 785946
1542 785946 738060 669583 766121 645607 619054 646934 764967 701791 628837 637199 760996
1531 760996 821613 763542 633684 713266 709946 643092 850282 819068 724926 761449 747818
1520 747818 713268 749129 825622 789772 630412 531496 489970 481016 596731 629984 569658
1509 569658 563499 594299 586712 609686 592667 589702 571140 616750 548384 512521 644493 737376
1497 737376 637999 611463 746729 806346 812402 766969 691305 725920 740951 633344 594682
1486E94682J44798q6397l2253J10454j24753k2016Q6626r692J4568J9742n379
1475F90380n4500Q1710J29086o9808p1988P8513m4242K6461j11203k0650Q9497
1464G23256j89647k2498J3519L1182l3758j0014K5475P9048j4164K3943M3666
1453F70008j03960N7675P3605n0499J9924m0048O7941m36L4512p6917l7616J5864
1441F30053l2796K6459K1734o3051n5929n313J800o155J1374N6119k8290r2273
1429D63732m2853n546R2039P8263L7250p576J1590M6273j04596j00095m044J09849
1417E74286K705r6907M5362j5449R141J4933Q9421o1959O3802J93Q163N4937k9952
1404F58676J1837p3939o626J29052m4764l5676L0218j11420L830N0614m4328r8104
$$ plain form
1486 594682 739480 653083 620830 731284 606531 584515 671141 661449 676017 695759 690380
1475 690380 635880 717590 846676 776868 704880 783393 739151 765612 654409 633759 723256
1464 723256 533609 511111 524630 555812 522054 512040 537515 616563 602399 626342 670008
1453 670008 566048 623723 697328 646829 666753 626705 694646 694210 728722 651805 614189 630053
1441 630053 597257 623716 645450 582399 526470 521157 522957 516802 528176 584295 556005 463732
1429 463732 420879 415333 507372 585635 622885 615309 626899 673172 568576 468481 464437 574286
1417 574286 576991 480084 525446 509997 519138 534071 623492 561533 625335 625528 633691 688628 658676
1404 658676 670513 596574 589948 719000 674236 638560 668778 557358 561188 611802 567474 469370
1392D69370R617R1674J3442j0028J09901O7324j83772j02677R2156L3770P6877
1381F67654j49990m7802R5346P3261J06598N7531j14845q3014r4696N0545m1759
1370E18829j377j2074J9443p934O5330k416m4920J09190j03705m0777M2569p0462
1358D71696N7061n4357P3796P1420M0182N5384p8904M0622N3503r3220O7059o6659
1346F37583j17971O6291N3747J14614j78913P5356q5748l9113k0096n0533j26813
1335C28404j8612O6001O1280N5978m7189R4293J04813k0700O9846j35567n5879
1324E02668J77709l6686k1712O4189j10399j15078L4643n2412q7491M0986J21499
1313E17916R4538j36802P8239J27876k21703l4392M2260M1980l2279j5560J15131
$$ plain form
1392 469370 478987 570661 584103 574075 683976 751300 567528 464851 557007 590777 667654
1381 667654 517664 469862 565208 638469 745067 802598 687753 604739 510043 560588 518829
1370 518829 517452 505378 524821 516887 582217 579801 534881 644071 540366 499589 542158 471696
1358 471696 528757 474400 548196 619616 659798 715182 636278 676900 730403 637183 704242 637583
1346 637583 519612 585903 639650 754264 575351 650707 564959 525846 505750 455217 328404
1335 328404 309792 375793 437073 493051 445862 540155 644968 624268 694114 558547 502668
1324 502668 680377 643691 621979 686168 575769 460691 495334 442922 355431 396417 517916
1313 517916 612454 475652 553891 681767 460064 425672 467932 509912 477633 462073 577204
1302E77204m2151q425l8009p7477J58855O3986p3509k0246J8524p645o3012p9582
1290D08513J97325j21172k38329O8788L4622K6764k8791Q8687N3240J1152n6525
1279D44274J74649k7540o4442j34612L6866L0260O9048o2303j47312K9028k0319
1268C27597L8446l9997J45071l5494M4390l1377R161n1263M7498j51679N5973
1257C58326L0909J7390j2671n435J22386o7088r8296K2269l4649l5141N1672Q700
1245C58372K21276o3091j02278Q955j14489J80955J4775L2938J01923r4206m0215
1234E04915M4620j20770O0725j5590n1605J136N7024p251k9339k0920N789k8871
1222C99863q3752k6301J45893J44675n5824j9697L6827o5308q1107m7985N8733
$$ plain form
1302 577204 535053 526628 488619 411142 569997 633983 560474 540228 558752 551107 488095 408513
1290 408513 605838 484666 246337 315125 349747 376511 347720 436407 489647 500799 444274
1279 444274 618923 591383 526941 392329 429195 459455 528503 466200 318888 347916 327597
1268 327597 366043 326046 471117 435623 480013 448636 457797 406534 454032 302353 358326
1257 358326 389235 406625 393954 388519 510905 443817 345521 367790 333141 298000 349672 358372
1245 358372 579648 516557 414279 423234 308745 489700 504475 537413 639336 545130 504915
1234 504915 549535 428765 489490 473900 422295 423431 480455 473204 443865 422945 428734 399863
1222 399863 316111 289810 435703 580378 524554 504857 541684 476376 395269 347284 406017
1211D06017L5056K0679Q3861n4447N8145L7259l2618j91622j72861Q2251Q5810
1200C57530Q930n2254j905j5731l1800Q877j6791K86920M5528r0581j10951N600
1188C93372j8965k1582l9846l6602J8302J35607p7672K296Q3993J14472j36792
1177D16583j42993J36317m4577j42526j26998J48203J15384l6321p80J03123K3095
1166D48510j81316O0644N8807j2762l2341j24932R3390n73n4125J07379k5072
1155C37609m2560r9751r78Q6472J19783l4651l8347l981j55174P1554Q1139o6607
1143B54508P1976P1960j66651j7628Q0148p1380J40215N9584J8849r6412j24058
1132B21111M227O1079l0308q056L0777M5580K1610P4446J8699m9528k0791J5422
$$ plain form
1211 406017 441073 461752 545613 491166 549311 586570 553952 362330 189469 271720 357530
1200 357530 366460 314206 312301 296570 264770 273647 256856 543776 589304 498723 387772 393372
1188 393372 374407 352825 312979 276377 294679 430286 352614 354910 438903 553375 416583
1177 416583 273590 409907 365330 222804 95806 244009 359393 323072 322292 425415 448510
1166 448510 267194 327838 386645 373883 341542 216610 310000 309427 255302 362681 337609
1155 337609 295049 195298 194320 280792 400575 365924 327577 323596 168422 239976 321115 254508
1143 254508 326484 398444 231793 214165 294313 222933 363148 422732 441581 345169 221111
1132 221111 225338 286417 256109 248053 278830 324410 346020 420466 439165 389637 368846 384268
1120C84268J5172M4957p9683j43877K5097J61081j66843m5783l1422q5241Q3773
1109A61499J47834j1468n815P9734n9760P923m1719P7840k023Q349o9401K8080
1097C21073k2665P717J43452J930j39856m126K39n0065K5527l7059M5412P6183
1085C67762j09812L4908o4020j413m218J01130m7990M5618n8156O85J0210R4851
1073C69555j79187J08274J15839k05761j460J3303N9483Q2474J6065K9347j7214
1062C90718r1001L4652n5100P9186J03542o9980j50885n4510J9517Q7527K1911
1051C15577m1244j27392j85743J09183J68102P5108L254j7135N1303L9992p0712
1040C20293o2017l0344l5735q735J64862R0902j40015j24354j3212K7692J09238
$$ plain form
1120 384268 399440 444397 364714 220837 245934 407015 240172 194389 162967 77726 161499
1109 161499 309333 297865 292050 371784 312024 319947 278228 356068 354045 362394 292993 321073
1097 321073 298408 306125 449577 451507 311651 307525 307764 257699 283226 246167 291579 367762
1085 367762 257950 292858 228838 227425 223207 324337 276347 321965 263809 264494 274704 369555
1073 369555 190368 298642 414481 208720 207260 220563 280046 362520 378585 407932 390718
1062 390718 299717 334369 279269 358455 461997 392017 241132 186622 206139 293666 315577
1051 315577 274333 146941 -38802 70381 238483 313591 316845 299710 351013 391005 320293
1040 320293 258276 227932 192197 183462 348324 439226 299211 174857 161645 189337 298575
1029B98575n3593k1256L1632o6474l3830N7152J02782r2068J21822J18978m6576
1018D17144k2541J8375o5570q9232N7656l9817r6177N43r4009Q4236Q8739P2048
1006C31395J02519j24243q5098J7886j6130k3278n8394j21290O2246J9702j84023
995g8708P4930J39915R401J367K7309r1409O2538J47666N673o2988l2800m9559
983A53335M1651J03184K3160K4478k0827j06775o4035j1246J31912j56836j50
972A17851k5750j4833k6879n635R4000O480J53353m1704j98117P1701J60261o9235
960B21493m5483K143O9830l6749j13185n151j12537K5945J45120q0116R9261J4545
948A85116j32197M5952J3756N8493j43807n6373J12674L6316M0307N310j09528
$$ plain form
1029 298575 244982 223726 255358 188884 155054 212206 314988 222920 344742 463720 417144
1018 417144 394603 412978 347408 258176 315832 276015 179838 180381 86372 170608 259347 331395
1006 331395 433914 309671 224573 242459 226329 203051 144657 23367 85613 105315 -78708
995 -78708 -3778 136137 145538 146905 174214 82805 145343 293009 298682 235694 202894 153335
983 153335 194986 298170 321330 345808 324981 218206 154171 142925 274837 118001 117851
972 117851 92101 77268 50389 44754 138754 145234 298587 256883 58766 130467 290728 221493
960 221493 176010 178153 247983 211234 98049 92898 -19639 6306 151426 71310 170571 185116
948 185116 52919 98871 112627 171120 27313 -29060 83614 119930 160237 165547 56019
937E6019J01983l7778m3788o7627J01131R4771k8095j659r3199l8852m8000L8204
925C3110J1530n2922o4391J18224L7034l472j3788j5563P2963Q1178n6735q6928
913F0240J17432L8884j10267k534r7441Q1675p8488J816p612N3857J22287J9356
901A99205o2286k2585k6284l1072L4424l8487N3494j44529J4232J26546p10N7166
889A59114k381q9127O6800J40702q3582o9404M5771N6456n0982l6120K5658j12130
877E0775J09913J2422r395k7144L0044j04643l5586P5738P5083o4424j33274o958
865b7449l9584N3037j18034k4802Q7188N3291K4561m5617r5745l311J9834J34091
853A7460N6332j09542n098O922N5737J50817j05327P9163L9912L6369l4049j03453
$$ plain form
937 56019 158002 120224 76436 8809 109940 204711 176616 174957 81758 42906 -5094 33110
925 33110 44640 -8282 -72673 45551 82585 79113 65325 49762 122725 203903 147168 60240
913 60240 177672 216556 106289 103755 6314 87989 9501 11317 3705 57562 179849 199205
901 199205 136919 114334 88050 56978 91402 52915 106409 -38120 -23888 102658 101948 159114
889 159114 156733 67606 134406 275108 191526 122122 167893 224349 173367 137247 162905 50775
877 50775 160688 173110 163715 136571 166615 61972 26386 102124 177207 112783 -20491 -27449
865 -27449 -67033 -13996 -132030 -156832 -69644 -16353 8208 -37409 -133154 -136465 -116631 17460
853 17460 73792 -35750 -40848 -33926 21811 172628 67301 146464 186376 222745 188696 85243
841H5243M929r2029j34032L5796J95J26423O7682l9893p2509j09244J03627J1346
829a2466J311N1210j8505K2472N861n2344J50295m5011r4092Q4169Q832L0856
817A32588J02065r7974r5348l1160K31J87473j8177k2791K5047p3768j92690K680
805h1824j04392j464J23437R9151L6872l0123N110m0336j3295P2799J4575l9917
793D0593L3280M2700k98K1153j41165M0068J56948k09977j0496m9991n9141J65270
781B8944p2451J7415P0079o1290L275L7156R1980q9369N2430k2094K687L7911
769I6673k2662P376l9978J4709K5394p846L8550j06521M0399l2274Q4062n7775
757D0107j2951k9491P5092L5947j67139J35692j56003N8922L6321o226n1257k0585
$$ plain form
841 85243 90172 -1857 -135889 -100093 -99898 26525 94207 54314 -18195 -127439 -23812 -12466
829 -12466 -11155 40055 21550 44022 49883 -2461 147834 102823 8731 92900 101732 132588
817 132588 234653 136679 41331 10171 10402 197875 179698 156907 181954 108186 -84504 -81824
805 -81824 -186216 -187680 -64243 34908 71780 41657 46767 6431 -6864 65935 80510 40593
793 40593 73873 116573 116275 137428 -3737 36331 193279 -16698 -27194 -77185 -136326 28944
781 28944 -43507 -26092 43987 -17303 -14028 23128 115108 25739 78169 56075 58762 96673
769 96673 74011 81387 41409 56118 81512 73666 112216 5695 46094 13820 97882 40107
757 40107 27156 -2335 72757 108704 -58435 77257 -78746 -19824 16497 10271 -40986 -61571
745f1571J26130l0964m4205k3260j0479Q4600L7742j06193K0024j7837L4694n479
733C202m7129N5331n4498Q8743J3941m7021J20559K6326k0152r0457j7698j88399
721a57252l5059M3450R8491J846o0083P310L2978N8591r9944N9246n398o4672
709a20496R5022l9692m622J4703N5170q8179j13841Q1954j41106q25R1263M0959
697a29690O9313k3800q0731K8088n4462j0680Q0583q0158k1468M3965L1777J15001
685c2262N1919m8907l2525j2410n2318m6257j6100j7041J97801q6021j07134m157
$$ plain form
745 -61571 64559 33595 -10610 -33870 -44349 40251 77993 -28200 -8176 -26013 8681 3202
733 3202 -43927 11404 -43094 45649 59590 12569 133128 159454 139302 48845 31147 -157252
721 -157252 -192311 -148861 -50370 -48524 -108607 -101297 -68319 -9728 -109672 -50426 -55824 -120496
709 -120496 -25474 -65166 -69788 -55085 85 -88094 -201935 -119981 -261087 -261912 -170649 -129690
697 -129690 -60377 -84177 -164908 -136820 -191282 -201962 -121379 -201537 -223005 -179040 -147263 -32262
685 -32262 19657 -29250 -61775 -74185 -126503 -172760 -188860 -205901 -8100 -94121 -201255 -205412
$$ [...]
##END NTUPLES=NMR SPECTRUM
##END=
