##TITLE=1H_DE-80H_X3
 200.13MHz, d2o
 8 sc
 
 19ns.26.2.2025
##JCAMPDX= 6.0         $$ Bruker NMR JCAMP-DX V2.0
##DATA TYPE= NMR SPECTRUM
##DATA CLASS= NTUPLES
##ORIGIN= UXNMR, Bruker Analytische Messtechnik GmbH
##OWNER= pz
$$ XWIN-NMR		Version 3.5
$$ Fri Oct 17 15:09:28 2025 Russian Standard Time (UT+4h)  Yarkov@DPX200
##.OBSERVE FREQUENCY= 200.1313
##.OBSERVE NUCLEUS= ^1H
##.ACQUISITION MODE= SIMULTANEOUS
##.ACQUISITION SCHEME= undefined
##.AVERAGES= 8
##.DIGITISER RES= 18
##SPECTROMETER/DATA SYSTEM= spect
##.PULSE SEQUENCE= zg30
##.SOLVENT NAME= CDCl3
##.SHIFT REFERENCE= (INTERNAL, CDCl3, 0, 15.4783)
##AUDIT TRAIL= $$ (NUMBER, WHEN, WHO, WHERE, WHAT)
$$ ##TITLE= Audit trail, XWIN-NMR		Version 3.5
$$ ##JCAMPDX= 5.01
$$ ##ORIGIN= Bruker BioSpin GmbH
$$ ##OWNER= Yarkov
$$ C:/Bruker/XWIN-NMR/data/yarkov2/nmr/H-C/1/pdata/1/auditp.txt
$$ ##AUDIT TRAIL=  $$ (NUMBER, WHEN, WHO, WHERE, WHAT)
(   1,<2025-10-17 15:06:26.31 +0400>,<Yarkov>,<DPX200>,
      <created by zg, POWCHK disabled, PULCHK disabled
       configuration hash MD5:
       00 E9 B6 7A A2 85 ED C7 34 08 36 98 17 FE 4E 26
       data hash MD5: 16K
       82 08 81 C3 11 42 71 68 E5 6B 95 CF 82 5E 17 60>)
(   2,<2025-10-17 15:07:56.35 +0400>,<Yarkov>,<DPX200>,
      <Start of raw data processing
       efp BC_mod = 2 LB = 0.25 FT_mod = 6 PKNL = 1 PHC0 = -3354.005 PHC1 = 9.132312 SI = 16K 
       data hash MD5: 16K
       B8 49 F2 7D 12 61 B6 BA A1 A3 2B EF 00 B6 BD 01>)
$$ ##END=
$$ 
$$ hash MD5
$$ E5 BE B3 C4 C0 88 E9 35 BA 09 9A 8C 15 8E 31 68
##$RELAX= 
##$RELAX= 
##$RELAX= 
##$RELAX= 
##$RELAX= 
##$RELAX= 
$$ Bruker specific parameters
$$ --------------------------
##$DU= <C:/Bruker/XWIN-NMR>
##$EXPNO= 1
##$NAME= <H-C>
##$PROCNO= 1
##$TYPE= <nmr>
##$USER= <yarkov2>
##$AMP= (0..31)
100 100 100 100 100 100 100 100 100 100 100 100 100 100 100 100 100 100 
100 100 100 100 100 100 100 100 100 100 100 100 100 100 
##$AQSEQ= 0
##$AQ_mod= 1
##$AUNM= <au_zg>
##$AUTOPOS= <>
##$BF1= 200.13
##$BF2= 200.13
##$BF3= 200.13
##$BF4= 200.13
##$BF5= 200.13
##$BF6= 200.13
##$BF7= 200.13
##$BF8= 200.13
##$BYTORDA= 1
##$CFDGTYP= 0
##$CFRGTYP= 5
##$CHEMSTR= <none>
##$CNST= (0..31)
1 1 145 1 1 1 1 1 1 1 1 1 1 1 1 1 1 1 1 1 1 1 1 1 1 1 1 1 1 1 1 1 
##$CPDPRG= <>
##$CPDPRG1= <>
##$CPDPRG2= <>
##$CPDPRG3= <>
##$CPDPRG4= <mlev>
##$CPDPRG5= <mlev>
##$CPDPRG6= <mlev>
##$CPDPRG7= <mlev>
##$CPDPRG8= <mlev>
##$CPDPRGB= <>
##$CPDPRGT= <>
##$D= (0..31)
0 0.7 0 0 0 0 0 0 0 0 0 0.03 0 0 0 0 0 0 0 0 0 0 0 0 0 0 0 0 0 0 0 0 
##$DATE= 1760699185
##$DBL= (0..7)
120 120 120 120 120 120 120 120 
##$DBP= (0..7)
150 150 150 150 150 150 150 150 
##$DBP07= 0
##$DBPNAM0= <>
##$DBPNAM1= <>
##$DBPNAM2= <>
##$DBPNAM3= <>
##$DBPNAM4= <>
##$DBPNAM5= <>
##$DBPNAM6= <>
##$DBPNAM7= <>
##$DBPOAL= (0..7)
0.5 0.5 0.5 0.5 0.5 0.5 0.5 0.5 
##$DBPOFFS= (0..7)
0 0 0 0 0 0 0 0 
##$DE= 6
##$DECBNUC= <off>
##$DECIM= 32
##$DECNUC= <off>
##$DECSTAT= 4
##$DIGMOD= 1
##$DIGTYP= 9
##$DL= (0..7)
0 120 120 120 120 120 120 120 
##$DP= (0..7)
$$ [...]
##$SUBNAM2= <"">
##$SUBNAM3= <"">
##$SUBNAM4= <"">
##$SUBNAM5= <"">
##$SUBNAM6= <"">
##$SUBNAM7= <"">
##$SUBNAM8= <"">
##$SUBNAM9= <"">
##$SW= 18.0517328524113
##$SWIBOX= (0..15)
0 0 2 0 0 0 0 0 0 0 0 0 0 0 0 0 
##$SW_h= 3612.71676300578
##$TD= 16384
##$TD0= 1
##$TE= 0
##$TE2= 300
##$TE3= 300
##$TEG= 300
##$TL= (0..7)
0 120 120 120 120 120 120 120 
##$TP= (0..7)
150 150 150 150 150 150 150 150 
##$TP07= 0
##$TPNAME0= <>
##$TPNAME1= <>
##$TPNAME2= <>
##$TPNAME3= <>
##$TPNAME4= <>
##$TPNAME5= <>
##$TPNAME6= <>
##$TPNAME7= <>
##$TPOAL= (0..7)
0.5 0.5 0.5 0.5 0.5 0.5 0.5 0.5 
##$TPOFFS= (0..7)
0 0 0 0 0 0 0 0 
##$TUNHIN= 0
##$TUNHOUT= 0
##$TUNXOUT= 0
##$USERA1= <user>
##$USERA2= <user>
##$USERA3= <user>
##$USERA4= <user>
##$USERA5= <user>
##$V9= 5
##$VALIST= <valist>
##$VCLIST= <CCCCCCCCCCCCCCC>
##$VD= 0
##$VDLIST= <DDDDDDDDDDDDDDD>
##$VPLIST= <PPPPPPPPPPPPPPP>
##$VTLIST= <TTTTTTTTTTTTTTT>
##$WBST= 1024
##$WBSW= 4
##$XGAIN= (0..3)
0 0 0 0 
##$XL= 0
##$YL= 0
##$YMAX_a= 69316
##$YMIN_a= -122082
##$ZGOPTNS= <>
##$ZL1= 120
##$ZL2= 120
##$ZL3= 120
##$ZL4= 120
##$ABSF1= 0
##$ABSF2= 0
##$ABSG= 0
##$ABSL= 0
##$ALPHA= 0
##$AQORDER= 0
##$ASSFAC= 0
##$ASSFACI= 0
##$ASSFACX= 0
##$ASSWID= 0
##$AUNMP= <proc_1d>
##$AZFE= 0.1
##$AZFW= 0.1
##$BCFW= 0
##$BC_mod= 2
##$BYTORDP= 0
##$COROFFS= 0
##$CY= -3
##$DATMOD= 1
##$DC= 0
##$DFILT= <>
##$DTYPP= 0
##$F1P= 0
##$F2P= 0
##$FCOR= 1
##$FTSIZE= 16384
##$FT_mod= 6
##$GAMMA= 0
##$GB= 0
##$INTBC= 1
##$INTSCL= 3.241238e-09
##$ISEN= 128
##$LB= 0.25
##$LEV0= 0
##$LPBIN= 0
##$MAXI= 10000
##$MC2= 0
##$MEAN= 0
##$ME_mod= 0
##$MI= 1.114404
##$NCOEF= 0
##$NC_proc= -8
##$NLEV= 6
##$NOISF1= 3.799351
##$NOISF2= 2.8
##$NSP= 0
##$NTH_PI= 0
##$NZP= 0
##$OFFSET= 15.4783
##$PC= 1
##$PHC0= -3354.005
##$PHC1= 9.132312
##$PH_mod= 1
##$PKNL= yes
##$PPARMOD= 0
##$PSCAL= 0
##$PSIGN= 0
##$REVERSE= no
##$SF= 200.130008685544
##$SI= 16384
##$SIGF1= 3
##$SIGF2= 2
##$SINO= 0.751879
##$SIOLD= 32768
##$SREGLST= <19F.Aceton>
##$SSB= 0
##$STSI= 16384
##$STSR= 0
##$SW_p= 3612.71676300578
##$SYMM= 0
##$S_DEV= 0
##$TDeff= 16384
##$TDoff= 0
##$TI= <>
##$TILT= no
##$TM1= 0
##$TM2= 0
##$TOPLEV= 0
##$USERP1= <user>
##$USERP2= <user>
##$USERP3= <user>
##$USERP4= <user>
##$USERP5= <user>
##$WDW= 1
##$XDIM= 16384
##$YMAX_p= 297119788
##$YMIN_p= -2837960
$$ End of Bruker specific parameters
$$ ---------------------------------
##NTUPLES= NMR SPECTRUM
##VAR_NAME=  FREQUENCY,     SPECTRUM/REAL,   SPECTRUM/IMAG
##SYMBOL=    X,             R,               I
##VAR_TYPE=  INDEPENDENT,   DEPENDENT,       DEPENDENT
##VAR_FORM=  AFFN,          ASDF,            ASDF
##VAR_DIM=   16384,         16384,           16384
##UNITS=     HZ,            ARBITRARY UNITS, ARBITRARY UNITS
##FACTOR=    0.220516191357247, 1,           1
##FIRST=     3097.67233237065, 0,            0
##LAST=      -515.044430635127, 0,           0
##MIN=       -515.044430635127, -2837960,    0
##MAX=       3097.67233237065, 297119788,    0
$$ Real data points
##PAGE= N=1
##DATA TABLE= (X++(R..R)), XYDATA
$$ [...]
9687 2918257 2998297 3276495 3066230 2948073 3017381 3185108 3768485 3862760 3731912 3727524
9677 3727524 3534327 3657985 3864461 4042884 4000545 3695043 3934510 3459321 3819186 4141974
9667 4141974 3824691 3639727 3742156 3848377 3899180 4091978 3892068 3643797 3683587 3615948
9657 3615948 3428681 3126179 3589962 3472752 3122714 3023597 2770862 2770682 2685313 2480546
9647 2480546 2622383 3036453 3056432 2567186 2083523 2832228 2894591 3197392 2831796 2696736
9637 2696736 2445403 1927802 2080333 2253934 2056032 2113762 2531408 2978951 3012818 2550697
9627 2550697 2237675 2331156 2414463 2372540 2378130 2818506 2050806 1997616 2168494 2208875 2044434
9616 2044434 2151544 2005787 1938086 1803211 1881731 1771077 1887137 2208079 2346613 2196811
9606 2196811 1874703 1914435 2250823 2148902 2335855 2296633 2038973 1995307 1770499 1337958
9596 1337958 1137831 1396683 1304538 1829495 1943586 1776062 1324633 1496358 1504064 1495172
9586 1495172 1476747 1526716 1578918 1464654 1363251 1775680 1626401 1785358 1227788 1320071
9576 1320071 1530542 1912414 2363388 1862121 1996812 1465060 1228331 1263189 1249796 1154778
9566 1154778 879614 1002172 1033819 1190087 1290365 1786617 1243450 1425040 1588669 1506256
9556 1506256 1333735 1390707 1463279 1583202 1591814 1144737 1055623 1088557 1476926 1001133 789836
9545 789836 861519 791378 355367 769933 1517275 1638519 1714686 1748471 1769777 729459
9535 729459 594308 1307533 1376794 1563776 1126296 830439 1194380 1148261 1074643 1347396
9525 1347396 843254 1247356 1368341 1251851 1316172 1430561 1185004 737670 1121454 1366877
9515 1366877 1033041 564447 510726 867244 1536899 1462194 1656210 2309965 2017543 1581806
9505 1581806 1548991 1397547 1115855 1280223 1481309 1465337 1304944 929964 1042523 1163943
9495 1163943 1131419 1308730 1790921 1752543 1230350 1205740 1306269 799748 1610961 1721412
9485 1721412 1662355 1794638 1538719 1607041 1336420 1123543 1063349 1089153 1190304 1381779
9475 1381779 1318102 988562 1059508 1476920 1136428 997115 1174043 1330371 1284030 1807922
9465 1807922 1676022 1567988 956289 1037242 1168665 1534780 1707309 1134685 1385685 903342
9455 903342 898453 975930 886734 1271620 1334312 1748246 1308312 1048022 1088611 1323299 1579425
9444 1579425 1854830 1640227 1098518 1658465 1831772 2018431 1513668 1425268 1485636 1302703
9434 1302703 1186098 1282866 1498717 1546975 1625355 1379283 1491554 1201044 1565347 1946967
9424 1946967 1603901 2061825 2438089 2121169 2051887 2019435 1631531 2112158 1892221 1497247
9414 1497247 1475821 1776670 1397588 999188 892138 1112898 1270728 1177839 1725370 1917370
9404 1917370 1986348 1521793 1138609 1610113 2018984 1871156 1851768 1706058 1752212 1732011
9394 1732011 1462248 1398175 1261101 1305507 1865042 1852392 1485573 1660124 1534113 914065
9384 914065 1312837 1763674 1525164 1220297 1388929 1892117 2094889 1901733 1737679 1453333
9374 1453333 1233793 1682985 1869340 2073002 1711971 2215610 1898208 1648629 1632537 1516739
9364 1516739 1714589 2068917 2336650 2276950 2064943 1622417 1733281 1412007 1060375 1321823
9354 1321823 1391671 1160306 1296988 1563147 1925215 1719285 1661253 1454030 1319591 1017473
9344 1017473 1134952 1255756 1511536 1324678 900768 1363753 1200220 1023686 973575 1712006
9334 1712006 1635630 1219306 1198535 1296505 1465678 1496331 1162614 986680 1173808 1139410
9324 1139410 1519660 1536980 1141033 1423830 1757389 1795665 1966141 1705318 1098403 1324907
9314 1324907 1070371 686747 1220868 1144756 852089 1498186 1396280 1426112 2059248 1797572
9304 1797572 1672820 1520598 1966622 2110618 1993982 1725547 1250232 735254 1312770 2015489
9294 2015489 2235364 2261896 2504239 2366897 2319188 2104067 1371778 1362212 1395040 1006528
9284 1006528 1188555 1273840 1688601 1285480 1232950 1700619 1766205 1396646 1468176 1524214
9274 1524214 1983122 2211669 2273703 2487481 2992834 2462655 1528650 1953811 1167933 1280253
9264 1280253 1287315 1097470 1351937 1357004 1108017 1271250 1624212 1301940 1394435 2081263
9254 2081263 1786526 1788368 2299042 2562913 2287535 2264678 2347711 2461281 2503791 2408102 1543101
9243 1543101 1493526 1688505 1709657 1581047 1569160 1790911 1822282 1751253 1706644 2008580 2097401
9232 2097401 1672324 1983234 2096058 2070958 2471899 2735963 2278453 1871726 1976349 1681452
9222 1681452 1533121 1392651 1456010 1799045 1705180 1690948 1608839 1830636 2536933 2049282
9212 2049282 2197937 2353294 2002062 1939395 1894509 2076049 2127186 2184648 2089030 2344310
9202 2344310 2003604 2180358 1883937 1936100 2266087 2014200 2197713 2292053 2399864 1870533
9192 1870533 1638342 1649440 2409416 2239738 1994965 2171130 2783468 2477077 2030946 2185586
9182 2185586 2033816 2328328 2814417 2589308 2029631 1922596 1669027 2023041 2380196 2455128
9172 2455128 2397596 2037067 2117142 2305553 2115408 2431109 2060080 1874358 1964045 1751203
9162 1751203 2081092 2240867 2219445 1990763 2176951 1936374 1691803 1665757 1840233 1984117
9152 1984117 2569340 2688350 2844811 2876062 2578364 2431977 2241737 2341683 2478802 2378247
9142 2378247 1947777 2018827 2314811 2410972 2474916 2395819 2549067 2408874 2696330 2719491
9132 2719491 2117976 2570964 2828156 2907364 2814110 2729949 2826837 2957650 2826743 2709036
9122 2709036 2826937 2863755 2745662 3098718 2958577 3164117 3657539 3246847 2934294 2817526
9112 2817526 2701499 3005146 3382646 2997960 2920826 2913096 2685880 2578743 2629322 2488798
9102 2488798 2477609 2851176 2597986 2835653 2878095 2840153 2980402 2933625 3016096 3132835
9092 3132835 3468181 3392515 3139805 3168420 3087648 3014249 3299175 3474164 3413479 3436269 3104100
9081 3104100 3663300 3931789 3896940 3461466 3483932 3567062 3238676 3370492 3893082 3798000
9071 3798000 3571753 4217469 4210042 4062703 3814158 3814429 3986120 4073840 3950506 3806617 3411006
9060 3411006 3473817 3282663 3374150 3594218 3672739 3570734 3540975 3829864 3561015 3687564
9050 3687564 3885498 3914956 4193573 4529446 4440125 4159734 4223577 4520759 4194052 4351084
9040 4351084 5200577 5120396 4982219 4737444 4307521 4803685 4925913 4774369 5024547 5288055
9030 5288055 4833252 4837821 4883650 4770680 4975906 5223819 5504330 5743978 5924486 5700910
9020 5700910 5610531 5665403 5984560 5633590 5790923 5859517 6120672 6188428 6596717 6599090 6306835
9009 6306835 6398162 6514069 5795413 6086348 6085129 5551463 5330783 5943898 6180950 6540275
8999 6540275 6865972 6639667 6925888 6323556 6063720 6242939 6320167 6266939 6529115 6805866
8989 6805866 7124228 7138991 7368055 7114576 6818740 6985272 7335047 6971157 7016668 7372139
8979 7372139 7345235 7611012 7676992 7705511 8205408 8044718 8362779 8298437 8091172 8325666
8969 8325666 8118111 8201022 8540190 8604715 9056190 9148230 9710714 10150220 10095129 10293959
8959 10293959 10646722 10880246 10437824 10258275 10749204 10838539 11170503 11384418 10947928 11160162
8949 11160162 11777440 11913403 12328710 13058476 13736928 14111238 14733137 16094029 16872599
8940 16872599 17455597 18571482 19440667 20004205 21153920 22885041 24686838 27001193 29333893
8931 29333893 32097137 35493042 39075243 43257717 48540215 54728118 60615285 65132347
8923 65132347 64886648 60128714 53060005 46572022 40149909 35722725 32051876 29281402
8915 29281402 27845946 26163729 24900899 23376410 22437842 21665389 21183411 20520692 20538172
8906 20538172 20496265 19967421 19955681 19799324 20024680 20611643 20560887 20607464 20844777 21740071
8896 21740071 22258791 23015842 23645468 24616009 26758980 28398248 29470077 30914336 32239075
8887 32239075 32756593 31978482 31083583 29469811 28247105 27705722 26610196 25861603 25663963
8878 25663963 25525837 25730713 26170326 26674188 27738645 28946910 30413742 31811201 33232822
8869 33232822 33947908 34159951 34029972 32953696 31879365 30671653 29016952 27891223 27327310
8860 27327310 26468424 25967328 26676583 27457407 28089075 29013618 29836553 30423262 32311974
8851 32311974 34775769 37419471 39545034 40851913 41271971 40674092 39621059 38406485
8843 38406485 36597476 34997858 33627665 32343670 31423930 30723986 30352350 30822042 31385000
8834 31385000 31949889 32604395 34130237 36357226 38069918 39219153 39537396 38908541 37722322
8825 37722322 35727587 33118360 30625896 28435095 26882595 25108709 23677480 23006614
8817 23006614 21817823 20940678 20365035 19608084 18789554 19005302 18881756 18614761 18007384
8808 18007384 17619029 17687083 17957423 17939505 17944669 17800488 17538663 17368544 17812928 17305390
8798 17305390 16526569 16143657 15786311 15990256 16250063 16227630 15919019 15986370 16526281 16446871
8788 16446871 15868911 15693175 15762351 16227503 16683767 17276267 17312108 17889337 17836863 17704590
8778 17704590 16995170 17311718 18015749 18129420 18652182 19233199 19193430 19949646 20581684 21920615
8768 21920615 22811655 23974819 25116159 26951273 28621123 30768236 32788830 34402836
8760 34402836 36000088 36357087 36564255 35975859 35486236 35149917 35114572 35256335 36223764
8751 36223764 37462002 38434051 39226846 39195704 38215725 36587029 33936433 31833259 29744238
8742 29744238 27746334 26672478 25656023 24881976 24369700 24497832 24875526 24718310 24432549
8733 24432549 24119086 24544226 25067131 24637186 24768858 25403655 26138556 26933991 27525221
8724 27525221 28853748 30476358 31745354 33451683 35002162 36399670 38459276 39411673
8716 39411673 39325201 38432498 37023983 36117197 36312809 36229009 36736958 37553674 38214671 39068200
8706 39068200 38825703 38136621 36543318 34560677 32493149 30061988 27977267 26512976
8698 26512976 24838863 23778185 23080576 21729869 21463878 21345739 20765619 20422740 20072243
8689 20072243 19653132 19252050 18545738 18486435 17716093 17107867 17196223 17288921 17572389 17921971
8679 17921971 17782244 16979704 16573591 16055591 16125051 15498672 15660702 15728898 15584337 15464966
8669 15464966 16022954 15945070 16190098 16246056 15918479 16491755 16896163 17595981 18111340 19542651
8659 19542651 20341369 20531563 21783006 22973519 24425496 25433205 26309344 27318579 27235250
8650 27235250 26299041 25548039 25150746 24959596 24382116 23465029 23984246 24937558 25425717
8641 25425717 25187619 24385196 23211265 22185107 20930043 20247940 19051448 18308725 17844381
8632 17844381 17823694 17754046 17710218 17616637 17901416 18161630 17971111 18233064 18686192 19147975
8622 19147975 19939246 20727816 21882066 23137484 24788977 25964902 27841489 29921231
8614 29921231 32353602 34916871 36718549 37383960 36977308 36126014 34842330 33298538 32349595
8605 32349595 31786461 31690720 32512096 32474336 32713670 33042666 32040608 31048879 29254253
8596 29254253 26732774 23994370 21984096 20762167 19917700 19273132 18107375 17255367 16331799
8587 16331799 16302528 16489546 16646598 16529549 16568130 16411045 16312421 16260601 16118409 16462308
8577 16462308 16938915 17925221 19109738 20173989 21665696 21788035 21644021 21840877 21071216
8568 21071216 20458020 19746021 19258920 19839548 19131237 19131248 19256801 19811460 19631526 19241004
8558 19241004 19139519 17640101 16301294 15141525 14366595 13515377 12479307 12408374 12244974
8549 12244974 11381889 10327933 10276261 10557731 10185657 9514892 9236457 9266101 9349756 9360258
8539 9360258 9191557 9391174 9537916 8888923 9324068 9524692 9962719 10062215 10053990 9995984
8529 9995984 9415841 8933627 8992367 9032698 8624742 8388300 8043908 8049820 8208423 8287928
8519 8287928 8459916 8534108 8015130 7678482 7119334 6857108 6536200 6499186 6475055 5836378
8509 5836378 5993839 6512558 6466527 6373488 6123384 6047418 5363150 5261459 5557987 5557588 5496519
8498 5496519 5783491 5686799 5344257 5449274 5870174 5833934 5794652 5607665 5251038 5014115
8488 5014115 5348640 5236572 5182152 5029742 4776335 5111040 5438506 5127443 4710998 4352801
8478 4352801 4189470 4454978 4487169 4463742 4299383 4196443 3826008 3888272 3980491 4187037
8468 4187037 3965635 3782863 3521303 3294914 3505083 3636161 3924445 4230256 3548666 3534100
8458 3534100 3944929 3898191 3624629 3183502 3266185 3342625 3139697 2778504 2770742 3256783
8448 3256783 2936770 2436203 2940879 3114199 2911985 2517571 2602549 2782091 2665820 2547385
8438 2547385 3280414 3461879 3142626 2911916 2769448 2234327 2197966 2081514 2101722 1922966
8428 1922966 2522193 2709564 2002604 2037857 2348350 2603294 2071599 2519965 2180122 1742862
8418 1742862 1844655 1976703 1932704 1746329 1733013 2130964 2049269 2227952 2481525 2740620
8408 2740620 2771300 2999541 2678935 2334528 2323267 1810308 1923997 2352309 2392406 1746828
8398 1746828 2029776 1887118 2518438 2065574 1942364 2314437 1808893 1800726 2347670 2248496
8388 2248496 1890437 1429559 2056436 2157315 2305467 2142929 1984580 2489931 2311027 2321067
8378 2321067 2444468 2243072 1956108 2155185 1929718 2388550 2927037 2626154 2193922 2398437
8368 2398437 1907002 2151549 2572503 2147754 1908725 1910463 1704493 1633939 1234886 1490778
8358 1490778 2093420 2106146 1817353 2252945 2287004 2107471 1860067 2043372 2320526 1994660
8348 1994660 1744147 1980527 2217764 2174139 1681817 1846901 2053641 2156615 1977971 2126824
8338 2126824 1984288 2002510 1822651 1409864 1254836 1054581 1391756 1633258 1262300 1661081
8328 1661081 1637143 1210234 1106010 917080 987979 1395239 1664125 1348960 1357613 1341255
8318 1341255 1434062 1511281 1815762 1186581 1064228 1377511 969401 1612195 1076846 985279
8308 985279 990685 245041 726903 940462 1275298 1205916 1360467 1316505 1268591 1274506 1529008
8297 1529008 1355537 1296384 1368115 1370561 1440687 1260717 914988 1209917 1680477 1730321 1085084
8286 1085084 1214796 1346964 1445150 1558749 1657771 1284028 447228 721499 1669809 1687788
8276 1687788 919304 948738 1349627 1419168 1121276 1075621 1524157 1682014 1532458 1063948
8266 1063948 1361172 2121680 1897323 1347038 1306561 1163952 1196779 1677763 1501917 1779389
8256 1779389 2043633 2293435 1705837 1407049 1087173 1337132 1611668 1230757 1231458 1270482
8246 1270482 1064710 1221200 1386284 1404603 1655589 1367790 1550141 1796876 1925620 1885601
8236 1885601 2014974 1885935 1330139 1025297 995942 1104361 1497441 1601000 1292600 1303534
8226 1303534 1628724 1350451 1572639 1610883 1419413 1693364 1103995 1139299 1053736 1185453
8216 1185453 1931564 1753480 1648495 1326155 1524610 1720996 1317218 1520021 1641259 1374081
8206 1374081 1561896 1821160 1681764 1676786 1460233 1617902 1588343 1248318 2020105 1635752
8196 1635752 1180015 2216250 2543336 4122145 -729604 -2837960 106182 -58038 609118
8187 609118 436333 988570 507453 764664 766089 1251216 571156 599528 1101529 1157071
8177 1157071 1065986 936937 1388583 1265457 1522008 987830 1043353 750480 531204 648376
8167 648376 810280 1067164 926756 894610 1017461 958816 1003230 884161 1190839 1458881
8157 1458881 1108297 706018 896145 1117718 1021280 1084843 920187 652422 919717 1218670
8147 1218670 778074 706240 888784 946156 812332 697570 782650 767248 783555 622443
8137 622443 879634 1168992 1139909 1367766 1320708 970206 353579 514057 1108010 769238
8127 769238 588456 499196 1008190 1111966 770488 660422 326956 723980 1412192 711397
8117 711397 271670 527055 551897 658742 1198264 989622 973749 1248565 1249727 869320
8107 869320 647801 607257 743190 944819 683932 976934 1599077 1433986 1379475 1232762
8097 1232762 852995 527399 766747 975179 1312730 969913 588490 213585 679303 942173
8087 942173 492390 263986 290757 864111 1119267 1446730 1410473 1469954 992088 1075592
8077 1075592 733706 839198 370697 511649 676518 1059594 1063524 1022128 1185737 656138
8067 656138 774781 874413 919881 1021500 1245433 1205446 910888 1134364 1516591 1232573
8057 1232573 1005890 789530 1276403 1523113 1069446 655574 1014524 739227 157796 73795
8047 73795 663093 1291700 1509879 1561440 745967 553148 600076 718519 603017 381866
8037 381866 320250 232402 287276 427944 386667 368466 179236 395440 567589 891572 533668
8026 533668 946562 1523846 1780902 1153619 501115 360864 555239 895596 820654 1099984
8016 1099984 949176 977753 722537 1031931 922649 565104 528941 607022 697481 1226268
8006 1226268 1171180 721277 319143 279855 608241 765546 639355 479039 588543 518164
7996 518164 643840 818711 601139 947828 727601 592236 681757 570394 562751 622491
7986 622491 740094 739720 472717 1146213 1384331 1117771 1046778 1124378 1588805 1084335 928098
7975 928098 796348 1116194 987772 850125 995285 1103912 1413982 1115995 725480 540911
7965 540911 485522 862533 496594 701497 1166732 1072433 765133 1018750 650153 602735
7955 602735 911406 717838 868177 661413 907100 1083965 926194 701998 982134 1286671
7945 1286671 1518945 1250669 1131247 976341 820351 1072670 1017572 948113 576290 735065
7935 735065 1024347 1047033 774162 1162985 613204 868656 1730645 1256515 444892 317979
7925 317979 518330 13199 256486 255591 240412 777997 1083190 832253 1216707 1266835 1509255
7914 1509255 1120214 994717 991524 1323310 887911 1000051 756858 838705 1192847 1021228
7904 1021228 668458 267141 585955 494627 327732 199152 476727 994560 746721 727100
7894 727100 606682 685070 1011408 1020414 1013963 923513 1128109 989491 1258975 1079931 871562
7883 871562 311333 300345 598761 977007 1019599 1125292 758462 910855 861103 608220
7873 608220 1056335 1120040 1135258 855030 873618 1061643 551399 637039 882526 1026103
7863 1026103 1109021 581107 276108 148810 459371 773097 930682 1197991 1031884 813210
7853 813210 648222 733567 732852 801105 1333837 1341420 1340642 1477944 914772 791865 1135518
7842 1135518 785598 931989 1380887 1202745 697591 830627 1154720 835054 1218939 894706
7832 894706 974984 1567268 1444514 973990 888658 767106 244895 712925 997441 807864
7822 807864 534303 427233 665569 649470 1038374 1189559 1169583 503515 993750 868612
7812 868612 345962 1018529 1155793 1075955 1894633 2327443 610046 1124185 1112940 1078851
7802 1078851 1057691 717374 656198 1278128 1316036 940257 722625 741256 1312527 730199
7792 730199 720953 1471093 1630310 1541060 1527911 837913 1149036 1678501 1307704 1145954
7782 1145954 789629 729704 746150 1087910 1559757 936661 370814 297326 752115 974661
7772 974661 1164641 1363322 1301037 1266686 997469 1634725 1080359 884418 1193838 1466104
7762 1466104 1162259 393216 48019 107684 823243 996116 1177872 600763 1209450 986576
7752 986576 677024 408251 649605 1032018 696596 574998 713850 578751 834093 954557
7742 954557 971846 874024 931161 767001 1059349 1285444 1039661 1633563 1105495 819354
7732 819354 845711 458837 580622 907719 992452 1005449 957543 1070544 814100 1148002
7722 1148002 822792 775420 1144425 824463 879951 857703 424797 661631 1229139 1068473
7712 1068473 1238081 1301654 1085802 933911 998515 502839 297642 776993 629577 712487
7702 712487 1285327 1240012 1128731 1106335 799239 781761 784565 832355 645325 596043 616262
7691 616262 766263 432657 618327 784839 904685 1029320 1321769 1218316 1346468 1102913
7681 1102913 1120048 1431500 1439393 1451692 1084352 882612 899802 1534278 1601089 1081732 1415307
7670 1415307 1345902 1466275 1410112 1103617 977014 931205 1005783 982292 916218 1002554 1156697
7659 1156697 1286881 1090928 1009125 933002 1007849 1274363 603256 867278 609397 565843
7649 565843 987938 1084769 1219779 1280759 1436755 1378440 1334058 1211227 992614 1495334
7639 1495334 1206548 949974 749503 1135967 1477557 1540303 1392393 1319344 1656902 1312344
7629 1312344 1118569 570520 735678 1031833 1096225 1424024 1508955 1164643 627932 586241
7619 586241 697603 838628 51716 -88486 426602 1301398 1326758 1437350 1319729 595465
7609 595465 433347 615415 872798 707925 954820 1056003 903995 1139209 943395 822361
7599 822361 745698 767242 964349 1211072 1366895 1293558 891292 658689 828737 678214
7589 678214 756126 1024878 1006650 537587 1067230 813887 26380 -36766 171775 1011781
7579 1011781 1511864 785009 351918 829310 1104570 870518 567502 659701 620590 1165562
7569 1165562 1431189 900319 718942 695889 738776 980956 894273 219829 219584 646572 686529
7558 686529 1159660 1261094 899799 1537769 1246510 935309 1139457 1038552 648981 526770
7548 526770 412152 688150 243325 456406 684056 1204345 1474716 669575 560043 709519
7538 709519 877324 470196 590065 702762 171090 517198 1123198 1206595 897231 622433
7528 622433 1217163 1022909 1213896 900684 982914 710569 691160 625116 707631 918687
7518 918687 991640 1086570 930193 1122930 1055300 1382778 1423351 849139 727422 951165
7508 951165 510354 515261 782689 748806 959525 788749 763383 1204544 890242 884143 920099
7497 920099 1070177 800404 883967 698265 817527 349693 -33590 703859 1327882 1199885
7487 1199885 1009920 915997 608350 565665 682314 497819 292770 591101 943707 1232632
7477 1232632 1090857 1020491 853133 548223 1036919 698474 813460 777291 1187738 1311479
7467 1311479 818831 985052 1036220 1119675 1265650 1195609 968118 1045324 825435 775521
7457 775521 446414 617125 561466 832435 981564 593360 509543 434989 42244 679976
7447 679976 1139874 1605782 894748 1014017 1251247 1328461 1314277 916646 1192177 867225
7437 867225 1038834 1044548 1187744 1042156 604601 515229 1079293 1349251 885956 1177746
7427 1177746 1197712 1307311 952307 934038 1195095 1277802 1443661 1126844 1370115 1352532
7417 1352532 1567729 1432649 978997 1470565 1200037 995738 1332740 1421636 1208285 764102
7407 764102 206099 439233 985609 1106403 1728052 1523820 1393019 801464 913221 852210
7397 852210 548455 926503 895418 943986 1477294 1831422 1579251 1720908 1390988 997847
7387 997847 723224 1007819 1016777 1013496 1070787 1198087 1749704 1739925 1480541 1661424 1422516
7376 1422516 1382371 1364150 1066073 1438481 1019651 901449 1081808 900356 1286411 1343222
7366 1343222 1473136 1495174 1315676 1483800 1655386 1650998 1342923 1532731 1256335 965224
7356 965224 1020491 1017490 1126834 1335860 1588919 1366470 1025853 785522 1107706 1555680
7346 1555680 1181426 929304 1271898 1307139 1104136 1332063 1394204 1546207 1129179 572444
7336 572444 669663 1485051 1294994 1228225 1437389 1354599 1315702 1572398 1227975 1104005
7326 1104005 1222945 1381680 1783653 1177672 1074264 917661 985164 1016028 1121309 1168605
7316 1168605 477927 548852 1187087 1339713 1611497 1368946 929139 741900 1169759 1393593
7306 1393593 1282685 1062494 897186 1010078 719924 587343 494993 863841 1086178 1195758
7296 1195758 892047 1097598 1174228 724222 1094861 1388218 1296262 946889 858559 1149883
7286 1149883 1742287 1393129 1166300 1164262 1026897 1047989 1229737 832769 508966 636193
7276 636193 796185 755578 257892 198164 647879 386362 429095 1090868 1069684 750607
7266 750607 612914 1179944 1306924 1307644 1019768 977435 1383810 640827 420913 465747 551317
7255 551317 1025080 1483191 1812236 1931558 1519060 1047132 587271 756654 1045354 1014319
7245 1014319 991334 767974 1055762 862925 780699 925877 854481 834044 867579 1202286
7235 1202286 1494061 1615214 1352835 842996 769591 663772 935994 840570 657216 686246
7225 686246 1444802 1703320 1296188 931222 1517545 1637100 1378234 1732436 1500051 1380948
7215 1380948 973791 808042 1400832 1545179 1437112 1745273 1627180 1203386 1168329 1002400
7205 1002400 1084580 1316457 1194780 898351 727584 723834 1182075 1050667 757650 1326636
7195 1326636 1267734 1311940 1214405 1181306 1196208 1265082 1550249 1398740 1269515 1795890 1980679
7184 1980679 1180621 977701 1691557 1414974 725008 1651531 1598621 1174110 984698 1001585
7174 1001585 911580 749369 1253543 1174149 583645 981321 1543996 1378951 1450639 1450129 1577673
7163 1577673 1219985 1369229 1642516 1981016 1781600 1402390 955410 1065010 1327554 1330990
7153 1330990 688028 1458447 1521817 999347 923823 804024 1046351 885699 1295982 1656969
7143 1656969 1050560 1053102 1019145 377510 638906 848449 729291 717854 656434 803758
7133 803758 823347 1767416 1910082 1490754 1403768 1455804 815409 730295 1352485 1523695
7123 1523695 1560942 1389318 958114 1125884 1215786 967090 1203120 984959 1115048 1515990
7113 1515990 2076662 1848544 1680394 1348100 1747239 1616204 1257451 981652 1395613 1971788
7103 1971788 1731234 1445080 1296262 1114303 1258157 1412791 1707089 1513792 1337270 1442611
7093 1442611 1238895 1123442 1156414 1202340 1479255 1250458 1491583 1758855 1579869 1494693
7083 1494693 1315086 1668844 2012815 1684713 1874823 1809858 1641469 1651741 1677636 1587829
7073 1587829 1441984 2021551 1764848 1617162 2118936 1430026 1728691 2150230 2201830 1753660
7063 1753660 1741992 1524817 1670447 1295804 854403 1677420 1680049 1597968 1643871 1781766
7053 1781766 1414933 1390120 1401782 1224167 1234331 1439438 1556162 1202427 1467761 1531974
7043 1531974 1760139 1462636 1603453 1894575 1299921 1661768 1315451 1548190 1188900 1569553
7033 1569553 2072517 1313402 1392060 1943259 1726437 1589687 1974450 1996332 1665717 1625169
7023 1625169 1764169 1978555 1764211 1180797 1370894 1304523 958633 1095008 1144167 1323549
7013 1323549 1315948 1136162 807307 1463527 1308300 730227 1278158 2032885 1894758 1799029
7003 1799029 2042854 2256343 2283388 2070878 2507934 2379918 1776695 1309369 1497689 1377609
6993 1377609 1182485 1596377 1799606 1816205 1765497 1949144 2409544 2755515 2141648 1936768
6983 1936768 1598135 1671867 1701288 1433005 1505332 1611082 1243258 945121 1633954 1481509
6973 1481509 1284815 1602340 1336241 1225885 1535363 1810095 1922379 1807249 1596816 1357513
6963 1357513 1276709 1607192 1786093 1383890 1409495 1747331 1828133 1436887 900542 1369231
6953 1369231 1515608 1521994 1715530 1748063 1568494 1553976 1682533 1741100 1780718 1680670 1732855
6942 1732855 1633491 1498833 1289003 1987751 2564467 2195832 2372454 2205464 2471767 2452850
6932 2452850 2275882 2124184 1928485 1587420 993923 1183083 1389800 1809958 1758934 2096669
6922 2096669 1939377 1785484 1688239 1393983 1182660 1153116 809538 1197597 1826668 1679115
6912 1679115 1773817 1528532 1809613 1901271 1742980 1011023 999505 1281076 1383942 1493927
6902 1493927 1710345 2141729 2448229 2106178 1739059 1820450 1963653 1889504 1512219 2184750
6892 2184750 1649863 1485481 1860457 1748384 1859047 2180225 2396454 2368985 2037549 2252792
6882 2252792 1957589 2282440 2268977 2271936 2319031 2131279 2348963 2302374 2186110 1515060
6872 1515060 1318597 1160725 1647133 2332681 2148006 2572262 1801973 1639934 1350218 1621492
6862 1621492 1798846 1910677 1737079 1384921 1592572 2154769 2270711 1733734 1966154 1924357
6852 1924357 1982200 2094101 1711290 1645262 1942251 2109813 2220481 1958470 2077962 2062129
6842 2062129 2074277 2280188 2757081 2860956 2586284 2169139 1894711 1809521 1640984 1556601
6832 1556601 1931163 2035460 1877468 1270105 1526110 1653553 1872525 1995614 2117310 2222473
6822 2222473 2379065 2489845 2019313 2437330 2631536 2200696 2011653 1524118 2197445 1789601
6812 1789601 1647513 1563940 1780807 2293782 2479216 2284185 2217769 2474680 2599034 2207639
6802 2207639 2254573 2147108 1762494 2375093 1734714 1694233 2233068 1924742 2298106 2122244
6792 2122244 2077846 2240008 1755679 1859188 1552021 1886032 1895775 1870805 2183518 2221523
6782 2221523 2345627 2185409 1930887 1578106 1724473 2304790 2485714 2544581 2123371 2063284
6772 2063284 2226776 2523481 2743515 2447494 2591825 2180836 2454254 2291356 2275497 2782753
6762 2782753 2295968 2247981 2211707 2489590 2260157 2062682 2175494 1991218 1735271 2378060
6752 2378060 2571239 2632283 2522404 2761949 2883397 2396631 2620116 3141912 3101736 2562343
6742 2562343 2321424 2228725 2040622 2390584 2431982 2615942 2154204 2217897 2651298 2663354
6732 2663354 2804259 3379056 3299285 3045645 2847080 2624159 2869527 2593472 2930262 2917928
6722 2917928 3295038 3191517 2856498 3096421 3436621 2808743 2983050 3025065 2935374 3213683
6712 3213683 3115928 3500481 3378249 2911972 3140876 2845337 2781991 2622880 2795298 3302548
6702 3302548 2776809 2612197 3244434 3197404 3297740 3295031 2602273 2344380 2480016 3177038
6692 3177038 3498405 3662536 3438052 3289593 3522807 3628228 3630117 3179197 2871915 2731403
6682 2731403 3194830 3458789 3636935 3220390 3320601 3264340 2722685 2557853 2458301 3037849
6672 3037849 3209742 3239227 3394105 3214470 2657728 2362412 2626427 2923888 3107609 2834880
6662 2834880 2969730 3476029 3225148 3186983 2677300 3001705 3172605 3111955 3254786 3250991
6652 3250991 2704024 2564172 2667270 3597084 4003857 4155679 3958864 3504599 3410707 3426050
6642 3426050 3386778 3481647 3299931 2893002 2924102 3153042 2984014 3037119 3185743 2878387
6632 2878387 3021619 2898953 3075273 3722099 4009247 3702762 4045404 4115405 3750012 3755870
6622 3755870 3369967 3511644 3537345 3338969 3887606 3707059 3545575 3956856 3876193 3568981
6612 3568981 3817481 3980497 3803979 3956758 3578034 3831949 3852964 3932416 3924735 3960319
6602 3960319 4030196 3751022 3556740 3433296 4275395 4297728 4434099 4318996 4030361 3900195
6592 3900195 4070005 3993468 4450101 4433795 4131473 4613966 4856657 4163503 4172848 4598601
6582 4598601 4681662 4339471 4641013 4536996 4795714 5386879 5598198 5774998 5123655 5164854
6572 5164854 5610981 5262513 4620569 4363898 4718329 4843069 5132313 5496696 5566399 5493121
6562 5493121 5322582 5339789 5168970 5448044 5426761 5712591 6124975 5651558 5168300 5300625
6552 5300625 5124418 5123957 5088799 4968260 5183317 4953560 4712729 4977103 5234635 5060843
6542 5060843 4681445 4975536 4840765 5494267 5503176 5457005 5307727 5061977 5034355 5137845
6532 5137845 5361594 5659277 5733241 5733846 5417011 5184086 5213327 5440641 5999777 6031183 5821258
6521 5821258 5224498 5287803 5452963 5353491 5071525 5596329 5430433 5896524 5767724 5473615
6511 5473615 5610317 5850582 5957390 6391955 6619845 6707777 6218804 5876784 6503636 6784632
6501 6784632 6893254 6755034 6667971 6759518 7228560 6982636 6746485 7152526 7168172 6605773
6491 6605773 6455632 6848325 7148164 7506037 7432736 7330027 6961817 7275870 7026009 7061663
6481 7061663 7545004 7869136 7499331 7194304 7307468 7560197 7819269 8178115 8558426 8130742
6471 8130742 7860439 7943062 8408594 8350381 8311259 8547932 8865980 8926777 9201801 9526112
6461 9526112 10154225 9786859 9577350 9378628 10038866 9823354 9692748 9815148 10026184 10321343
6451 10321343 10530623 10546626 10820419 10614422 10390826 10306785 10420862 10104266 9787167 10540398
6441 10540398 10443525 10675255 11234234 11517427 10914390 10897846 11942729 12015543 11993548 12127750
6431 12127750 12473847 12922626 12549550 12874583 13257523 13369608 13323294 13261597 13214753 13204724
6421 13204724 13578630 13903307 13914762 14577517 14730070 14189257 14225089 14793444 14987809 15321173
6411 15321173 15634813 15354901 15539323 15844822 16322532 16679395 16998866 17429231 17702098
6402 17702098 17700462 17785644 17837359 18502366 18822361 19304272 19618797 19657273 20145812 20539087
6392 20539087 21208989 21534090 22379232 22936026 23584568 24150775 24873073 25778340 26906304
6383 26906304 28041688 29064789 30237105 31489903 33102969 34115248 34736516 35408513
6375 35408513 35790992 36072143 36987493 38079805 39881571 41238371 41982954 42580153 43166387
6366 43166387 44104820 45176027 45758756 46945314 48174524 48949425 49444741 50599284 51667154
6357 51667154 51721837 53071802 54288091 55859350 57994362 61183151 65204107 68996112
6349 68996112 73757729 78787375 83663359 87119996 88865389 88413415 86620946 83062139
6341 83062139 79266643 76320761 73557414 72528380 71984846 72333810 73376193 75098665
6333 75098665 77716567 80895578 85141360 90081249 94516163 98425930 100821152 102615497
6325 102615497 102536813 100761557 97113889 92652080 87302693 82614112 78457875 74960465
6317 74960465 71806392 69607359 68090260 67693156 68108848 69118347 70404164 71977858
6309 71977858 73980541 76677426 80600571 84706140 89060180 93697638 97548950 100437974
6301 100437974 100944816 99762728 98291286 94651032 90414910 85839282 81879532 77952829
6293 77952829 74829875 72582644 71418756 70646523 70666786 71427414 72899816 75165081 77982711
6284 77982711 80661476 83286082 85170750 84955450 82989282 79420999 74868433 69577989
6276 69577989 65030915 61139424 57433334 54599295 52572292 50317080 48967169 48252527
6268 48252527 47473757 46886636 45820212 44318581 43870253 42960247 42122438 41728003 40817810
6259 40817810 39531174 38823506 38025449 36172929 35194400 33857330 32670834 31928589 31140531
6250 31140531 29855419 29263460 28915396 28221285 27150268 26044201 24289059 23414350 22264530
6241 22264530 21256148 20272020 19622401 18803169 18146636 17762958 17197954 16478149 16269213
6232 16269213 16090036 15586489 14638139 14444198 14843219 13972399 13667285 13513520 13073054
6223 13073054 12775385 12251083 12226271 12075791 11826201 11049432 10940489 11037641 11083740 10700615
6213 10700615 10215972 10335692 9820035 9479503 9649982 9800279 10081586 9812232 9416633
6204 9416633 9522297 9210171 9111627 8931491 9453618 9321838 8843702 9255174 8517157 7952508
6194 7952508 8383335 8427673 8363546 7608928 8036094 8024789 7807624 8177733 8071143 7796054
6184 7796054 7264169 7718466 7981721 7059462 7063775 7356927 7279037 7396042 7279583 6860121
6174 6860121 6833847 6614855 6512690 6816005 6814909 6249301 6082615 6031600 5917322 6211934
6164 6211934 6108548 5407025 5384082 6234330 6095531 5969789 6793911 6426222 6086660 5912257
6154 5912257 5809573 5480763 5475232 5591935 5738393 5569523 5248037 5002286 5463343 5623896
6144 5623896 5275530 5257822 4837556 4830381 4831867 4420118 4680955 4809635 4765007 4531272 4632162
6133 4632162 4920812 5388732 5302834 5052987 4853414 4750873 4523267 4372429 4715744 4983990
6123 4983990 4498591 4377520 4799101 4674462 4086722 3998157 4112086 3907086 3960357 4021254
6113 4021254 4209947 4209847 3513705 4029957 3963333 3961542 4136325 3630187 4061218 4310672 4343697
6102 4343697 4271939 4404668 4155875 3973547 3892874 4313305 4111716 3759687 3929556 4086987
6092 4086987 3840747 4038926 3963875 3672625 3710929 3988003 4119730 4543866 4220246 4009378
6082 4009378 3959579 3961873 3740439 4092589 4442284 3677922 3219150 3608998 3326008 3379236
6072 3379236 3568736 3829920 3879628 4247164 3920123 3649731 3411284 3749310 4002197 3708243
6062 3708243 3809207 3873310 3986446 4402355 4135209 3440784 3067868 2789426 3176101 3769777
6052 3769777 3781956 3871962 3820718 4056345 4104998 3899687 3973375 3465943 3579576 3160446
6042 3160446 3849018 4000590 3284168 3346305 3101857 2998518 3561820 4000483 3910731 4167574
6032 4167574 4297073 4263211 3862187 3742015 3656294 3616213 4288162 3847047 3650589 3709311
6022 3709311 4308814 4355860 4290509 4588379 4548359 3962635 4014617 4125035 4161761 3731245
6012 3731245 3843836 4024825 3866774 3969485 3871099 3647519 3435056 4024234 4461785 4283500
6002 4283500 4277683 4321857 3774811 4242664 4168608 3744251 4233843 3836838 3759227 4288360
5992 4288360 4325010 4405620 4299740 4422343 4466360 4496996 4621037 4243281 4074255 4433217
5982 4433217 4764514 4586552 4227877 4536905 5034636 5089955 4973323 4785370 4695554 4975465
5972 4975465 5189521 4829467 4750303 4252900 4335298 4854196 4926230 4575072 4398269 4758355
5962 4758355 4818037 4109698 3797693 3705869 3894554 4434893 4100036 3902541 3531584 3392134
5952 3392134 3534311 3149415 3368440 3759168 3724227 3835218 3742572 3802247 4350271 4163390
5942 4163390 4186121 4376595 4100867 4119705 3777224 3996180 4208342 4127728 4400186 4141400
5932 4141400 3899807 3974516 4180988 4515186 4048865 3467747 3543656 3156446 3265131 3632849
5922 3632849 3807828 3968343 3977259 3930930 4071766 3996719 3756841 3584608 3570024 3831580
5912 3831580 4204906 4458186 4173588 4265499 4132990 3493424 4196088 4679499 4414771 4759883
5902 4759883 4749753 4528430 4586621 4929457 4650751 4372218 3849677 4279128 4676282 4650441
5892 4650441 3953448 3486331 3279478 3328972 3725943 4130071 4082053 4080085 4291037 3883592
5882 3883592 3516507 3903591 4385776 4440615 3810135 3771523 3599976 3717742 3799891 3460389
5872 3460389 3921382 3262942 3297581 3845379 4484884 4593022 4275102 3920256 4047913 3908594
5862 3908594 3966898 3799093 4083014 4313164 4313606 4045213 3802667 3828278 3910691 4068415 3887247
5851 3887247 4513363 4673806 4518098 3965458 3738850 3569192 3782015 3895131 3952156 3976714
5841 3976714 4000255 3979162 4064033 4282955 4646861 4887496 4201439 3885964 4176093 4447159
5831 4447159 4249045 4168731 4222008 4072678 4640335 4653145 3771545 3703161 4027598 4253036
5821 4253036 4146345 4028222 3756938 3698327 3981294 4019290 4390509 4607450 3849053 4182817
5811 4182817 4387546 4275300 4583129 4646890 4896437 5108780 4936750 5139616 5063207 4467247
5801 4467247 4635914 5064330 5339067 5371656 5246182 5050865 4354077 4351763 4524173 4975159
5791 4975159 5400769 4858136 4690467 4643390 4965607 5055853 4848195 5231181 5471633 5354216
5781 5354216 5118043 5066520 5186119 5281466 5440197 5399465 5103717 5251283 5809988 5641770
5771 5641770 5436245 5183335 5679687 5737877 6131309 6063969 5662184 5716919 5303234 5796902
5761 5796902 5923672 5954034 5639463 5796635 5968726 5620606 5807526 6339830 6400097 5849466
5751 5849466 6112423 6614871 6422269 6699692 6459308 6635090 6959531 6916301 7460615 7332000
5741 7332000 7230833 7063281 6983007 6953697 7626421 7330682 6856366 7346028 7188775 7561827
5731 7561827 7784164 7937549 7745170 7607818 7598963 7400274 8096886 8634840 9044632 8936712
5721 8936712 8511286 8753297 8791762 8586023 9083194 8942560 9088492 9830665 9905310 9983648
5711 9983648 10008646 10294308 10285184 10273499 10123341 10352070 10633614 10933430 10866383 10738598
5701 10738598 10500978 10800384 10887426 10164674 10574721 10892870 10987198 10397276 10720970 11700014
5691 11700014 11647397 11455855 11424282 11149294 11103971 11537919 11616061 11422867 11416644 11522957
5681 11522957 11997668 12431110 12189965 12645195 12364764 13049919 13262084 13005043 12872776
5672 12872776 12209713 12752664 12703893 12495161 12690232 12934733 13603475 13948779 13651962 13365273
5662 13365273 13976284 14446414 14886166 15021606 15112120 15370637 15584654 16035567 15559748 15474225
5652 15474225 15802419 16276591 17255969 17778193 17823803 18106967 18656333 19217196 19460128 19563941
5642 19563941 19490817 20352797 20886581 21251640 21594945 22541144 23195438 23031757 23736964 25277478
5632 25277478 26324878 27001015 28123975 29576684 30263082 31848149 33482988 35188356
5624 35188356 37853805 40368940 42581646 45188838 47670168 51369008 56205557 60749656
5616 60749656 65810966 71358851 77134163 82988136 90093927 97017110 104372147 111870717
5608 111870717 118728929 125315945 130957505 136306768 139877622 141832143 141073056 139051816
5600 139051816 135683116 129626286 123358682 117037932 110243187 102977703 95657793 88905089
5592 88905089 82159912 75229735 68895842 63442367 59168870 54858885 50784874 47396751
5584 47396751 44736174 42250225 39650483 37450503 35376906 33728355 31968847 30675833
5576 30675833 29681426 28097816 26884808 25896900 25564744 24668814 23591972 22950153 22464323
5567 22464323 21409122 20717895 19977237 19288372 18510763 18180164 18356888 18245408 18014894
5558 18014894 16652585 15903897 15851457 15334561 15220388 14967111 14908164 14813052 14236544 13543539
5548 13543539 13739401 13928369 13539340 13184649 12956615 12491152 12166266 11855386 11836764 11348070
5538 11348070 11027591 11309983 11163540 11035574 10938754 10779077 10320690 9656983 9674873 9420746
5528 9420746 9605207 9840583 9368629 9259778 9487385 9296245 9008619 9030038 9055614 8749861
5518 8749861 8808206 8513417 8384175 8771894 8277158 8150839 8057111 7719001 7710509 7874442
5508 7874442 8336873 7934777 7857833 7737802 7505588 7688189 7235243 7550443 7694233 7864205
5498 7864205 7430646 7657292 7598225 7508064 7374213 7152781 7250367 7160312 6817446 6728016
5488 6728016 5998756 5588564 6112203 6210422 5832415 6155992 6187400 6540127 6402711 5782931
5478 5782931 5600867 5460028 5973056 6178786 5916046 6313978 6695189 6248861 5809309 6240806
5468 6240806 6548747 6440171 6149770 6048556 6099148 5488878 5783017 6202801 6092353 6457415
5458 6457415 6373663 6379982 6409029 6395073 6641934 6148365 5916141 5721535 5712093 5814642 5830227
5447 5830227 6207626 6116392 6293982 6101601 5807769 5545942 5541471 6161582 6183513 5903792
5437 5903792 5924960 5874093 5784003 6154943 5873256 5755962 5442133 5751802 5847991 5905561
5427 5905561 5664801 5693940 5419766 5357883 4778424 4904565 5418068 5128084 5170127 4833016
5417 4833016 5329761 5142199 5064135 5456527 5661772 5727266 5728565 5278114 5398333 5130851
5407 5130851 5054150 5631847 5796445 5915596 5461296 5234064 5624983 5871604 5613328 5200301
5397 5200301 5316975 5808363 6069839 5663286 5549965 5164619 5048407 5660715 5385656 5364623
5387 5364623 5381919 5399759 5134360 5129033 5053257 4849219 4689327 4457290 4606074 5085211
5377 5085211 5402765 5164190 4974750 4911121 4859490 4601878 5036127 5211799 5162884 4753443
5367 4753443 4422180 4585122 5037735 5179028 5317805 5549456 5568454 5346048 4668525 4278925
5357 4278925 4144630 4729837 4689336 4322116 4494789 4743681 5216005 5000688 4520459 4963508
5347 4963508 4986756 4920334 5212252 4954507 5202424 5166825 4866372 4768601 4611149 4924999
5337 4924999 5556357 5339604 5256669 4813283 4958156 5037567 4784230 4671967 4883124 4999258
5327 4999258 4942079 5644857 5725824 5716054 5431966 5616207 5180128 5075376 5035213 4755551
5317 4755551 4747116 4798579 5001781 4922493 5279576 5255518 5058585 5228023 5017132 5008048 5017014
5306 5017014 5317307 5112150 5444919 5438051 5429692 5420608 5292241 5316462 5224910 5396769 5507228
5295 5507228 5675800 6391705 6097995 5861393 5787053 5596337 5706118 6043962 6195025 5870866
5285 5870866 6092219 5847779 5741937 6131979 5820198 5726415 5669825 5428866 5968579 5959132
5275 5959132 5805506 6032258 5895355 6054259 5855717 6088288 6362354 5829226 5346401 5345304
5265 5345304 5817739 5093018 5118402 5260994 5330235 5602600 5719596 5222936 5391203 5634143
5255 5634143 5853249 6324207 5941346 5460774 5905652 6108089 6070920 6182903 6227854 6149439
5245 6149439 5993262 6189336 6230800 6200939 6189861 6376248 6548674 6474277 6162096 5758400
5235 5758400 6151863 5948015 6018085 5821032 6045354 6449600 6440019 6552885 6457598 6885680
5225 6885680 7326196 7023272 6874040 7633621 7259012 7161622 7181144 6493567 6321513 6651480
5215 6651480 7134829 6977365 6766136 6718584 6032695 6247822 6264266 6565607 6921102 6747652
5205 6747652 6784642 7084079 7061257 7070253 7170561 7272460 7362066 7255398 7231428 7616870 7684840
5194 7684840 7084793 7337467 7406692 7213613 6976373 7138657 6674256 7415368 7303759 7603085
5184 7603085 7135196 7060220 7477174 7180614 7099541 6878034 6914551 6618902 7003425 7573665
5174 7573665 7569587 7024529 7396771 7377827 7251414 7311741 7267348 6733132 6593862 7291716
5164 7291716 7351646 7385876 7413321 7583213 7848195 8058859 8239509 7688282 7495542 7964979
5154 7964979 8186340 7758723 7806036 7985298 8327232 8496731 8318203 8575504 8976624 8758018
5144 8758018 8559708 8961275 9361553 9341927 9229798 8783358 9339015 9366319 9466220 9589707
5134 9589707 10023377 9923852 10012365 9739233 10033273 10136829 9636399 10532918 10846562 11066471
5124 11066471 10987505 10488856 10562712 10236223 10176278 9766189 9569042 9651392 9937485 10147289
5114 10147289 10148467 10217369 10078433 9784549 10196055 10266444 9640311 10173247 10059110 10428451
5104 10428451 10417814 10666048 10601016 10725078 10800624 11149123 11009268 10753995 10769136 10720553
5094 10720553 10327446 10351796 10829529 10602870 10655285 10634542 11001893 11260761 10995517 10953914
5084 10953914 11247183 11833283 12200904 11893524 11994222 12376715 12666273 12083824 12422698
5075 12422698 12428518 12762918 12829325 13020711 13452069 13191647 12945079 13595245 13639042 13621532
5065 13621532 13998130 13862192 13784335 13817242 14373198 14015311 14218731 14281861 14540400 14850061
5055 14850061 15003511 14924699 15078081 15325186 15619559 15358492 15000509 15984869 16182421 16123899
5045 16123899 16104063 16653266 17123214 17081253 17704688 18373988 18844309 18702759 19439026 19273055
5035 19273055 19429313 19757712 19546794 20048913 20353272 19789927 20041865 19914051 20593001
5026 20593001 20744193 20652088 20305875 20960840 21250909 21392875 21459321 21175986 21205335 21271100
5016 21271100 21578697 21457427 22141556 22324738 22799221 22848492 22636209 22666173 23438855 23686100
5006 23686100 23684642 23767725 23683904 23556479 24092369 24444245 24278639 24446095 24429261 24712910
4996 24712910 25717833 26543255 27256673 27717867 27694666 27927843 28522727 28802102 29204343
4987 29204343 30047026 30891359 30845806 31408581 32408257 32834827 33196735 34435368 34746509
4978 34746509 34928740 35913375 36704509 37393214 38291950 38693870 39629167 40756090 41427093
4969 41427093 42719963 44077271 44510132 45108104 46177396 47413638 49017673 50667339
4961 50667339 52685859 53972686 55826785 57355176 58888920 61699004 63871280 66959855
4953 66959855 69758149 73006110 76709255 80815839 84759216 88874094 93892144 99015507
4945 99015507 103927317 109156234 115287285 121756298 129913010 137613300 145887482 154472420
4937 154472420 163775855 173170935 182505831 192309600 202298722 211511575 220201274 227525647
4929 227525647 232426923 234058122 233366730 229636336 223591527 215348431 206376240 197484496
4921 197484496 188569737 180760248 172931201 164906333 155840066 146789198 138015349 129799651
4913 129799651 121752408 114563537 107852002 102539719 97881073 93524072 90011321 86934835
4905 86934835 84005299 81264419 79159471 76907110 74632934 72421674 69934992 68211615
4897 68211615 66407944 63899049 61956778 60383282 58350647 56359654 55173824 54317856
4889 54317856 53447665 52484327 51706232 51732210 51270936 50114370 49027611 47768381 46196029
4880 46196029 44927388 43385154 41595422 39570825 38371757 38045297 36978976 36160402
4872 36160402 35342717 34561458 33916367 33032248 31798998 31266275 31314862 30966821 30620561
4863 30620561 30511748 30052652 29400217 29247526 28719279 28479345 27851189 27943927 27699314 27339107
4853 27339107 27281712 26880412 26509003 26764449 26230447 26024994 25963782 25618146 25946096 25787238
4843 25787238 25760027 25304847 25294488 25162722 24925324 24428484 24405798 24521326 24720598 25082873
4833 25082873 24611870 24267252 24026225 23547410 23137645 23621704 24172247 24114878 24170521 24112188
4823 24112188 23738377 23907938 23988836 24095193 24086920 23980543 23848663 24076615 23934043 23372437
4813 23372437 23720739 24267407 24844696 24121794 23853129 24181645 24317610 24026342 23852731
4804 23852731 23993219 24245111 24377521 24679152 24949791 25152177 25539605 25009193 25097528 25126018
4794 25126018 25147554 25876961 25484136 25608108 26005878 26188941 26112881 26446547 26361722 26983281
4784 26983281 27652245 27426188 27866355 28081584 28513467 28705494 27990750 28548005 28742821
4775 28742821 29424508 30504985 30773555 30890941 30853620 31180918 31395527 31964497 32503930
4766 32503930 33058452 33630562 34516353 35279438 35527456 35902806 36098514 37226097 37921691
4757 37921691 38662876 39501196 40257902 41251674 41385056 41937068 43103552 43863074 44399764
4748 44399764 45802151 46847828 48882297 50776386 52246371 54653293 57003262 60171773
4740 60171773 63344194 66066626 69316656 73935401 79040976 84970882 91586025 98767365
4732 98767365 106405085 115543584 127472659 140709200 155621598 173770644 194134320
4725 194134320 216846074 243150401 269714104 291280348 297119788 281535527 252039389
4718 252039389 220300512 190489960 165244731 146511160 131691642 119485660 110226629
4711 110226629 102431567 96075018 91019926 86658777 81824325 77829986 74923576 72103213
4703 72103213 69294058 67070715 64803512 63419262 61700735 60502244 59670636 59171518
4695 59171518 58355246 57711359 57056411 55775023 54987875 54499699 54175701 54009061 54048815
4686 54048815 54256367 54696774 55089692 55266926 55198397 55581017 56533668 57533756 58749710
4677 58749710 60661968 62435380 63874852 66070182 68542935 71294400 75089990 78482964
4669 78482964 83172196 87770749 93409180 99765642 107271323 115400315 124258327 134158360
4661 134158360 146003577 159391118 174285491 191772704 211492309 233196740 255225964
4654 255225964 274767129 287017928 287492312 275122851 253089796 226694129 200740158
4647 200740158 178037933 158745147 142920935 130377173 119653570 110613750 103178924
4640 103178924 96769484 90987425 85512758 80651212 76154377 72280592 68844038 65630366
4632 65630366 62186010 58705835 56436120 53760776 51691756 50376259 48297420 46681650
4624 46681650 44491375 42936710 41499948 40004570 38699416 37263202 35797837 34846262
4616 34846262 34344377 33487707 32469474 31715689 30763124 29700248 28783344 27602136 27776759
4607 27776759 27454658 26208564 25672397 25218170 24035841 23907292 23471430 22676274 22353504
4598 22353504 21917107 21392660 21197601 20936391 20338040 19801253 19296452 18852114 18673419
4589 18673419 18107325 18089123 17973962 17506830 17320538 16948391 16809256 16959471 16805577 16385872
4579 16385872 15975889 16233754 15815054 15851377 15295823 15032626 14700614 14112252 13806775 13875176
4569 13875176 14153482 13408998 13134525 13142623 13428151 13303334 12864812 13021778 12848277 12110575
4559 12110575 12301808 12341435 12181216 11793393 11475573 11394403 11668634 11847494 11533336 11617157
4549 11617157 11586200 11398491 11502473 11018169 10838425 10473616 10626457 9845380 10087728 10690362
4539 10690362 10346029 10333598 10424563 10462589 10475689 10613806 10639070 10899130 10592787 11033394
4529 11033394 11412660 10765943 10635553 10646846 10434895 10607886 10714654 10269971 10180517 9792237
4519 9792237 9811845 9862775 8956058 8508719 8702947 8719634 8501198 8464043 8382734 8371166 8201855
4508 8201855 8130494 8120518 8047663 8175816 7802896 7505412 7367159 7405947 7455381 7448090 7401428
4497 7401428 7023440 7105252 7284495 6826922 6692200 6319971 5918407 5975460 5977879 5901872
4487 5901872 6399926 6496168 6358060 6054904 6121265 6463791 6395220 6256583 6292514 6320595
4477 6320595 6323809 6256612 6126869 6052636 6083009 6329345 5862588 6163794 6033314 6072121 5882900
4466 5882900 5683675 5387863 5155733 5180531 5359280 5281512 5142910 5168209 5305505 5216140
4456 5216140 5359631 5447109 5396736 5845446 5545865 5172141 4956887 5068867 5216856 5134223
4446 5134223 5223076 5483124 4903956 5187878 5760304 5467876 5276085 5182724 5195092 4856984
4436 4856984 4998606 4781519 5329239 5715702 5450164 4978500 5383306 5338032 5174302 5055750
4426 5055750 4867036 5356448 5451691 4685236 4576402 4810191 4459584 4807294 5068790 5368886
4416 5368886 5120764 4885185 5219713 5098888 4935953 5259925 5407753 5572301 5773754 5820940
4406 5820940 5663563 6001282 6278828 5839041 6052308 6392831 5896777 5171718 5009483 4807416
4396 4807416 4849355 4670454 4196816 4662468 4853283 5235601 4967416 4904321 4797503 4679395
4386 4679395 4583082 4410971 5216350 5259796 5097908 5094561 4852707 4686201 4222432 4156113
4376 4156113 4593708 4915028 4775673 4110514 3946161 4460090 4261036 4226162 4206580 4579728
4366 4579728 4304979 3862605 4519960 4580935 4475441 4312449 4599438 4752685 4772643 5173028
4356 5173028 5056348 4360482 4539949 4688541 4476558 4374167 4534350 5383366 5826418 5654918
4346 5654918 5110885 5053377 5425468 5393382 4975614 4166506 4716413 4826310 4159660 4322991
4336 4322991 4335941 3876742 4150781 4978287 4885808 4959454 4532762 4297685 4203764 4214276
4326 4214276 4543958 4235929 4260462 4330306 4323400 4801266 4728492 4773191 4292846 4611322 4981127
4315 4981127 5101445 5325278 4666597 4708266 4671130 4871326 4888176 4953191 5296779 5191109
4305 5191109 5106911 4908174 5005959 5181569 5178640 4786616 4973188 5021644 4946813 4779027 4671093
4294 4671093 4592210 4857966 4471245 4715753 5002931 4641624 4299865 4280623 4686695 4754097
4284 4754097 4542461 4624415 4772670 4841656 4772493 4696276 4985869 4979831 4740962 4867884 4997024
4273 4997024 4653417 4744426 4659171 4451280 4651483 5011196 4744599 4688584 4561262 4988548
4263 4988548 5091947 5377750 5076869 4838380 5360372 5301612 5301778 5500068 5905414 5504664
4253 5504664 4640668 4567693 5155330 5868881 5466177 5442272 5924837 5839168 6051321 6088774
4243 6088774 5787155 6113876 5760395 5888753 6150340 5923491 5505628 5818995 5889807 6273717
4233 6273717 6122665 5940790 6163064 5951002 5908118 5804159 5855943 5869948 6272127 6952065
4223 6952065 7080699 7151121 7343714 7012946 7104144 7249070 7169370 7054681 6776493 6687185
4213 6687185 7069538 7267259 7471146 7309870 7494035 7399312 7627647 7334470 7455518 8173374
4203 8173374 8076385 8060267 8380007 8399741 8320867 8315706 9186949 9732301 9424106 9473985 9494148
4192 9494148 9167964 9307789 9642840 9707803 10030192 10089112 10194065 9710589 9557079 10273805
4182 10273805 10128790 10439026 11087395 11406964 11573510 11054223 11055801 11021225 11480773 11836080
4172 11836080 12147346 12091206 12309875 12695423 12533514 13108343 13396545 13412439 13985316 14564509
4162 14564509 14703955 14567140 14391080 14902883 15367560 15455872 16273354 16388540 16594040 17063247
4152 17063247 17802997 17497185 17363272 17952265 18748618 19422032 18959220 19232170 19295244 19729587
4142 19729587 19449480 19984526 20356781 20625316 21095359 20695386 21198026 21242233 21157355 21502654
4132 21502654 21444134 21264517 21651089 21053463 20858835 21471114 21220826 20624709 20497757 19967373
4122 19967373 19951753 20122144 19700586 19451087 18855307 18988252 18771931 18875090 18555225 18300685
4112 18300685 17815870 17836707 17280487 16852180 16524910 16179012 15854397 16022791 15394001 14262275
4102 14262275 14173958 13719897 13843090 13457057 12877868 12858138 12952158 12306168 11931577 11645157
4092 11645157 11900313 12221680 11686709 11416765 10946251 10386290 10704371 10031263 10214006
4083 10214006 10191362 10162549 9737103 9229653 9051283 8980917 8976545 9074157 8756540 8443136
4073 8443136 8216279 7846705 7835220 7467985 7796785 7673741 7679193 7422473 7734084 7412425
4063 7412425 7187107 7390319 6964926 6833683 6545851 6585393 6487744 6424265 6723706 6869135
4053 6869135 6553019 6552602 6581040 6097076 5809705 5395001 5371489 5445324 5973189 5650102 5467127
4042 5467127 5210022 5176531 5563303 5875686 5926884 5482441 5083755 5063028 4638306 4230833
4032 4230833 4617035 4812618 4718897 4283312 4277184 4497559 4487916 4371568 4481450 4756125
4022 4756125 4733933 4500622 3957964 3886994 4740667 4767538 4154953 4115848 4251956 4417648
4012 4417648 4180775 4141560 4324626 3625948 3110277 3414588 4321187 4299964 4131655 4397955
4002 4397955 4097304 4177135 4276022 3937942 3534646 3480430 3671922 3684286 3341793 3857919
3992 3857919 3919571 4030568 4165507 3640429 3355121 3151768 3275050 3334670 3103130 2888630
3982 2888630 3391724 3095224 3477355 3506722 3818254 3424189 3361234 3459955 3293430 3020933
3972 3020933 2757551 2903265 2962689 3255000 3486413 3686288 3255793 2874665 2959232 2586061
3962 2586061 2529056 2930389 2908958 2536694 2592419 2653234 2732109 2489704 3100795 2925417
3952 2925417 2661274 2729337 2526238 2761246 2871315 3256300 2953298 3031186 2811323 2652687
3942 2652687 2627481 2795482 3199631 2914336 2606666 2568945 3004108 3587366 3002869 2645143
3932 2645143 2500026 2301648 2464790 2708041 3164303 3236345 3621519 3256953 2748997 2611070
3922 2611070 2809282 3013257 3311646 3493553 3124002 3031672 3013560 3042085 2956295 2218900
3912 2218900 2194330 3235399 2760021 2682594 2911605 2483659 2481769 2852699 2612996 1708796
3902 1708796 2136474 2554484 2625197 3227985 2839280 2766095 2490355 2021099 2565401 3058499
3892 3058499 3505342 2995292 2318625 2554700 2732522 2421567 2422193 2969423 2397122 2481047
3882 2481047 2211473 2488098 2250268 2287887 2644389 2625672 2708773 3023640 2972062 3012398
3872 3012398 2210034 1554506 2103209 2203783 2315821 2806877 2969373 2509489 2727358 2611361
3862 2611361 2254823 2379178 3183835 3351662 2551164 2504431 2383054 2622352 3126223 2879713
3852 2879713 2405460 2637270 2195902 2552868 2483448 2315783 2674439 2885280 2398520 1944508
3842 1944508 2563268 2908044 2345880 2234333 2454781 2550536 2902515 2655513 1809336 1959981
3832 1959981 2594567 2585767 3275379 2955428 2692298 2610185 2886769 2998100 3270104 2800717
3822 2800717 2758857 3177057 2933695 2613630 2840996 2793314 3168002 3038138 3181751 2703013
3812 2703013 2563813 2463806 2108805 2467489 2774558 2798982 3058937 3323242 3118035 2950243
3802 2950243 2876994 2358315 1949558 2795995 2682608 2572657 2596535 2305130 2374321 2053002
3792 2053002 1735636 2382634 1978783 2701393 3243911 2786872 2819482 2650596 2753319 2705522
3782 2705522 3035393 2915776 2532579 2697915 2916250 2791114 2740540 2630365 2310020 2144215
3772 2144215 2351415 2559756 2557069 2225933 2144491 1907429 2046624 2202827 2160992 2000038
3762 2000038 2169296 2365436 2670311 2742145 3005023 3028279 2822004 2209628 2452095 2434682
3752 2434682 2464429 2691790 2340996 2380261 2171960 2648707 2817494 2556472 2622740 2581181
3742 2581181 2106567 2302555 2430315 2766580 2645420 2579926 2414966 1983354 2614196 3139920
3732 3139920 3013293 3247984 3243227 3416736 3549460 3024048 2638120 2825450 2530256 2595091
3722 2595091 2515601 2649347 3112632 2868852 2689275 2873225 3015370 2619330 1981349 1969839
3712 1969839 1983659 2199333 2873297 2701930 2756290 2791506 2946335 3086093 2831052 2281061
3702 2281061 2275110 2639892 2398087 2520728 2501997 2158167 2772667 2819424 2530092 2254367
3692 2254367 2387974 2874590 3162879 2930116 2308440 2303529 2264572 2056936 1929870 1998121
3682 1998121 1958976 1950760 1853303 1913504 1983586 2050357 2546893 2779088 2605209 2515186 2477043
3671 2477043 2384502 2509402 2911206 3218819 3378554 3229394 3247452 2695448 2874604 3262637
3661 3262637 2707210 2493680 2996422 3106905 2779743 2875215 2903102 3048071 2651822 2161209
3651 2161209 3048540 3183800 3135046 3302512 2853608 2303627 2442016 2916539 2653268 2740741
3641 2740741 3168766 3052279 3292863 3160484 3309797 3166012 2962320 2888264 3053312 3220122
3631 3220122 2840734 3374790 3013604 2770527 2918749 3071263 3520519 3646942 3369177 3302051
3621 3302051 3932423 3860547 3355134 3397074 3250606 2834760 2920475 3754290 3888871 3859201
3611 3859201 3879991 3328786 3336808 3180607 3288365 2897536 3035297 3175221 3529087 3787214
3601 3787214 3934201 4584258 4258673 3813841 3667376 3942285 4001267 3497048 3156490 3258953
3591 3258953 3755806 3274366 3257468 3950216 3720414 3963253 4222722 3658645 3389849 3929624
3581 3929624 4148029 4219973 4289557 4233730 4257736 4637352 4888648 4957040 4649509 4394167
3571 4394167 4139813 4287266 4394166 4873859 4996529 4671043 4423745 4641533 4647415 4472621
3561 4472621 4672005 4490022 4377706 4505559 4645292 4407503 4587703 5033258 5320186 5240911
3551 5240911 4821732 4574216 4494061 4337820 4881853 5580111 4902533 5609910 6214945 6415001
3541 6415001 6103367 5964556 6058901 6157897 6358496 6031400 5921001 5973567 6371752 6731056
3531 6731056 6512505 6466232 6320351 6449543 6277113 6422425 6591048 5710740 5603626 6676056
3521 6676056 6894309 7326467 7127757 7358752 7919739 7667668 7701036 7901012 8086300 8394045
3511 8394045 8230133 8001439 8449457 8299471 8645510 8725497 8769813 8627046 8484438 9001914
3501 9001914 9494606 9143297 9370054 9790321 9860773 9755852 10549949 11068051 11504408 12388917
3491 12388917 12454435 11883648 12334972 12801780 13862161 14154944 15025681 15620805 15874903
3482 15874903 16506848 17302655 17608440 17462576 17870364 18141211 18311145 17915668 18431158
3473 18431158 18738495 18506105 18435121 18513422 18595455 18040868 17386203 17508060 16768098 15497406
3463 15497406 15583860 14999721 14606152 14053580 13470411 13049650 12833152 12570901 12634110 12449282
3453 12449282 12024058 12814453 11460214 11057050 11278599 11498786 11016205 10929628 10755291
3444 10755291 10561421 10195972 9818949 9440686 9563781 9745285 9202447 8727555 8263307
3435 8263307 8016074 8401824 8765223 8758337 8452727 8242639 8093469 7349793 7580566 7553617
3425 7553617 7602018 7616247 7657971 7055729 6865215 6787731 6777074 6966336 7157467 7127891 6553495
3414 6553495 6435397 5950298 5913354 6547022 6117580 6065262 6130443 5782799 5696157 5912040
3404 5912040 5829946 6110010 5784264 5544244 5349801 5058026 4560606 4559435 5224846 5402592
3394 5402592 5739250 5197710 4530770 4480779 4812355 4731515 4571157 4503773 3991489 4376412
3384 4376412 4856063 4697332 4547834 4223703 4389352 4332227 4164474 4243213 4462176 4344426
3374 4344426 4393450 4245544 4111914 4481700 4561406 4390386 4350119 4282420 4518478 4666485
3364 4666485 4438468 3975004 3993893 4312219 3891222 3407586 3423297 3903121 3664700 3441871
3354 3441871 3440775 3614230 3459942 3547951 3420049 2854096 3661070 3954262 3593660 3339776
3344 3339776 3401513 3415694 3252615 3384557 3355533 3668089 3904796 3456705 3121448 3117132
3334 3117132 2918787 2756261 3634260 3669617 3271169 3542965 3028563 3438430 3399231 3707781
3324 3707781 3641747 3131245 3105350 3511913 3274972 3025919 2714575 3244671 3665992 3133258
3314 3133258 3326884 3481278 3519168 3163695 2905055 3199217 3489942 3247897 3231208 3271630
3304 3271630 2801215 2361643 2649497 3394333 3660279 3255489 3112298 2783534 3208207 2984499
3294 2984499 3401376 3646927 3331452 2987957 2913032 2943266 3335991 3141273 3059439 3367986
3284 3367986 3466248 3165860 3366968 3128763 3291223 3034283 2831083 2765063 2855022 2373496
3274 2373496 2997721 3497062 3511969 3000649 3067421 2773501 2592159 3092569 2846910 2955594
3264 2955594 2809766 2689854 2481370 2429149 2642514 3089321 2793381 3217680 3071230 2999179
3254 2999179 2722214 2935217 2438081 2439586 2986239 3223157 2705528 2183092 2478258 2476681
3244 2476681 2475182 2972396 2498015 2445276 2340339 2482533 2764628 2473317 2625896 2756031
3234 2756031 3440031 3709936 3481862 3475112 3423024 2941101 2937304 2898649 2463681 2790815 2977230
3223 2977230 3128713 2987039 2959018 2907355 3079422 2884939 2725633 2793896 2985695 2913483
3213 2913483 3023784 3260725 3335550 3531960 3387007 3000925 2838469 2909267 2860597 3149202
3203 3149202 3665773 3451882 3385424 3230014 3502173 3895861 3951563 3750226 3657493 4065567
3193 4065567 3910718 3816473 3647526 3758552 3613504 3568324 3558570 3202628 3222498 3498575
3183 3498575 3482691 3742455 3961341 3979010 3559144 3810243 4057234 4153801 5012968 4552065
3173 4552065 4474885 4624736 4653745 4946187 4828666 5132574 5568989 6002076 6032160 5722860
3163 5722860 5872349 5408214 5250788 5556493 5890542 6263256 6387807 5760663 5993454 6493784
3153 6493784 6509476 6719940 6918269 6795329 6590002 6997829 7215809 7139089 7136632 7469181
3143 7469181 7756328 7695773 7820456 8242921 8303105 8307401 8537128 8937644 9227844 9718610
3133 9718610 10273427 10358401 10800131 10458533 9930774 9718342 9541987 9066529 8472036 8944283
3123 8944283 8599879 8092362 8442667 8369896 8204468 8203571 8033681 8047700 7914972 8065054
3113 8065054 8344316 8474679 8619343 8656091 8569695 8662953 8850665 9023978 8803349 8602297
3103 8602297 9115626 8847650 8379188 8529407 8482222 8277521 8292663 7982959 7922468 7453050
3093 7453050 7040474 7322039 6647647 6378815 6280430 6521599 6521952 6693465 6523111 6419693
3083 6419693 6393975 6623764 6287333 6596295 6036612 5745739 5721436 5181274 5044096 5266226
3073 5266226 5636300 5691170 5097656 4832394 4750583 4577151 4273307 4391826 4221922 4389474
3063 4389474 4421623 4113880 3672058 3741244 4105468 4151049 4354984 3806694 3626973 4151064
3053 4151064 4136595 4023646 4223991 3827791 3750588 3329302 3248918 3064549 3165514 3114924
3043 3114924 2914023 2823393 2780149 2153027 2182969 2604840 2501786 2375757 2342246 2248520
3033 2248520 2595680 2688930 2182517 2533560 1748603 1537829 2171334 1882683 1942897 2202892
3023 2202892 2348398 2340942 2574940 2648068 2212477 2008382 2425169 1899014 1551917 1759766
3013 1759766 2111927 2201253 2084007 1564147 1439981 2075817 2581281 2194283 1834077 1956683
3003 1956683 1953185 2154727 2724638 2317731 1960955 2004607 2250162 2066591 1582616 1355927
2993 1355927 1262839 1493488 1592996 1689098 1534615 734265 660166 1125934 1447192 1441810 1109240
2982 1109240 1336949 1636502 1244736 1175782 1289015 1340397 1221555 1618651 1454736 1499363
2972 1499363 1703809 1257888 1529796 1354558 1578243 1623683 1829102 2091012 2109095 1941547
2962 1941547 1387393 1562677 2242716 2142016 1758170 2004167 1848973 1566209 1729806 1849535
2952 1849535 1360193 1406201 1361801 1248784 929553 1271172 1320996 1295626 646740 632170
2942 632170 1082968 836631 1321741 971499 1117894 908721 475154 554438 1147188 1450298
2932 1450298 1691181 1777593 1739908 1490692 799573 618046 931026 1129070 844187 1351163
2922 1351163 950918 1170472 1473805 1383263 1642037 1541918 1230203 1151176 1636511 1556032
2912 1556032 1641555 1328442 998798 1072667 1224979 1198703 1929919 1710038 1376569 1401625
2902 1401625 978583 742733 659873 746676 1003285 1165562 1366133 1507260 1684758 1713127
2892 1713127 1872619 1847965 1623437 1578816 1891272 1435453 1407370 1466757 1131459 908038
2882 908038 1756259 1779008 1612160 1098868 963953 1202995 977630 1244033 1698516 1552802
2872 1552802 1575060 1470480 944366 1908046 1722556 1332591 969979 1033282 1080507 1014535
2862 1014535 791251 609653 716832 1190027 1360281 1106183 922763 855863 1258569 1563368
2852 1563368 1708186 1820002 2094111 1330382 1098255 960469 1232578 1461990 1467434 1420664
2842 1420664 1365113 1466946 1344189 1287301 1559548 1644855 1392846 1485496 1779619 1810176
2832 1810176 1634036 1298344 1080869 1202197 924735 1015831 1419430 1050981 716371 700066
2822 700066 411167 899070 1050366 1177512 1270024 1239719 1041951 807891 1024336 1328599
2812 1328599 1300061 1243612 1072971 1060386 1093394 1236081 1229776 1435338 1765686 1768228 1895542
2801 1895542 1639201 1879709 1589959 1467059 1902643 1850944 1638738 1190723 1273228 837695
2791 837695 555566 881235 1040139 1602068 1802086 1342088 1369090 1333675 1014621 1088421
2781 1088421 1189175 1438642 1460169 1396114 1139021 920223 1203762 1269051 1519471 1277555
2771 1277555 1273042 1314391 1208956 1439674 1628807 777860 993736 1321343 952592 1080351
2761 1080351 1022969 1310849 1713073 1661299 1638323 1684666 1096431 886679 1408370 1071084
2751 1071084 797401 1061715 1043325 705037 669834 1306397 1408166 1351761 1462942 1486264
2741 1486264 1344909 833055 1004272 808774 912951 1122169 1214344 1237657 1028975 1309012
2731 1309012 1309341 1163475 1096615 1137199 1592251 1771907 1481265 1461411 911626 934081 812814
2720 812814 859638 1156085 917231 895335 979145 1288813 1526692 1085865 1255368 1397813
2710 1397813 477692 457148 863388 1033525 1792143 1966891 1882415 1779871 1231582 1182484
2700 1182484 1301862 1067364 1223417 1236835 806857 1293827 1624663 1554794 1616349 1370200
2690 1370200 1659617 1381632 733343 1133040 1067269 1107162 1210670 1437420 1245430 1235519
2680 1235519 1585734 1496490 1163352 1170610 1441078 1482023 1599906 1250874 1646281 1375005
2670 1375005 1448211 1551005 1111734 797397 393869 817893 1378798 1877260 1809398 1715812
2660 1715812 1257137 1211285 1500504 1163393 1191536 1399169 1215054 949628 1600300 1890953
2650 1890953 1729725 1764560 1490505 1224194 1327996 1247605 1084113 1202967 1040018 1246077
2640 1246077 1083810 1126304 1454142 1473046 1810141 1676327 1525130 1225695 1243628 1696073
2630 1696073 1684965 1609936 1990292 1421786 1601485 2119812 1895040 1689006 1303537 1044176
2620 1044176 1529350 1735500 1536881 1381886 1711530 1260269 1147944 1684931 1573975 1333364
2610 1333364 1928069 1725143 1764563 1919196 1682587 1901145 2215771 2203225 2205282 2507238
2600 2507238 2417546 2349503 2679900 2736907 2635552 2920446 2312594 1747940 2115678 2448456
2590 2448456 1985428 1929008 1717531 1432021 2014251 1594693 1636205 1923868 2187734 2542644
2580 2542644 2127513 2123854 2129810 2306818 2322602 2074007 1921685 2130921 1773961 1628464
2570 1628464 1784746 1628143 2231826 1957978 2263782 2439646 2028714 2162899 1978078 2051365
2560 2051365 2104556 2129453 1602355 1999164 1801415 2069668 2122172 1885566 1985369 1483895
2550 1483895 1494410 1568163 1605120 1439315 1527095 1964587 2364619 2272471 2074905 2005781 1614096
2539 1614096 1606925 1649549 2079562 2125593 2042829 1997127 2152149 2208159 2507119 2199037 1887280
2528 1887280 1713361 2048362 2240861 2043042 2694625 3146122 2621354 2166240 2235236 2613958
2518 2613958 2697799 2309279 1784266 2053744 2301740 2742611 2737742 2333944 2131540 2249938
2508 2249938 2608121 2758845 2813893 2481031 3042091 2679898 2297595 2774105 3221570 2812305
2498 2812305 2578913 2966515 2914426 2553928 2576910 2870150 2394836 2396792 2879264 3296558
2488 3296558 3343946 3709397 3582970 3476289 3391542 3284242 2923028 2504340 2584732 3397878
2478 3397878 3683486 3802317 4391495 4230914 3868280 3525133 3410197 3913222 4321050 4491733
2468 4491733 3956850 3809510 3940335 3985438 4337622 4406044 4209696 4191374 4719797 4656482
2458 4656482 4453194 4714005 4871835 4542703 4730252 4716673 4923100 4761856 4797789 4653544
2448 4653544 4723130 5051222 5327182 5220895 5221463 5234833 5688106 5516580 5503258 5285135 5049324
2437 5049324 5484887 5652403 5107139 4904939 5253446 5412636 5597631 5269474 5505597 5433123
2427 5433123 5420193 5613955 5828278 5912758 6455532 6625364 6376505 6678572 6239915 6597196
2417 6597196 6586643 6282507 6203856 6220395 5786920 6113461 7108670 7511483 7121043 7512829
2407 7512829 7400785 7154600 6709395 7092305 7615325 7362330 6727995 7040852 7293289 7215163
2397 7215163 6754436 6951053 7298727 7460517 7755857 7731947 7878214 8070409 8082652 7850934
2387 7850934 8131652 8529771 9120724 9229499 8838923 8752284 9421850 9911637 9790437 9079035
2377 9079035 9287401 9901130 10231250 10203351 10576081 10544091 11283228 11708788 11998353 12448836
2367 12448836 12057276 12292683 12688710 12839213 13667693 14518447 14953169 15401176 15976810
2358 15976810 16156246 16555743 18012421 18976550 19933323 21627508 22911914 24205813 25605741
2349 25605741 27647776 30269556 32906927 34933271 37767453 40645103 43614389 47174727
2341 47174727 50969920 55865707 61978097 68809167 77563086 87007124 97842956 110093919
2333 110093919 124468363 139866017 152403578 155116085 144815091 127426615 109177937
2326 109177937 93271215 80491925 69830138 61906031 55821829 50019270 45451830 42817193
2318 42817193 40498549 37967672 35856174 33569181 32029981 29991485 27390357 26375278
2310 26375278 24522942 23192463 21465060 20417658 19903780 18955627 17978350 17326587 16589670
2301 16589670 15169964 14898718 14890665 13927674 12714981 12067516 12343968 11929987 11237076
2292 11237076 10762282 10388634 10284497 10045201 9991258 8999973 8629258 9089541 8476235 8062103
2282 8062103 7945209 7784586 7978477 7860979 8356293 7572920 6567410 6603728 6622841 6645010
2272 6645010 6414298 5417767 5497012 5909659 6003725 5439346 5074628 4907073 4775656 4727236
2262 4727236 4710506 4731213 4782152 4697159 4811578 5354287 5099931 4567428 4772392 4955521
2252 4955521 4653492 4559837 4670468 4379890 4483755 4110840 3855274 3909582 3931371 3795158
2242 3795158 3410085 3024990 3226994 2889022 3571701 3268718 3194732 3206770 3107017 3783986
2232 3783986 3818744 3228125 2888106 3071625 3190661 3075301 2926248 2955207 2532930 2750984
2222 2750984 2614354 2521307 2308081 2274211 2710137 2780170 2939208 2794013 2583451 2465926
2212 2465926 2792764 2536436 2165731 2490993 2083310 1920138 2162734 2228399 2519634 2132658
2202 2132658 1745302 2368413 2679805 2487271 2502918 2192912 1703346 1659081 2109638 2073208
2192 2073208 1650810 2016357 2008742 2111820 2427374 2124652 2024828 2140988 2106011 2097390 2088538
2181 2088538 2467028 1823176 1476842 1607872 1845644 1416964 1392651 2273842 2191266 1708953
2171 1708953 1576730 1917502 2046876 1997138 1861244 2237477 2276597 1871170 2050403 2012798
2161 2012798 1515925 1535109 1671866 1938992 1811989 1834090 1541536 1204877 1190938 2240422
2151 2240422 1960150 1622732 1675655 1580820 1631399 1048110 982471 1545157 2269284 1757094
2141 1757094 1277048 1155792 1286014 634420 1145793 1825981 2136192 1601403 1304202 1137025
2131 1137025 1281399 1452577 1319315 1241576 1444847 1167773 1519829 1578343 1378904 852633
2121 852633 650805 1191699 1415997 1350660 1641160 2129539 1906651 1489810 1221878 1749870
2111 1749870 1291090 1091036 727132 587484 889425 1096548 1439104 1090475 960659 1547225
2101 1547225 1408746 797744 890818 886183 1340995 854524 1130183 1851451 1681376 1359875
2091 1359875 1198260 1338071 1114160 1541163 1598504 1461492 1405065 1067664 962016 1287803
2081 1287803 1848980 2169353 1801525 1539141 1388243 1476688 1269714 1559951 1569549 921907
2071 921907 1118557 1269213 1041211 1544079 1962971 1800162 1368165 1142162 1192563 1193833
2061 1193833 1049993 1618313 1910787 1524509 1713519 1859150 1584498 1042320 1274207 1093230
2051 1093230 728638 893459 1469815 908014 500563 714508 736220 1136187 1366460 906871
2041 906871 776804 1689880 1722938 1503399 1287395 1425672 829607 478904 776151 1024763
2031 1024763 552219 589053 1181681 1116248 1045216 1005707 1000848 674853 759671 355419 389239
2020 389239 225512 306710 537549 879023 756052 717727 1325781 1819621 1584067 1095036
2010 1095036 957768 877054 738717 751102 1130081 877701 476627 539645 777650 962990
2000 962990 1130879 1199869 990120 609727 1162816 1337777 1079960 643403 1075741 818818
1990 818818 1103530 943146 874795 869183 597769 19346 155583 772032 876580 1117851
1980 1117851 1105961 878461 585943 325109 366616 898244 1244666 975326 738605 249338
1970 249338 347725 1456163 1412328 1181239 1041007 792801 511287 273755 335645 99419
1960 99419 543847 987860 1061055 581359 554558 556864 358405 432990 660055 904645 893587
1949 893587 587753 295563 615922 764549 580439 365875 585470 740316 371307 151300
1939 151300 399029 242962 404214 745923 1195296 1029356 598160 478975 259178 144404
1929 144404 819422 870056 1160373 1264046 974115 693932 357481 326505 501373 784106
1919 784106 979492 542774 729070 608477 393565 337464 845715 795666 798883 509329
1909 509329 512751 510571 616813 735589 541253 719539 834980 1380564 740958 811718 862281
1898 862281 402972 503883 634154 655740 435622 383097 -86684 51115 317338 610076
1888 610076 295081 414552 270232 333815 262976 523165 637129 584338 268344 -13385
1878 -13385 437749 459751 820149 816634 837536 401093 425332 251577 596914 1027169 587036
1867 587036 75338 685685 242412 382426 805037 505276 438301 633497 394673 776339
1857 776339 768820 558091 593258 444217 461053 927540 597177 380552 870423 742058
1847 742058 510656 -765 -168817 158198 563669 780267 982570 942988 563709 366463
1837 366463 332653 -216373 -79252 42561 -78817 357379 84581 362122 489359 756763
1827 756763 738952 176127 186537 -59810 217630 386590 361225 188473 82654 35457
1817 35457 473694 711074 784927 1026592 1216394 938341 474805 140620 869424 610460
1807 610460 345314 816505 749168 572857 652565 1056482 1183310 1559805 1094892 606603
1797 606603 750763 1151699 482466 276791 414152 380250 909546 954585 560831 1003258
1787 1003258 552574 100646 492919 574516 936111 1024179 732457 862998 900872 777539
1777 777539 844445 503363 187454 141813 701778 681824 902748 833435 431027 902140
1767 902140 1004117 677251 498988 99132 403194 640226 680801 1204389 760863 484916
1757 484916 332546 359986 593228 264656 383120 320031 117068 78047 117797 279752
1747 279752 359654 210411 835900 488260 159405 312311 342350 566916 575031 854041
1737 854041 1258663 928683 462157 500824 736542 1176430 580125 774815 766204 1083814
1727 1083814 1161064 561814 245556 385809 831618 478442 767551 910521 792437 684286
1717 684286 396894 513732 784866 860306 859845 694892 426345 316462 226244 491407 121886
1706 121886 690026 681768 776725 690955 326932 -203979 -505215 -142335 -3159 74260 431089
1695 431089 206166 -282007 108479 831259 1177302 870542 451810 309853 884459 399362
1685 399362 372086 802471 762115 659725 1411711 1431401 958417 752336 404837 693201
1675 693201 990946 1201537 842165 345932 87138 230931 343608 905060 736453 588184
1665 588184 1109314 896281 780179 465006 710406 821280 445275 456626 195470 381480
1655 381480 528446 318149 330465 45522 1775 197831 257031 -11775 571673 690047
1645 690047 1000627 704680 703589 694270 1034369 834689 794165 769162 770027 342293 909181
1634 909181 770461 733580 1285221 540530 281971 454879 858913 236201 174315 500243
1624 500243 694541 758330 805065 554527 332546 370070 698130 615448 487109 142620
1614 142620 212978 429211 635202 788239 844956 536471 9821 -6338 184412 218565
1604 218565 256834 153863 469765 196043 -402571 -336577 -24052 205463 548993 552156
1594 552156 585635 827569 393891 679501 1076493 260683 215788 374334 576577 894487
1584 894487 991261 834217 823168 472510 403009 1003561 1276100 917147 639080 634409 489891
1573 489891 1012816 670590 879157 1151656 557986 474781 847937 844779 777323 524311
1563 524311 592400 502193 511704 817499 392763 154501 467258 660618 521933 692281
1553 692281 484399 574059 555824 447801 301582 394483 336154 303548 421553 492487 608942
1542 608942 660478 769373 782722 181295 408015 241035 762215 786614 314855 546642
1532 546642 1011885 1167395 376837 61483 644806 971202 466986 381306 406334 456026
1522 456026 556935 463039 132454 522910 736569 340354 534453 694522 350301 353573
1512 353573 616763 971382 1002163 551917 227578 415987 206238 209423 243827 88111
1502 88111 366702 41387 420283 395679 -163185 369204 -148151 9294 826672 957240
1492 957240 834660 482930 204491 212460 256983 197073 -382549 -446369 -397367 -313576 208300
1481 208300 700934 999254 664880 162047 314083 311394 469366 370112 565026 -57413
1471 -57413 -243374 462825 320750 426320 375214 518802 416963 414035 230837 -74377
1461 -74377 81489 936268 820910 -101304 -255255 62980 248113 326924 469958 521385
1451 521385 116550 -165444 91291 241205 461187 647609 580001 927827 922748 868454
1441 868454 1099296 477366 -102359 -64603 409793 856461 902902 768270 561437 339883
1431 339883 493595 84528 234963 108156 148108 269324 126422 60702 37390 68511
1421 68511 370212 360363 64334 299756 491285 835678 568410 458155 479041 418447 -135441
1410 -135441 -200226 314832 -64822 -146815 17639 311962 147016 265936 526584 683593
1400 683593 815420 492682 363129 600372 777957 99343 30901 326109 747909 959918
1390 959918 580092 395255 -16362 606945 830344 1114476 804021 478253 809881 177989
1380 177989 314493 594331 498636 1110842 1106115 1016390 816925 -25994 652620 420248
1370 420248 477254 723373 519036 680425 803852 226339 178930 586287 571394 454080
1360 454080 624546 428728 795590 912129 225647 129935 383074 155507 492669 355933
1350 355933 -299251 333181 864069 382669 463055 230791 55873 271007 288016 247424
1340 247424 134072 249579 572290 606810 274761 220123 327896 -7809 -138812 587840
1330 587840 619071 385325 99106 306416 341127 122185 765703 327287 125193 295750
1320 295750 -45681 268614 258198 586843 801486 417806 314838 205097 442295 799641
1310 799641 322717 197469 531614 738609 610505 644998 499250 296564 365709 148664
1300 148664 482790 992447 723378 837433 670825 500454 291971 259881 42444 54683
1290 54683 358930 343910 501297 577779 530585 706218 651032 2449 159068 716932 914956
1279 914956 943758 586890 1020410 862366 196497 348467 402008 430528 275565 891816
1269 891816 748855 292391 189814 904494 1295493 1086011 715578 391119 295047 181516
1259 181516 455844 721105 931780 557472 620312 856237 1057866 668529 306109 -92
1249 -92 175960 549760 736510 366989 704439 1025028 1282493 973545 413058 426519 557564
1238 557564 -194983 106450 452520 63525 752458 1130172 675768 427653 633351 314036
1228 314036 676544 385497 535875 744732 510982 552920 1113939 853764 608995 -60187
1218 -60187 -389160 -113311 381015 99232 -32463 414520 327601 526582 420013 223121
1208 223121 -62453 400664 681232 702503 339726 220334 -46974 257598 503590 173814
1198 173814 49917 222027 711788 827632 641891 1044540 443145 346932 164957 439428
1188 439428 974468 555549 576205 354352 -178195 259608 868607 754705 958532 484131
1178 484131 298247 417331 394805 141723 201032 398267 721462 376275 289745 638380
1168 638380 876195 395691 926164 667204 751189 822171 349245 552837 359506 367063
1158 367063 562626 222561 428993 182279 -84568 166897 557770 889345 619721 607513
1148 607513 361955 213504 772971 723029 845497 825650 834847 625631 131194 610522
1138 610522 384377 -102388 -340652 264152 274369 523222 547683 -222247 -7374 719043
1128 719043 473047 628504 234836 311679 193638 441837 742896 513112 611808 521688
1118 521688 764970 680089 524115 761465 670052 646261 350773 441279 1185042 875574
1108 875574 739958 288905 687088 804756 797701 434607 324335 534572 575726 479299
1098 479299 204861 665586 888746 503782 611108 780538 -10865 115726 497600 56877
1088 56877 -485595 -225299 218903 735320 791507 605083 559317 622703 404372 1185835
1078 1185835 1230582 725375 557691 496927 480588 960565 797954 654968 219531 -338
1068 -338 31499 -247246 -101729 19269 470285 98364 269797 398123 649013 348134
1058 348134 549118 563684 646111 985311 670434 413854 554355 369301 361860 221436
1048 221436 261530 486483 452280 621556 622518 693668 778168 601442 459192 682714 195219
1037 195219 -408932 -18613 5771 427919 1264008 1131983 802881 695966 722248 280622
1027 280622 473968 551812 756979 592484 187807 471270 243653 201588 243949 103671
1017 103671 149478 678754 923911 862667 1050324 1048592 932650 821861 1194870 967469
1007 967469 559825 1029201 914981 635098 319894 792812 1253442 530816 241378 357049
997 357049 387164 514025 998551 666216 251193 428989 554781 731235 1068993 721628
987 721628 771959 918570 648453 551707 812764 1144145 765687 577543 406898 227778
977 227778 569845 902613 840979 587301 681018 794427 716654 344334 427260 304156 173211
966 173211 491530 781391 787419 866093 1428351 948885 570299 558714 459132 261573 276783
955 276783 452488 261462 348902 369321 309315 525059 613509 1069036 1314498 1227132 721867
944 721867 792285 1008624 822177 944061 949297 819164 817339 673799 460137 325499 154269
933 154269 694587 656735 364349 598264 242878 515772 781901 1005077 808539 753448
923 753448 733177 424608 195057 187046 625953 475509 241108 115126 -86934 182936
913 182936 160215 -33477 207798 344971 224149 -229150 272165 934315 774560 437434
903 437434 158875 222958 389756 -132935 -74397 -251055 -393940 -82501 31696 273868
893 273868 676108 761028 704982 522318 405088 938414 555856 613556 1133591 900697
883 900697 596802 1100234 562771 381618 -300141 127656 841687 897053 680952 402965
873 402965 540510 139868 364565 257639 692435 594365 308339 372274 12159 -272640
863 -272640 147425 159925 84633 535842 381804 602737 1221128 890610 616186 487570
853 487570 556885 713187 916610 537485 692292 560699 500023 609006 952086 687415
843 687415 336628 -45547 -90 201531 365762 631426 1016002 558043 27953 604538
833 604538 703784 546527 735830 607857 488297 90520 122781 827296 806758 749165 847409
822 847409 846794 6297 78084 422255 863585 828118 740899 645158 465440 303671 707552
811 707552 696284 80720 152817 187892 -2194 304412 805487 909794 798485 723683 391632
800 391632 551581 328145 154812 341467 318740 301983 476858 515666 450452 679787 486581
789 486581 478548 170864 185711 766402 813687 303520 41719 51004 100103 100065 545714 686015
777 686015 854310 102774 173288 583964 1109752 1088720 694552 953943 -140076 -729756
767 -729756 -31860 -30213 -62509 197202 -54211 -54977 -19758 487811 812183 36983 697512
756 697512 1038201 611016 867266 521264 458387 227957 580809 635422 387662 324802
746 324802 411835 -147844 -220662 -29714 425257 407101 718015 592367 590169 778646 660176
735 660176 607742 546346 522974 740786 712351 893229 886084 722500 374294 -225682 -83993
724 -83993 -78827 577466 632822 422054 695775 872955 1251180 1148031 877368 656056 -34093
713 -34093 34880 498251 285375 618860 615689 451081 279923 351167 -10541 -371149 34666
702 34666 294149 571084 606713 327298 859248 1102846 896086 635529 -27213 386901
692 386901 46759 355574 1013979 979055 643101 1051747 697866 911933 1386009 923272
682 923272 743747 869352 872523 642502 593981 574530 -131567 134295 311239 502469 619847
671 619847 576312 400475 805977 850371 757785 766294 590061 120305 -123808 250284 592199
660 592199 598580 -138170 266513 474535 367490 840340 874919 386990 531370 235122
650 235122 -332408 -119235 207092 243713 252641 77751 -135675 73858 -103158 49172
640 49172 437724 914612 908273 602324 377189 -351070 -141061 -218297 492472 1023575 346374
629 346374 167496 462323 892573 588270 333382 143874 695345 1257821 1128159 1165536
619 1165536 501726 847459 545808 195500 -129234 -236722 927069 872152 652661 945305
609 945305 703430 510667 221768 424181 372572 39355 152159 413775 586647 964679
599 964679 796887 640773 617232 200164 244815 584886 386149 484728 441861 -147678 -225679
588 -225679 204118 606265 736017 781320 328960 549730 645441 551802 953557 751756
578 751756 468868 843042 383208 -17674 218512 642879 985220 956455 1217258 1010188
568 1010188 1095446 1034912 753015 626097 260594 249851 60593 -459776 -30361 246249
558 246249 201242 613989 930477 847277 263705 445453 636087 325960 35187 -299379
548 -299379 -372119 168661 755798 496628 169944 440779 945756 814037 593506 454310
538 454310 401935 150469 476990 763567 559120 231678 -16509 -176549 -800162 -1188223
528 -1188223 -574585 -33138 576923 621244 232213 360045 358596 332693 483641 803961
518 803961 782431 815512 301989 405682 539555 605861 624971 721148 794642 646843 472048
507 472048 627212 812150 658995 34029 192041 220997 246348 439243 523530 950998
497 950998 465100 17323 646958 721174 738983 711931 318354 78768 -166679 349883
487 349883 403920 -66415 -178725 -122442 -157263 -128421 -198909 -179421 157777 142312 643796
476 643796 389052 70827 142700 586770 811834 424386 618883 658530 64110 -229590
466 -229590 165883 204340 -107453 270436 667190 355372 439808 110012 -170011 242015
456 242015 566939 3941 315103 647686 619034 306780 -348445 -97701 416000 250891
446 250891 174730 94679 142744 683184 114421 317392 777942 768973 918791 912926 697866
435 697866 281296 432409 752335 692086 633359 630428 266955 533041 452697 571931 606531
424 606531 104646 332127 694321 380727 255779 -138968 255748 224432 328734 538294
414 538294 706936 1234920 1008947 1128970 1597921 1191269 655217 781604 218471 302229
404 302229 499906 496148 291905 383099 413049 516502 228356 210395 547080 991074 760834
393 760834 543904 194180 515958 727126 554925 -1020 82408 568910 425015 838648
383 838648 735476 408581 367617 437053 228877 448644 200615 332757 -18493 210220
373 210220 313279 772469 325754 -75902 32029 143705 -49378 431309 299320 219895
363 219895 105131 260929 899069 867667 1056758 458964 801881 834892 514431 518303 693874
352 693874 1017920 719942 876517 945507 731300 607982 527902 419634 722988 779262
342 779262 708092 397387 116861 760373 723414 711390 585578 739044 767888 1072607 523664
331 523664 789205 861587 1159677 709618 48680 326811 169645 51201 50791 449849 502790
320 502790 328891 287978 843541 927043 430381 631105 787953 276740 -50375 406837
310 406837 -43006 -170742 138637 484529 349965 -95585 225032 443019 449767 932378
300 932378 940027 1304189 1072021 693868 546811 106301 108685 41921 -87537 264248 716871
289 716871 427952 323340 270080 600511 893085 1054898 651194 631854 1154940 1124365
279 1124365 654599 558012 435403 251372 718265 949431 581261 497904 547451 340535
269 340535 67199 129447 458844 888935 200307 -69447 211576 30967 23941 136898
259 136898 433820 384280 55898 -164908 308478 217481 41136 -104353 -49260 104750
249 104750 191871 139985 299893 318414 503116 941125 336909 294431 317941 537914 151004
238 151004 167760 95414 286141 341303 342609 347915 112353 117313 141781 462139 628807 271707
226 271707 -115992 -102895 -4626 414374 319617 553652 869396 657874 481618 684603
216 684603 866193 872681 440557 373383 707043 765747 703016 306039 728811 1103266 629726
205 629726 799695 816699 488635 367684 586131 426429 591254 664554 484809 426405
195 426405 207866 436137 525902 238152 -293620 405717 302685 406759 516792 876952
185 876952 711564 448717 517430 476721 358354 598008 538309 203337 77533 71346 143032
174 143032 133747 379266 618090 238823 -88914 241922 728102 1078681 709080 631505
164 631505 455712 308473 604809 832279 918937 567090 -47457 395899 435576 442530 254419
153 254419 605776 596221 743740 681659 707105 421625 294138 510640 418330 700779 515296
142 515296 809705 492743 465049 817799 402216 300446 365200 472776 460377 147505
132 147505 -203427 -164107 228654 428329 712068 435792 241189 266730 -271738 252434
122 252434 302586 125514 172363 329515 252005 171998 216290 -28457 454790 543680 278248
111 278248 220322 422904 661550 725047 527256 551499 307596 93145 284676 72842
101 72842 163277 233117 -9722 -276493 224596 266524 221458 337886 143725 233680 167230
90 167230 468488 565586 191087 -93192 -50262 267852 -19235 13610 -115058 169788 457745
79 457745 555107 64060 -77226 -51938 -53959 253482 367555 45374 -111356 45313 -117994
68 -117994 258314 197440 23541 247245 79717 -143582 90367 103144 492267 466538 428179
57 428179 394097 -254394 -262039 284797 169699 276584 -44181 -43543 -137676 -82286 -369722
46 -369722 -570564 -60513 -143688 -71257 166388 -30742 202241 95056 -27050 59332 -296201
35 -296201 -182054 -96922 67797 -377896 -187581 189069 -51468 -3609 88814 308453 3133
24 3133 -289840 -315918 -152545 -353887 -279536 -15479 279255 176588 55802 128085 123760
13 123760 329960 315531 72904 301018 198871 -212135 -108924 252501 447029 470987
3 470987 357083 54321 -202321
0 -202321
$$ Imaginary data points
##PAGE= N=2
##DATA TABLE= (X++(I..I)), XYDATA
16383 -1187409 -1670370 -1440374 -1136951 -1299821 -1369316 -1257443 -1187263 -1199040 -1063132 -578175
16373 -578175 -573833 -787130 -910636 -561071 -82306 -182723 -415580 -501432 -536153 -810514
16363 -810514 -567149 -561694 -446574 -613840 -709992 -727932 -776692 -848882 -1034896 -602659 -480429
16352 -480429 -522529 -506542 -506380 -500759 -124045 55122 59675 222636 108329 -34698 -375
16341 -375 -195901 -399384 -183614 5976 -428923 -61143 213968 347714 5668 -183572
16331 -183572 47670 257633 133391 97768 84548 45815 374106 143970 171266 362488
16321 362488 512712 592289 364507 609851 678727 643599 395842 521169 619070 248259
16311 248259 291326 530211 595621 289435 824039 1042245 765144 473246 456026 963495
16301 963495 777598 881398 902720 1112950 1308371 1140177 1075073 982648 1052557 1130931
16291 1130931 1374701 1071158 1171957 960762 660214 947113 1173565 813779 1101184
16282 1101184 1379607 1295316 1172446 1049492 567640 827950 1152852 1389136 1607939 1548763
16272 1548763 1508001 1048760 1561384 1286329 1121769 1395440 1670946 1681174 1508117 1237812
16262 1237812 1721672 1658944 1799384 1494951 1522430 1646844 1558781 1640098 1329494 1268459
16252 1268459 1222390 1201636 1117430 1383402 1417525 1454897 1881839 2271098 1859017 1802838
16242 1802838 1639315 1769723 1922441 1960297 1503764 1351167 1412660 1632320 2026522 1989254
16232 1989254 2064761 2330261 2014029 1993199 2084983 1901248 1831330 2128615 1673344 1561969
16222 1561969 1651255 1807627 1885254 2158232 2160096 2129550 1704272 1520240 1790854 1905811
16212 1905811 1859135 2274761 2128556 2057347 2457338 2023357 1631945 1611497 2282436 2014260
16202 2014260 1681598 1815559 2196568 2569390 2567088 2537983 2199287 2543364 3192048 3080773
16192 3080773 2874486 2957901 2828047 2318784 2525801 2249549 2266770 2500476 2578063 2527299
16182 2527299 2531947 2860936 3097410 2686064 2535061 2497353 1937902 1818342 2177503 2321746
16172 2321746 2513888 2638142 2553701 2661968 2473551 2572341 2608189 2576607 2287734 1840553
16162 1840553 2124450 2119448 2297273 2492744 2459054 2707443 2207578 2246786 2858962 3146116
16152 3146116 2826205 2114323 2398174 2408060 2442985 2910582 2561268 2121008 2248382 2199809
16142 2199809 2403083 2475415 2352877 2762829 2111512 2326586 2705517 2152286 2409446 2657523
16132 2657523 2719093 3054722 3186109 2738789 2834169 3251147 3234922 2873163 3109590 3258805
16122 3258805 3321853 2766998 2492516 2534632 2671055 1922289 1821107 2056351 2356503 3189871
16112 3189871 2964736 3177515 3090313 3026049 3246900 3026146 3449271 3888241 3291955 2567410
16102 2567410 2446827 2692241 2747037 2904200 2751244 2851503 2984857 2939770 2639545 2832901
16092 2832901 2914650 2538463 3024303 2809515 2752312 2863547 2869631 2734863 2562487 2328768
16082 2328768 2357165 2816999 3221691 2625360 2681039 3017044 3297515 3224073 2746280 2735925
16072 2735925 2567160 3029140 2989773 2731242 2856867 2947552 2962708 2521779 2625099 2870001
16062 2870001 2669512 2852428 2832473 2783268 2658578 2605063 2676254 2760034 3068457 2925855
16052 2925855 2533383 2416657 2851601 2834039 2555868 2516334 2859696 2699234 2959289 2788929
16042 2788929 2514617 2805775 2704756 2478483 2481649 2766592 2271947 2062832 2243650 2452981
16032 2452981 2525318 2239487 2508449 2963403 3526622 3678676 3201384 3329439 3023146 3224378
16022 3224378 3236089 3068823 2056794 2311769 2935552 2636169 2133299 2286003 2370930 2578809
16012 2578809 2356215 2007068 2396024 3109197 3015505 2836294 2341253 2419243 2419875 2740187
16002 2740187 2964446 2896994 3203356 2695930 2326110 2769900 2840800 2840902 2832729 2741549 3073929
15991 3073929 2716231 2371600 2678701 3143563 2779161 2536997 2718886 3148954 3285799
15982 3285799 3076905 2990632 2778222 2644485 2696559 2996477 3408573 3476612 3380103 3741578
15972 3741578 3635356 3381060 3239960 2779931 2840186 2472294 2546173 2837502 3201115 3200879
15962 3200879 3124254 3109246 3388406 3255191 2810519 2737297 2948143 2542421 2560920 3020027
15952 3020027 2802964 2120268 1955809 2471948 2587898 2622635 2765023 2986755 2944857 2701426
15942 2701426 2726703 3105674 2996771 2868923 2790449 3091812 2967576 2638158 2835821 2845325
15932 2845325 2851093 2734112 3410753 3044666 2545760 2955613 2865762 2961940 3574476 3363966
15922 3363966 3196952 2709013 2170569 2297765 2311315 2639027 2968535 2946025 2863977 3065846
15912 3065846 2944969 2897115 3201596 3215632 3120768 3253523 2933561 2705418 2877394 3054539
15902 3054539 3424635 2824085 2552684 2665626 2689930 2905396 3099391 3175338 3190599 3084796
15892 3084796 2681715 3111646 2972152 2765566 2957633 2433378 2836595 2756396 2633401 2785808
15882 2785808 2695164 2755475 2258287 2485722 3293459 3297205 3129763 3227025 3473181 3411015
$$ [...]
##END NTUPLES=NMR SPECTRUM
##END=
