##TITLE=1H_DE-80H_X3
 200.13MHz, d2o
 8 sc
 
 19ns.26.2.2025
##JCAMPDX= 6.0         $$ Bruker NMR JCAMP-DX V2.0
##DATA TYPE= NMR SPECTRUM
##DATA CLASS= NTUPLES
##ORIGIN= UXNMR, Bruker Analytische Messtechnik GmbH
##OWNER= pz
$$ XWIN-NMR		Version 3.5
$$ Fri Oct 10 11:42:53 2025 Russian Standard Time (UT+4h)  Yarkov@DPX200
##.OBSERVE FREQUENCY= 200.1313
##.OBSERVE NUCLEUS= ^1H
##.ACQUISITION MODE= SIMULTANEOUS
##.ACQUISITION SCHEME= undefined
##.AVERAGES= 8
##.DIGITISER RES= 18
##SPECTROMETER/DATA SYSTEM= spect
##.PULSE SEQUENCE= zg30
##.SOLVENT NAME= CDCl3
##.SHIFT REFERENCE= (INTERNAL, CDCl3, 0, 17.8558)
##AUDIT TRAIL= $$ (NUMBER, WHEN, WHO, WHERE, WHAT)
$$ ##TITLE= Audit trail, XWIN-NMR		Version 3.5
$$ ##JCAMPDX= 5.01
$$ ##ORIGIN= Bruker BioSpin GmbH
$$ ##OWNER= Yarkov
$$ C:/Bruker/XWIN-NMR/data/yarkov2/nmr/H-C/1/pdata/1/auditp.txt
$$ ##AUDIT TRAIL=  $$ (NUMBER, WHEN, WHO, WHERE, WHAT)
(   1,<2025-10-10 11:41:04.93 +0400>,<Yarkov>,<DPX200>,
      <created by zg, POWCHK disabled, PULCHK disabled
       configuration hash MD5:
       00 E9 B6 7A A2 85 ED C7 34 08 36 98 17 FE 4E 26
       data hash MD5: 16K
       3E B0 BF 38 69 59 0C 4B 0A FB F0 9C 5E F3 B3 B9>)
(   2,<2025-10-10 11:41:13.20 +0400>,<Yarkov>,<DPX200>,
      <Start of raw data processing
       efp BC_mod = 2 LB = 0.25 FT_mod = 6 PKNL = 1 PHC0 = -2636.563 PHC1 = 8.79097 SI = 16K 
       data hash MD5: 16K
       0A 20 5E 92 9E 31 D1 A8 2A 21 51 95 CA 4D 51 CC>)
(   3,<2025-10-10 11:41:43.59 +0400>,<Yarkov>,<DPX200>,
      <abs ABSG = 5 
       data hash MD5: 16K
       45 E4 B4 84 B4 F6 01 D1 C2 95 9A 9A 3D 2D 9C B3>)
(   4,<2025-10-10 11:42:25.40 +0400>,<Yarkov>,<DPX200>,
      <pk PHC0 = -2.225002 PHC1 = 6.400002 
       data hash MD5: 16K
       BA 8C DE B9 00 90 95 2B 45 23 55 5C 44 B8 B8 0E>)
$$ ##END=
$$ 
$$ hash MD5
$$ DF 53 59 8E CC CA B3 8E 10 1C CB FE D5 40 B6 CB
##$RELAX= 
##$RELAX= 
##$RELAX= 
##$RELAX= 
##$RELAX= 
##$RELAX= 
$$ Bruker specific parameters
$$ --------------------------
##$DU= <C:/Bruker/XWIN-NMR>
##$EXPNO= 1
##$NAME= <H-C>
##$PROCNO= 1
##$TYPE= <nmr>
##$USER= <yarkov2>
##$AMP= (0..31)
100 100 100 100 100 100 100 100 100 100 100 100 100 100 100 100 100 100 
100 100 100 100 100 100 100 100 100 100 100 100 100 100 
##$AQSEQ= 0
##$AQ_mod= 1
##$AUNM= <au_zg>
##$AUTOPOS= <>
##$BF1= 200.13
##$BF2= 200.13
##$BF3= 200.13
##$BF4= 200.13
##$BF5= 200.13
##$BF6= 200.13
##$BF7= 200.13
##$BF8= 200.13
##$BYTORDA= 1
##$CFDGTYP= 0
##$CFRGTYP= 5
##$CHEMSTR= <none>
##$CNST= (0..31)
1 1 145 1 1 1 1 1 1 1 1 1 1 1 1 1 1 1 1 1 1 1 1 1 1 1 1 1 1 1 1 1 
##$CPDPRG= <>
##$CPDPRG1= <>
##$CPDPRG2= <>
##$CPDPRG3= <>
##$CPDPRG4= <mlev>
##$CPDPRG5= <mlev>
##$CPDPRG6= <mlev>
##$CPDPRG7= <mlev>
##$CPDPRG8= <mlev>
##$CPDPRGB= <>
##$CPDPRGT= <>
##$D= (0..31)
0 0.7 0 0 0 0 0 0 0 0 0 0.03 0 0 0 0 0 0 0 0 0 0 0 0 0 0 0 0 0 0 0 0 
##$DATE= 1760082064
##$DBL= (0..7)
120 120 120 120 120 120 120 120 
##$DBP= (0..7)
150 150 150 150 150 150 150 150 
##$DBP07= 0
##$DBPNAM0= <>
##$DBPNAM1= <>
$$ [...]
##$SUBNAM3= <"">
##$SUBNAM4= <"">
##$SUBNAM5= <"">
##$SUBNAM6= <"">
##$SUBNAM7= <"">
##$SUBNAM8= <"">
##$SUBNAM9= <"">
##$SW= 18.0517328524113
##$SWIBOX= (0..15)
0 0 2 0 0 0 0 0 0 0 0 0 0 0 0 0 
##$SW_h= 3612.71676300578
##$TD= 16384
##$TD0= 1
##$TE= 0
##$TE2= 300
##$TE3= 300
##$TEG= 300
##$TL= (0..7)
0 120 120 120 120 120 120 120 
##$TP= (0..7)
150 150 150 150 150 150 150 150 
##$TP07= 0
##$TPNAME0= <>
##$TPNAME1= <>
##$TPNAME2= <>
##$TPNAME3= <>
##$TPNAME4= <>
##$TPNAME5= <>
##$TPNAME6= <>
##$TPNAME7= <>
##$TPOAL= (0..7)
0.5 0.5 0.5 0.5 0.5 0.5 0.5 0.5 
##$TPOFFS= (0..7)
0 0 0 0 0 0 0 0 
##$TUNHIN= 0
##$TUNHOUT= 0
##$TUNXOUT= 0
##$USERA1= <user>
##$USERA2= <user>
##$USERA3= <user>
##$USERA4= <user>
##$USERA5= <user>
##$V9= 5
##$VALIST= <valist>
##$VCLIST= <CCCCCCCCCCCCCCC>
##$VD= 0
##$VDLIST= <DDDDDDDDDDDDDDD>
##$VPLIST= <PPPPPPPPPPPPPPP>
##$VTLIST= <TTTTTTTTTTTTTTT>
##$WBST= 1024
##$WBSW= 4
##$XGAIN= (0..3)
0 0 0 0 
##$XL= 0
##$YL= 0
##$YMAX_a= 72088
##$YMIN_a= -119219
##$ZGOPTNS= <>
##$ZL1= 120
##$ZL2= 120
##$ZL3= 120
##$ZL4= 120
##$ABSF1= 17.85577
##$ABSF2= -0.1961212
##$ABSG= 5
##$ABSL= 3
##$ALPHA= 0
##$AQORDER= 0
##$ASSFAC= 0
##$ASSFACI= 0
##$ASSFACX= 0
##$ASSWID= 0
##$AUNMP= <proc_1d>
##$AZFE= 0.1
##$AZFW= 0.1
##$BCFW= 0
##$BC_mod= 2
##$BYTORDP= 0
##$COROFFS= 0
##$CY= -3
##$DATMOD= 1
##$DC= 0
##$DFILT= <>
##$DTYPP= 0
##$F1P= 0
##$F2P= 0
##$FCOR= 1
##$FTSIZE= 16384
##$FT_mod= 6
##$GAMMA= 0
##$GB= 0
##$INTBC= 1
##$INTSCL= 3.241238e-09
##$ISEN= 128
##$LB= 0.25
##$LEV0= 0
##$LPBIN= 0
##$MAXI= 10000
##$MC2= 0
##$MEAN= 0
##$ME_mod= 0
##$MI= 1.114404
##$NCOEF= 0
##$NC_proc= -8
##$NLEV= 6
##$NOISF1= 3.799351
##$NOISF2= 2.8
##$NSP= 0
##$NTH_PI= 0
##$NZP= 0
##$OFFSET= 17.85577
##$PC= 1
##$PHC0= -2638.788
##$PHC1= 15.19097
##$PH_mod= 1
##$PKNL= yes
##$PPARMOD= 0
##$PSCAL= 0
##$PSIGN= 0
##$REVERSE= no
##$SF= 200.129532891664
##$SI= 16384
##$SIGF1= 3
##$SIGF2= 2
##$SINO= 0.751879
##$SIOLD= 32768
##$SREGLST= <19F.Aceton>
##$SSB= 0
##$STSI= 16384
##$STSR= 0
##$SW_p= 3612.71676300578
##$SYMM= 0
##$S_DEV= 0
##$TDeff= 16384
##$TDoff= 0
##$TI= <>
##$TILT= no
##$TM1= 0
##$TM2= 0
##$TOPLEV= 0
##$USERP1= <user>
##$USERP2= <user>
##$USERP3= <user>
##$USERP4= <user>
##$USERP5= <user>
##$WDW= 1
##$XDIM= 16384
##$YMAX_p= 344887002
##$YMIN_p= -2367893
$$ End of Bruker specific parameters
$$ ---------------------------------
##NTUPLES= NMR SPECTRUM
##VAR_NAME=  FREQUENCY,     SPECTRUM/REAL,   SPECTRUM/IMAG
##SYMBOL=    X,             R,               I
##VAR_TYPE=  INDEPENDENT,   DEPENDENT,       DEPENDENT
##VAR_FORM=  AFFN,          ASDF,            ASDF
##VAR_DIM=   16384,         16384,           16384
##UNITS=     HZ,            ARBITRARY UNITS, ARBITRARY UNITS
##FACTOR=    0.220516191357247, 1,           1
##FIRST=     3573.46693175217, 0,            0
##LAST=      -39.2498312536068, 0,           0
##MIN=       -39.2498312536068, -2367893,    0
##MAX=       3573.46693175217, 344887002,    0
$$ Real data points
##PAGE= N=1
##DATA TABLE= (X++(R..R)), XYDATA
$$ [...]
5405B44142n3915K60517L1385n82678O4055M6858k69268l44224p4194N84269J14148
5394B1095k20017k04476j31274L32085K94175m2995L69902k98971m54579K02594
5384a32461J68575L2486l49559M30480M08383r85013j36823M47537j15216j38260
5374c69871M08620k27497j59123k22418Q3176M88813J35639l8600j16924r34441
5364i52626j25847O01624l1085k10777O32083L54434k61964L09466j22512k76027
5354h3231k84558j71425L08103M13764K54882q21895n58870J46217K40446r886
5344e66453p1796j21614K6460O00723J130k10060q8266p8331N6400L73407j19606
5333a98006k15671L67562J60568p1827l02273J65626j53120M77706k9188k3267
$$ y = [244142, 190227, 450744, 482129, -100549, -36494, 10364, -258904, -603128, -677322, -93053, 21095, -198922, -403398, -534672, -202587, 91588, 48593, 418495, 119524, -335055, -132461, 36114, 68600, -280959, 149521, 557904, -427109, -563932, -116395, -231611, -369871, 38749, -188748, -347871, -570289, -487113, 1700, 137339, 98739, -18185, -952626, -1078473, -476849, -507934, -718711, -86628, 267806, 5842, 315308, 192796, -83231, -367789, -539214, -231111, 182653, 437535, -384360, -943230, -797013, -556567, -566453, -638249, -759863, -733403, -132680, -131550, -341610, -429876, -508207, -451807, -78400, -198006, -413677, -46115, 114453, 42626, -259647, -94021, -247141, 230565, 201377, 178110]
5323A78110P0718j57477J27724J95167o50175k45927j15340J98561M03667N9927
5313F4955J13659l74143l62211M27964J19283k61570J58519l46353p8388k70037
5303h08322J71110K17071k99103Q6945M43476M60718l6143n89575k29596M23725
5293a59694K20462P5182K44773r4506j05070k10954k8638j38126j6225K07649
5283e147N02600l58218m66447M31170k00127k16428L50722k36402N1868k8878
5273a75287k39197j96185L06746M54720j66125Q3803J38515l41120o7381K93500
5263I1989l57062k86053L96477N8491j12432M7611J94012j88401j1670k75263
5253d42301p7735k58876M88085M0974P2898m46461K34915J11163k7825L49696
$$ y = [178110, 248828, 91351, 219075, 414242, -235933, -481860, -597200, -398639, 5028, 64955, 178614, -195529, -557740, -129776, -10493, -272063, -113544, -459897, -538285, -808322, -637212, -420141, -719244, -632299, -188823, 271895, 235752, -353823, -583419, -159694, 60768, 135950, 380723, 286217, 181147, -29807, -58445, -196571, -212796, -5147, 497453, 139235, -327212, 103958, -96169, -312597, 38125, -198277, -146409, -175287, -414484, -610669, -303923, 150797, -15328, 68475, 206990, -134130, -201511, 91989, -265073, -551126, -154649, -96158, -208590, -160979, 33033, -155368, -167038, -442301, -520036, -778912, -290827, -249853, -176955, -623416, -388501, -277338, -305163, 44533]
5243D4533l9130k66344O2864j05229q9995L97211n1599o9801j64551J7715J2043
5232b52283K97191j56676j58682L92525J19006n96783M11725l83274n29637J90808
5222f66080J78162M81573J72516o185j1809K07615L74149m21241n66931J55727
5212a02504O2931N2356j50115J10957l08307l97129M68341L44072L45725J18654
5202E44981m46066K10716j07319k962j20308k88715J85780q22462K27261N37673
5192h1421j259m02396j59148K42073L95588l23073k49597L59957l09253j12477
5182f41006J92198K05884l8845M36932k6983R8157k97402k41643K00775l81307
5172d93240N51698q5235k75802l62653L4361M47642J80605j72069J47375j03246
$$ y = [44533, 5403, -260941, -198077, -303306, -393301, 3910, -47689, -117490, -282041, -264326, -252283, 44908, -111768, -270450, 122075, 241081, -355702, 56023, -327251, -856888, -666080, -487918, -6345, 166171, 159986, 148177, 355792, 729941, 308700, -258231, -102504, -39573, 12783, -137332, -26375, -334682, -731811, -263470, 80602, 426327, 544981, 98915, 309631, 202312, 199350, 79042, -209673, -23893, -846355, -619094, -81421, -82680, -485076, -644224, -402151, -6563, -329636, -579233, -219276, -528529, -641006, -448808, -242924, -281769, 155163, 128180, 226337, -71065, -312708, -111933, -493240, 58458, -26777, -302579, -665232, -630871, -183229, -2624, -174693, -27318, -130564]
5162a30564J78577J93347N02l15364J78931J79990P5382o91229M78473J18210
5152B66255l8941O28624l15191r2057K45401m41596j36232n289o6103K74923m83221
5141a63427o4534O93986K84266M2925J50857q6514k31851k67244J82294L6806
5131E77564k95004J69097q9134p37127N47128N12436k7027k75722m71970M19088
5121C29329j95686l25497k32991j206k72501K47037M78920k50260N4626r8797
5111b67026N67525q0975l33317J38527L09988N0724n01132Q0558M18887p07144
5101c23385j71522L32059M5021M8400J30144L67324Q6003k61570K97986j88826
5091C61634k10257k00312J10183m4017l75539K64868N78352L51401k30777j89899
$$ y = [-130564, 48013, 241360, 241862, -73502, 105429, 285419, 360801, -330428, 148045, 266255, 227314, 855938, 540747, 448690, 694091, 252495, 116263, 110974, 44871, 319794, -163427, -227961, 466025, 750291, 793216, 944073, 857559, 625708, 358464, 540758, 577564, 282560, 451657, 362523, -374604, 172524, 684960, 657933, 382211, -89759, 329329, 133643, -191854, -424845, -426051, -698552, -451515, 27405, -222855, -168229, -267026, 300499, 219524, -113793, 24734, 334722, 385446, -115686, -35128, 383759, -323385, -494907, -162848, -117827, -69427, 60717, 428041, 514044, 252474, 550460, 361634, 151377, -48935, 61248, 17231, -358308, -93440, 484912, 836313, 605536, 415637]
5081D15637j61110l90126M19623m7225J6804Q7530k95336K86426j50085o72251
5071d90113M66709K90831n24653J77266L58289m40712j00758J90299J92100n02493
5061c83235O3189K90004k42670R8748L72312K12990l4775O4150o0114l84172m22098
5050d25671j0629K31134R0653k42168L03091P27755p20548R3049P18624j17748
5040F47542l56100k43122K98256J95203N2606K1181j68125n77710j96955L42610
5030A5386J43426K72588p9048r0659l08441J36009K64264m79390L58595R9474
5020C32204k93413J38121j13572n2837N72975K15671j98290o00285J792M10644
5010D13010m3406k61386k83003M37106L07079N6917j6949p2665k08326J77280
$$ y = [415637, 254527, -135599, 284024, 236799, 253603, 341133, 45797, 332223, 182138, -490113, -23404, 267427, -257226, -79960, 278329, -162383, -263141, -72842, 119258, -383235, -320046, -30042, -272712, -173964, 198348, 411338, 376563, 440713, 380599, -3573, -425671, -436300, -205166, -114513, -356681, -53590, 674165, -46383, 46666, 765290, 647542, 291442, 48320, 346576, 541779, 594385, 615566, 447441, -130269, -327224, 15386, 158812, 431400, 352352, 261693, -46748, 89261, 353525, -125865, 232730, 332204, 38791, 176912, 63340, 10503, 583478, 799149, 600859, 574, 2366, 413010, 369604, 108218, -174785, 262321, 569400, 626317, 609368, 536703, 328377, 505657]
5000E05657P9727p19769L39532K73765m28790l04724M18749l61056l35639Q9863
4990d42685L13656L50038M73354K94348j09626k34570o89858K55011K17757n77873
4980a50448K50368J84133O40540J0008L13612K07527m33491K28272k42748n72142
4970D35631O71637j54105l7771O48070L90124J27792l05717l57636K07467r6522
4960A528970L8956K94300K26355K30606L08457m11843m34417L74579J90950m64000
4950A882913P6925K09435L41801k9766M681J69703J4310j8766J7825l71451q40485
4939A457125k66854j2151k26033q7980Q82094J92147r6693l31216j01496j2406
4929A396537L22543j71430l96996k35975L33709k27262L09266j14536j6397L76122
$$ y = [505657, 585384, -134385, 205147, 478912, 50122, -254602, 164147, -196909, -532548, -442685, -129029, 221009, 694363, 988711, 879085, 644515, -45343, 209668, 427425, -150448, 99920, 284053, 924593, 934601, 1248213, 1455740, 1022249, 1250521, 1007773, 435631, 1107268, 953163, 915392, 1563462, 1953586, 2081378, 1775661, 1418025, 1625492, 1528970, 1567926, 1862226, 2088581, 2319187, 2627644, 2215801, 1781384, 2155963, 2346913, 1882913, 1959838, 2169273, 2511074, 2481308, 2485989, 2655692, 2670002, 2651236, 2669061, 2297610, 1457125, 1190271, 1178120, 952087, 864107, 1746201, 1938348, 1841655, 1510439, 1408943, 1396537, 1719080, 1547650, 1150654, 914679, 1248388, 1021126, 1330392, 1215856, 1199459, 1575581]
4919A575581j25594j38810k4175L86939j00621j84602j01397m30819K90040m1947
4909A104595k84295l3074M19124o0605J70198j73913m23669k94641Q2795L02911
4899H09426l18666J71926J76585j95357j63286K07694k82148J72443J80622j3817
4889G45422J37830J81902j20663J68486L90916k14447J85294q0278k49402j11168
4879A033892l4271K37237r9961K01050n5175q43616K65294K81810k32994N6897
4869H10163o3212q2714j54649r646J46321j86820j78987j67269M93537O705p5614
4858E37815L88190o91683n2470J80792j61845J99392l44220J80817O41330L29675
4848A207793j02933k88849j32477L7941N00984L73605O580j7297J8329J79702
$$ y = [1575581, 1449987, 1311177, 1287002, 1673941, 1573320, 1388718, 1287321, 856502, 1146542, 1104595, 820300, 787226, 1206350, 1145745, 1315943, 1142030, 718361, 423720, 506515, 809426, 490760, 662686, 839271, 643914, 480628, 688322, 406174, 578617, 759239, 745422, 883252, 1065154, 944491, 1112977, 1503893, 1289446, 1474740, 1394462, 1145060, 1033892, 999621, 1236858, 1136897, 1337947, 1282772, 439156, 704450, 986260, 753266, 810163, 746951, 664237, 509588, 499942, 646263, 459443, 280456, 113187, 606724, 613429, 537815, 926005, 234322, 181852, 362644, 200799, 400191, 55971, 236788, 878118, 1207793, 1104860, 816011, 683534, 721475, 1222459, 1596064, 1602644, 1585347, 1603676, 1783378]
4838A783378m9388q35576N2176n6512J99357L24860k61387P9793K09109L58388
4828A804198j76443o1627n5364P2136n92244k45982J09299k32357l18039K00306
4818E03883N94442o78998j51085M90139m76443j62322O56458j33557Q5186Q6481
4808H14184l32888m15433l6259J1794k20440K40348N10419K64048l2670l14053
4798D89050l68539j32500L55148L79314m73300K16982N02999N6649l71713J2011
4788F66101M73318l43985k25704M19437L99983J64830M7197J7584K38780K16703
4778B074244J29429j96631j64518m56839m2918j39112J046374l58088l20649J06390
4768A677682K14232m30915o61741J42488M56723L4482o16879M2895m27669J40093
$$ y = [1783378, 1733990, 898414, 950590, 894078, 1093435, 1418295, 1156908, 1236701, 1445810, 1804198, 1627755, 1566128, 1510764, 1582900, 990656, 744674, 853973, 621616, 303577, 503883, 1098325, 419327, 268242, 758381, 281938, 119616, 776074, 642517, 727703, 814184, 481296, 65863, 29604, 41398, -179042, 61306, 571725, 835773, 803103, 489050, 120511, -11989, 343159, 722473, 249173, 466155, 969154, 1025803, 654090, 666101, 1139419, 795434, 569730, 989167, 1389150, 1553980, 1601177, 1618761, 1857541, 2074244, 2203673, 2007042, 1842524, 1385685, 1342767, 1203655, 2250029, 1891941, 1571292, 1677682, 1891914, 1460999, 799258, 941746, 1398469, 1432951, 816072, 858967, 431298, 571391]
4758E71391M28504l62152l01803m63894J29947M02626L2160j1472l14039l56680
4748b45412M60417J36668p3363L69252m57637k12390m1158J89235j18897L91962
4738C98677J86357p99429R69997L87420l45814N0171n49677j10657j44040J93875
4728B36880j63232R2902L5620O216n25514K39969K15132k03776j22784M78068
4718B89481j13626p53471n386J03719L21733P59893k03121k94252j94518J6962
4708g2586J24780L51528l35885m07321J30455J68669J41750j01987k47210K14924
4698c2883l35144L29272J6405j42192L40697k28579K68082Q1491M79900m83329
4688B93720n39355K3827P8716N93191J43578M0833N9410p44719j94116J70602
$$ y = [571391, 999895, 637743, 335940, -127954, 1993, 404619, 436779, 425307, 111268, -245412, 215005, 351673, 278310, 647562, 189925, -22465, -63623, 125612, 6715, 398677, 585034, -214395, 755602, 1143022, 797208, 847379, 297702, 187045, 43005, 236880, 73648, 166550, 202170, 208386, -317128, -77159, 137973, -65803, -188587, 289481, 175855, -577616, -583002, -479283, -157550, 602343, 399222, 104970, -89548, -72586, 52194, 403722, 67837, -339484, -209029, -40360, 101390, -597, -247807, -32883, -368027, -38755, -22350, -164542, 176155, -52424, 215658, 297149, 777049, 293720, -245635, -221808, -143092, 450099, 593677, 634510, 693920, -50799, -244915, -74313]
4678g4313J78763k76768K50288K95295j58712k73571o61926K98760O99193J44554
4668D21563O44321l83504n58376J56408J10011p1347k52619m45320L24584M56489
4658D02210J87312J19404o8803N5687J52816j30283n41646J96906J5224J52111
4648E40938O00848m5606J92421P58020j67033j52582m08049j80595j40292j86053
4638H12017k33362p84511K62076L24941k73716J09505o5527k1741O23752j61531
4628E91903o9073K86612n9096l68355J39473j50725j17667Q0087K77877J14137
4618G25173J71961m66024K12269j84289j6633L69455n75961M18837J84114K0812
4608H59714J85754R9986N28442K47013j76690l05108M89546j08662p6930J68565
$$ y = [-74313, 104450, -172318, 77970, 373265, 214553, -59018, -720944, -422184, 277009, 421563, 1065884, 682380, 124004, 280412, 390423, 319076, 66457, -378863, -54279, 402210, 589522, 708926, 640123, 695810, 848626, 718343, 176697, 373603, 388827, 540938, 1141786, 1096180, 1288601, 2046621, 1879588, 1727006, 1318957, 1138362, 998070, 812017, 578655, -205856, 56220, 381161, 107445, 216950, 151423, 129682, 753434, 591903, 522830, 809442, 750346, 381991, 521464, 370739, 253072, 333159, 611036, 725173, 897134, 431110, 643379, 459090, 442457, 811912, 235951, 654788, 838902, 859714, 1045468, 1145454, 1673896, 1920909, 1744219, 1439111, 1928657, 1819995, 1743065, 1911630]
4598A911630j14998N74861l95867r433j0869J94355l62124o20455O16907K1538
4588A805545l37160J18204n156M84450J71001N16168o18223l64003O57058N05723
4578B933607J04314n82595R7480K10738q1430m17894j33062K1295l15747k89211
4568A547495k16930N58709M87286J56206J04295J32991l94908l60202K0393L6410
4558B071745k287J55261k83809r4460P92662K23038m17339l71161J57129r3450
4548B137329K48400k66611n17390o09497k95416L89882K2920O38825M06847j72559
4538A982730o39837n83477M45280Q1424J64984L25981j82540k50295l48599J52472
4528A148123J57281K97723J12218l98875N2287j23404k51000j33297P4860M4081
$$ y = [1911630, 1796632, 2371493, 1975626, 1966193, 1955324, 2149679, 1787555, 1167100, 1784007, 1805545, 1468385, 1586589, 1581433, 2065883, 2236884, 2753052, 2134829, 1770826, 2427884, 2933607, 3037921, 2455326, 2552806, 2763544, 2682114, 2264220, 2131158, 2152453, 1836706, 1547495, 1330565, 1889274, 2376560, 2532766, 2637061, 2770052, 2375144, 2014942, 2035335, 2071745, 2069458, 2224719, 1940910, 1846450, 2639112, 2862150, 2444811, 2073650, 2230779, 2137329, 2385729, 2119118, 1601728, 992231, 696815, 1086697, 1109617, 1748442, 2155289, 1982730, 1342893, 759416, 1204696, 1286120, 1451104, 1777085, 1594545, 1344250, 995651, 1148123, 1305404, 1603127, 1715345, 1316470, 1368757, 1245353, 994353, 861056, 935916, 979997]
4518I79997j71700j60744k22773K0428O92994Q4696l8094J89160J49301m51679
4508A071586J64199N61214r2928o7672K4093J01987j83505j48507k98687m50157
4498F81623J19451N10307n09655o84784P93146L26783p8469J04048m64123l39180
4488D59147L81063o3122l74418J38394j24001K67020l45317N22557L54365n13742
4478G01946j48142K47920k11268J01325O1277K33930J47439m8063N9681k6344
4468A119701M77380p59175l96583j49312J59719M96164L25212l1943j18960r7006
4458A025197K42037q4947J86441l05636j85211N08663J85312O30704l09692J80310
4448B073178k61772l80180j82731J29019O30112k08283k83843k10467L69160L51311
$$ y = [979997, 808297, 647553, 424780, 445208, 1138202, 1222898, 1184804, 1373964, 1523265, 1071586, 1235785, 1796999, 1704071, 1636399, 1660492, 1762479, 1578974, 1430467, 1131780, 681623, 801074, 1311381, 801726, 116942, 910088, 1236871, 1158402, 1262450, 798327, 459147, 840210, 777088, 402670, 541064, 417063, 684083, 338766, 861323, 1215688, 701946, 553804, 801724, 590456, 691781, 753058, 986988, 1134427, 1086364, 1146045, 1119701, 1597081, 837906, 441323, 292011, 451730, 947894, 1273106, 1241163, 1122203, 1025197, 1267234, 1182287, 1368728, 1063092, 877881, 1386544, 1571856, 2202560, 1892868, 2073178, 1811406, 1431226, 1248495, 1377514, 2007626, 1799343, 1515500, 1305033, 1674193, 2025504]
4438B025504k80286R3532J79570n10315R6027q9559K36210J6142L11761O08237
4428B686823J24100j78870m55142j29141k27005P75894m1751j98798N65573O85863
4418C607546n4587j64889Q330R39059P89969J48666O2031J43681L74968O36009
4408F490783N7846P517o0844j272560j79409K7275m76778K15072r1246p82769
4398C934887j17091n23644p9401M69804k93454l72968J94218p3285k44198J1859
4388B906727M4350k55012N9697n5091L71367n43236l42607j12317K60683K19222
4378B553783j30076m26234J46967J82932P2539P728N5390J6286m58522K82750
4368B303543J96037J23488l56285k3735J82542l51923L6031K52794m10780l15322
$$ y = [2025504, 1745218, 1838750, 2018320, 1508005, 1604032, 1514473, 1750683, 1766825, 2078586, 2686823, 2810923, 2632053, 2176911, 2047770, 1820765, 2596659, 2554908, 2356110, 2921683, 3607546, 3552959, 3388070, 3396400, 4335459, 5125428, 5274094, 5336125, 5479806, 5854774, 6490783, 6548629, 6556146, 6495302, 5222742, 5043333, 5070608, 4593830, 4808902, 4717656, 3934887, 3817796, 3294152, 3214751, 3684555, 3391101, 3018133, 3212351, 3139066, 2894868, 2906727, 2951077, 2696065, 2755762, 2700671, 3072038, 2528802, 2186195, 2073878, 2334561, 2553783, 2423707, 1997473, 2144440, 2327372, 2399911, 2407639, 2463029, 2479315, 2020793, 2303543, 2499580, 2623068, 2266783, 2243048, 2425590, 2073667, 2109698, 2362492, 1951712, 1636390]
4358A636390K49660N92754l27201k10775L43745j26376k73945J23807L83126K8142
4348B419327L80914O2358N2280L21904m67457J73677K13306q1309j99279N94781
4338C470502k78382Q0318q5215N26375l48819n02969J69991N18889M24809q7888
4328C887611m88592K98588M61489k20607L805K58725r32m1050j58559O5125J9432
4317D085035M2124K12497n4095M25105L15659K80636p0774N6025l9735J05570
4307E358047l04747N1938M99136N38759N15792K07049r0267j66488k54139o98442
4297E656638k07672O39027M9404K74317N0969L37385L6197N4276j66677m4534
4287F679330j5671Q29212k97990K87547L51045M01731N2273j99672P1447j43256
$$ y = [1636390, 1886050, 2478804, 2151603, 1940828, 2284573, 2158197, 1884252, 2008059, 2391185, 2419327, 2800241, 2862599, 2914879, 3236783, 2769326, 2943003, 3156309, 3075000, 2875721, 3470502, 3192120, 3272438, 3187223, 3713598, 3364779, 2861810, 3031801, 3550690, 3975499, 3887611, 3399019, 3697607, 4159096, 3938489, 3942294, 4201019, 4200087, 4159037, 4000478, 4065603, 4085035, 4127159, 4339656, 4285561, 4710666, 5026325, 5306961, 5236187, 5292212, 5252477, 5358047, 5053300, 5105238, 5604374, 6143133, 6658925, 6865974, 6775707, 6609219, 6355080, 5656638, 5448966, 6087993, 6137397, 6411714, 6462683, 6800068, 6836265, 6890541, 6723864, 6679330, 6663659, 7492871, 7194881, 7482428, 7833473, 8235204, 8287477, 8087805, 8159252, 8015996]
4277H015996L9279N45132L08749L92266J43146M93104L14395k90056P61890p21683
4267A0002218k03800M86623P09993K0154K30976K66090L38088L32773J33025m52712
4257A1863428k2855K12027P66526K76847K71028N96053P65009L22998n45840P96418
4247A5301639J26018j04714L66869L45644M49976J139594L81244L84285P18148
4238A9108703J82498N96992L38296K69090O68005J147648R87728O66398R12782
4229B4878140Q81827J084009J928598J026192J737432J311534J437998N08685
4221C4794415M98373J432628R29858J421093R98131J286064J997171J218015P85751
4212D5361499J297439J67272J121522J245567J074004J547444J073706O08534
$$ y = [8015996, 8055275, 8600407, 8909156, 9301422, 9444568, 9937672, 10252067, 9962011, 10723901, 10002218, 9798418, 10285041, 10995034, 11015188, 11246164, 11512254, 11850342, 12183115, 12316140, 11863428, 11840573, 12052600, 12819126, 13095973, 13367001, 13963054, 14728063, 15051061, 14505221, 15301639, 15427657, 15322943, 15689812, 16035456, 16485432, 17625026, 18006270, 18390555, 19108703, 19291201, 19888193, 20226489, 20495579, 21163584, 22311232, 23298960, 23965358, 24878140, 25759967, 26843976, 28772574, 29798766, 31536198, 32847732, 34285730, 34794415, 35292788, 36725416, 37655274, 39076367, 40074498, 41360562, 43357733, 44575748, 45361499, 46658938, 46826210, 47947732, 49193299, 50267303, 51814747, 52888453, 53496987]
4204E3496987Q25478J063210M27323R29005J434299K370321K748718L348603L457100
4195G0101044M943164N685651O246115O681557M002125J795718n79656k292567
4187I6583151l344355l596825l886881k843435k207297j305858r20869P58977
4179G9236608J448429K850179M047632M896841N234716M880419M572242M091654
4171A11258720J859427L63855p46208l998276m780438n594278n535664n124799
4163H7702339m008442l599875l425292k832439j602721q55659k90586M68773J115873
4154G2671971K176171L170290L933373M489366N724259N441472M550181M155777
4146A06312860K975184Q53374j178834k225700l891896n112461m757317m600117
$$ y = [53496987, 54322465, 55385675, 55812998, 56742003, 58176302, 60546623, 63295341, 66643944, 70101044, 75044208, 80729859, 86975974, 93657531, 97659656, 99455374, 98875718, 96583151, 93238796, 89641971, 85755090, 82911655, 80704358, 79398500, 78477631, 79236608, 80685037, 83535216, 87582848, 92479689, 97714405, 102594824, 107167066, 111258720, 113118147, 113482002, 112735794, 108737518, 103957080, 98362802, 92827138, 87702339, 83693897, 80094022, 76668730, 73836291, 72233570, 71377911, 71087325, 71556098, 72671971, 74848142, 78018432, 81951805, 86441171, 92165430, 97606902, 102157083, 106312860, 109288044, 110141418, 108962584, 106736884, 102844988, 97732527, 92975210, 88375093]
4138H8375093m552425l180221k619756l085903r36925K80246O09414K459117K899226
4129H0247866L399466L841917L289578P04831j275905k762773l956155m905509
4121G8583316n443301m612302m312477l932975l734058k498237j712926j391375
4113E0945665j649966j683172q05812r59053r10912j325082q86102o97728j061591
4104D0966247q30382j043463j635534j897132j004137r24317j864926q61400r03818
4095C0001138k71274o12282r17375j200204q10778j443430j514952j277762j341362
4086B0611719r90943j084624r21654j289243j616390o70532k25334k72233n60045
4077A2980721r69572m47360K46703K06431o20899p92865k21393J97079p87542
$$ y = [88375093, 83822668, 80642447, 78022691, 74936788, 73999863, 74280109, 74889523, 77348640, 80247866, 83647332, 87489249, 90778827, 91483658, 90207753, 87444980, 83488825, 78583316, 73140015, 68527713, 64215236, 60282261, 56548203, 54049966, 52337040, 50945665, 49295699, 47612527, 46806715, 45847662, 44936750, 43611668, 42725566, 42027838, 40966247, 40135865, 39092402, 37456868, 35559736, 34555599, 33631282, 31766356, 30904956, 30001138, 29729864, 29117582, 28200207, 27000003, 26189225, 24745795, 23230843, 21953081, 20611719, 19620776, 18536152, 17614498, 16325255, 14708865, 14038333, 13812999, 13540766, 12980721, 12011149, 11563789, 11810492, 12016923, 11396024, 10603159, 10381766, 10578845, 9791303]
4068I791303q3831k46729l91362k58577l84699M3899J64684j91422l38257o04853
4058G500156N5744j5083K36631L63066J06121k92331l50865j89196l10720j80314
4048F923209K17639m38257n4356J74642R4164k79165K26812k59105k9907p9989
4038F495687j38161K35419J98621o6134m02772J16727K5977k48386k23636p6470
4028E916872L95933N1481n50316O11261k88299n80927L70848k72249p0284k1170
4018E563150J23499j79798K55805p9969R427J24339j08255J27443p60194q8933
4008D986514j36416M31707M5992l58802j02567K9936m17917J10610r5972q6737
3998D406348j15228N1933k19827l66440O3614m71482p3515J35573j39680J80401
$$ y = [9791303, 9707472, 9460743, 9069381, 8810804, 8426105, 8470004, 8634688, 8443266, 8105009, 7500156, 7555900, 7540817, 7777448, 8140514, 8246635, 7954304, 7603439, 7414243, 7103523, 6923209, 7140848, 6702591, 6648235, 6822877, 6917041, 6637876, 6864688, 6605583, 6575676, 6495687, 6357526, 6592945, 6791566, 6725432, 6322660, 6439387, 6465364, 6216978, 5993342, 5916872, 6312805, 6364286, 5813970, 6425231, 6136932, 5556005, 5926853, 5654604, 5584320, 5563150, 5686649, 5506851, 5762656, 5682687, 5692114, 5816453, 5708198, 5835641, 5075447, 4986514, 4850098, 5281805, 5327797, 4968995, 4866428, 4896364, 4478447, 4589057, 4493085, 4406348, 4291120, 4343053, 4123226, 3756786, 3820400, 3348918, 3275403, 3410976, 3271296, 3451697]
3988C451697P3280J28490K61949j32380j54625j32478n5315n01740j31721L08531
3978C115688j64829K8981J15445j56399j92092J48157j79313M65183R1447n2261
3968C220007k97598n46381M20496J38216j73628l0906O68619k13177m80938P9759
3958B784469R1304N70280m10410n68046k71258J0150O03495k42510K986J34661
3948B705121K4322K64637P2048q3005o1328l01184K91253l71196j58025n72247
3938A810396L80835O42093j24580m3128l9860L10055j8508p9853o5370k84940
3928B487140k20741K36349R0861J14618j2528M5736J28308k69940m6298O4565
3918B618070K2066L31062j85520K83822q5590k57932l69982L47797O7726L02714
$$ y = [3451697, 3524977, 3653467, 3915416, 3783036, 3628411, 3495933, 3440618, 2938878, 2807157, 3115688, 2950859, 2979840, 3095285, 2938886, 2746794, 2894951, 2715638, 3180821, 3272268, 3220007, 2922409, 2376028, 2796524, 2934740, 2761112, 2730206, 3398825, 3185648, 2704710, 2784469, 2875773, 3446053, 3035643, 2467597, 2196339, 2206489, 2809984, 2567474, 2570460, 2705121, 2729443, 2994080, 3066128, 2983123, 2921795, 2620611, 2911864, 2540668, 2382643, 1810396, 2191231, 2833324, 2708744, 2665616, 2625756, 2935811, 2917303, 2837450, 2772080, 2487140, 2266399, 2502748, 2593609, 2708227, 2695699, 2741435, 2869743, 2599803, 2553505, 2618070, 2640136, 2971198, 2785678, 3069500, 2983910, 2725978, 2355996, 2703793, 2771519, 3074233]
3908C074233K1805o06837k81225L72513L49394K10556J12156j96180r1417J3608
3898B978606j10534k60447J57172m58671J36939K77821l25460M22917J3207L105
3888B834655k14017J8599j28416N5114L50496L16536J54262N145n4082k04107
3878C134185K523K56724j10448L65614M29622k30630m59587J80207j92243j28945
3868C247022M808m20950l0611l1786J44417j78463J83890P9208J02075j42649
3858B956961N13346k5045k7335J79421k31733k19944M24361L42503M9793j46060
3848C816268J53470J44942Q6780p9613M56108p7997k2235n2830o34160L77674
3838D168407J8045L56212K64109L66350r3666m79890L27826L16626J32787k5059
$$ y = [3074233, 3096038, 2489201, 2207976, 2580489, 2929883, 3140439, 3252595, 3056415, 2964998, 2978606, 2868072, 2607625, 2764797, 2306126, 2443065, 2720886, 2395426, 2818343, 2831550, 2834655, 2620638, 2639237, 2510821, 2565935, 2916431, 3232967, 3387229, 3392374, 3338292, 3134185, 3136708, 3393432, 3282984, 3648598, 4078220, 3847590, 3388003, 3568210, 3375967, 3247022, 3251830, 2830880, 2800269, 2768483, 2912900, 2734437, 2918327, 2997535, 3099610, 2956961, 3470307, 3445262, 3417927, 3597348, 3365615, 3145671, 3570032, 3912535, 3962328, 3816268, 3969738, 4114680, 4201460, 4121847, 4577955, 4499958, 4477723, 4424893, 3790733, 4168407, 4186452, 4542664, 4806773, 5173123, 5079457, 4599567, 4927393, 5244019, 5376806, 5351747]
3828E351747k6585K60624L93512N75533L59190j46440P52123R637P7015k32211
3818G374145j59686n42529k89854o43856k5217l08609l61492k74584k40560k681
3808D525077K11750J56088j63700k5982l42051K53444l10329k24352M47661j55558
3798D372048m28574k18297J19708L9469m79800m94579o505Q16671q467q74214
3788B837460K51733L02479R9863L8712r8158r3425q1720L99971M09799m7220m70131
3777C549363j07905l44863L69336R2298M24973J97161l24005m66136J4722l05896
3767C099048p2270N971O67315J58282j85704L679p3851k65356M94212j55099j94073
3756C482154L16939r7557o2788J74528l04779l0489K76003N57149l54353k27675
$$ y = [5351747, 5325162, 5585786, 5979298, 6554831, 6914021, 6767581, 7519704, 7529341, 7606356, 7374145, 7214459, 6671930, 6382076, 5738220, 5713003, 5404394, 5042902, 4768318, 4527758, 4525077, 4736827, 4892915, 4729215, 4703233, 4361182, 4614626, 4304297, 4079945, 4527606, 4372048, 3943474, 3725177, 3844885, 3884354, 3404554, 2909975, 2903470, 3720141, 3711674, 2837460, 3089193, 3391672, 3491535, 3530247, 3432089, 3338664, 3256944, 3656915, 4066714, 4019494, 3549363, 3441458, 3096595, 3465931, 3558229, 3983202, 4180363, 3856358, 3390222, 3404944, 3099048, 3026778, 3032749, 3700064, 3858346, 3672642, 3676321, 3602470, 3337114, 3831326, 3676227, 3482154, 3799093, 3701536, 3638748, 3813276, 3508497, 3478008, 3754011, 4311160, 3956807, 3729132]
3746C729132j58633J30474N3796J05N13123K04187m59587l94036r6100K53441
3736C775902O2761K97282j02364m79510j77628m26995K48184R5680M76583k44620
3726C525275k66822p95442L2962M53505M26291k45660l58414J47380n2940n17962
3716B348173p2866J13548j98604J86787N2765m73740J81975J33054L65115L42468
3706B978675j95375J06034q7990m42141l09458n6337N9408L1754O66176p7562
3696B673184k29263K10497J06741K94162q4779j33891k250m9624k26677O06919
3686C165019Q5207j47833O801r2496J87702M45638j07877n80296j23998j73733
3676B664134M28319K5983k46626R9767p2739k26048J11510J20211L7994k08052
$$ y = [3729132, 3570499, 3700973, 3754769, 3754874, 4267997, 4472184, 4012597, 3618561, 3522461, 3775902, 3838663, 4135945, 4033581, 3554071, 3376443, 2949448, 3197632, 3293312, 3769895, 3525275, 3258453, 2463011, 2495973, 2949478, 3375769, 3130109, 2771695, 2919075, 2866135, 2348173, 2275307, 2388855, 2190251, 2377038, 2429803, 1956063, 2138038, 2271092, 2636207, 2978675, 2783300, 2889334, 2801344, 2359203, 2049745, 1993408, 2052816, 2084570, 2750746, 2673184, 2443921, 2654418, 2761159, 3055321, 2970542, 2836651, 2834401, 2784777, 2558100, 3165019, 3250226, 3102393, 3109194, 3016698, 3204400, 3650038, 3542161, 2961865, 2837867, 2664134, 3092453, 3118436, 2871810, 2971577, 2898838, 2672790, 2784300, 2904511, 2942505, 2734453]
3666B734453k6907o0525K9172K94027j93941k39956K62737J72928K34183J92690
3656C398861n79395J38437m0337L27113Q1759n09717k6157l40746P13756o0238
3646C103336k49117K96519l7032J39438n4803n99766L77849J05494K18869J719
3636C302506j64426J16383J91092k65815j76284k58866N2211L81190K77615Q8194
3626C543800l78252K6058J25379r058n00738L99377O50089L18591l87184r0018
3616C698044N9294K0848M5851M9745j233l81452m03541K8766N0745K31934N45676
3605C944677j16707J85865J02670l16848j92535m9091O12084j66225J96467k47665
3595C952692l34621L17534K00721k62618M8403K12633P4238K25561P09637N3665
$$ y = [2734453, 2707546, 2647021, 2676193, 2970220, 2776279, 2536323, 2799060, 2971988, 3206171, 3398861, 2819466, 2957903, 2917566, 3244679, 3326438, 2816721, 2790564, 2449818, 3163574, 3103336, 2854219, 3150738, 3113706, 3253144, 3198341, 2598575, 2976424, 3081918, 3300787, 3302506, 3138080, 3254463, 3445555, 3179740, 3003456, 2744590, 2796801, 3177991, 3455606, 3543800, 3165548, 3191606, 3316985, 3307927, 2807189, 3206566, 3856655, 4175246, 3788062, 3698044, 3757338, 3778186, 3824037, 3873782, 3872549, 3491097, 3087556, 3116322, 3167067, 3399001, 3944677, 3827970, 4013835, 4116505, 3799657, 3607122, 3558031, 4170115, 4003890, 4200357, 3952692, 3618071, 3935605, 4136326, 3873708, 3922111, 4134744, 4208982, 4434543, 5144180, 5197845]
3585E197845J8934J15623j1516M00079M03425o442n77983N6233L6563J41522M26942
3574F201225m42221L82751J81350l14512O74259j61037L68592L34966j80709K0005
3564G064669J62043l48449M40857K75903j13225j72774K12196m0568O4914J93339
3554G738905j26595L52664J35740L96948j45706q4402L26992L90020k8852P7507
3544I033221m97977L72454O10116K93711K47327J88894Q6825j12096J06329O43253
3534A0972057L7005p3349k84492K37280K95881l74301J22540m2187m0235N00602
3524A1350801O95515M0229j05271P03120k3077O4572L42292K92446j35574M7991
3514A3273044P62353Q3139K58673J93969K47343R3156K64169l62146O97326N85196
$$ y = [5197845, 5216779, 5332402, 5320886, 5720965, 6124390, 6117948, 5539965, 5596198, 5632761, 5774283, 6201225, 5759004, 6141755, 6323105, 6008593, 6682852, 6521815, 6890407, 7225373, 7044664, 7064669, 7226712, 6878263, 7319120, 7595023, 7481798, 7309024, 7521220, 7480652, 7545566, 7738905, 7612310, 7964974, 8100714, 8497662, 8351956, 8267554, 8594546, 8984566, 8955714, 9033221, 8535244, 8907698, 9517814, 9811525, 10058852, 10247746, 10334571, 10222475, 10328804, 10972057, 11009062, 10935713, 10651221, 10888501, 11184382, 10810081, 10932621, 10890434, 10850199, 11350801, 12046316, 12086545, 11981274, 12684394, 12661317, 12725889, 13068181, 13360627, 13225053, 13273044, 14035397, 14118536, 14377209, 14571178, 14818521, 14911677, 15175846, 14813700, 15511026, 16096222]
3504A6096222L80488J94452J66558L42151L14783K22801J77253j41842K98576
3495A8051442N75621P09739L46157j88121M35797J65163J273619M83255P67336
3486B2620008K10480J73631O86421P11699J019875O40548J147795N87693Q33689
3477B8631839Q88703P94553J143255K293223J550041J251267J886619K290852
3469D0730352K350385J973066K412177L199741L163219L866781M508260M398847
3461F6602828N557258N787877O369454O951200P590631Q701704Q895392R932118
3453A26388462J0117080R737904R098443P897837O505486M998932J893921p33902
3445A75904163k480779m445573o009218p201234q326832q621721r402587r189638
$$ y = [16096222, 16476710, 16671162, 16837720, 17179871, 17494654, 17717455, 17894708, 17752866, 18051442, 18627063, 19336802, 19682959, 19494838, 19930635, 20095798, 21369417, 21852672, 22620008, 22830488, 23004119, 23690540, 24402239, 25422114, 26062662, 27210457, 27798150, 28631839, 29520542, 30315095, 31458350, 33751573, 35301614, 36552881, 38439500, 40730352, 43080737, 45053803, 47465980, 50665721, 53828940, 57695721, 62203981, 66602828, 72160086, 77947963, 84317417, 91268617, 98859248, 107560952, 116456344, 126388462, 136505542, 146243446, 155341889, 163239726, 169745212, 174744144, 176638065, 175904163, 173423384, 168977811, 162968593, 155767359, 147440527, 138818806, 129416219, 120226581]
3437A20226581r072055q768362q557226q126390p478621o402319n886566n323264
3429F0611778m518050l921041l616054l289898k801218l146710k208744k537773
3421C4572290j931196k022225j313901j147622j186153j668595o64789r52854
3413B3684955p44017o86833j171338j130570o44900l27928r50327j07713l75492
3404A7545837n73180l89646m50432l79798o00035l51357j51078n84033J6778q15565
3394A3267491n68435J17881J65220j89029p23442p65478l10270j99233K34532
3385A1029237m2735k56647k22333p06297P8450o899n42563m93574K19355K7499
3375I083493l65210l96982l1437L18830j61385l23655N5046K32336J68219l02025
$$ y = [120226581, 111154526, 102386164, 93828938, 85702548, 78223927, 71821608, 65935042, 60611778, 56093728, 52172687, 48556633, 45266735, 42465517, 39318807, 37110063, 34572290, 32641094, 30618869, 29304968, 28157346, 26971193, 25302598, 24637809, 23684955, 22940938, 22254105, 21082767, 19952197, 19307297, 18979369, 18029042, 17921329, 17545837, 16972657, 16583011, 16132579, 15752781, 15152746, 14801389, 14650311, 14066278, 14083056, 13267491, 12699056, 12816937, 12982157, 12793128, 12069686, 11304208, 10993938, 10794705, 11029237, 10986502, 10729855, 10507522, 9801225, 9879675, 9872776, 9330213, 8836639, 9055994, 9083493, 8718283, 8321301, 8289864, 8608694, 8447309, 8123654, 8178700, 8411036, 8579255, 8277230]
3365H277230m69111R3928O72663M1557m53900J22147j04310l50208k7336l47511
3355G455149k14434j08297N0301O1798k50097n7756m04868l0306K43895l00430
3345F444955n06444l91483j13024k44395J96716L65720k22605p6194R4143j59099
3335E388290L83950o90073j30010j04164K6820q0771m33274j82552J93813N2461
3325D424490j96185N64540L24104j22379n83697k55862L69695L00447n5158j92253
3315D577742M6369N7345m14493q9981r4339K63493j55330M8520L36155p8791M23345
3304D920035k37457k86075j65972k42891M11132J07088m51732m86538k8788j63798
3294C375004N7839L2026J47262L56899M30040J02482P0920J42155j54631n18678
$$ y = [8277230, 7808119, 7902047, 8574710, 8616267, 8162367, 8284514, 8180204, 7829996, 7802660, 7455149, 7240715, 7132418, 7182719, 7244517, 6994420, 6936664, 6531796, 6501490, 6745385, 6444955, 5938511, 5547028, 5434004, 5189609, 5386325, 5752045, 5529440, 5453246, 5547389, 5388290, 5772240, 5082167, 4952157, 4847993, 4874813, 4794042, 4360768, 4178216, 4372029, 4424490, 4228305, 4792845, 5116949, 4994570, 4410873, 4155011, 4524706, 4825153, 4769995, 4577742, 4624111, 4681456, 4266963, 4176982, 4082643, 4346136, 4190806, 4239326, 4575481, 4496690, 4920035, 4682578, 4396503, 4230531, 3987640, 4398772, 4505860, 4054128, 3567590, 3538802, 3375004, 3432843, 3464869, 3612131, 3969030, 4399070, 4501552, 4572472, 4714627, 4559996, 4041318]
3284D041318l33279M87634l4160m62592j28514R9318M8534l1476n5904k68550
3274C362329K04094K19777k71719o7929J12133o29910L26194L03679Q756J40049
3264C707453l7318N6961o1941j46115k09272M94760J35541k41745k3832m94246
3254C180246J96129K48685j08996M16038J23581r22157J20163M6656k25070n16522
3244B558753J78462J00181j89087L03528j85641R4638Q2090k33004r2261K14518
3234B832177K16104N09979q4079k1017K08682j69186l03732J26511j71312l10382
3224B833745k5549K05253N86144J79103o45464l29390j51970l41860M32659J77641
3214B920312p99548k8858Q07228J2540o05684J64287J12253j15933k93934j82667
$$ y = [4041318, 3708039, 4195673, 4161513, 3698921, 3570407, 3669725, 3718259, 3686783, 3630879, 3362329, 3566423, 3786200, 3514481, 3446552, 3558685, 2928775, 3254969, 3558648, 3567404, 3707453, 3670135, 3727096, 3665155, 3519040, 3309768, 3804528, 3940069, 3698324, 3674492, 3180246, 3376375, 3625060, 3516064, 3932102, 4055683, 3133526, 3253689, 3300345, 3075275, 2558753, 2737215, 2837396, 2648309, 2951837, 2766196, 2860834, 2942924, 2709920, 2617659, 2832177, 3048281, 3558260, 3474181, 3453164, 3661846, 3492660, 3188928, 3315439, 3144127, 2833745, 2808196, 3013449, 3599593, 3778696, 3133232, 2803842, 2651872, 2310012, 2742671, 2920312, 2120764, 2091906, 2899134, 2911674, 2305990, 2470277, 2582530, 2466597, 2172663, 1989996]
3204A989996M52916K16664m58597k38503O39724k7404m32951p3335L01080L44330
3194B713920m4655K80604m9467k61543L30340j22378r2217K01316J11021j76644
3184B890297l08357J11062O1619k17740l8787j86683Q9860L11161J18140n3052
3174B777520j41470K280q8001O44868j87858M4726j8453j45220k0555O6493k10976
3163B723354k80515L0278J48816j31750L97484k56587m27792L98259M97937j857
3153C097627n4747j11870m9243J56066j33703q614k62419N82921j82606k28326
3143B805086K4325k3260O23484l09711K26058n9569o2283K72693o0518K52459
3133C688764m87357j15465Q1689l02407J822k32981p0569K02186O2781l97221
$$ y = [1989996, 2442912, 2659576, 2200979, 1962476, 2602200, 2574796, 2141845, 2068510, 2369590, 2713920, 2669265, 2949869, 2900402, 2638859, 2969199, 2846821, 2754604, 2955920, 3066941, 2890297, 2581940, 2693002, 2754621, 2536881, 2498094, 2311411, 2401271, 2712432, 2830572, 2777520, 2636050, 2638330, 2550329, 3195197, 3007339, 3052065, 3033612, 2888392, 2867837, 2934330, 2723354, 2442839, 2473117, 2621933, 2490183, 2887667, 2631080, 2203288, 2601547, 3099484, 3097627, 3042880, 2931010, 2881767, 3037833, 2904130, 2895516, 2633097, 3216018, 3033412, 2805086, 2829411, 2806151, 3429635, 3119924, 3345982, 3286413, 3224130, 3496823, 3436305, 3688764, 3201407, 3085942, 3167631, 2865224, 2867046, 2634065, 2563496, 2765682, 2828463, 2431242]
3123B431242L97001P4349l79759l29850K44838M68424O0825L05487K32078k38374
3113C266261j98204M83645m41301M03852j46949n93269L11420k70392M01304J28844
3103C345211j59361J64538J0363J26763J98953k84085k75383N79234K45972N7916
3093D010121K69930l06596j23717P8325m44280q516n0001L95660J4420J5486K80970
3082D131802j05546K35714l8491J1505k88424J27858M89663m76286R3802O52478
3072D834075k5978K87547r6993k67868K81780K64143l2145l72073L7363J0787
3062D920638L90313j09442L36880k34181M46803j69049k17959k97104m05390k87071
3052D374438O19680k67064j11028K40303K63470m5332K34557J047j03516o8015
$$ y = [2431242, 2828243, 2902592, 2522833, 2192983, 2437821, 2906245, 2967070, 3272557, 3504635, 3266261, 3068057, 3551702, 3110401, 3514253, 3367304, 2774035, 3085455, 2815063, 3216367, 3345211, 3185850, 3350388, 3360751, 3487514, 3686467, 3402382, 3126999, 3706233, 3952205, 4010121, 4280051, 3973455, 3849738, 3928063, 3483783, 3475267, 3425266, 3820926, 3835346, 3850832, 4131802, 4026256, 4261970, 4223479, 4234984, 3946560, 4074418, 4564081, 4087795, 4181597, 4834075, 4808097, 5095644, 4998651, 4730783, 5012563, 5276706, 5244561, 4872488, 4909851, 4920638, 5310951, 5201509, 5538389, 5304208, 5751011, 5581962, 5364003, 5066899, 4661509, 4374438, 4994118, 4727054, 4616026, 4856329, 5119799, 5074467, 5309024, 5310071, 5206555, 5138540]
3042E138540l91105M88116k78620k24009O12434j08000o2491J46219N10988M07970
3032F240042J0413k63397m68901K21924r8622J58910j16935M53659j50703J08727
3022F095117k52456R0021k82243M10975P1172L30360K62929K54902l06094J19182
3012F793865L7420k25372J72406L94135J39624J45786L4044l6645L07917r2463
3002G670717j53055l44738J47606J06025K74557O18550M25638j56664N21157J69233
2992I279026R280L12177M52882Q54550L63366p6488O01748R0605j3295j76141
2982A1697710n3888O93988Q0942M90252P82457J560859J909141J513631J837645
2973B0512737J852303L20225m18358q87729j276428j417769r58588j182010j092892
$$ y = [5138540, 4747435, 5235551, 4956931, 4732922, 5345356, 5237356, 5174865, 5321084, 5832072, 6240042, 6250455, 5987058, 5518157, 5740081, 5641459, 5800369, 5683434, 6137093, 5986390, 6095117, 5842661, 5932682, 5650439, 6061414, 6132586, 6462946, 6725875, 6980777, 6674683, 6793865, 6831285, 6605913, 6778319, 7172454, 7312078, 7457864, 7491908, 7455263, 7763180, 7670717, 7517662, 7172924, 7320530, 7426555, 7701112, 8319662, 8745300, 8588636, 9109793, 9279026, 9288306, 9600483, 10053365, 10907915, 11271281, 11194793, 11796541, 11887146, 11873851, 11697710, 11643822, 12337810, 12418752, 12909004, 13691461, 15252320, 17161461, 18675092, 20512737, 22365040, 22685265, 22266907, 21379178, 20102750, 18684981, 17726393, 16544383, 15451491]
2964A5451491o71033j027937p76585r05644o89781n60283n55417m9432K573K51484
2954A0469436o80346m12159j6636l04363m4897Q33K27921M9026k4629l58191k94208
2943H611787P6530j73862M49655K11959k33582K49918K03871j55778k02615l605
2933I034278l8136n6802j34711K19803P3080M14671l2988J4678l7957j2896K21453
2922I664473N7090n5385j37278P2824l27132R4829P86729n54278J50250j74293
2912I577829L39348J88349m89591P87521Q11947j35957j49547j004j34633L2988
2902A0827250K79943M13456P8444K50433J37089J02917j6942N93720M28805l65905
2892A2729210L56651N10692l33499K01801O29116J48962L84753L92749M27162
$$ y = [15451491, 14780458, 13752521, 12975936, 12070292, 11380511, 10820228, 10264811, 10215379, 10217952, 10469436, 9789090, 9376931, 9360295, 9055932, 9011035, 9011868, 9239789, 9288815, 9264186, 8905995, 8611787, 8688317, 8514455, 8964110, 9176069, 8942487, 9192405, 9396276, 9240498, 9037883, 9034278, 8996142, 8939340, 8804629, 9024432, 9097512, 9512183, 9479195, 9493873, 9455916, 9443020, 9664473, 9721563, 9666178, 9528900, 9601724, 9274592, 9369421, 10156150, 9601872, 9752122, 9577829, 9917177, 10105526, 9615935, 10403456, 11215403, 11079446, 10929899, 10928895, 10794262, 10827250, 11107193, 11520649, 11599093, 11849526, 11986615, 12089532, 12072590, 12666310, 13095115, 12729210, 13085861, 13596553, 13263054, 13464855, 14093971, 14242933, 14627686, 15020435, 15447597]
2883A5447597P67630k09015L45887N9118K69634K2652k25895J30369J14180M4446
2873A6766603L44132n8862K41385N85128k06808N16008O99771P55129J0100K44468
2863A9897054N94523K38816K83938K39872O2981O04292M88919N19959N45641M77199
2853B3953194L25940l16275J20963O96440J48254K27666j10146L1122L53692P06156
2843B6137006Q24603N17261J94619O60566P95662N95180M45644N91576N71214
2834C1333331M43228N28449R06083P73541M77557N84316R58356K58428P23823
2825C6987112J239574N56355M61761J010332M47545N20835J480429O76645R86825
2816D4367413P37381R58216J196689Q62752P66972J298545J465012J438294J932507
$$ y = [15447597, 16215227, 16006212, 16352099, 16411217, 16680851, 16703503, 16477608, 16607977, 16722157, 16766603, 17110735, 17051873, 17293258, 17878386, 17671578, 18187586, 18887357, 19642486, 19652586, 19897054, 20491577, 20730393, 21014331, 21254203, 21317184, 21921476, 22410395, 22930354, 23475995, 23953194, 24279134, 23962859, 24083822, 24780262, 24928516, 25156182, 25046036, 25077158, 25430850, 26137006, 26961609, 27478870, 27673489, 28334055, 29129717, 29724897, 30170541, 30762117, 31333331, 31776559, 32305008, 33211091, 33984632, 34462189, 35046505, 36004861, 36263289, 36987112, 38226686, 38783041, 39244802, 40255134, 40702679, 41223514, 42703943, 43380588, 44367413, 45104794, 46063010, 47259699, 48122451, 48889423, 50187968, 51652980, 53091274, 55023781]
2807E5023781J362649J290941K175506J950268K322286K217792K211073K669639
2799G1223935K799483L531409M657602L941083M485676M276549L930984N183223
2791A04029944O039713N682698O014796O645901P071098P967829Q489952Q735943
2783A60677874R368160R930204J0197594J1292446J2058116J2471672J2194343
2776B38190409J1125721R687095O727232M067915R04797k298489m745917o615285
2768B57043478p927759q870096r550145r220072r099979j0486213j0886310j1852696
2760A79150208j0626650r919024j0161040q660179p958447p011391o562673n613696
2752A12637108n080395m612114l664495k423111k777280k580072k230570j899238
$$ y = [55023781, 56386430, 57677371, 59852877, 61803145, 64125431, 66343223, 68554296, 71223935, 74023418, 77554827, 82212429, 86153512, 90639188, 94915737, 98846721, 104029944, 110069657, 115752355, 121767151, 128413052, 135484150, 143451979, 151941931, 160677874, 170046034, 179976238, 190173832, 201466278, 213524394, 225996066, 238190409, 249316130, 259003225, 265730457, 269798372, 270703169, 268404680, 263658763, 257043478, 249115719, 240245623, 230695478, 221475406, 212375427, 201889214, 191002904, 179150208, 168523558, 158604534, 148443494, 139783315, 131824868, 124813477, 118250804, 112637108, 107556713, 102944599, 99280104, 96856993, 94079713, 91499641, 89269071, 87369833]
2744H7369833j342741j777553j441839k150086j791307l234660k876370k098190
2736G0657087k944224k894557k919920k820292j651785j842431j310206j316588
2728E2957084o78672n79338k72980l83736j301475j080028j600778j472750k071309
2719D3516018j555776j236471j067012j702374j616039j057659q43966p18067
2711C3718654k96324r76653q93097j92077n70671m05140k13043j59218n38729
2702B9473702m52428j20540j90695j48831o78148j93818n8938n03991k81203o11588
2692B6233522o84710J19005J97677m99129J54901J7891l42172j47007j14535p24161
2682B4211282k26227k83328l73868k16497j18735L65506j31792n39532l25694
$$ y = [87369833, 86027092, 84249539, 82807700, 80657614, 78866307, 75631647, 72755277, 70657087, 67712863, 64818306, 61898386, 59078094, 57426309, 55583878, 54273672, 52957084, 52278412, 51699074, 51426094, 51042358, 49740883, 48660855, 47060077, 45587327, 43516018, 41960242, 40723771, 39656759, 37954385, 36338346, 35280687, 34436721, 33718654, 33422330, 32445677, 31552580, 31360503, 30789832, 30384692, 30171649, 30012431, 29473702, 29021274, 28900734, 28710039, 28561208, 27883060, 27689242, 27630304, 27126313, 26845110, 26233522, 25548812, 25667817, 25865494, 25366365, 25521266, 25539157, 25196985, 25049978, 24935443, 24211282, 23985055, 23701727, 23327859, 23111362, 22992627, 23358133, 23226341, 22686809, 22361115]
2673B2361115k13484J22145J58468k23262o2871j03099N4476K83763J1545k23702
2663B2165094k03581j62285j01033n0346M23735K03263j91237J50267J9511M45109
2653B2698497n9956m79988J011322K99778k43270J04859Q2624N15081M73434L75316
2643B4777697K38273Q1940o6519L37808J131111L86164K79029J59627N01148L51131
2633B8177409j14333K46262O0960L71929L79806M87835K78250K11014P73283M57299
2623C1329714J56710O20121P57752N82410L28471j01086N30329K80576P66428
2614C5251425K47529L81618N20752N56715N41913P7870K92383j56307O78136N20008
2604C8912042L88387Q81168J373374J215016P78067P55769J085728J066114J232875
$$ y = [22361115, 22147631, 22269776, 22428244, 22204982, 22142111, 22039012, 22093488, 22377251, 22388796, 22165094, 21961513, 21799228, 21698195, 21647849, 22071584, 22274847, 22083610, 22233877, 22253388, 22698497, 22638541, 22158553, 23169875, 23469653, 23226383, 23331242, 23413866, 23928947, 24402381, 24777697, 25015970, 25097910, 25031391, 25369199, 26500310, 26886474, 27165503, 27325130, 27826278, 28177409, 28063076, 28309338, 28370298, 28742227, 29122033, 29609868, 29888118, 30099132, 30872415, 31329714, 31486424, 32106545, 32864297, 33446707, 33775178, 33674092, 34204421, 34484997, 35251425, 35498954, 35880572, 36401324, 36958039, 37499952, 37577822, 37870205, 37713898, 38392034, 38912042, 39300429, 40181597, 41554971, 42769987, 43548054, 44303823, 45389551, 46455665, 47688540]
2595D7688540J516815J232582J318518J495065J311015K014490J681176K226680
2587F0484881K532185L188616L953130M257408M147569M348734N061371N568634
2579I3542528O566078O992574P189604R013852J2177746J4372106J8877644K3969061
2571A92701193K8844227L5614984L7921730L0181916J2983893n269627j8616182
2564C14362134k3735218k6409540k7504560k4870830k3011115k0139168j7108145
2557A51583558j3945688j1639170r949616p745344o432606n632359m389828m291308
2549H7557639l698502l000478l027761l220510k765812j923484k032375j385281
2541F6503436j645487j368627j79765q13498j162418l33599R8284K0574O32592
$$ y = [47688540, 49205355, 50437937, 51756455, 53251520, 54562535, 56577025, 58258201, 60484881, 63017066, 66205682, 70158812, 74416220, 78563789, 82912523, 87973894, 93542528, 100108606, 107101180, 114290784, 123304636, 135482382, 149854488, 168732132, 192701193, 221545420, 257160404, 295082134, 325264050, 338247943, 332978316, 314362134, 290626916, 264217376, 236712816, 211841986, 188830871, 168691703, 151583558, 137637870, 125998700, 116049084, 108303740, 101871134, 96238775, 91848947, 87557639, 83859137, 80858659, 77830898, 74610388, 71844576, 69921092, 67888717, 66503436, 64857949, 63489322, 63309557, 62496059, 61333641, 61000042, 61098326, 61118900, 61751492]
2532F1751492N99369K35900J158492O96816M97738N45989L64464M68639R79285
2523F7298184K103722J364896J494843K643144K083843K762703L169357M075983
2515H6996675M423197M497796N220557N751612O573064O767625P716329Q690189
2507A36637044R316496J2281891J5220866J7608482K1541559K5604447K9240977
2500B67451762K9652964K5781210J6515181N485885m681646j1294873j7358634
2493C11551849k2066756k3746662k3295903k2150627k0609409j8159117j5752202
2486A65771173j3695192j1853283r971128q741770p497327o485695o102580o494169
2478I4930029n375413n094638m616077l465704l842487l171134k805345k752135
$$ y = [61751492, 62350861, 62586761, 63745253, 64442069, 64939807, 65485796, 65850260, 66318899, 67298184, 69401906, 70766802, 72261645, 74904789, 76988632, 79751335, 82920692, 86996675, 91419872, 95917668, 101138225, 106889837, 113462901, 120230526, 127946855, 136637044, 145953540, 158235431, 173456297, 191064779, 212606338, 238210785, 267451762, 297104726, 322885936, 339401117, 344887002, 340205356, 328910483, 311551849, 289485093, 265738431, 242442528, 220291901, 199682492, 181523375, 165771173, 152075981, 140222698, 130251570, 121509800, 114012473, 107526778, 101424198, 94930029, 89554616, 84459978, 79843901, 76378197, 72535710, 69364576, 66559231, 63807096]
2470F3807096k652818k226162j968928k089316k087858j552814k103261j711728
2462D7414211j737824k009835j262932j273996q86999j254164j183708p47784
2454C7056969j099299q14017q10889Q8986n11448q78064k35692j007491j261307
2445C0527748l13615k67074n30346n80409q36687p55690k98221m04470k29692
2436B6311544k50835q76937l65929m40087o66702m62816p30005l18309j76194
2427B2023730p62914m58925l44835j02951l0685j83049K27466P79594P2026M3394
2417B1262851n93238j38322K65007p82397o37588l44093l23962j38357l34287
2408A8235614k17761n69543l97518k28447m27409j37649R0283K75284K0616j05929
$$ y = [63807096, 61154278, 58928116, 56959188, 54869872, 52782014, 51229200, 49125939, 47414211, 45676387, 43666552, 42403620, 41129624, 40242625, 38988461, 37804753, 37056969, 35957670, 35143653, 34332764, 34421750, 33910302, 33032238, 32796546, 31789055, 30527748, 30214133, 29947059, 29416713, 28836304, 27999617, 27243927, 26945706, 26541236, 26311544, 26060709, 25183772, 24817843, 24377756, 23711054, 23248238, 22518233, 22199924, 22023730, 21260816, 20801891, 20457056, 20354105, 20323420, 20140371, 20367837, 21147431, 21219457, 21262851, 20669613, 20531291, 20796298, 20013901, 19376313, 19032220, 18708258, 18569901, 18235614, 18017853, 17448310, 17050792, 16822345, 16394936, 16257287, 16347570, 16622854, 16643470, 16537541]
2398A6537541o8278P29046J94305p59373m47425J47942O03124l1771K30211M37880
2388A7573202K81117k00714J14217P26225L79979J40060L97030o2082N92549J058589
2378B1000172P48179K19173J031673O31114k10475n28278j37081m13819n44398
2369B1796260m94642l33452J14124j19995j51894K96965R08395k5599O83674J364636
2359B4038472K01485P03619n52507m50193p98902r46778j073589j642837j097376
2350A8381394j335671o37759l24662m86813q43080q36833q22294l0287n22605
2341A2541390l67487L22808j31875m59132n71632j004294J97878O012j78029l5220
2331A0320419m38964n68396j18317j73495N71565L86923Q2054J37153N7129l05114
$$ y = [16537541, 16469263, 17198309, 17392614, 16633241, 16185816, 16333758, 16936882, 16905111, 17135322, 17573202, 17854319, 17653605, 17767822, 18494047, 18874026, 19014086, 19411116, 19349034, 19941583, 21000172, 21748351, 21967524, 22999197, 23630311, 23419836, 22891558, 22754477, 22340658, 21796260, 21301618, 20968166, 21082290, 20962295, 20810401, 21107366, 22015761, 21990162, 22673836, 24038472, 24239957, 24943576, 24391069, 23940876, 23141974, 22195196, 21121607, 19478770, 18381394, 17045723, 16407964, 16083302, 15596489, 14753409, 13916576, 13094282, 13063995, 12541390, 12173903, 12496711, 12364836, 11905704, 11334072, 10329778, 10527656, 10533668, 10355639, 10320419, 9881455, 9313059, 9194742, 9021247, 9592812, 9979735, 10061789, 10198942, 10256071, 9950957]
2321I950957k45418l59460q9667q76864k37433M29606n47410M70845j69384j74002
2311H151770P0507L38913K62855J37266J73799q20952l21528N70787k40913j0571
2301H311933R2804J06532K1651o42731K51651K19843o45806j01465L79051q2012
2291G911451l25970L50733M52636k15974J1146J61035J09782o68315l14867J29658
2281G601315L96140K88558K89393L15380k21621j19884K739m20033k23927K42597
2271H150657M3019J72843N1223l63360n7751K09359M9993r8297J24169k13345
2261H068510Q598K28017l33992r6642k84077j99730k87290L36252M87705J59311
2251H086662k43373q8905J23680m10834K94144K4792J11518n74355j77825J30478
$$ y = [9950957, 9705539, 9346079, 9256412, 8379548, 8142115, 8571721, 8024311, 8495156, 8325772, 8151770, 8222277, 8561190, 8824045, 8961311, 9135110, 8314158, 7992630, 8563417, 8322504, 8311933, 8404737, 8511269, 8532920, 7890189, 8141840, 8361683, 7715877, 7614412, 7993463, 7911451, 7585481, 7936214, 8388850, 8172876, 8184022, 8345057, 8454839, 7786524, 7471657, 7601315, 7997455, 8286013, 8575406, 8890786, 8669165, 8549281, 8552020, 8131987, 7908060, 8150657, 8193676, 8366519, 8417742, 8054382, 7996631, 8205990, 8255983, 8157686, 8281855, 8068510, 8077108, 8305125, 7971133, 7874491, 7590414, 7390684, 7103394, 7439646, 7927351, 8086662, 7843289, 7754384, 7878064, 7467230, 7761374, 7786166, 7897684, 7323329, 7145504, 7275982]
2241G275982m0212K961j46107m14442m14131L31432K07885j83051Q0876K18537
2231F919730j35550n64914K74382J62122M39791o3842P6539L90648M4633l24825
2221G218714k72055J58113p07776J56788L64568Q3955m88748k60248l15856J60941
2211F098396l10693K61309K30546J49348P4895j14635M19895L70203J65728m66338
2201F878654n06163M22296M06157J14808l37690M18419L54060L92405K4507l34753
2191G832700j1288K30208j72424k54818J26739j25687k84278J09614k82612m32966
2181F735188O31425j5379l7315M70134j70840N1565Q72412j75867j09542L86593
2171H638374K48296N63241j86532J62564L68491N54692L59996K32584P81692L12284
$$ y = [7275982, 7235770, 7238731, 7092624, 6678182, 6264051, 6595483, 6803368, 6620317, 6701193, 6919730, 6784180, 6219266, 6493648, 6655770, 7095561, 7031719, 7108258, 7498906, 7543539, 7218714, 6946659, 7104772, 6396996, 6553784, 6918352, 7002307, 6513559, 6253311, 5937455, 6098396, 5787703, 6049012, 6279558, 6428906, 6503801, 6389166, 6809061, 7179264, 7344992, 6878654, 6372491, 6794787, 7200944, 7315752, 6978062, 7396481, 7750541, 8142946, 8167453, 7832700, 7821412, 8051620, 7879196, 7624378, 7751117, 7625430, 7341152, 7450766, 7168154, 6735188, 7366613, 7351234, 7313919, 7784053, 7613213, 7664778, 8537190, 8361323, 8251781, 8638374, 8886670, 9449911, 9263379, 9425943, 9794434, 10349126, 10709122, 10941706, 11723398, 12035682]
2161A2035682R35356J476893Q66279J167040J459646K408410L140767L866561
2153B7356634L140232J599476m32672j665538j905379k114755k191199k771357
2145B1015442k402029j942544j227128j658232j451189p78803n05214q25527p34230
2136I490546l92984k56801m94478m00714n19313l50576K04273j72168m08433p0683
2126F628669j82139J64233k36460j41269l48994L7274L83078j38324k36696O9422
2116E998794j61757m62419j10730N48791l90377j23109J87196p04723m01997K32074
2106D611743o0554Q264j80611K84335M56900k25415M78164r3154o64404k98140
2096D317128j54093N40760N28479k58941j32082m75576m7849J40345m6963K68147
$$ y = [12035682, 12971038, 14447931, 15314210, 16481250, 17940896, 20349306, 23490073, 27356634, 30496866, 32096342, 31663670, 29998132, 28092753, 25977998, 23786799, 21015442, 18613413, 16670869, 15443741, 13785509, 12334320, 11555517, 11050303, 10224776, 9490546, 9097562, 8840761, 8346283, 7945569, 7426256, 7075680, 7279953, 7107785, 6699352, 6628669, 6446530, 6610763, 6374303, 6233034, 5884040, 5921314, 6304392, 6166068, 5929372, 5998794, 5837037, 5374618, 5263888, 5812679, 5422302, 5299193, 5486389, 4781666, 4379669, 4611743, 4551189, 4559453, 4378842, 4663177, 5120077, 4894662, 5372826, 5279672, 4615268, 4317128, 4163035, 4703795, 5232274, 4973333, 4841251, 4365675, 4317826, 4458171, 4411208, 4679355]
2086D679355M5216k78728J33184L20790L71524n12686k1816J34351P8776J20929
2076E070895l62792j16933M43354K25998k61114j97298L68731j8821l29605N5884
2066D878299l02067N07903O05370J7719l15301p55564L97009N5859Q4132M96305
2056E669664m31930o6614j19833L32193K71566j01904Q8965l12733j79021p1678
2046E078675N24845O47035p7207m29824k16185N5443N06281k05187l11181o0920
2036E511775O488M15333k00276J92873J96098K1102K9056Q6790o14798J93716
2026E838157L87925L55266l88350m1776N39327k801q307L22009L00566K17534
2016G519550K269j56106j42776M1887k1351K84742K16894P5116r2921k7270k6759
$$ y = [4679355, 4724571, 4445843, 4579027, 4899817, 5271341, 4758655, 4736839, 4871190, 4949966, 5070895, 4708103, 4591170, 5034524, 5260522, 4999408, 4802110, 5170841, 5152020, 4822415, 4878299, 4576232, 5084135, 5689505, 5707224, 5391923, 4636359, 5033368, 5089227, 5173359, 5669664, 5237734, 5171120, 5051287, 5383480, 5655046, 5553142, 5642107, 5329374, 5150353, 5078675, 5603520, 6250555, 6173348, 5743524, 5527339, 5582782, 6089063, 5883876, 5572695, 5511775, 5518263, 5933596, 5733320, 5926193, 6122291, 6143393, 6172449, 6259239, 5644441, 5838157, 6226082, 6581348, 6192998, 6151222, 6690549, 6687748, 6679441, 7001450, 7302016, 7519550, 7521819, 7365713, 7222937, 7264824, 7243473, 7528215, 7745109, 7820225, 7727304, 7700034, 7673275]
2005G673275K3679M69509J22858k16665K62299N14900P9118k7625N385K47150
1995I153883K30529Q465P5605J83483k96063L74325K51606K87603K34298L32080
1985A0835814n30507K87507O18645K89113J02277L43715M78033L74765L12953
1976A3112315P4077J83662M04866l6096N14671L57108J13572M97814Q1767L23065
1966A5626821K06894N06951K73414P28367O08558Q95045P30220M56473J27419
1957B0160162Q08334M88563P74178J519722N30060N51812O56708j54310R40100
1948B6275329Q50780Q36984J289932N99316K42767L4940Q67137P82002P59677
1939C2538864P63866O54969N92263J069379N64989Q65877J003411L68721J152906
$$ y = [7673275, 7696954, 8166463, 8289321, 8072656, 8334955, 8849855, 8928973, 8901348, 8906733, 9153883, 9384412, 9392877, 9468482, 9651965, 9355902, 9730227, 9981833, 10269436, 10503734, 10835814, 10305307, 10592814, 11211459, 11500572, 11602849, 11946564, 12424597, 12799362, 13112315, 13186392, 13370054, 13774920, 13738824, 14253495, 14610603, 14724175, 15221989, 15303756, 15626821, 15833715, 16340666, 16614080, 17342447, 17951005, 18846050, 19576270, 20032743, 20160162, 20968496, 21457059, 22231237, 23750959, 24281019, 24832831, 25489539, 25335229, 26275329, 27126109, 27963093, 29253025, 29852341, 30095108, 30130048, 30997185, 31779187, 32538864, 33302730, 33957699, 34549962, 35619341, 36184330, 37050207, 38053618, 38422339, 39575245]
1930C9575245R45374N78084J244288Q65485K00405J119575P15284N16508P11223
1921D6471471M0940M42021K63165K67404j27740p38547m29558j24247j60732l51223
1911D5552954q29955k39200q76535l81300p52683j241268j358115n27002j388660
1902C7958236j012136j102391j738964r04132j378986j785576q35186j035186
1894B8165679j590259q32065q65027j493640p62659p05817j477812m06762m53750
1885A9577888j055826p66168n14229j28142m82155n31478o16064m76388p15936
1876A4291502r37541q31279q37142j82028J61895J66903m23410q22445l67817
1867A0218638J20125l79706K23461o30k1231q53195n91258o8423j92067q0852
$$ y = [39575245, 40520619, 41098703, 42342991, 43208476, 43408881, 44528456, 45243740, 45760248, 46471471, 46512411, 46954432, 47217597, 47485001, 47357261, 46618714, 46189156, 46064909, 45904177, 45552954, 44722999, 44483799, 43607264, 43225964, 42473281, 41232013, 39873898, 39346896, 37958236, 36946100, 35843709, 34104745, 33200613, 31821627, 30036051, 29200865, 28165679, 26575420, 25743355, 24878328, 23384688, 22622029, 21916212, 20438400, 20031638, 19577888, 18522062, 17755894, 17241665, 17113523, 16631368, 16099890, 15483826, 15007438, 14291502, 13353961, 12522682, 11685540, 11503512, 11665407, 11832310, 11408900, 10586455, 10218638, 10338763, 9959057, 10182518, 10181888, 10160657, 9307462, 8716204, 8647781, 8455714, 8374862]
1857H374862P3794l48709m51049l60665j75274n8842k30460K39403P70635p31209
1847G102486l81521K0409K856j45717k61604k09964k26821j94664L94462j12268
1837E987654k17847l08835j14089l3987o9329J03164K45765j44322k61452j44718
1827E042004l09201R4489K12824n13753j74512J81938N01284j45480l35163l71586
1817D182844j71384J02628J27330K15863L54942m41663q55859J86044N46166k76286
1807C970625J44666K19955k18574N3209M7247q5623m40390j54727J98919J93265
1797C928572n61036L31127j25182K4464L09621L40438m78668J58587r5637j10844
1787C721442k07146k39739M70847P6777K16034j10576o09912j7297L31636K66958
$$ y = [8374862, 8448656, 8099947, 7648898, 7288233, 7112959, 7054117, 6823657, 7063060, 7833695, 7102486, 6720965, 6741374, 6744230, 6598513, 6336909, 6126945, 5900124, 5705460, 6099922, 5987654, 5769807, 5460972, 5346883, 5312896, 5243567, 5346731, 5592496, 5448174, 5186722, 5042004, 4732803, 4827292, 5040116, 4526363, 4351851, 4533789, 5035073, 4889593, 4554430, 4182844, 4011460, 4114088, 4241418, 4457281, 4812223, 4370560, 3514701, 3700745, 4246911, 3970625, 4115291, 4335246, 4116672, 4169881, 4217128, 4131505, 3691115, 3536388, 3735307, 3928572, 3367536, 3698663, 3573481, 3597945, 3907566, 4248004, 3769336, 3927923, 3832286, 3721442, 3514296, 3274557, 3745404, 3822181, 4038215, 3927639, 3317727, 3300430, 3632066, 3899024]
1777C899024l09934o15357J1493J43871l53266M24230R4780l83746k20544L01971
1767B992522Q572L82723P1667j19097j36746o63814M57553O77011j56647p3251
1757C440493l2698j87403O37876j81206P2827k02296L45366l76538n94117J51384
1747C073688j3147J48268J87491N89265m8808k69567m77457J37608P7493J75280
1737C580114k39842J46476J6871n8975J19627k68918j77053k48219Q98083l13320
1727C454844k44325P5416l21535O59558k1709m94364L8159R4547o03738j57113
1717B479740L80555O29804n05955j48127P5971j00659k09268N2591K92719N5871
1707C003242K42720k86155K81328L68276m17989J94409k19602l94139r2471L73413
$$ y = [3899024, 3589090, 2973733, 2985226, 3129097, 2775831, 3200061, 3294841, 2911095, 2690551, 2992522, 3001094, 3383817, 3455484, 3336387, 3199641, 2535827, 2993380, 3670391, 3513744, 3440493, 3407795, 3220392, 3858268, 3677062, 3749889, 3547593, 3892959, 3516421, 2922304, 3073688, 3060541, 3208809, 3396300, 3985565, 3936757, 3667190, 3189733, 3327341, 3404834, 3580114, 3340272, 3486748, 3503619, 3444644, 3564271, 3295353, 3118300, 2870081, 3768164, 3454844, 3210519, 3285935, 2964400, 3623958, 3602249, 3107885, 3146044, 3240591, 2636853, 2479740, 2860295, 3490099, 2984144, 2836017, 2911988, 2811329, 2602061, 2654652, 2947371, 3003242, 3245962, 2959807, 3241135, 3609411, 3191422, 3385831, 3166229, 2772090, 2679619, 3053032]
1697C053032J63493k49851r0919M16273k54484l15137j24134j29253J83602K26800
1687B879422J01927j58192K33532K84230k15309o6396k95087j65570N25580m30356
1677B693781J54223K53995M85007k24526m66812q752O6931o5913j78058M10965
1667C120841p3585j3462M43779l20310L04978m28833q9893l07855k07950L64483
1657B792193j79200M31970J47738k37079M46105J18368m66040m16707q0428k42247
1647B314673L96819R1842k27586l45781K66725J14543m7052N64670k07049n4333
1637B867471L7059L71861j8611L33364k82436k27132j78306K18720L05900n9415
1627C368475k9007j24001J3245l8472l2253k1210n00469n25654R10776N81866
$$ y = [3053032, 3216525, 2966674, 2875755, 3292028, 3037544, 2722407, 2598273, 2469020, 2652622, 2879422, 2981349, 2823157, 3056689, 3340919, 3125610, 3059214, 2764127, 2598557, 3124137, 2693781, 2848004, 3101999, 3587006, 3362480, 2895668, 2886916, 2953847, 2887934, 2709876, 3120841, 3047256, 3033794, 3477573, 3157263, 3462241, 3033408, 2943515, 2635660, 2427710, 2792193, 2612993, 3044963, 3192701, 2955622, 3401727, 3520095, 3054055, 2637348, 2556920, 2314673, 2711492, 2803334, 2575748, 2229967, 2496692, 2611235, 2564183, 3128853, 2921804, 2867471, 2904530, 3276391, 3257780, 3591144, 3308708, 3081576, 2903270, 3121990, 3427890, 3368475, 3339468, 3215467, 3228712, 3190240, 3157987, 3136777, 2636308, 2110654, 3021430, 3603296]
1617C603296j26030j21596j38607q5417O16253O22067j37130k95163k63578Q3351
1607C757446J79525L8671p434k7655K16994n8782l85879M77434M51512o10232
1597D031600j59961l33657p3840J02856M5859n10082K72812J62521m73439k773
1587C061896L20160K007L39660p9746j6724N5874R2940r9590p2362J34102K84604
1576D022821l00399j9399J39029m43687J79133K89857L35586l0577p54477p60289
1566B657598l34800O15900J8944J29419o3355k65484q2330k24233O8983j66233
1556B354409K94501M98827j57742o06402L66155j26537q4768K12049K07679k33676
1546B724495k61187j15871K54996o12514Q4364L94275N19643J35149j54300l15306
$$ y = [3603296, 3477266, 3355670, 3217063, 3131646, 3747899, 4369966, 4232836, 3937673, 3674095, 3757446, 3936971, 3975642, 3968208, 3940553, 4157547, 4098765, 3712886, 4190320, 4641832, 4031600, 3871639, 3537982, 3464142, 3566998, 3612857, 3102775, 3375587, 3538108, 3064669, 3061896, 3382056, 3384063, 3723723, 3643977, 3627253, 3683127, 3776067, 3676477, 3604115, 3738217, 4022821, 3722422, 3703023, 3842052, 3398365, 3577498, 3867355, 4202941, 4172364, 3417887, 2657598, 2322798, 2938698, 2957642, 3087061, 3023706, 2758222, 2675892, 2451659, 2520642, 2354409, 2648910, 3147737, 2989995, 2383593, 2749748, 2623211, 2538443, 2750492, 2958171, 2724495, 2463308, 2347437, 2602433, 1989919, 2074283, 2468558, 2988201, 3123350, 2969050, 2653744]
1536B653744k49506l73288R55253K26070p35300L90471j38761m30505O31439m20811
1526B508806o39688J75821O0366j44271J61025K62286L68355N0752l82326j62945
1516B258181l5201k74743K23395J59476J62414K0315l52969l08078L98266m1032
1506B210024M441M74043j88726l14151l11635L21719L61540j45912l30205N09326
1496B590464k46692k36482J4450L23168N55324J20390l20195j74375K03829l37642
1486B492239m19294L15419N31189l30399j93212M1237J58454l31829L38953k49407
1476B353350r6611R62995m01594q0525N6708m44095L7643L63007j08350m22518
1466B220010M64562K43770k90568N10923o8075k55245j81179K9738n8477k84884
$$ y = [2653744, 2404238, 2030950, 2986203, 3212273, 2476973, 2867444, 2728683, 2298178, 2929617, 2508806, 1869118, 2044939, 2105305, 1961034, 2122059, 2384345, 2752700, 2803452, 2421126, 2258181, 2222980, 1948237, 2171632, 2331108, 2493522, 2513837, 2160868, 1852790, 2251056, 2210024, 2214465, 2688508, 2499782, 2185631, 1873996, 2195715, 2557255, 2411343, 2081138, 2590464, 2343772, 2107290, 2121740, 2444908, 3000232, 3120622, 2800427, 2626052, 2829881, 2492239, 2072945, 2388364, 2919553, 2589154, 2395942, 2437179, 2595633, 2263804, 2602757, 2353350, 2256739, 3219734, 2818140, 2737615, 2794323, 2350228, 2387871, 2750878, 2642528, 2220010, 2684572, 2928342, 2637774, 3148697, 3080622, 2825377, 2644198, 2673936, 2615459, 2330575]
1456B330575K72766M35595K65461k76187l58350J38817j38039j88030l9872K26180
1446B668916r1514L4788K14403j15504L06207J71260J64359J32138p78194j82682
1436B524177L84367O0658k26879j68290N38614J21898l05769K97341k0860o6940
1426C138317Q1065K29304L01138p2130m10600k21271m26783J55454O10038J72177
1416C556709L48135N11335n41521o04960l15847M47871l245K26209l91461K90975
1406C524200K61375J92724J34497k95927j29934N16557K20219N78085p2794j79904
1396D749098m47049l0688J90877k71487N1981k61792j17132N79617N97486Q1791
1386E122702M28288j70939M4955j88916l69003J85711K5524L26105J61858k88120
$$ y = [2330575, 2603341, 3038936, 3304397, 3028210, 2669860, 2808677, 2670638, 2482608, 2442736, 2668916, 2577402, 2612190, 2826593, 2711089, 3017296, 3188556, 3352915, 3485053, 2706859, 2524177, 2908544, 2969202, 2742323, 2574033, 3112647, 3234545, 2928776, 3226117, 3205257, 3138317, 3219382, 3448686, 3749824, 3677694, 3267094, 3045823, 2619040, 2774494, 3384532, 3556709, 3904844, 4416179, 3874658, 3269698, 2953851, 3401722, 3398477, 3624686, 3233225, 3524200, 3785575, 3978299, 4112796, 3816869, 3686935, 4203492, 4423711, 5001796, 4929002, 4749098, 4302049, 4271361, 4462238, 4190751, 4242732, 3980940, 3863808, 4443425, 5040911, 5122702, 5550990, 5380051, 5425006, 5236090, 4867087, 5052798, 5078322, 5404427, 5566285, 5278165]
1376E278165M53622j0377k13085j45496P11135l1144N07578m41010O11838K3613
1366F744839j62498N76752q4786J8089J10211j37103P54266l0888J51382j06572
1356G833692O3607N36238k79590o5396p9674Q52409j04948k42627m63O73309L28749
1345I515306k33319N49138N99321n7850K63141J37582N84711M60001M89482O93780
1335A3001293J31786O00970O88707P19722M71227K44337P11211N11457Q9867J62091
1325A7332668k44079K01782J2169p82963K25055J58154k08966l99079m28026R7988
1315A5964703l91714p64863j042079K87204K54010r63854j267595p29759m31626
1306A0914427l66319P4056l57766n20638J62869O196n95851m30383r98173j48484
$$ y = [5278165, 5731787, 5721410, 5508325, 5362829, 6073964, 6042820, 6550398, 6109388, 6721226, 6744839, 6582341, 7159093, 7074307, 7092396, 7202607, 7065504, 7819770, 7788882, 7940264, 7833692, 7897299, 8433537, 8153947, 8088551, 8008877, 8861286, 8756338, 8513711, 8513248, 9186557, 9515306, 9281987, 9831125, 10430446, 10372596, 10635737, 10773319, 11358030, 11818031, 12307513, 13001293, 13133079, 13734049, 14422756, 15142478, 15613705, 15858042, 16569253, 17080710, 17170577, 17332668, 17088589, 17290371, 17302540, 16519577, 16744632, 16902786, 16693820, 16294741, 15866715, 15964703, 15572989, 14808126, 13766047, 14053251, 14307261, 13343407, 12075812, 11346053, 10914427, 10548108, 10622164, 10264398, 9743760, 9906629, 9912825, 9316974, 8886591, 7888418, 7739934]
1296G739934J74074j94316l40474k77448P9165P1284k62529p3616m23962n22175
1286E969937N41500m59725J21384k1204k12966k83725k10866j30526L79038r3219
1276E599628p68890k50639K39120J11219M94533n09929p13367K36138k27814j18335
1266D091664j79662L01538N21157p1257j77969m60734K29651J3644k71701M1368
1256D037699k53785m25312r6228R05539j39436r88718k33424L12552M27963L62500
1246C909350l5564J12804j74402l35471p230J83286N4915k23557R7691j91956
1236C389866K6213q3683n08785J81126J80661N7191k09798o7652J90837N47340
1226C703316r607l00613o12663k93166l1640M50755j4335m1139J9443l3270k17506
$$ y = [7739934, 7914008, 7719692, 7379218, 7101770, 7180935, 7252219, 6989690, 6916074, 6492112, 5969937, 6511437, 6051712, 6173096, 6151892, 5938926, 5655201, 5444335, 5313809, 5692847, 5599628, 4830738, 4580099, 4819219, 4930438, 5424971, 4915042, 4201675, 4437813, 4209999, 4091664, 3912002, 4213540, 4734697, 4663440, 4485471, 4024737, 4254388, 4268032, 3996331, 4037699, 3783914, 3358602, 3262374, 4167913, 4028477, 3039759, 2806335, 3118887, 3546850, 3909350, 3873786, 3986590, 3812188, 3476717, 3469487, 3652773, 3707688, 3484131, 3581822, 3389866, 3416079, 3332396, 2823611, 3004737, 3185398, 3242589, 3032791, 2965139, 3155976, 3703316, 3693709, 3393096, 2780433, 2487267, 2455627, 2906382, 2892047, 2850908, 2870351, 2837081, 2619575]
1215B619575j83342M92672N88725M3938k20090r49741n64444L6221R6785j90946
1205A769353M04413K13111K00388J12076K83621j64815j26313L77352l8950m63028
1195B567208M39984k3896l51227k52445P01903J75485r82867L90588j41216n3607
1185B469910K51672k11314o88808M50300J45482m0510j19496J97374M67688M8443
1175B970741n2596l56857l74022j66488O63346J90396n94154n6468P8890J92533
1165B495321k25277L8456L6383j00610l04247m68247K12651J96508J20655J39718
1155B141311L00736J26676Q3733l51980l70844P79734J13495J28419m84932l47169
1145B119179j48700L04189K07301o11644k8113N85152n17827l10792Q4476M43527
$$ y = [2619575, 2436233, 2928905, 3517630, 3561568, 3341478, 2391737, 1827293, 1863514, 1960299, 1769353, 2173766, 2386877, 2587265, 2699341, 2982962, 2818147, 2691834, 3069186, 3030236, 2567208, 3007192, 2983296, 2632069, 2379624, 3081527, 3257012, 2274145, 2664733, 2523517, 2469910, 2721582, 2510268, 1821460, 2271760, 2417242, 2376732, 2257236, 2454610, 2922298, 2970741, 2918145, 2561288, 2187266, 2020778, 2684124, 2874520, 2280366, 2223898, 2302788, 2495321, 2270044, 2308500, 2344883, 2244273, 1940026, 1471779, 1684430, 1880938, 2001593, 2141311, 2442047, 2568723, 2652456, 2300476, 1929632, 2709366, 2822861, 2951280, 2466348, 2119179, 1970479, 2274668, 2481969, 1870325, 1842212, 2427364, 1909537, 1598745, 1683221, 2126748]
1135B126748N63734m02012n02672M32723N49027P5645K36142j27379j37977l66539
1125B447440p9116k03359L87469J18982n60983J58249K04580j54419k23017p089
1115B088737J36743j10558j57959J04281k19488L35575N84413K30963n14354r1323
1105B387030m07308J23222P06683l11281l3340k12551L02791K71930n0898l86773
1095B389505P0234K197j94958O2925j51162K78817j53043M4375o2718K75279j38358
1084B423093n38688J7522k140L23442l92095L84334K22996M10355j84179l65140
1074B299500M6250j08565m8522k24479R27444R4617k7098k56481k36513j14133
1064B352020O3299K74390q38M0448K75652j58877l45323L4541j69447M67457r8784
$$ y = [2126748, 2690482, 2288470, 1785798, 2218521, 2767548, 2843193, 3079335, 2951956, 2813979, 2447440, 2368324, 2164965, 2552434, 2671416, 2110433, 2268682, 2473262, 2318843, 2095826, 2088737, 2225480, 2114922, 1956963, 2061244, 1841756, 2177331, 2761744, 2992707, 2478353, 2387030, 1979722, 2102944, 2809627, 2498346, 2465006, 2252455, 2555246, 2827176, 2776278, 2389505, 2459739, 2461936, 2266978, 2329903, 2178741, 2457558, 2304515, 2348890, 2286172, 2561451, 2423093, 1884405, 1901927, 1899787, 2223229, 1831134, 2215468, 2438464, 2848819, 2664640, 2299500, 2345750, 2237185, 2188663, 1964184, 2891628, 2986245, 2959147, 2702666, 2466153, 2352020, 2415319, 2689709, 2688871, 2729319, 3004971, 2846094, 2500771, 2535312, 2365865, 2833322, 2734538]
1053B734538k52062l37601P96200M91447l55695l10755L1402p6926j12028n4465
1043B554055k9209K2166L13089M31485m24121J006L28258j99185j74626l82149
1033B440769J16811O9004J80268K27671n52521M24143L52066J99331L75682K16615
1023D049839n5153O3311N3755L82510k19352L1016k14578O6522O10653j5889N26236
1012E278870K37305L7546L15092j97372M32709K88452j96954n3932O34442L53792
1002G129950o5043R489M93631n36679O503M97170r2476K9110o66404K7534N75554
991G408339m3250l95075M2322N72214M1223O50723L36530L20030P42593M05564
981A0081213Q55784M95548J8685m10518j97250j78861l31643o26409J4729n38165
$$ y = [2734538, 2482476, 2144875, 2941075, 3432522, 3076827, 2766072, 2797474, 2720548, 2608520, 2554055, 2524846, 2547012, 2860101, 3291586, 2867465, 2868471, 3196729, 2997544, 2822918, 2440769, 2557580, 2626584, 2806852, 3034523, 2482002, 2906145, 3258211, 3457542, 3833224, 4049839, 3994686, 4057997, 4111752, 4494262, 4274910, 4305926, 4091348, 4157870, 4768523, 4752634, 5278870, 5516175, 5553721, 5868813, 5671441, 6104150, 6392602, 6195648, 6141716, 6776158, 7129950, 7064907, 7074396, 7568027, 7031348, 7037851, 7535021, 7442545, 7471655, 6805251, 6832785, 7408339, 7365089, 6970014, 7012336, 7584550, 7625773, 8276496, 8613026, 8933056, 9675649, 10081213, 10936997, 11432545, 11451230, 11040712, 10843462, 10664601, 10332958, 9706549, 9721278, 9183113]
971I183113n62105k57595l69880n91732n49879L4344k47354Q8868J90346m20053
961F498073M2655j4575k71686l12323L85854P5574o0086K56611l9710Q9220P70067
950G419674j33802j93898K01253q0919l93649j54566j3036l88664l28136j66625
940E767632q82542J99152k71876K91237L19134n78907m28162L8871M6236j15376
930D385399k90029j32130j24469j34310O16926J52997l95380k89441k41349m27101
920C121113K07259k18405j86423j96846K5296L93232o10005j72485K39853q6517
910B516072K08773M09902l88551m18571J24512l28028l31447L52938J83833R2896
900B422329q5741l07719K35246Q8888K49455p08421M23310m42004m81090K01189
$$ y = [9183113, 8621008, 8363413, 7993533, 7401801, 6851922, 6886266, 6638912, 6727780, 6918126, 6498073, 6540728, 6526153, 6254467, 5942144, 6327998, 6403572, 6343486, 6600097, 6560387, 6649607, 7419674, 7285872, 7091974, 7293227, 7212308, 6818659, 6664093, 6651057, 6262393, 5934257, 5767632, 4885090, 5084242, 4812366, 5103603, 5422737, 4843830, 4415668, 4454539, 4500775, 4385399, 4095370, 3963240, 3838771, 3704461, 4321387, 4474384, 4079004, 3789563, 3548214, 3121113, 3328372, 3109967, 2923544, 2726698, 2751994, 3145226, 2535221, 2362736, 2602589, 2516072, 2724845, 3134747, 2746196, 2327625, 2452137, 2124109, 1792662, 2145600, 2329433, 2422329, 2336588, 2028869, 2264115, 2353003, 2602458, 1894037, 2317347, 1875343, 1394253, 1595442]
890A595442J95250l14297k45704j59968K33735k52270P97994k49793k27605L63450
880A736234j04051q5882m4605M99347o32382l3649j11286l55947N4955P12742
870A635476q2735L16236m9110K14871l86078k74959j13809r9440L18299k98238
860A180513M29213j39035J7678L2235j59298k28533j31482K31508m61411j00511
850F70877J0003M83575J85265j74400K76719k33035M38985o3048l20263n10035
840G64643O4012K89166K70236m93564j27878M15120l8681J07933j78979N0770
830A122778n98315p3680r3365k20091N66285J99946n01743j07162L38401K19079
820H52133K3955K08905K19425l58825J51552R0943k43204k10500N49474L3524
$$ y = [1595442, 1790692, 1476395, 1230691, 1070723, 1304458, 1052188, 1850182, 1600389, 1372784, 1736234, 1632183, 1546301, 1501696, 2001043, 1368661, 1335012, 1223726, 867779, 922734, 1635476, 1552741, 1868977, 1819867, 2034738, 1648660, 1373701, 1259892, 1160452, 1478751, 1180513, 1609726, 1470691, 1488369, 1520604, 1361306, 1132773, 1001291, 1232799, 771388, 670877, 680880, 1164455, 1349720, 1175320, 1452039, 1219004, 1657989, 1594941, 1274678, 764643, 828655, 1117821, 1388057, 894493, 766615, 1181735, 1143054, 1250987, 1072008, 1122778, 524463, 450783, 357418, 137327, 703612, 903558, 401815, 294653, 633054, 852133, 876088, 1084993, 1304418, 945593, 1097145, 1188088, 944884, 734384, 1283858, 1317382]
810A317382k01947J26709P1475K05397J12640n96175j16696k0779p1323r9585
800G27098K10234N30987j4222K0740l41955o8186k28896j42506K87877l0118j74960
789G76093L55758j39619l88217k79958M44288L26256q2460K83401m06976n75684
779C12882K92229K43533l41427K49988q3325j57987O1130J80301N2757l92836
769D17245K2318Q0557L54901L8157k62816K02122l75468r82643K15433J16167
759a74027K58953J39992J80643L60236L99511M68297k50623l5857m715l66025
749I76385r4784K35110R7210n41431K31042j08179j9750J43938L9052o63715J7358
738C12236K94216j93024m46659L75864k8886M9465K22786k70007m13238M34804
$$ y = [1317382, 1115435, 1242144, 1313619, 1519016, 1631656, 1035481, 918785, 898006, 826683, 727098, 937332, 1468319, 1454097, 1474837, 1132882, 1064696, 835800, 693294, 981171, 951053, 776093, 1131851, 992232, 604015, 324057, 768345, 1094601, 1012141, 1295542, 888566, 312882, 605111, 848644, 507217, 757205, 673880, 515893, 577023, 757324, 810081, 417245, 439563, 520120, 875021, 913178, 650362, 852484, 477016, -505627, -290194, -174027, 84926, 224918, 405561, 765797, 1165308, 1633605, 1382982, 1347125, 1342410, 976385, 881601, 1116711, 1213921, 672490, 903532, 795353, 775603, 919541, 958593, 294878, 312236, 606452, 413428, -33231, 342633, 313747, 363212, 585998, 315991, -97247, 337557]
728C37557J65509l51851L63171M83232l01794K81336r9846m5134N4998l39761
718E47417J96923l58155N3468K46385N44730K8948j33710o99220j05852K43689
708E64623j79906K95670J17749l19483M62051k49768j22181L16798l85296J26976
698F27233N57991m8800l47600r111J7396j85491j14810j29094M46363N3210k52600
687F14687M75050M25131p09700l68140N77525r3613l35949K42737l39691M5385
677E33422L23869L6446p5389L95582J0655l80751r7865m90234l1713M76235J0834
666G11091j02525o4598K94029m72639P51902K8437l41680K15862P7364k38168
656H59075l08642L64416m7700J11830m999p82364L953J13607K41755P1960l70159
$$ y = [337557, 503066, 151215, 514386, 997618, 695824, 977160, 877314, 832180, 887178, 547417, 744340, 386185, 439653, 686038, 1230768, 1259716, 1126006, 426786, 320934, 564623, 384717, 680387, 798136, 478653, 940704, 690936, 568755, 885553, 500257, 627233, 1185224, 1136424, 788824, 779713, 797109, 611618, 496808, 367714, 814077, 867287, 614687, 1089737, 1514868, 805168, 437028, 1014553, 920940, 584991, 827728, 488037, 533422, 857291, 893737, 818348, 1213930, 1224585, 843834, 745969, 255735, 224022, 700257, 711091, 608566, 543968, 837997, 365358, 1117260, 1145697, 804017, 1019879, 1097243, 859075, 550433, 914849, 867149, 978979, 973980, 191616, 195569, 309176, 550931, 622891, 252732]
645B52732M98951J19031j07963L079l03559k53620J21602o47n02322j8163K68505
634G7626O98234O3301O6187M6926M8541j55530m51366j96493k08667j2141J51711
623A28329M75465N8145k72311k80865P8351N35599M34637k39568K28911M3582
613A190275p71165L46522J52915o69567K7780K08371M97509j18711J03016k17541
603G49404j61174j20536N12227p845n50072r1618L18370j82146k26874j00528
593A39208L22170L11896K34332l0762J72847l24929K24157J80421j40309m95544
583E93487J15848L18068p49647m93392n4730J95190M11277M29014k36847j20893
573D07375r3563K46137k36453j47460R5178K92530m28647L7028j9256l65366L23355
$$ y = [252732, 751683, 870714, 762751, 765830, 462271, 208651, 330253, 329606, -172716, -190879, 77626, 775860, 839161, 905348, 952274, 1000815, 845285, 393919, 197426, -11241, -23382, 128329, 603794, 661939, 389628, 108763, 187114, 722713, 1157350, 917782, 1146693, 1190275, 419110, 765632, 918547, 248980, 276760, 485131, 982640, 863929, 966945, 749404, 588230, 467694, 979921, 972076, 422004, 330386, 648756, 466610, 239736, 139208, 461378, 773274, 1007606, 976844, 1149691, 824762, 1048919, 1229340, 1089031, 593487, 709335, 1027403, 277756, -215636, -270366, -75176, 336101, 765115, 528268, 407375, 313812, 559949, 323496, 176036, 271214, 563744, 135097, 172125, 152869, -212497, 110858]
562A10858j50397O82246j41534k37554p7036j34662M43516J67608P251l98555
552B71741J31682k64844J31406P8321m5968J26126K0360J50601K11300l72010
542D38715K45085J43625n1571m27226m63063J06858J68503L25319l1134j09409
532C45702L8864J49114J46294L75001l33694K1967j81600K61261K30176m25567
522F27518k43624n66785O42692K74925k48709L11447m01776J91145M70782o42262
512D15353m7128L74356k16445O9060l7888K7458m53064J29995k04846J63173j57826
501F2198l01679L70956K42239M9502m29602M8252L31280L91190M8101l34360l1708
490D46369o2946l68377k1817k59384L17654K19999J60867K81496M6836k24906
$$ y = [110858, -39539, 642707, 501173, 263619, 186583, 51921, 495437, 663045, 670296, 271741, 403423, 138579, 269985, 348306, 302338, 428464, 448824, 599425, 810725, 438715, 683800, 827425, 775854, 348628, -114435, -7577, 160926, 486245, 455111, 345702, 384566, 533680, 679974, 1054975, 721281, 743248, 561648, 822909, 1053085, 627518, 383894, -182891, 459801, 734726, 486017, 797464, 395688, 586833, 1057615, 415353, 368225, 742581, 526136, 595196, 557308, 584766, 131702, 261697, 56851, 220024, 62198, -239481, 131475, 373714, 423216, -6386, 41866, 373146, 764336, 812437, 478077, 446369, 383423, 15046, -6771, -266155, 51499, 271498, 432365, 713861, 760697, 535791]
480E35791n10969L54670J51349n60785k87021l54237M23626K37717P10960J61528
470H62629o92757L4969M16110L72558j8836j02348n07424p19953L03960L36906
460B85814r9608L50072j3691q7742R8986j82493L23765Q9425J24162M56205l60648
449I84247q5425K10949k76644N19262p1368k32739K76224n35356k2748K55483
439A021885j03329L72344L70256n15512J07754K66525o02319N20j77436r6966
429F43722L28442k68478j95318j02423K93321P1554k67152j36715R7333j29993
419C34293o4118J30402j22804K21291J75802L3975P9870l08360j28565j66736
409A85050k110O30489J88108L16154L78432R85432K23307M7523L24349l30864
$$ y = [535791, 24822, 379492, 530841, -29944, -316965, -671202, -247576, -9859, 701101, 862629, 169872, 204841, 620951, 993509, 974673, 872325, 364901, -355052, -51092, 285814, 186206, 536278, 522587, 434845, 533831, 351338, 675103, 764528, 888690, 1344895, 984247, 898822, 1109771, 833127, 1352389, 1281021, 1048282, 1324506, 789150, 766402, 1021885, 918556, 1290900, 1661156, 1145644, 1253398, 1519923, 917604, 918124, 740688, 643722, 972164, 703686, 508368, 405945, 699266, 770820, 503668, 366953, 464286, 334293, 270175, 400577, 277773, 499064, 674866, 708841, 788711, 480351, 351786, 185050, 182940, 813429, 1001537, 1317691, 1696123, 2681555, 2904862, 2952385, 3276734, 2945870]
399B945870K65949N16530K43766N28815q4645k63175M9697M13593q8243K80321
389D808478K33264l97734K01834N62853P60713k66484J42553K11462j16915L77308
379F517332K59782k06577L4172j18654L43107p3262j6551K26346J88565j78184
369F976076j02513K29219K4039m26544J80759J42979L22601K29496M12158P814
359G996084l62073M28589m90567L35990j24094j27410k80904N8735M32127l83135
349G483342j58300M40243q41983k73601L25990Q6416l92832k59910K1723L19733
339F750821K06466j71994J54487j80550m65709J56312j41429r0589L38166k59996
329F295985l88546p72499K53256O32863r6518l64808K2481n16165O9101M39488
$$ y = [2945870, 3211819, 3728349, 3972115, 4500930, 4416285, 4153110, 4202807, 4616400, 4528157, 4808478, 5041742, 4644008, 4845842, 5408695, 6169408, 5902924, 6045477, 6256939, 6140024, 6517332, 6777114, 6570537, 6604709, 6486055, 6829162, 6755900, 6739349, 6965695, 7154260, 6976076, 6873563, 7102782, 7126821, 6700277, 6881036, 7024015, 7346616, 7576112, 7988270, 7996084, 7634011, 8062600, 7572033, 7908023, 7783929, 7656519, 7375615, 7434350, 7866477, 7483342, 7325042, 7765285, 6923302, 6649701, 6975691, 7062107, 6669275, 6409365, 6431088, 6750821, 6957287, 6785293, 6939780, 6759230, 6293521, 6449833, 6308404, 6217815, 6555981, 6295985, 5907439, 5134940, 5388196, 6021059, 5924541, 5559733, 5582214, 5066049, 5135150, 5574638]
319E574638J66950k80850l90145n55571N51118K8320L63421l53522l51872K72786
309E025273n82042l80133K76936j02790L39950R6600m29356J2305m97773K68923
299D027893l53522k00184K47403M46900m38727l6612j93977l98337j06318l65451
289B629068K57819L80803J72559l97151j45865j59518m67557l0227n99244o0054
279A580633R327J83451m21600k94396P5103j7536K15264j41474l29394K80117
269A139495l64870n8296J60278j85904l03619k93064O05460k88606M88679n56541
259C43012o51857K28268J70902L42J32355k3341o55122m56797L14262P4813L01720
248b21443m67579k0404K55524k2281R5007J48159L2045l49384L02336K01009M18924
$$ y = [5574638, 5741588, 5460738, 5070593, 4515022, 5066140, 5094460, 5457881, 5104359, 4752487, 5025273, 4443231, 4063098, 4340034, 4237244, 4577194, 4673794, 4244438, 4256743, 3758970, 4027893, 3674371, 3474187, 3721590, 4168490, 3729763, 3693151, 3499174, 3100837, 2994519, 2629068, 2886887, 3267690, 3440249, 3043098, 2897233, 2737715, 2270158, 2239931, 1640687, 1580633, 1589960, 1773411, 1351811, 1057415, 1132518, 1114982, 1330246, 1188772, 859378, 1139495, 774625, 716329, 876607, 690703, 387084, 94020, 699480, 410874, 899553, 343012, -308845, -80577, 90325, 90667, 223022, 199681, -455441, -912238, -597976, -523163, -221443, -689022, -709426, -453902, -476183, -381176, -233017, -200972, -550356, -248020, -47011, 371913]
237C71913K71510r0536J17517K21672J32822o16905L42894P20005m20389p7256
227I73247m1002J23889j89120j61801M34875L0826J34317j16377N99747L88342
217B176943k23934K13017J0240M30448m1366J040571M65288O25299P72497L25852
207E794855M58400O81383J013922O20549L46765J243037O85551J233035J563458
198A3640955K136286J417869J858193K756417K737409K712045K590989K306866
190C2157029K787420L499169L803483M318226N637758P465962R697605J2308277
182H1674929J4417469J8760318K2603980K0101263Q786221j350827r268135j3618347
174A42106871j3893479j5330956j4803579j2978401j2047440r669769q475316
$$ y = [371913, 643423, 552887, 670404, 892076, 1024898, 407993, 750887, 1470892, 1050503, 973247, 932245, 1056134, 867014, 705213, 1140088, 1170914, 1305231, 1188854, 1788601, 2176943, 1953009, 2166026, 2176266, 2606714, 2565348, 3605919, 4071207, 4696506, 5469003, 5794855, 6253255, 6934638, 7948560, 8569109, 8915874, 10158911, 10844462, 12077497, 13640955, 15777241, 17195110, 19053303, 21809720, 24547129, 27259174, 29850163, 32157029, 34944449, 38443618, 42247101, 46565327, 52203085, 59669047, 69366652, 81674929, 96092398, 114852716, 137456696, 157557959, 166344180, 164993353, 155725218, 142106871, 128213392, 112882436, 98078857, 85100456, 73053016, 63383247, 54907931]
167E4907931o627422n930132m497001l823550l354927k715809k710717k544589
159B2703784k279715k584151k232855j748180j554800j013056j572959j096671
151H621397p17914o06328o76314r50724r81379n51012j83098j34116l31542m53986
141C034984n95144m51339m7615o60517j15185o5588K35574N8964n94266j35795
131F64073Q9218N52812K20889l58008j00847j75655k90552M34915j96596J48151
121I88400K83411j26477N1549j29104j53157n2486L26331J30938K63423m03059
111A179769k2302O97447m422J59409K06921j48904R0606L9269m6300N34167N33500
100C219160J88284m8411K45802m304J64357j12162M84649K56099l59032j71379
$$ y = [54907931, 48280509, 42350377, 37853376, 34029826, 30674899, 27959090, 25248373, 22703784, 20424069, 17839918, 15607063, 13858883, 12304083, 11291027, 9718068, 8621397, 7903483, 7297155, 6620841, 5670117, 4688738, 4137726, 3954628, 3820512, 3488970, 3034984, 2439840, 1988501, 1940886, 1280369, 1165184, 1099596, 1335170, 1394134, 799868, 664073, 753291, 1306103, 1526992, 1168984, 1068137, 892482, 601930, 1036845, 840249, 988400, 1271811, 1145334, 1196883, 1067779, 914622, 862136, 1188467, 1319405, 1582828, 1179769, 1157467, 1854914, 1850492, 2009901, 2216822, 2067918, 2158524, 2197793, 2151493, 2685660, 3219160, 3407444, 3359033, 3604835, 3600531, 3764888, 3652726, 4137375, 4393474, 4034442, 3863063]
90C863063K48154M24953M13170j13945M3674l68119P4155P18808K69971J58787
80E732671Q521J7896K41186M90040K79878k60995o8375L00850L31205L71127j3012
69G430992J98941n19305j35540M40513K64643K07618P3875K51816L13762o9226
59H458089q9863O7917R7709l16554L93546J82616R3098L56627M15j84459J64026
48I223167J01159m56052m9584Q4303O0207M72868p9975o87770p648J91807N3840
37H906322O4491l30645r6106j76327j81286J97034j5136K49118j42245m34215
27H041005k38931j04777J6131n97570k48792L9152K2753j69945j90535m61539
17F106952p2509l49806m00254k75693n36717j98825j41309j29893j54416k18597
$$ y = [3863063, 4111217, 4536170, 4949340, 4835395, 4879069, 4510950, 4585105, 5303913, 5573884, 5732671, 5741192, 5759088, 6000274, 6490314, 6770192, 6509197, 6440822, 6741672, 7072877, 7444004, 7430992, 7629933, 7110628, 6975088, 7415601, 7680244, 7887862, 7961737, 8213553, 8527315, 8458089, 8368226, 8436143, 8533852, 8217298, 8610844, 8793460, 8886558, 9243185, 9243600, 9059141, 9223167, 9324326, 8868274, 8818690, 8902993, 8963200, 9436068, 9356093, 8668323, 8660675, 8852482, 8906322, 8970813, 8640168, 8544062, 8367735, 8186449, 8383483, 8368347, 8617465, 8475220, 8041005, 7802074, 7697297, 7713428, 7115858, 6867066, 6906218, 6928971, 6759026, 6568491, 6106952, 6034443, 5684637, 5284383, 5008690, 4471973, 4273148, 4131839, 4001946, 3847530, 3628933]
7C628933m49032l59246p39925o94239l73065m60819m57521
0I5086
$$ y = [3628933, 3179901, 2820655, 2080730, 1386491, 1013426, 552607, 95086]
$$ Imaginary data points
##PAGE= N=2
##DATA TABLE= (X++(I..I)), XYDATA
16383g505040J1268L95257R0547J76654P0215l33029K18698J94974J75961K21276
16373f283219k15214m9571M90914M9520k48755M52376p8139L4761K04712j52328
16363e794943L27881J40028K106l65950J10120J1202N77413L72272k51200R7610
16353d773461J15734n55159M4058K93612P4557J65279J01046J25656k2434k42351
16343d673463q8456M68284L19599R6830l4477j87929M5500M33215L84656k3041
16333c259282k00296J00607K9873J15821l9527K67835k9048R3452j40142K3601
16323c037106M1425J1807j7022J68360J89826L91903k83452n30971L66715J93029
16313b505486q7890J27823J32144J00493j35550K98099K76590r0158m47709K46448
$$ y = [-7505040, -7493772, -7098515, -7007968, -6831314, -6761099, -7094128, -6875430, -6680456, -6504495, -6283219, -6498433, -6548004, -6057090, -6007570, -6256325, -5803949, -5882088, -5847327, -5642615, -5794943, -5467062, -5327034, -5324928, -5690878, -5580758, -5569556, -4992143, -4619871, -4871071, -4773461, -4657727, -5212886, -5168828, -4875216, -4800659, -4635380, -4534334, -4408678, -4431112, -4673463, -4761919, -4293635, -3974036, -3877206, -3911683, -4099612, -4054112, -3620897, -3236241, -3259282, -3459578, -3358971, -3329098, -3213277, -3252804, -2984969, -3014017, -2920565, -3060707, -3037106, -2995681, -2983874, -3000896, -2832536, -2642710, -2250807, -2534259, -3065230, -2698515, -2505486, -2593376, -2465553, -2333409, -2232916, -2368466, -2070367, -1793777, -1883935, -2331644, -2085196]
16303b085196K58480R6519m0805l41948N84906J75384j04517j79712N7291j87327
16293a766925K55419J40862j61375K07441L22563N7738r6367q8660M35814k59445
16283i52935P287j35282j19490J8336l0790J82398K94405J87855K39816j2183
16273c20583m07392K92782J40925q2343m0927J12270J93448K03794m93076K35699
16263a65403N6257m9721l41084R1695J80260l23126k3331K4594L17971K27184
16253d704p9003q4127Q2343j9527r8741O99049K88764m00169o7580N625J73444
16242D95374N34884q0658k09699l55795J39561j64969L94963n2335J06384j10190
16232F97520k71279L06084Q1418J11125m8018Q4633n9691p360K982L38410N2469
$$ y = [-2085196, -1826716, -1730197, -1771002, -2112950, -1528044, -1352660, -1457177, -1636889, -1579598, -1766925, -1511506, -1370644, -1532019, -1324578, -1002015, -944277, -1040644, -1129304, -693490, -952935, -945648, -1080930, -1200420, -1182084, -1212874, -1030476, -736071, -548216, -308400, -320583, -727975, -435193, -294268, -376611, -417538, -305268, -111820, 91974, -401102, -165403, -109146, -158867, -499951, -408256, -227996, -551122, -574453, -549859, -231888, -4704, -83707, -167834, -85491, -105018, -203759, 495290, 784054, 383885, 316305, 321930, 495374, 1030258, 949600, 739901, 384106, 523667, 358698, 753661, 701326, 807710, 697520, 426241, 732325, 813743, 924868, 876850, 961483, 901792, 894432, 897414, 1235824, 1288293]
16221A288293r8441J30750o3131n5504j7608J1300N44753k1547m87836K4493L58174
16210A613696K99445P995J51862k59978k15866M1818m566K48675L40848l24442
16200A899487l54266N12273l39975m37091o21582L57375J67114j03298O41759
16191A721796K81033l98424M35877m6482O540k62130M98549l67337J35767k28637
16181A776552j91651k1779K56787p1551k84069M70529J65722M92555j92999J37796
16171B537892n17285L22862L61530k1548L3410k51246j15720J89924l63961k66582
16161A909276J77071j71847J68667K77497j95248l7228K6871K49756K33184k27379
16151B410620j80764K40917K02479Q0564O4050m49646k90500N38198J74539m66870
$$ y = [1288293, 1189852, 1320602, 1257471, 1201967, 1184359, 1195659, 1740412, 1718865, 1231029, 1255522, 1613696, 1913141, 1921136, 2072998, 1813020, 1597154, 1638972, 1634406, 1883081, 2223929, 1899487, 1545221, 2057494, 1717519, 1280428, 658846, 1016221, 1183335, 1080037, 1721796, 2002829, 1604405, 2040282, 1993800, 2000340, 1738210, 2236759, 1869422, 2005189, 1776552, 1584901, 1563122, 1819909, 1748358, 1464289, 1934818, 2100540, 2593095, 2400096, 2537892, 2020607, 2343469, 2704999, 2683451, 2716861, 2465615, 2349895, 2539819, 2175858, 1909276, 2086347, 1914500, 2083167, 2360664, 2165416, 2128188, 2155059, 2404815, 2637999, 2410620, 2229856, 2470773, 2673252, 2753816, 2817866, 2368220, 2077720, 2615918, 2790457, 2323587]
16141B323587o4991M15537r2645n15007L57704J17646l01773J74775p3664l80007
16131A961162L53711J59290k60664j92590J19133K49492J80154L34910l39708
16122B564890m80759m60788K98461N77021K7354o77124j79629L76239O65632j05249
16112B606048k74416k375J98473M0566K12887J64874m36018J22466M10757n2661
16102B990601k67025n2696n3341L4146J91632R8289l44923J0163R2934l64068
$$ y = [2323587, 2258596, 2674133, 2581488, 2066481, 2424185, 2541831, 2240058, 2414833, 2341169, 1961162, 2314873, 2474163, 2213499, 2020909, 2140042, 2389534, 2569688, 2904598, 2564890, 2084131, 1623343, 1921804, 2498825, 2526179, 1849055, 1669426, 2045665, 2711297, 2606048, 2331632, 2329257, 2527730, 2568296, 2781183, 2946057, 2510039, 2632505, 3043262, 2990601, 2723576, 2670880, 2617539, 2651685, 2843317, 2941606, 2596683, 2606846, 2699780, 2335712]
$$ [...]
##END NTUPLES=NMR SPECTRUM
##END=
