##TITLE=1H_DE-80H_X3
 200.13MHz, d2o
 8 sc
 
 19ns.26.2.2025
##JCAMPDX= 6.0         $$ Bruker NMR JCAMP-DX V2.0
##DATA TYPE= NMR SPECTRUM
##DATA CLASS= NTUPLES
##ORIGIN= UXNMR, Bruker Analytische Messtechnik GmbH
##OWNER= pz
$$ XWIN-NMR		Version 3.5
$$ Wed Oct  8 12:12:31 2025 Russian Standard Time (UT+4h)  Yarkov@DPX200
##.OBSERVE FREQUENCY= 200.1313
##.OBSERVE NUCLEUS= ^1H
##.ACQUISITION MODE= SIMULTANEOUS
##.ACQUISITION SCHEME= undefined
##.AVERAGES= 8
##.DIGITISER RES= 18
##SPECTROMETER/DATA SYSTEM= spect
##.PULSE SEQUENCE= zg30
##.SOLVENT NAME= CDCl3
##.SHIFT REFERENCE= (INTERNAL, CDCl3, 0, 15.4869)
##AUDIT TRAIL= $$ (NUMBER, WHEN, WHO, WHERE, WHAT)
$$ ##TITLE= Audit trail, XWIN-NMR		Version 3.5
$$ ##JCAMPDX= 5.01
$$ ##ORIGIN= Bruker BioSpin GmbH
$$ ##OWNER= Yarkov
$$ C:/Bruker/XWIN-NMR/data/yarkov2/nmr/H-C/1/pdata/1/auditp.txt
$$ ##AUDIT TRAIL=  $$ (NUMBER, WHEN, WHO, WHERE, WHAT)
(   1,<2025-10-08 12:11:20.04 +0400>,<Yarkov>,<DPX200>,
      <created by zg, POWCHK disabled, PULCHK disabled
       configuration hash MD5:
       00 E9 B6 7A A2 85 ED C7 34 08 36 98 17 FE 4E 26
       data hash MD5: 16K
       93 66 FB B1 9C 9B EE 66 38 FA 6F 5B 07 2E 06 48>)
(   2,<2025-10-08 12:11:47.98 +0400>,<Yarkov>,<DPX200>,
      <Start of raw data processing
       efp BC_mod = 2 LB = 0.25 FT_mod = 6 PKNL = 1 PHC0 = -2281.05 PHC1 = 12.99097 SI = 16K 
       data hash MD5: 16K
       3C 25 84 A2 B0 DD 10 74 6A 1E 06 A2 8C 37 BF 17>)
(   3,<2025-10-08 12:11:53.57 +0400>,<Yarkov>,<DPX200>,
      <abs ABSG = 5 
       data hash MD5: 16K
       0C 88 9A 9F EE 37 4B 80 2C 4D 32 E7 44 25 5F 61>)
$$ ##END=
$$ 
$$ hash MD5
$$ F8 63 DA E9 F9 1F F6 65 32 DE 60 01 A2 65 35 14
##$RELAX= 
##$RELAX= 
##$RELAX= 
##$RELAX= 
##$RELAX= 
##$RELAX= 
$$ Bruker specific parameters
$$ --------------------------
##$DU= <C:/Bruker/XWIN-NMR>
##$EXPNO= 1
##$NAME= <H-C>
##$PROCNO= 1
##$TYPE= <nmr>
##$USER= <yarkov2>
##$AMP= (0..31)
100 100 100 100 100 100 100 100 100 100 100 100 100 100 100 100 100 100 
100 100 100 100 100 100 100 100 100 100 100 100 100 100 
##$AQSEQ= 0
##$AQ_mod= 1
##$AUNM= <au_zg>
##$AUTOPOS= <>
##$BF1= 200.13
##$BF2= 200.13
##$BF3= 200.13
##$BF4= 200.13
##$BF5= 200.13
##$BF6= 200.13
##$BF7= 200.13
##$BF8= 200.13
##$BYTORDA= 1
##$CFDGTYP= 0
##$CFRGTYP= 5
##$CHEMSTR= <none>
##$CNST= (0..31)
1 1 145 1 1 1 1 1 1 1 1 1 1 1 1 1 1 1 1 1 1 1 1 1 1 1 1 1 1 1 1 1 
##$CPDPRG= <>
##$CPDPRG1= <>
##$CPDPRG2= <>
##$CPDPRG3= <>
##$CPDPRG4= <mlev>
##$CPDPRG5= <mlev>
##$CPDPRG6= <mlev>
##$CPDPRG7= <mlev>
##$CPDPRG8= <mlev>
##$CPDPRGB= <>
##$CPDPRGT= <>
##$D= (0..31)
0 0.7 0 0 0 0 0 0 0 0 0 0.03 0 0 0 0 0 0 0 0 0 0 0 0 0 0 0 0 0 0 0 0 
##$DATE= 1759911079
##$DBL= (0..7)
120 120 120 120 120 120 120 120 
##$DBP= (0..7)
150 150 150 150 150 150 150 150 
##$DBP07= 0
##$DBPNAM0= <>
##$DBPNAM1= <>
##$DBPNAM2= <>
##$DBPNAM3= <>
##$DBPNAM4= <>
##$DBPNAM5= <>
##$DBPNAM6= <>
##$DBPNAM7= <>
##$DBPOAL= (0..7)
0.5 0.5 0.5 0.5 0.5 0.5 0.5 0.5 
##$DBPOFFS= (0..7)
0 0 0 0 0 0 0 0 
##$DE= 6
$$ [...]
##$SUBNAM3= <"">
##$SUBNAM4= <"">
##$SUBNAM5= <"">
##$SUBNAM6= <"">
##$SUBNAM7= <"">
##$SUBNAM8= <"">
##$SUBNAM9= <"">
##$SW= 18.0517328524113
##$SWIBOX= (0..15)
0 0 2 0 0 0 0 0 0 0 0 0 0 0 0 0 
##$SW_h= 3612.71676300578
##$TD= 16384
##$TD0= 1
##$TE= 0
##$TE2= 300
##$TE3= 300
##$TEG= 300
##$TL= (0..7)
0 120 120 120 120 120 120 120 
##$TP= (0..7)
150 150 150 150 150 150 150 150 
##$TP07= 0
##$TPNAME0= <>
##$TPNAME1= <>
##$TPNAME2= <>
##$TPNAME3= <>
##$TPNAME4= <>
##$TPNAME5= <>
##$TPNAME6= <>
##$TPNAME7= <>
##$TPOAL= (0..7)
0.5 0.5 0.5 0.5 0.5 0.5 0.5 0.5 
##$TPOFFS= (0..7)
0 0 0 0 0 0 0 0 
##$TUNHIN= 0
##$TUNHOUT= 0
##$TUNXOUT= 0
##$USERA1= <user>
##$USERA2= <user>
##$USERA3= <user>
##$USERA4= <user>
##$USERA5= <user>
##$V9= 5
##$VALIST= <valist>
##$VCLIST= <CCCCCCCCCCCCCCC>
##$VD= 0
##$VDLIST= <DDDDDDDDDDDDDDD>
##$VPLIST= <PPPPPPPPPPPPPPP>
##$VTLIST= <TTTTTTTTTTTTTTT>
##$WBST= 1024
##$WBSW= 4
##$XGAIN= (0..3)
0 0 0 0 
##$XL= 0
##$YL= 0
##$YMAX_a= 622154
##$YMIN_a= -1006699
##$ZGOPTNS= <>
##$ZL1= 120
##$ZL2= 120
##$ZL3= 120
##$ZL4= 120
##$ABSF1= 15.5662
##$ABSF2= -2.485651
##$ABSG= 5
##$ABSL= 3
##$ALPHA= 0
##$AQORDER= 0
##$ASSFAC= 0
##$ASSFACI= 0
##$ASSFACX= 0
##$ASSWID= 0
##$AUNMP= <proc_1d>
##$AZFE= 0.1
##$AZFW= 0.1
##$BCFW= 0
##$BC_mod= 2
##$BYTORDP= 0
##$COROFFS= 0
##$CY= -3
##$DATMOD= 1
##$DC= 0
##$DFILT= <>
##$DTYPP= 0
##$F1P= 0
##$F2P= 0
##$FCOR= 1
##$FTSIZE= 16384
##$FT_mod= 6
##$GAMMA= 0
##$GB= 0
##$INTBC= 1
##$INTSCL= 3.241238e-09
##$ISEN= 128
##$LB= 0.25
##$LEV0= 0
##$LPBIN= 0
##$MAXI= 10000
##$MC2= 0
##$MEAN= 0
##$ME_mod= 0
##$MI= 1.114404
##$NCOEF= 0
##$NC_proc= -5
##$NLEV= 6
##$NOISF1= 3.799351
##$NOISF2= 2.8
##$NSP= 0
##$NTH_PI= 0
##$NZP= 0
##$OFFSET= 15.48687
##$PC= 1
##$PHC0= -2281.05
##$PHC1= 12.99097
##$PH_mod= 1
##$PKNL= yes
##$PPARMOD= 0
##$PSCAL= 0
##$PSIGN= 0
##$REVERSE= no
##$SF= 200.130006972857
##$SI= 16384
##$SIGF1= 3
##$SIGF2= 2
##$SINO= 0.751879
##$SIOLD= 32768
##$SREGLST= <19F.Aceton>
##$SSB= 0
##$STSI= 16384
##$STSR= 0
##$SW_p= 3612.71676300578
##$SYMM= 0
##$S_DEV= 0
##$TDeff= 16384
##$TDoff= 0
##$TI= <>
##$TILT= no
##$TM1= 0
##$TM2= 0
##$TOPLEV= 0
##$USERP1= <user>
##$USERP2= <user>
##$USERP3= <user>
##$USERP4= <user>
##$USERP5= <user>
##$WDW= 1
##$XDIM= 16384
##$YMAX_p= 301423491
##$YMIN_p= -170397
$$ End of Bruker specific parameters
$$ ---------------------------------
##NTUPLES= NMR SPECTRUM
##VAR_NAME=  FREQUENCY,     SPECTRUM/REAL,   SPECTRUM/IMAG
##SYMBOL=    X,             R,               I
##VAR_TYPE=  INDEPENDENT,   DEPENDENT,       DEPENDENT
##VAR_FORM=  AFFN,          ASDF,            ASDF
##VAR_DIM=   16384,         16384,           16384
##UNITS=     HZ,            ARBITRARY UNITS, ARBITRARY UNITS
##FACTOR=    0.220516191357247, 1,           1
##FIRST=     3099.38736346563, 0,            0
##LAST=      -513.329399540146, 0,           0
##MIN=       -513.329399540146, -170397,     0
##MAX=       3099.38736346563, 301423491,    0
$$ Real data points
##PAGE= N=1
##DATA TABLE= (X++(R..R)), XYDATA
$$ [...]
10006 126372 91408 46593 43845 81660 81766 54507 138249 175044 100822 69208 63252 40609
9994 40609 47085 24037 -4691 -20432 7255 7660 14090 4851 18065 -24280 -31070 43099 104146
9981 104146 25456 47523 31517 -12634 60615 42121 34636 30458 20537 31105 9671 44197
9969 44197 33763 61948 113019 64328 13264 38335 35307 52961 74132 59561 21495 -49013
9957 -49013 58528 5422 4931 -26095 -35704 -26517 32868 29283 -6235 41383 35791 -27254 -25441
9944 -25441 -64734 -56126 -10723 14200 25062 -29997 2234 18044 8503 38294 59579 130971
9932 130971 184779 137801 87694 100653 67232 51023 33763 4491 42883 56314 27621 -3131
9920 -3131 8990 17010 35966 41413 11166 19183 6314 35407 -16089 -30464 48597 67270 43733
9907 43733 21080 94855 48036 48632 72201 40279 19138 16862 -59861 -4751 36700 65575
9895 65575 53530 49329 68124 77419 21680 23912 8186 41560 59858 76529 113839 100757
9883 100757 30625 61735 78546 1514 -5712 6611 49673 64535 58768 63668 100729 108931
9871 108931 181880 186604 142244 117052 126761 137014 149996 153190 203324 146701 159334 151901
9859 151901 168444 173967 160384 205114 195321 167430 147883 148132 102212 84343 126219 147273
9847 147273 180085 216947 208251 169027 145417 104160 105449 99329 105704 204831 207653 159965 159757
9834 159757 167519 173668 168778 143254 123344 121675 92867 137326 130317 106076 91211 103980 95667
9821 95667 164354 176712 129109 85815 95258 110350 90311 137737 139788 119270 129469 87212
9809 87212 58338 113102 68330 74406 30337 40589 66961 83691 48442 2779 51412 94839
9797 94839 41605 5138 125297 123626 117358 96556 107957 79973 30628 57522 40984 81060
9785 81060 119530 68073 37669 -3086 -21476 -7032 -66586 38388 27465 41016 61426 48194
9773 48194 41882 -8845 33735 35239 20386 -21141 -21314 58025 62399 60236 62143 15111 68718
9760 68718 62469 95600 92649 35325 46969 29275 35093 57866 94466 90234 61570 28183 40227
9747 40227 6430 49538 47470 -15041 19090 27382 -11003 35641 61900 25615 82585 134194
9735 134194 104430 70017 99481 81115 35299 45057 14541 10556 15632 45333 94883 79220
9723 79220 39009 18469 41905 101195 50546 59404 85466 24442 32075 21396 66502 116391
9711 116391 122933 105967 136868 125711 76590 107020 94003 125110 137808 116472 109678 137150
9699 137150 143463 104407 92260 112209 107479 130696 69155 4024 55721 120728 150344 100600
9687 100600 106622 100379 131867 138259 127588 84550 108595 136645 116827 190008 245472 241159
9675 241159 216325 244552 176901 166203 194819 156741 192043 250613 245518 240619 271129 269823
9663 269823 257313 150566 97342 121961 147352 177896 229428 240010 265141 213044 215469 224994
9651 224994 276233 260860 205662 240015 259244 215794 214504 246333 268424 283707 269790 240002
9639 240002 235380 256474 272792 330203 277076 249011 212465 181462 222986 256818 238396 191348
9627 191348 220635 201213 274994 248267 221410 253448 214840 276087 286900 315752 326716 296568
9615 296568 310367 372163 367054 394593 349711 312435 376351 342889 278352 340354 338200 270353
9603 270353 217984 219403 262209 297070 289231 301813 304306 265470 262465 281537 240330 302917
9591 302917 321260 322880 322695 348266 313118 252700 326147 331954 340547 307061 271335 282478 291367
9578 291367 266018 278667 319645 403922 413761 357896 346620 369665 370134 378119 423191 409075
9566 409075 364758 346287 334782 296402 253242 289553 265050 296785 342692 351782 364621 305501
9554 305501 276541 251968 248513 237280 302230 283043 242954 261806 280968 322142 335342 283848
9542 283848 216100 207988 186026 227058 235470 314567 345473 298443 335136 401597 407533 360390
9530 360390 369565 362201 382306 411953 397812 394954 349750 334433 317891 348366 402996 431478
9518 431478 440171 406905 405569 415108 448591 452587 417161 462012 467073 531333 487448 433290 461232
9505 461232 440286 428960 450174 452239 445597 441037 423625 468349 482196 437116 403780 482595
9493 482595 448970 413162 446001 483179 472521 453096 463588 491111 458137 453529 411755 457539
9481 457539 434955 417916 408769 475573 472691 429720 419115 367961 362148 365314 385883 341667
9469 341667 382847 460908 450025 448528 492896 504628 501769 418765 372287 398404 490447 449503
9457 449503 400556 388220 387689 316508 314611 317074 288844 265312 235499 301695 371946 347036
9445 347036 373293 338386 251916 236904 221641 303713 329476 306379 290510 239852 239361 225841
9433 225841 308868 379825 333286 351387 329244 251236 232056 253094 311148 319344 272530 242517
9421 242517 256918 306928 286398 266106 257834 261313 293994 307956 304715 326495 285032 255629
9409 255629 302196 387103 406818 363782 366557 377918 411161 436437 525635 554861 583291 678974
9397 678974 634802 605182 558021 472499 451411 419489 384290 357336 333892 367255 349354 332823
9385 332823 354967 340289 274138 368593 417339 415829 418558 427713 459604 380984 370156 360715
9373 360715 329174 259593 301848 304857 360125 346400 299997 302468 297099 377688 346985 348892
9361 348892 396617 318154 292014 320447 316758 238277 231867 289888 295568 273351 287144 314101
9349 314101 297400 268815 303295 342463 295106 272614 254627 260879 224168 253632 309510 264935
9337 264935 251645 246151 207671 229124 210702 228058 227253 307848 276645 282639 282371 266647 269877
9324 269877 222088 236937 225614 231660 292029 309328 362026 308098 315210 326964 335734 344076
9312 344076 297366 261307 244369 284660 270032 267775 167291 217016 208312 169877 200757 207600
9300 207600 237547 306169 338091 361348 295228 250545 269331 250366 245105 325545 238002 236737
9288 236737 227850 263621 374362 315815 331271 312543 290338 330269 331509 384718 394064 351661
9276 351661 359491 333809 252070 266529 293862 282635 307322 302827 360694 324141 341749 377693
9264 377693 386969 413345 423803 373025 378593 429012 349555 306707 279655 367318 396218 339668
9252 339668 357284 382670 395129 462210 452081 444801 391407 312571 323611 362433 398950 370408
9240 370408 404059 357887 399626 435438 478623 461781 488244 567604 534420 432960 492789
9229 492789 518492 472566 461538 450324 469526 519605 568112 510911 482865 571904 555396 534118
9217 534118 608364 653883 650960 636626 596985 500128 537059 545372 547259 583228 565392 571269
9205 571269 617624 572626 601229 631336 644551 623651 595166 628287 633073 602925 599641 639650
9193 639650 650690 660365 726108 696551 660890 705278 784366 735531 681707 689797 700092 764085
9181 764085 775756 812092 792700 821202 910712 951485 903293 886296 878221 844352 848583 789639
9169 789639 811734 821816 850997 885486 795480 771148 823777 862338 834001 818221 799880 798846
9157 798846 811933 859409 876665 901500 913729 936796 923402 913016 893075 872605 923672 901446
9145 901446 865164 889386 838221 833138 823644 847274 902932 843851 805046 836668 937395 953291
9133 953291 977884 945373 917966 928975 958892 950307 997368 1005243 999020 1017057 1015111 989415
9121 989415 1015375 998536 1005935 947906 956724 994472 1004746 1079358 1121407 1196235 1201005 1200703 1203607
9108 1203607 1241111 1273316 1290331 1323150 1355913 1412043 1466229 1554620 1684323 1770078 1795589
9097 1795589 1863903 1918778 1960816 1951451 1897039 1832452 1805979 1825617 1758183 1740423 1728682 1717957
9085 1717957 1694421 1731735 1796096 1855825 1834458 1846445 1915643 1974955 2131981 2164236 2166611
9074 2166611 2161762 2134580 2020681 1986069 1949785 1868539 1888903 1950486 2015085 1989282 2036918
9063 2036918 2056889 2165437 2166989 2231620 2353284 2424917 2479238 2558790 2521399 2568872 2534686
9052 2534686 2446479 2361855 2311613 2281739 2269462 2286906 2259165 2215539 2221964 2304040 2345498 2332695
9040 2332695 2358723 2429681 2475621 2485869 2508642 2534721 2517259 2498351 2414356 2260227 2204143
9029 2204143 2195281 2132944 2105208 2075861 2024811 2028772 1985503 1921444 1890259 1960022 1995310 1959045
9017 1959045 1951892 1982255 2029742 1991670 2014845 1969432 1945299 1954948 2027956 2039570 2037286 2033828
9005 2033828 2106812 2117688 2092079 2132110 2149774 2183358 2245004 2248601 2226148 2254463 2367688
8994 2367688 2385792 2400976 2438225 2483695 2462840 2410999 2450115 2461479 2521201 2550281 2585349
8983 2585349 2614279 2642422 2717413 2747150 2885320 2931402 3009893 3008881 3098625 3211267 3300043
8972 3300043 3336119 3486676 3636873 3721480 3825518 3968826 4052498 4171956 4267858 4397338
8962 4397338 4525229 4706469 4853173 5040122 5238249 5356620 5551168 5798763 5992721 6241435
8952 6241435 6467862 6755787 7044556 7454772 7861894 8359570 8952928 9525431 10267489 11043874
8942 11043874 11962027 13007599 14170436 15520508 17164973 19025803 20833140 22702812
8934 22702812 24907650 27504375 30991240 35862262 41759758 47103051 53221741 60664858
8926 60664858 66656327 71775686 74921494 68369531 58454672 51130696 45397921 40648312
8918 40648312 36440603 33289736 30456201 27985624 25849970 24014693 22144601 20401861
8910 20401861 18810651 17585847 16501378 15578266 14852707 14222222 13644469 13125100 12655247
8901 12655247 12299979 11974603 11670334 11348199 11112393 10890014 10744421 10631693 10516668
8892 10516668 10393702 10295129 10116480 9956753 9826682 9690259 9561946 9511593 9445881 9436175
8882 9436175 9425473 9449894 9460341 9577691 9746901 9940543 10231658 10554779 10945767 11469124
8872 11469124 11978593 12477206 13073194 13698341 14419397 15205305 16073564 17105262 18285311
8863 18285311 19804941 21513116 23218147 24922553 26527164 27957691 29118504 29628210
8855 29628210 29535792 28977387 28002492 26890698 25930698 25156348 24660660 24378297 24349402 24521862
8845 24521862 25025134 25794828 26763584 27886382 29099558 30362065 31562358 32496833 33022005
8836 33022005 33061185 32621830 31790529 30740684 29747563 29031616 28529342 28231863 28165240 28219890
8826 28219890 28405714 28934801 29852482 31206234 32776630 34433170 36279997 37994433 39473198
8817 39473198 40525358 41047538 40710247 39707568 38228652 36376925 34759494 33458989
8809 33458989 32505485 31797893 31396325 31377495 31642573 32333061 33304086 34407274 35586396
8800 35586396 36861263 37878353 38646012 38892067 38298964 37089965 35317043 33145821 31000706
8791 31000706 29133268 27445898 25930222 24526999 23249003 22106786 21015138 20022587
8783 20022587 19168806 18363447 17556374 16847993 16160100 15655729 15198872 14822010 14360166
8774 14360166 13935374 13663175 13354120 13096844 12953103 12740929 12632291 12612124 12573344 12584266
8764 12584266 12602599 12622375 12722961 12798155 12893819 13093521 13377103 13704672 14129009 14620689
8754 14620689 15103498 15765361 16560983 17466442 18490754 19705135 21108696 22808545 24750220
8745 24750220 26926216 29163662 31368201 33490747 35381047 36797281 37553997 37884917
8737 37884917 37848644 37829391 38179462 38849864 39786186 40818976 41816989 42578286 42824323 42242379
8727 42242379 40909766 38903178 36586784 34315055 32312592 30581574 29108044 27887527
8719 27887527 26846649 26025522 25308108 24802892 24413048 24109050 23937376 23747368 23732180
8710 23732180 23894205 24256089 24800750 25472811 26472465 27768790 29362003 31234919 33264801
8701 33264801 35424217 37613553 39729910 41475132 42649343 43305751 43451193 43400043 43439642
8692 43439642 43786590 44525184 45413317 46226659 46955286 47465447 47289146 46290790 44618261
8683 44618261 42346707 39725473 37292637 35129570 33136248 31278712 29652828 28216669
8675 28216669 26822345 25542632 24353674 23266841 22250023 21260281 20321579 19462984 18709368
8666 18709368 18091141 17514881 17117148 16797368 16567332 16392948 16255117 16139823 16057557 16122275
8656 16122275 16166188 16214541 16302132 16402600 16610851 16900063 17158258 17427389 17759345 18107489
8646 18107489 18383105 18749933 19081420 19461886 19895950 20257292 20595798 20909909 21225129
8637 21225129 21537601 22020167 22518518 23026114 23787070 24789043 25908121 27192404 28407031
8628 28407031 29564659 30715401 31652937 32276264 32137027 31485453 30739202 30163127 29815288
8619 29815288 29706448 29741028 29865164 30070845 30147131 30082170 29705578 28872921 27675668 26479834
8609 26479834 25525921 24791264 24219032 23786129 23486742 23282138 23191267 23161342 23138911 23217487
8599 23217487 23395408 23689794 24046733 24590436 25284384 26186698 27374341 28879285 30659525
8590 30659525 32692446 34912178 37221309 39421025 41434731 43196066 44337469 44721085
8582 44721085 44292517 43299104 42288110 41589617 41268790 41158068 41128822 41121237 41016233 40504274
8572 40504274 39412594 37764536 35602608 33164687 30806047 28777137 26937934 25427862
8564 25427862 24110654 22891703 21836615 20910330 20084783 19490123 18969324 18512395 18175366
8555 18175366 17945734 17877300 17974019 18143967 18442236 18982086 19670890 20396519 21120473 21825754
8545 21825754 22487905 23077182 23457197 23383591 22873571 22227364 21670192 21382812 21199043 21120761
8535 21120761 21047713 20917184 20878808 20626501 19952162 18993428 17752095 16565629 15467071
8526 15467071 14452933 13572177 12842164 12169955 11564540 11065152 10537641 10122683 9737128
8517 9737128 9324296 8993481 8684999 8439169 8256543 8116363 7988675 7860223 7767972 7717871
8507 7717871 7647817 7538292 7494556 7425078 7305796 7234327 7163156 7061556 6966778 6976157 6938778
8496 6938778 6796159 6710712 6618058 6523775 6377987 6266694 6234157 6146576 6029915 5909199
8486 5909199 5842949 5821350 5790702 5775811 5891511 5941084 5976756 6083863 6212558 6265544 6246513
8475 6246513 6226121 6264029 6301130 6331829 6375994 6431357 6491467 6498833 6470076 6482020 6495307 6493250
8463 6493250 6447336 6294918 6115505 5988456 5924862 5873719 5839252 5714730 5643859 5613295 5610248
8452 5610248 5550704 5590830 5640943 5753975 5836413 5891292 6006877 6081961 6156872 6261392 6357377
8441 6357377 6594502 6729630 6846100 6937304 7003386 7141086 7281708 7332936 7387994 7443694
8431 7443694 7418282 7457225 7497549 7534272 7593758 7670660 7605574 7512235 7348555 7172441 6990390
8420 6990390 6731528 6398662 6045887 5786355 5557345 5371464 5161571 4955115 4822487 4645404
8410 4645404 4546162 4505339 4385816 4336739 4338688 4341957 4363499 4278143 4262050 4281575 4292557 4263658
8398 4263658 4103497 4083691 4105072 4136760 4201415 4168929 4142256 4188129 4184070 4133537 4161191
8387 4161191 4180802 4192285 4157754 4101406 4030839 3973914 3823419 3680066 3508923 3355794 3141430
8376 3141430 3018336 2865712 2810711 2636705 2456881 2310233 2224717 2154964 2029930 1948047
8366 1948047 1807538 1699096 1648875 1669024 1522314 1454044 1469825 1405831 1316268 1343569 1263731
8355 1263731 1179678 1259288 1218629 1232422 1169872 1074613 1091580 1121991 1074687 969883 1044628
8344 1044628 973094 914506 917688 916737 888038 861937 765878 810891 878873 813262 781036 803183
8332 803183 792238 807526 835650 869868 854395 783084 791810 777035 829848 858576 847366 847924
8320 847924 840162 813113 775946 815268 818996 788618 729239 749588 742741 743672 730808 723477 706558
8307 706558 660537 743278 708626 651428 665459 659507 684762 680230 575182 535526 556623 564991
8295 564991 518747 512948 487313 473861 460476 488257 463504 429366 435526 400834 423558 404672
8283 404672 409009 412330 474198 523467 559974 574211 532277 517627 596028 685801 658330 625888
8271 625888 679211 743362 731624 721742 722286 802522 805271 860495 867422 821938 829290 820516 901280
8258 901280 928775 884906 793277 836824 863823 823078 782548 691769 616128 648247 645428 620567
8246 620567 563802 604974 600657 616660 584950 585389 653759 627963 678809 660789 679651 706233
8234 706233 801912 822766 808104 778820 823311 879642 871860 833957 803436 817690 767703 773560
8222 773560 727269 671535 692162 691978 675914 564649 534879 539621 551018 533454 512957 540300
8210 540300 512346 510533 469320 461269 441971 495297 461571 476028 457656 455356 401139 394754
8198 394754 402676 377962 400855 415817 379399 401126 524253 280760 236925 205500 249252
8187 249252 272356 281467 198498 199553 250524 209741 174536 201840 227810 207327 175401 168512
8175 168512 168320 229405 235915 230367 246019 261892 248291 239193 301185 279024 245121 211707 218280
8162 218280 127210 161301 171860 165878 103113 93414 48000 51288 29559 27772 94567 103181 102509
8149 102509 65308 31307 61179 81581 119082 105639 33937 16441 138967 80167 14562
8138 14562 -6696 -4038 75121 50956 51236 53084 37911 -20333 -14066 24542 23022 24233 -13809
8125 -13809 -33705 42916 75177 98504 93624 79475 24266 -18922 29886 92680 55039 39241
8113 39241 85649 19171 -9962 42111 14649 -15712 -29476 20089 25236 5522 6982 23336
8101 23336 -40560 -78920 -39243 -7106 56978 -2923 19378 3582 -55437 -101621 -81595 -70128
8089 -70128 -119366 -14617 31398 -49907 -100443 -51942 -48648 -30904 -24577 -41357 -25479 49983
8077 49983 9336 -65935 -60292 -87329 -80575 -49614 -47385 -44501 -57771 -63849 1274 10963 -14888
8064 -14888 -66523 -25740 -23439 -64801 -79614 -63858 -73623 -55097 -57032 -59312 -22172 13677 28752
8051 28752 27855 56605 17345 -10532 8506 -47814 -27418 -36327 -28750 -22640 -62832 -28756 30007
8038 30007 82089 108965 38776 -10998 60221 22076 56006 51919 52400 30639 39459 2307 -60698
8025 -60698 -5500 27110 55318 41482 14422 21544 3472 -20891 -24411 -12679 -109450 -105747
8013 -105747 -62740 -27838 -20268 -36628 35334 60151 3936 -17549 -19374 25491 39920 24604
8001 24604 26049 1237 2793 8716 40713 56814 -842 -36881 22532 6711 28167 33612 23344
7988 23344 -956 59407 106846 12451 19757 70916 35767 15384 70928 71188 88016 98729
7976 98729 109710 90862 41305 98046 51444 892 -48778 20553 74772 87346 179587 132860
7964 132860 91858 72534 103088 111980 87261 18692 -2489 -25078 -102939 -68929 -61509 -3324
7952 -3324 43502 17991 -29647 -41818 28566 25983 60504 32249 32601 55711 -3059 25611 38895
7939 38895 22479 -3276 11083 -30326 9613 17420 -38305 16781 66649 43411 -18497 20044
7927 20044 108296 46695 15453 39511 41851 39567 -18821 -16509 36492 -2243 -35672 -62775
7915 -62775 -102218 -91174 -132372 -103257 -77290 -145484 -96757 -57774 -79103 -54476 11303 -22774
7903 -22774 -79200 -58242 -97572 -136546 -108663 -74854 -56914 -56854 -87321 -77701 -49254 -20390 -50171
7890 -50171 -55945 -46518 -95040 -141018 -150534 -104858 -94194 -110527 -96324 -66404 -16766 30667
7878 30667 49939 32847 -23119 -35738 -38514 -31264 -85536 -95612 -32155 -99782 -31245 -81121
7866 -81121 -96878 -101881 -98410 -85458 -89843 -100296 -99252 -57507 -84690 -66030 -131621 -109439 -50769
7853 -50769 -95121 -48952 -34891 -73105 -106593 -105797 -69632 -107927 -132190 -106891 -84944 -59023
7841 -59023 -97555 -122906 -89966 -119752 -129144 -144826 -140862 -120607 -126157 -124018 -152065 -133055 -136721
7828 -136721 -95184 -75857 -97365 -95443 -110866 -105425 -49344 -42719 -27917 -71439 -137211 -137928 -148904
7815 -148904 -125525 -132847 -144422 -103620 -74171 -45551 -25518 -31953 -67434 -34132 -31518 -63726
7803 -63726 -44365 -4285 240952 53131 -87953 -27517 -17587 -16921 6605 -6548 3769 13447
7791 13447 21788 50434 -17355 -35705 -26548 21947 -7948 -55633 -58475 -90854 -11463 35914
7779 35914 40248 789 -4045 -35926 -12761 -51815 -30512 -89359 -72797 9084 44721 -819
7767 -819 -63949 -15076 -50070 5771 -4205 -7748 -58788 -103540 -107456 -8973 70683 84343 60193
7754 60193 41191 54183 20897 -50858 -48538 -1866 59904 53836 95807 -18596 -31368 14636
7742 14636 62436 66701 110429 77918 -9915 -15048 -12223 2787 46792 73646 37561 98676
7730 98676 90046 150062 192393 94268 67146 72295 100325 121620 149425 111870 92918 105027
7718 105027 130038 159062 152730 165413 159034 174307 198959 206865 177498 206910 228524 162391
7706 162391 178769 169483 31520 52016 111160 109560 134409 157999 158638 213753 161018 79612
7694 79612 42850 55036 74932 126189 124296 148740 119474 140967 147392 109871 108316 156840
7682 156840 157701 127666 119437 56435 54290 57827 54713 14503 96204 85901 60137 58409 96746
7669 96746 39502 79114 81672 49024 44718 7383 -51147 -23671 16575 15739 -55079 -28346 46462
7656 46462 47427 24854 12122 27214 -51737 -111437 -124871 -107676 -96167 -43743 -10253 42855
7644 42855 9082 50255 21010 -36777 28403 11253 -24405 -20454 -18055 -37234 -31385 17209
7632 17209 95213 37496 -18826 -18965 -11785 41153 68660 18819 -69683 -1102 66641 23090
7620 23090 -3059 56351 42639 60240 40399 50574 110435 78295 71395 77570 65492 79418
7608 79418 110602 130296 168283 181699 114732 123517 142959 183848 215639 161093 169317 189165
7596 189165 168788 149674 172309 154804 129600 186976 175380 185198 88704 160820 148690 136664
7584 136664 174656 195342 172743 196088 250966 149078 155184 176832 223031 193109 162342 162829
7572 162829 135190 136609 143907 136766 180431 158665 164480 187068 147520 184325 202091 266568
7560 266568 252168 297072 295605 229265 247715 288153 279879 295820 336229 257970 231807 209209
7548 209209 201115 197772 216150 233963 303562 283509 242101 177395 216871 253068 197403 198787
7536 198787 157493 140835 137315 106280 104125 104317 196965 249423 203305 123774 124451 156057 107112
7523 107112 108448 122095 80907 145053 190056 197378 148637 165373 171161 150484 108956 84307
7511 84307 81032 82575 91713 95943 85447 87796 69258 115573 135244 119864 157446 134602 87798
7498 87798 123444 170408 112406 145069 145431 124226 135846 109016 69329 53704 113290 104631
7486 104631 53223 88059 151534 134232 133354 185583 162155 111138 139502 130518 154301 151950
7474 151950 67319 77567 104669 111437 162980 136394 73940 77270 47696 62496 47110 88386
7462 88386 45143 25742 97800 69183 55528 85404 41555 69607 89886 55677 42279 63874
7450 63874 37293 58737 54329 124561 142018 79327 59215 74295 92104 50578 65914 41407
7438 41407 38399 39190 131069 135868 174763 172305 133272 164166 118712 129413 145335 151132 152749
7425 152749 143553 112125 167357 191038 131430 118412 166018 199957 208519 164754 106745 85346
7413 85346 73680 119994 158601 139871 124275 113328 80143 77736 171219 211453 82296 24615
7401 24615 41669 85045 162685 142487 128889 126010 166798 161375 172222 137232 97735 148556
7389 148556 147003 228701 268384 216813 222751 189843 193941 220489 228222 218939 228314 231344 192036
7376 192036 258034 296853 302743 269360 285247 287560 238551 257370 293558 288291 306082 274909
7364 274909 191255 221572 262064 238309 199725 212352 305217 396299 342585 345846 413041 398068
7352 398068 397353 475424 432816 418075 428221 440163 511212 430774 398730 442694 465434 413793
7340 413793 470767 430397 437165 553398 491040 470935 511081 545229 544277 593257 600055 600043 647109
7327 647109 628860 614307 647527 615716 640786 675576 666810 684987 801775 869068 862258 852465
7315 852465 866808 948140 959967 984135 1066559 1158963 1131931 1177283 1217138 1184992 1251879 1313758
7303 1313758 1400413 1457230 1532324 1661206 1723865 1682726 1725924 1845510 1909095 1970786 1998255
7292 1998255 2065626 2095639 2098638 2117614 2177206 2239316 2254553 2127187 2081198 2129678 2099030
7281 2099030 2029960 1947950 1912000 1904277 1904979 1861948 1786467 1689126 1627320 1625194 1595886 1566089
7269 1566089 1485854 1419637 1346168 1297535 1237866 1185993 1096431 1024422 986630 956641 941482
7258 941482 971544 943271 934854 870365 829098 852867 787510 754336 720666 669905 624657 623228
7246 623228 623683 611301 589299 593061 630044 567851 540333 557829 499633 506144 504913 493241 561916
7233 561916 578137 506630 468519 429439 396796 373020 427281 483010 445387 442121 438804 360116
7221 360116 337259 366323 402305 447133 435985 390260 414412 468156 479971 429599 436971 426137
7209 426137 404934 421860 421631 407103 414234 455975 476557 451822 396258 316183 358817 365477
7197 365477 394927 356346 346420 440007 379559 320929 312383 345537 372913 385766 385133 406059
7185 406059 364757 352867 320982 256196 371304 394473 327079 312569 347365 337842 340355 360858
7173 360858 386282 379223 396384 426824 467046 472893 455807 431520 438909 398942 417724 434046
7161 434046 396883 428480 402192 378618 384693 365819 337777 335925 295578 312990 315977 332149
7149 332149 352094 343837 361007 348029 318274 245469 252403 297803 291036 220218 248902 269178
7137 269178 251947 245604 262023 261515 263619 259808 218813 247539 266728 346475 366715 362014 392682
7124 392682 363573 316510 320287 326953 325888 401125 382218 330264 360657 356712 364462 349821 374917
7111 374917 387116 356022 413382 445744 433240 473640 440366 503670 517044 560876 569821 535493
7099 535493 555256 689335 739809 845297 958007 1025096 1086789 1251368 1347962 1494894 1641183
7088 1641183 1714257 1813025 1904392 1911514 1890643 1940051 1839212 1709101 1645373 1545108 1408598
7077 1408598 1445862 1346689 1298666 1273084 1253926 1269876 1250110 1198753 1181329 1147970 1135043
7066 1135043 1093610 1161730 1204264 1174588 1137526 1102495 1006093 943862 916630 872897 883227
7055 883227 944303 980978 889160 803111 762936 797034 798556 773607 761080 735932 745114 703812
7043 703812 684555 694193 657396 679662 658139 672266 677461 705766 753334 716788 775000 805714
7031 805714 810050 899087 940176 948558 982621 1048666 1082974 1086088 1152862 1287616 1355418 1475346
7019 1475346 1541532 1581112 1667437 1813864 1862167 1946818 1956253 1919345 1903839 1782334 1686432
7008 1686432 1630472 1479807 1395232 1349274 1264780 1261804 1212171 1089537 999398 915846 902370
6997 902370 863255 818064 746632 673548 688535 722865 731714 701193 674937 680613 641279 538216
6985 538216 625045 618916 562182 540617 545327 555357 479237 509037 502731 425446 463673 454291
6973 454291 435380 445012 424966 463395 486792 440732 454053 422819 402192 358977 375340 419005
6961 419005 437224 442224 442067 412597 430044 451695 491735 492499 466884 389020 363678 329525 349720
6948 349720 322710 270798 299565 341679 401613 419157 433281 362445 350543 332734 300499 362125
6936 362125 422759 359544 339858 386812 396863 404066 421906 473714 443999 366145 331396 390364
6924 390364 446980 409903 379493 387228 428757 411894 393379 425804 420517 438391 403807 367331
6912 367331 300791 368367 460447 481644 450827 506542 462445 396777 403880 382688 445263 522709
6900 522709 521463 487831 477257 433813 421886 435927 462093 481210 443516 357996 386011 411707
6888 411707 448648 392259 378190 421436 436758 388602 345561 347758 436167 447731 391498 364943
6876 364943 385897 388143 366601 412722 388934 340456 335995 370371 420255 356363 328698 335914
6864 335914 347724 395169 360341 263053 346697 415151 414134 408073 335340 253701 280861 256920
6852 256920 300286 318982 338529 310839 310859 331990 314161 349433 383842 348164 354183 354252 372684
6839 372684 339742 364664 396809 376491 355590 328721 395909 351927 400303 397756 406230 421919
6827 421919 365992 367839 392181 301452 319586 394822 361474 450603 472714 450227 425163 400078
6815 400078 461551 454712 414354 446477 426968 454659 498504 429174 381863 370234 396610 435865
6803 435865 464900 451306 517080 480833 496476 527748 544642 596555 579790 553050 573171 549500
6791 549500 605056 644226 660024 655850 746342 848728 1010353 1098170 1220356 1261749 1298480
6780 1298480 1474826 1512173 1625815 1732273 1767731 1762465 1744670 1703408 1647108 1606677 1567070
6769 1567070 1424232 1318907 1223921 1126314 1093074 1042694 1032557 978534 918369 877669 877625 835513
6757 835513 750635 755641 815032 788522 717987 760813 761114 843658 884368 841821 888382 983660
6745 983660 1017834 1049322 1112757 1215806 1322972 1336117 1361350 1505223 1654788 1776334 1863235
6734 1863235 1894638 1815927 1818971 1803914 1777902 1654256 1536587 1463640 1365825 1280699 1162797
6723 1162797 1196104 1147682 1050079 1059415 1055030 989945 916891 948298 985504 954841 934441 905523
6711 905523 855751 834187 869567 825838 813327 818185 790608 743363 676967 725359 803049 814493
6699 814493 836203 823699 783132 776671 890998 827477 794901 839331 920949 869667 856317 877462
6687 877462 877512 954162 878517 803568 875489 952380 980727 924421 862320 909184 903385 873055
6675 873055 875006 942308 954990 971406 939022 930004 985473 919459 879201 939710 916441 920800
6663 920800 992998 971367 974603 1015283 973044 1007718 983543 1065835 1079907 997102 1051326 1030278
6651 1030278 1046563 1123525 1061416 1033870 1044006 1029948 1048760 1016416 1004941 1073622 1123644
6640 1123644 1179757 1193857 1207927 1239616 1262008 1287597 1254096 1310036 1383315 1404243 1324623
6629 1324623 1287221 1274596 1302440 1322467 1261725 1273088 1309783 1275849 1162251 1137676 1126338
6618 1126338 1198589 1228423 1237878 1254285 1180299 1212718 1220935 1167380 1185551 1253229 1296461 1315746
6606 1315746 1392311 1334117 1227807 1233676 1226057 1219194 1261798 1276726 1301134 1265329 1226839 1233708
6594 1233708 1234675 1251927 1218730 1224012 1251430 1202896 1238981 1281469 1289782 1351038 1393247 1410968
6582 1410968 1408554 1424275 1460395 1507259 1589816 1590249 1578581 1570255 1526144 1487500 1506198 1491133
6570 1491133 1531638 1564664 1525758 1522275 1532143 1527597 1494351 1515151 1542379 1595493 1596373 1615180
6558 1615180 1669611 1681340 1663380 1654188 1712119 1779074 1818204 1782802 1840332 1879187 1937413 2026844
6546 2026844 2050021 2092045 2200681 2309268 2369309 2446895 2534602 2716507 2879464 3061395
6536 3061395 3263991 3490198 3665801 3905678 4164469 4463631 4793113 5039049 5314253 5531515
6526 5531515 5737306 5841835 5755218 5654005 5495036 5380139 5206649 4952028 4715712 4535994
6516 4535994 4401616 4196418 4018813 3949146 3850897 3678268 3531935 3430193 3337165 3240231
6506 3240231 3104299 2962132 2897815 2851742 2704240 2644795 2560325 2500393 2478349 2460778 2360684
6495 2360684 2274644 2223491 2227928 2204299 2134779 2123462 2154743 2070419 2049240 2104190 2086644 2054871
6483 2054871 2021996 2049416 2024831 1994837 2019633 2076619 2171605 2248365 2293803 2334290 2367713
6472 2367713 2346222 2428791 2417248 2325993 2266130 2185720 2174532 2106403 2099143 2116834 2108943 2051398
6460 2051398 2015944 2036735 1979217 1956108 2024768 2021246 1995091 1990057 2031147 2041653 2062326 2053346
6448 2053346 2056220 2039339 2092935 2074928 2065210 2007244 1988914 2048765 2033456 2047854 2006997 1986750
6436 1986750 2040543 1997774 2012899 2040272 2023057 2048877 2069736 2106494 2160243 2109012 2175643
6425 2175643 2226424 2173845 2215549 2262296 2330986 2312852 2317474 2353014 2353261 2386500 2481295 2560476
6413 2560476 2520434 2565287 2624387 2678324 2652136 2756378 2780853 2739872 2808566 2902612 2968042
6402 2968042 2960819 3040369 3051405 3037237 3067315 3138395 3186836 3293748 3310583 3281793 3374835
6391 3374835 3390838 3376621 3466658 3427496 3516632 3605965 3663893 3775413 3827023 3860451 3923502
6380 3923502 4009282 4066237 4165218 4248091 4259325 4340203 4387733 4427413 4542384 4611416 4662736
6369 4662736 4641769 4671301 4736190 4829956 4924375 4994604 5045642 5157371 5306159 5454682 5529883
6358 5529883 5571488 5682127 5835967 5996713 6176636 6338723 6457709 6630086 6858957 7032115
6348 7032115 7249449 7505961 7732980 8025094 8300087 8620693 9065656 9494243 9900663 10313484
6338 10313484 10870499 11427220 12008631 12710287 13525903 14375768 15349673 16506940 17784921
6329 17784921 19088060 20390605 21744346 23020310 24432922 25741815 26936175 28095536
6321 28095536 29198090 30345363 31432140 32531233 33624834 34641836 35697725 36644642
6313 36644642 37491032 38432988 39444302 40536233 41774969 43132874 44590286 46129966
6305 46129966 47793484 49503938 51370050 53480590 55998681 58948279 62418207 66207332
6297 66207332 70041671 73655483 76868124 79537998 81567131 82572367 82486322 81332812
6289 81332812 79403400 77241618 75242938 73708903 72670650 72197157 72267428 72883193 74118957
6280 74118957 76095185 78490781 81046736 83767834 86630802 89229489 91141545 92004338
6272 92004338 91938090 91093439 89375595 86914258 83764764 80122120 76219005 72478950 69107338
6263 69107338 65988630 63171327 60654492 58360564 56427720 54736487 53430737 52552749
6255 52552749 51925404 51664657 51837429 52527704 53703319 55399593 57670334 60501408 63787552
6246 63787552 67412237 71242747 75084014 78777877 82115983 84814304 86609681 87441852
6238 87441852 87421899 86685895 85339190 83610868 81642451 79559186 77619855 76075066 74935110
6229 74935110 74247480 74112684 74529965 75477142 76858790 78547125 80226089 81748389 82998977
6220 82998977 83735570 83719225 82969353 81305026 78988356 76366910 73598564 71081311 68837041
6211 68837041 66753239 64772144 62710933 60682394 58753171 56761707 54891508 53047352
6203 53047352 51243001 49602157 48025177 46599659 45326821 44207029 43060464 41921554
6195 41921554 40817174 39729356 38607671 37476420 36407951 35452786 34446655 33409675
6187 33409675 32309995 31189110 29903873 28512814 27157158 25801914 24603261 23474263
6179 23474263 22339842 21266228 20239508 19291960 18458052 17723778 16946575 16164588 15583846
6170 15583846 14985838 14335078 13790573 13309998 12900345 12432999 12132846 11787827 11447921
6161 11447921 11174635 10871202 10599675 10333622 10120429 9926042 9821277 9578318 9401852
6152 9401852 9208749 8959014 8761295 8538144 8354504 8144214 8042844 7894841 7802716 7699244
6142 7699244 7611342 7533366 7350542 7253799 7152335 7137675 7074761 6896639 6772721 6650115
6132 6650115 6542715 6428135 6280838 6087725 5908156 5769081 5587970 5474562 5356262 5254381
6122 5254381 5103087 4924827 4811055 4753773 4611158 4534568 4526079 4454109 4326357 4243670 4181292
6111 4181292 4148173 4080983 3997753 3896102 3837070 3797600 3758073 3630966 3501214 3435339 3462663
6100 3462663 3414350 3365685 3354876 3337027 3268751 3241887 3191158 3159446 3058679 2989761 2985399
6089 2985399 2931791 2906628 2888318 2826599 2805057 2768274 2728785 2734712 2739117 2736474 2664025 2651550
6077 2651550 2621471 2645780 2573257 2517631 2526346 2491318 2473060 2453131 2443867 2425109 2382831 2406388
6065 2406388 2412737 2354768 2324548 2262353 2218855 2226329 2259276 2309415 2257595 2263759 2268332 2194580
6053 2194580 2186953 2159146 2112340 2166931 2142449 2110836 2089225 2046039 2083074 2053848 2000240 2057856
6041 2057856 2051674 2050303 2070040 2088884 2023517 2018281 2028998 2021774 2054979 2118549 2124716 2104338
6029 2104338 2125627 2103211 2100796 2156648 2229925 2182330 2102531 2103606 2125784 2106476 2064672 2033014
6017 2033014 2049582 2070202 2068127 2077394 2036730 2066536 2042563 2063680 2045573 2075038 2107227 2085054
6005 2085054 2135416 2199809 2194385 2207095 2221218 2307934 2443870 2544529 2579110 2548341 2621544
5994 2621544 2728245 2708970 2687316 2746223 2691520 2683448 2618052 2617131 2664911 2724064 2757077 2771641
5982 2771641 2797544 2766719 2801536 2894697 2913691 2915995 2945384 3048459 3116936 3168312 3241734
5971 3241734 3288659 3380742 3447639 3571594 3734055 3868759 4062523 4111139 4238297 4468922
5961 4468922 4684756 4840816 4972092 5240561 5447878 5623874 5891157 6095501 6374397 6492278
5951 6492278 6540998 6582980 6513008 6422176 6285523 6147501 6085725 5867470 5668454 5499788
5941 5499788 5265217 5141285 4973773 4853866 4718861 4663744 4568422 4433961 4307585 4201027
5931 4201027 4176238 4137197 4031541 4006481 3897964 3831751 3773454 3682427 3599186 3532196 3454937
5920 3454937 3384164 3384532 3257841 3169601 3237333 3184842 3104374 3132685 3117073 3072913 2993398 2959591
5908 2959591 3036857 3058568 3050639 3068338 3048820 3047235 3042724 3021402 2989705 2982142 2944231 2945991
5896 2945991 2974137 2908995 2913769 2953934 2934906 2921676 2950752 2967258 3003566 3009611 3039724 3156763
5884 3156763 3258256 3222239 3229746 3270444 3257092 3308847 3327869 3351411 3397250 3319175 3240188
5873 3240188 3233616 3228638 3227102 3181331 3195857 3187275 3116599 3051544 3096633 3103257 3041185 3043127 3078367
5860 3078367 3059792 2983612 2969648 3057336 3041238 2972018 2976886 3006677 3047957 3061082 3080998 3065717
5848 3065717 3112024 3089590 3077186 3141831 3103492 3054093 3034316 3001348 3008175 2979040 2914193 2989146
5836 2989146 3013975 3022445 2990747 2920422 2890527 2885689 2886369 2822144 2793283 2833397 2864063 2865203
5824 2865203 2844593 2842573 2825528 2809622 2800786 2809868 2787674 2769650 2780827 2803664 2768194 2790786
5812 2790786 2819310 2849586 2802858 2761456 2779885 2799207 2791042 2799332 2807414 2760555 2761138 2744853
5800 2744853 2789844 2789260 2764309 2715931 2686890 2704612 2663486 2660284 2711291 2754626 2770724 2720421
5788 2720421 2763275 2747651 2804567 2809131 2786125 2815727 2832713 2870644 2891478 2946357 3011240 3055385
5776 3055385 3049592 3110083 3196920 3213322 3214578 3200944 3217262 3266752 3367770 3408633 3464813 3456204
5764 3456204 3472282 3548187 3610068 3748125 3821219 3882302 4019175 4133483 4201270 4352403 4604809
5753 4604809 4790534 4981974 5189143 5366618 5648060 5903482 6120332 6242360 6247523 6261953
5743 6261953 6282957 6344358 6389027 6459172 6584894 6622456 6758090 6859104 6989581 7101133
5733 7101133 7226093 7400899 7569410 7734961 7892539 8212853 8413802 8565152 8854471 9155391
5723 9155391 9496932 9949225 10301579 10542898 10802482 10976876 11175896 11137825 10845511 10524010
5713 10524010 10302240 10103702 9885519 9651681 9456035 9292098 9124667 8979578 8772153
5704 8772153 8632957 8470558 8345151 8278733 8112527 8015539 7967272 7953122 7873433 7791101 7796188
5693 7796188 7790402 7837096 7851924 7877671 7828930 7794492 7736668 7551821 7342267 7104062 6892399
5682 6892399 6723988 6536837 6328742 6224696 6106561 5970926 5899347 5796064 5748850 5712156
5672 5712156 5672144 5645710 5588551 5552048 5522717 5543645 5501597 5461452 5490120 5508174 5510521 5487292
5660 5487292 5512501 5536340 5591719 5702927 5726386 5807180 5874130 5919624 6017915 6095586 6172539
5649 6172539 6316568 6548446 6638914 6783520 6969663 7101579 7184668 7321332 7484290 7611725
5639 7611725 7670564 7816897 7947468 8155384 8333761 8513381 8698589 8917321 9141916 9395571
5629 9395571 9710405 9904801 10236697 10526512 10854966 11159051 11493549 11910327 12347525 12866373
5619 12866373 13337937 13856167 14431744 15118848 15874746 16590995 17310432 18175672 19012975
5610 19012975 19867285 20758950 21640971 22601132 23627157 24817963 26100003 27588146 29310357
5601 29310357 31004852 32911429 35133196 37585134 40363476 43435978 46922953 50776594
5593 50776594 55167405 60074751 65498410 71495016 78103574 85248829 92889075 100916745
5585 100916745 109374630 117911195 126190111 134035363 140984252 146866057 151367636 154154729
5577 154154729 154968088 153855420 151033437 146970999 142161239 136895923 131352747 125617255
5569 125617255 119616189 113630820 107795620 102103399 96652575 91372863 86306900 81444322
5561 81444322 76824944 72449219 68262171 64185154 60258256 56515574 53117813 49931885
5553 49931885 46980846 44233422 41747924 39416349 37218603 35231352 33470440 31818186
5545 31818186 30171595 28641842 27245585 25951676 24775131 23642334 22587154 21665496
5537 21665496 20770353 19936037 19159296 18474037 17844444 17197901 16642496 16104341 15593218
5528 15593218 15173431 14735135 14328615 13967178 13603522 13326575 13040055 12727412 12374252
5519 12374252 12037044 11765547 11501340 11214336 10971168 10737511 10441111 10249132 10030949
5510 10030949 9821234 9570812 9415870 9306996 9069910 8899203 8771540 8703598 8608208 8527873
5500 8527873 8426808 8341791 8236153 8117611 8036138 8026657 7905656 7747711 7691689 7636713 7512139
5489 7512139 7322923 7156647 7031585 6933726 6694394 6516349 6394861 6223756 6056903 5975354
5479 5975354 5818151 5682302 5577549 5402167 5329037 5229875 5129333 5137644 5006659 4994205
5469 4994205 4870766 4726134 4628329 4544051 4440167 4428769 4389025 4268819 4190800 4066687
5459 4066687 4014232 4006207 3965098 3943344 3886807 3821373 3740504 3733130 3695079 3567937 3491428 3460027
5447 3460027 3514689 3491866 3407827 3380915 3381340 3391213 3371004 3317866 3309285 3345872 3296581 3311344
5435 3311344 3340878 3289901 3250125 3186799 3244295 3215211 3210365 3201313 3206916 3210702 3211672 3255625 3226936
5422 3226936 3206804 3188004 3206056 3246461 3255529 3204893 3220069 3210452 3257530 3264695 3232783 3215164
5410 3215164 3262112 3237708 3248157 3278946 3224588 3290268 3339336 3361145 3372923 3422221 3443849
5399 3443849 3395303 3391971 3394309 3396512 3361144 3328378 3283381 3265732 3320707 3279395 3254869 3212458
5387 3212458 3151696 3196452 3205311 3203418 3221085 3251851 3245066 3315479 3362685 3323510 3352870 3341261
5375 3341261 3420148 3496663 3559729 3671909 3716508 3728627 3865372 3956418 4057665 4143943 4271585
5364 4271585 4442529 4667599 4843430 5144427 5465799 5798364 6137125 6631847 7274379 8100671
5354 8100671 8933211 9747115 10456881 11075914 11762010 12264451 12475796 12195219 11628728 11032789
5344 11032789 10247879 9552114 9102323 8813174 8592291 8296925 7822578 7397354 6956388
5335 6956388 6627519 6349310 6053677 5816379 5573707 5303435 4932061 4675042 4498711 4377051
5325 4377051 4242442 4064076 3947928 3842317 3719102 3702479 3656117 3582818 3502409 3522472
5315 3522472 3628806 3662509 3700772 3745028 3815833 3848700 3886636 3945207 3981993 4009153 3957468
5304 3957468 3883534 3781633 3776625 3721296 3638757 3622197 3533097 3457412 3403824 3378365 3334497
5293 3334497 3217583 3184193 3150994 3059844 2976173 2978624 2954872 2947716 2948803 2966001 2980163 2988687
5281 2988687 3052243 3150187 3067088 3126988 3088451 3131189 3245950 3240771 3277359 3295535 3307598
5270 3307598 3391096 3446400 3437350 3471122 3433333 3399048 3350790 3242186 3185787 3120764 3096021
5259 3096021 3040678 2993895 2989002 2904064 2820928 2795791 2775105 2714903 2675926 2706804 2629821 2656933
5247 2656933 2609044 2579206 2652355 2621180 2618244 2652094 2673240 2705670 2691684 2645302 2729743 2817810
5235 2817810 2792139 2794954 2832620 2789800 2780697 2841215 2889971 2901441 2874715 2914731 2975480 2903544
5223 2903544 2915281 2969033 3043813 3075427 3084541 3159288 3200110 3196455 3216372 3284937 3300122 3291446
5211 3291446 3338279 3458133 3551326 3564151 3632687 3666309 3655545 3755994 3858080 3815092 3834053
5200 3834053 3830505 3878755 3925790 3983340 4060518 4052522 4009917 3978486 4042987 4040831 4042492 4062514
5188 4062514 4024081 4042264 4152412 4144136 4119501 4096143 4162918 4260942 4351107 4429837 4442129
5177 4442129 4517968 4562080 4553299 4592255 4609848 4624411 4748460 4715358 4697712 4731334 4858353
5166 4858353 4902476 4854490 4860432 4949822 5069759 5061268 5018933 5009224 4996486 5059569 5052753 5104188
5154 5104188 5097819 5057595 5075050 5108574 5094762 5159810 5243472 5313421 5350900 5460173 5513161
5143 5513161 5607160 5785572 5954127 6057828 6160362 6292395 6405578 6519505 6602551 6668949
5133 6668949 6794249 6924222 7023471 7109421 7184014 7311630 7418285 7548178 7598971 7693857
5123 7693857 7805403 7892089 8001429 8013823 8107830 8153727 8173622 8213596 8222832 8274393 8321942
5112 8321942 8411059 8472265 8567112 8684449 8821052 8979026 9140816 9359556 9543627 9760962
5102 9760962 9985850 10132899 10236697 10321221 10439720 10513527 10459097 10446347 10572993 10604199
5092 10604199 10755042 10897693 10991354 11084495 11163537 11176554 11148083 11041114 10957949 10777593
5082 10777593 10540940 10214554 9968278 9769594 9593549 9472697 9344516 9199235 9076056
5073 9076056 8949276 8863973 8768164 8716036 8675486 8569327 8430611 8354712 8288082 8166939 8159977
5062 8159977 8072005 7987383 7924368 7939583 7913251 7830553 7794383 7769982 7807861 7799043 7755377 7753867
5050 7753867 7662892 7559075 7558012 7487811 7505209 7450170 7407515 7406963 7457596 7427390 7458891 7493865
5038 7493865 7507517 7536250 7599028 7696571 7761349 7789170 7823900 7902497 8065473 8167354 8290862
5027 8290862 8364672 8408613 8518320 8498201 8593668 8671839 8616293 8585638 8648885 8683958 8677037
5016 8677037 8718888 8836936 8833239 8967010 9033110 9096442 9201688 9285115 9392329 9507523 9613822
5005 9613822 9732606 9912357 9988928 10181917 10384929 10544818 10758163 10988299 11240830 11431841
4995 11431841 11743587 12008926 12223639 12469240 12690294 12770299 12936256 13226659 13529167 13827083
4985 13827083 14175256 14482566 14762175 14995360 15310425 15467634 15486116 15436821 15391959 15429827
4975 15429827 15412312 15456295 15489610 15538855 15663791 15707381 15781029 15907642 16055291 16169860
4965 16169860 16299483 16521768 16722659 16962240 17226484 17502401 17773691 18041906 18354722
4956 18354722 18751097 19142863 19546694 19885433 20370866 20780784 21203165 21651692 22167583
4947 22167583 22721508 23232262 23840717 24413635 25123488 25778314 26471896 27163596 27936100
4938 27936100 28789368 29705170 30698777 31663689 32683722 33864358 35068124 36233275 37536963
4929 37536963 38905942 40376991 41981904 43696185 45596322 47789309 50101605 52625717
4921 52625717 55456821 58705375 62323218 66281077 70886312 75891109 81582090 87988707
4913 87988707 94976214 102704145 111234746 120619539 131083383 142541541 154882613 168351365
4905 168351365 182653016 197715041 213247805 228597842 243272774 256736959 268421729
4898 268421729 277831212 284389982 287485368 286879376 282719384 275556279 265829346 254075355
4890 254075355 240443436 225639002 210702406 196059117 182215252 169339395 157410884
4883 157410884 146349330 136209922 126873126 118379509 110551477 103580106 97171506 91352706
4875 91352706 86153688 81548117 77374320 73620797 70121821 66970391 64083088 61389646
4867 61389646 58774815 56352066 54130514 51963695 50058795 48334499 46594600 44927180
4859 44927180 43412709 41990723 40751793 39506043 38346468 37102525 36004241 35000965
4851 35000965 34148145 33255394 32444711 31645992 30946225 30330867 29673329 29069848 28503721
4842 28503721 28012346 27511997 27063002 26818646 26579775 26340563 26081144 25902027 25815429 25817540
4832 25817540 25736072 25764213 25884878 26074434 26288383 26530033 26890079 27301523 27741064 28194251
4822 28194251 28690655 29120997 29712432 30444964 31200970 32037749 33038509 34080770 35228236
4813 35228236 36373055 37590719 38780557 39943953 40998469 41963700 42736300 43421299 43783998
4804 43783998 43873499 43713288 43264702 42584709 41752460 40770042 39663806 38436157 37237020
4795 37237020 35929510 34724192 33543347 32342869 31193556 30060208 29032835 27977687
4787 27977687 26961261 26001096 25134519 24318800 23477489 22753123 22027428 21355975 20836289
4778 20836289 20313399 19878518 19478945 19181676 18788237 18562442 18339249 18017684 17743962
4769 17743962 17591495 17396064 17207803 17040927 16891452 16784896 16651944 16547102 16485248 16445632
4759 16445632 16422266 16460670 16443652 16458245 16471335 16505858 16587758 16563011 16584749 16618994 16716670
4748 16716670 16716375 16732349 16836888 16901622 16990769 16994489 17019080 17041937 17138380 17232880 17271221 17324013
4736 17324013 17428856 17554378 17729465 17889176 18053881 18268502 18522615 18847983 19120289
4727 19120289 19368120 19696122 20070643 20389182 20735057 20993094 21412970 21891943 22331233
4718 22331233 22810405 23356929 23968445 24553243 25234383 25950457 26717377 27532613 28334130
4709 28334130 29220609 30204795 31284811 32430124 33787654 35207309 36798719 38700598
4701 38700598 40705919 43008440 45624405 48639644 52157803 56154142 60746561 66037672
4693 66037672 72000286 78742661 86565956 95503082 105904225 118569841 134362749 153524512
4685 153524512 177037299 204232633 229093006 247761011 265709453 283662299 297992435
4678 297992435 301423491 290431984 269682483 246166167 226860989 211242753 196698311
4671 196698311 182336825 169325109 158243081 148618604 139227068 130390510 122538779 115315798
4663 115315798 108438334 102306017 97397905 93315842 89918009 87387504 85653910 84619193
4655 84619193 84167347 84455789 85246888 86735429 88826864 91619873 95039009 99245873 104179686
4646 104179686 109876348 116479013 124176645 133088341 143446212 155391156 169123780 185014953
4638 185014953 203027539 222379771 241704638 259620360 275063559 287193821 294480142
4631 294480142 294105490 284645494 268733556 250737920 233436721 217524406 203212477
4624 203212477 190509346 179434097 169746347 161232983 153802938 147265149 141391681 136059725
4616 136059725 131210845 126855485 122867396 118982064 114657299 109776070 104488978 99140913
4608 99140913 94054565 89227200 84639387 80238071 76107611 72233175 68597650 65269352
4600 65269352 62126469 59281883 56686549 54307162 52088216 50027081 48184345 46499440
4592 46499440 44861677 43327913 41825075 40438439 39145069 37872859 36580721 35338337
4584 35338337 34143333 33024771 31980324 30961148 29987507 28986913 28124572 27286148 26534041
4575 26534041 25738195 25045469 24455469 23893682 23387001 22878812 22416654 21980172 21579204
4566 21579204 21243760 20915594 20467661 20045214 19749180 19412842 19080517 18772760 18438477
4557 18438477 18203931 17947463 17765981 17605921 17443374 17257801 17088163 16900892 16707548
4548 16707548 16592903 16474130 16344576 16280171 16256071 16219373 16138976 16049231 16080235 15979444
4538 15979444 15749669 15574208 15355824 15120859 14917498 14772617 14641628 14597939 14610858 14588708
4528 14588708 14720093 14803774 14883641 15071788 15215737 15519724 15768409 16177139 16578895 17028951
4518 17028951 17458630 17784381 18093865 18454761 18783410 19018469 19102699 19078183 19045400 18808801
4508 18808801 18458661 18032923 17609772 17215089 16808522 16510934 16246632 16070088 16013423 15989726
4498 15989726 16059694 16160464 16414220 16782671 17184155 17810988 18558070 19408323 20441920
4489 20441920 21604069 22810302 23929835 24859968 25645158 26222393 26384949 25953040 24922033
4480 24922033 23501138 22018453 20732860 19507980 18419607 17413158 16461950 15564116
4472 15564116 14761505 13975983 13268678 12651871 12100649 11535045 10997486 10498625 10028330
4463 10028330 9628572 9290083 8998324 8719859 8435658 8279878 8088789 7894093 7758314
4454 7758314 7558666 7388632 7225958 7091550 7018690 6949917 6851701 6768389 6767896 6792968 6815562
4443 6815562 6796545 6738386 6815348 6850119 6757330 6735065 6688897 6609174 6567903 6533816 6497116
4432 6497116 6530413 6495991 6540360 6592773 6654748 6716653 6850657 6943962 7013988 7155921 7256787
4421 7256787 7191185 7032559 6960058 6823013 6623580 6441005 6178753 6094904 5923549 5720238
4411 5720238 5660002 5532562 5478503 5430066 5384326 5348955 5284839 5250763 5181782 5214893 5207615
4400 5207615 5149636 5147765 5109696 5119243 5104819 5078796 5020237 4948071 4876311 4798399 4720773 4684558
4388 4684558 4630980 4578173 4476992 4425040 4355601 4338288 4273933 4273441 4175752 4056760 3998342
4377 3998342 3977954 3938871 3895244 3898875 3890961 3946254 4023233 4015396 4046572 4065985 4087761 4203736
4365 4203736 4247549 4330501 4474856 4517211 4521003 4501444 4386394 4246154 4138043 4010802 3872317
4354 3872317 3804297 3702903 3630166 3629553 3599213 3568146 3507269 3494031 3427310 3396361 3381138 3336548
4342 3336548 3308439 3350181 3372063 3405353 3424239 3467669 3439891 3470017 3634443 3704562 3784373
4331 3784373 3893053 4009725 3994865 4034075 3970447 3952598 3845380 3632728 3545535 3436000
4321 3436000 3349626 3270725 3163614 3029545 2912457 2878691 2851440 2772994 2714708 2642315 2571154
4310 2571154 2570018 2543452 2521039 2440552 2429790 2448477 2382105 2348197 2273054 2259974 2224516 2207372
4298 2207372 2224839 2169621 2188773 2197559 2117996 2090028 2066240 2040567 1994931 2009874 2058531 2071841
4286 2071841 2085677 2061585 2002087 2006178 2037265 2002282 1944240 1909068 1841811 1847664 1809356 1805899
4274 1805899 1778763 1692343 1629474 1535835 1627132 1667850 1662283 1679663 1660418 1635232 1547468 1530165
4262 1530165 1540977 1548668 1532506 1524233 1534708 1511152 1489557 1494295 1487349 1481547 1405493 1386855
4250 1386855 1412199 1358030 1444395 1434221 1459734 1394679 1388827 1437486 1408995 1333685 1361414 1341709
4238 1341709 1382821 1371406 1366151 1384496 1378414 1366164 1387611 1395199 1457209 1502942 1399267 1402641
4226 1402641 1352109 1365035 1359334 1408559 1422089 1390021 1370709 1352580 1429897 1392056 1322280 1363469
4214 1363469 1335294 1312802 1317684 1390929 1419834 1386110 1412558 1461005 1425193 1390932 1448309 1484889
4202 1484889 1446372 1453501 1484804 1482252 1456877 1358727 1428262 1466641 1485917 1453886 1424556 1399175
4190 1399175 1372666 1403354 1383781 1380742 1272726 1353271 1390828 1392097 1329424 1349896 1394797 1373034
4178 1373034 1478443 1421855 1419202 1520766 1563021 1591141 1624739 1590382 1646652 1694730 1778069
4167 1778069 1829056 1888709 1948177 1964195 2050323 2030559 2082978 2084735 1986107 1943735 1953137 1916266
4155 1916266 1864191 1847850 1797078 1718933 1800784 1794291 1761375 1814054 1823326 1810318 1857835 1921319
4143 1921319 2008693 2114860 2232821 2314995 2459823 2507729 2494369 2573444 2600732 2644750 2672726
4132 2672726 2635888 2679111 2704261 2620377 2549289 2493642 2386443 2315020 2230921 2194154 2190369
4121 2190369 2190389 2233487 2217588 2196325 2206935 2234261 2241949 2290571 2300232 2333363 2317576 2340085
4109 2340085 2361337 2399006 2380170 2363009 2370128 2368616 2349966 2398492 2439713 2480688 2512274 2421497
4097 2421497 2457409 2448186 2446305 2428599 2433572 2356703 2387153 2410470 2447548 2493439 2419798 2428916
4085 2428916 2463867 2419828 2417778 2489537 2490891 2463687 2457923 2473703 2490336 2486546 2496197 2480953
4073 2480953 2482366 2498486 2468419 2417736 2399379 2364936 2313134 2290427 2213419 2210864 2185455 2223766
4061 2223766 2298901 2306370 2274540 2337626 2364662 2298644 2241717 2295281 2299804 2320244 2330042 2363759
4049 2363759 2480512 2569728 2620784 2686573 2738820 2838443 2982557 3028075 3050050 3149231 3247771
4038 3247771 3493129 3622774 3736799 3802658 3991107 4197816 4349497 4504590 4723195 4973224
4028 4973224 5198877 5352034 5309942 5298542 5248420 5211038 5321826 5423716 5561892 5716736
4018 5716736 5856458 6116621 6338193 6515244 6647192 6783444 6903534 6965648 7022568 7179938
4008 7179938 7276679 7343290 7541337 7773798 7995029 8344778 8771233 9229659 9547863 9768020
3998 9768020 10038391 10170043 9903181 9422462 8990403 8618515 8271669 8064884 7931612 7838266
3988 7838266 7677445 7619191 7571563 7497631 7458390 7315058 7141340 6970348 6695705 6511305
3978 6511305 6269318 6079306 5918610 5815167 5695937 5693958 5725498 5771030 5714644 5670418 5661959
3967 5661959 5519408 5277632 4993684 4750031 4612800 4490550 4298246 4111399 3967885 3776906
3957 3776906 3613012 3475194 3244448 3230608 3219347 3050187 2963149 2943809 2839224 2779861
3947 2779861 2733242 2759877 2763487 2654495 2523883 2525825 2530944 2641918 2612102 2589574 2628628
3936 2628628 2670784 2543052 2429573 2439489 2402051 2433574 2476873 2488489 2429366 2363599 2393169
3925 2393169 2374303 2391425 2346352 2351781 2413747 2425709 2429012 2411387 2424325 2472222 2484328 2515039
3913 2515039 2554220 2549135 2529244 2585941 2615215 2596444 2575656 2461407 2467200 2562746 2553195 2557180
3901 2557180 2592047 2647415 2654563 2651668 2670997 2626601 2651012 2721754 2707410 2711388 2709018 2715337
3889 2715337 2719159 2723985 2805474 2782021 2765102 2816070 2914417 2923023 2892401 2817305 2866905 2878345
3877 2878345 2905321 2921809 2945016 2933048 2923750 2944239 2933644 2983704 2955193 2926796 2909611 2886671
3865 2886671 2975711 2972481 2962176 2996231 3014334 3005833 2987515 3016396 3027345 2990407 3029936 3030853
3853 3030853 3025145 3054304 3069738 3060452 3056757 3060514 3046298 3068695 3098903 3083297 3086225 3054075
3841 3054075 3080717 3162825 3202536 3161000 3145443 3186053 3140557 3174914 3134017 3128435 3120232 3139837
3829 3139837 3165651 3121072 3203610 3209235 3151198 3129156 3104499 3089829 3086560 3095556 3036983 3009302
3817 3009302 3038946 3073557 3087652 3090875 3110294 3071009 3026844 3034595 2995499 2997937 2965128 2991473
3805 2991473 2971243 2955235 2947143 3004981 3019295 3013628 3029050 2991398 2915102 2944884 2964248 2979228
3793 2979228 2943031 2922218 2945441 2940394 2966155 3018823 2989410 3058531 3103022 3049002 3027869 3036385
3781 3036385 3107386 3103339 3073053 3002848 3021873 3025372 3039046 3095413 3110058 3086252 3078852 3084267
3769 3084267 3126082 3144577 3154327 3188909 3227488 3209444 3220352 3231881 3207305 3274918 3222944 3187885
3757 3187885 3159095 3147166 3200916 3277030 3279258 3313048 3304999 3338302 3354371 3382807 3424127 3425170
3745 3425170 3445555 3528782 3516565 3496575 3589249 3578727 3653354 3650163 3636356 3621360 3687660 3629364
3733 3629364 3664098 3717048 3774227 3789112 3857842 3868574 3878504 3900234 3927411 3929779 4003923 4080848
3721 4080848 4134197 4164596 4204726 4218360 4324181 4426352 4508773 4605950 4653087 4821701 4935754
3710 4935754 4948705 5027284 5102017 5108071 5072467 5084626 5080488 4978271 4958422 4973497 4878310 4793553
3698 4793553 4714426 4726879 4731705 4610790 4537381 4494225 4462902 4528019 4544874 4504796 4540154
3687 4540154 4566296 4579320 4572784 4672365 4711551 4762944 4802745 4939548 4979184 5023783 5084262
3676 5084262 5096688 5119892 5131575 5052455 5016791 4962189 4814563 4735350 4707575 4619195 4509510
3665 4509510 4502324 4513906 4409269 4350469 4365760 4235954 4156386 4138216 4028461 4035855 4001614
3654 4001614 3968873 3972117 3924255 3965667 3945678 3879467 3926656 3917394 3924067 3897468 3916982 3853317
3642 3853317 3787141 3774006 3790641 3854247 3872695 3856406 3829526 3824070 3844112 3852928 3863271 3884307
3630 3884307 3911607 3942040 4006926 4049880 4092699 4098943 4127250 4156369 4161892 4140836 4097590 4115061
3618 4115061 4075009 4117309 4161442 4244495 4201936 4200395 4209894 4246288 4267663 4249040 4256885 4314003
3606 4314003 4287318 4331086 4402422 4425012 4480373 4493956 4544948 4627592 4693234 4803047 4849579
3595 4849579 4868778 4953303 4978148 5069248 5073096 5017683 5068449 5140650 5103448 5084005 5130733 5182663
3583 5182663 5272298 5242729 5197214 5208039 5275079 5294731 5329725 5425900 5415935 5392222 5471200 5559724
3571 5559724 5643392 5715285 5715336 5729168 5734416 5806579 5925744 6012793 6093170 6112508 6178358 6226365
3559 6226365 6233612 6280755 6395910 6498719 6556996 6664132 6749343 6811787 6863287 6987691 7056659
3548 7056659 7111135 7132848 7198939 7338724 7494738 7553458 7675223 7816242 7909536 7975074 8131446
3537 8131446 8274167 8398683 8512480 8616744 8748230 8876116 9085788 9313523 9468961 9646481
3527 9646481 9878183 10057077 10330008 10642515 10840689 10982810 11260991 11501830 11755581 11999732
3517 11999732 12171497 12346139 12486275 12622547 12819798 13067339 13283705 13401965 13640840
3508 13640840 13912079 14161842 14501263 14774832 15012886 15334138 15688475 16099377 16505927
3499 16505927 16913181 17419472 17858986 18276963 18805210 19427450 20114096 20789214 21516850
3490 21516850 22308614 23208565 24053556 25015258 25971331 27021885 27996471 29079470 30296130
3481 30296130 31542320 32908102 34262763 35766656 37321218 38832953 40320537 41787825
3473 41787825 43179534 44344569 45218873 45727123 45911709 45739233 45140845 44247795 43207762
3464 43207762 42136198 40974972 39815677 38751166 37655074 36525356 35563478 34615123
3456 34615123 33695297 32867700 32022559 31180401 30445667 29691278 28946750 28297694 27696680
3447 27696680 27004511 26438585 25930756 25497170 25010944 24534537 23995671 23494008 23083451
3438 23083451 22608536 22178167 21746938 21275609 20851924 20453994 20050527 19687545 19296620
3429 19296620 18916022 18489411 18136364 17816146 17478609 17216799 16926739 16640172 16398832
3420 16398832 16211884 16010870 15836215 15686540 15618644 15630501 15621471 15649210 15577734 15517611 15498017
3409 15498017 15411832 15291565 15123621 14828978 14494758 14127795 13889540 13722162 13452309 13192953
3399 13192953 12993438 12743047 12597221 12529299 12358465 12248191 12189290 12074342 12001113 11956352
3389 11956352 11888890 11863167 11812458 11856135 11961580 12098501 12282689 12578088 12764672 12908305
3379 12908305 13026459 13162703 13296875 13280191 13128418 12853115 12478216 12115424 11832113 11623557
3369 11623557 11421031 11256376 11090978 10822035 10615367 10438833 10280444 10109136 9951029
3360 9951029 9825091 9718645 9596923 9491460 9367899 9382465 9318284 9289372 9325348 9327854 9378767
3349 9378767 9399989 9425952 9527520 9554420 9539485 9481515 9277945 9120020 8959203 8701698
3339 8701698 8527263 8439882 8269028 8168996 8029214 7843415 7763767 7677095 7575164 7533478
3329 7533478 7423123 7307174 7245514 7219581 7188855 7045842 6994012 6975097 6934745 6856882 6815120
3318 6815120 6879463 6813392 6754780 6665718 6634762 6647442 6594618 6568803 6435113 6449415 6460492
3307 6460492 6371247 6363780 6235623 6167595 6146700 6086691 6016541 5930911 5878720 5833344 5798115
3296 5798115 5732585 5659355 5606828 5564668 5597774 5594071 5536973 5559270 5525876 5429042 5449487 5429514
3284 5429514 5425272 5366225 5297868 5303630 5256106 5209135 5167346 5176135 5160342 5150337 5055451 5005584
3272 5005584 4950962 4918650 4805789 4752755 4743877 4721420 4716694 4699040 4640776 4595143 4555940 4510184
3260 4510184 4494572 4442931 4495318 4432485 4382590 4433758 4409240 4491019 4475440 4419731 4421106 4421307
3248 4421307 4476433 4462683 4471802 4552048 4527246 4461859 4470297 4431989 4388890 4387546 4373712 4280311
3236 4280311 4354861 4364519 4308138 4381262 4406876 4361628 4317692 4330953 4372407 4358409 4306559 4313728
3224 4313728 4428051 4515486 4582375 4596080 4652142 4628141 4616332 4698870 4792114 4780631 4823646
3213 4823646 4845714 4837252 4882596 4878397 4951644 4941287 4943552 5042000 5115994 5129760 5182391 5202135
3201 5202135 5284392 5349954 5367237 5368954 5425953 5469638 5495641 5592857 5664839 5636023 5687118 5721309
3189 5721309 5719090 5765336 5820953 5858954 5946220 6041016 6091360 6220268 6284730 6312983 6416456
3178 6416456 6513017 6624581 6760711 6869523 6988331 7196662 7332802 7477811 7569490 7762852
3168 7762852 7910870 8076535 8280855 8451096 8671808 8911062 9189813 9384041 9639882 9872571
3158 9872571 10139450 10350303 10535919 10706193 10916700 11085204 11290946 11420322 11540208 11694176
3148 11694176 11935032 12147452 12341427 12612538 12845387 13020593 13361016 13746248 14135123
3139 14135123 14504936 14956486 15448373 15952707 16469780 17062792 17592107 18126834 18733157
3130 18733157 19285237 19844633 20205181 20415270 20603087 20629014 20568894 20438681 20189798 19895322
3120 19895322 19653329 19522625 19498010 19470702 19514861 19625905 19713711 19870161 20122298 20348732
3110 20348732 20587396 20915691 21185475 21445152 21688912 21960530 22180503 22310008 22363630 22355758
3100 22355758 22268317 22179325 21992392 21731410 21437727 21061470 20606600 20188917 19700855 19333534
3090 19333534 18879217 18543185 18220418 17945506 17680404 17461482 17328641 17151694 17050122
3081 17050122 16957748 16781461 16584864 16355338 16139920 15859996 15574340 15191239 14795098 14363886
3071 14363886 13943276 13542828 13003701 12537377 12158196 11776060 11349345 10927072 10588591
3062 10588591 10173322 9857427 9548552 9267267 9077342 8770303 8524382 8299299 8091849
3053 8091849 7915935 7699850 7482077 7327153 7112992 6954646 6819511 6625782 6445514 6370481
3043 6370481 6190807 6041024 5876143 5717336 5579639 5456392 5325994 5217651 5079484 4936130
3033 4936130 4774534 4706869 4567126 4434917 4401043 4292994 4216440 4106658 4042008 4000871
3023 4000871 3971816 3840801 3767991 3741751 3687014 3654304 3570919 3485519 3473258 3419039 3380361
3012 3380361 3334347 3244092 3204909 3158335 3138970 3035962 3027268 2992686 2917609 2825124 2807621
3001 2807621 2750521 2620549 2585952 2498616 2467113 2502565 2473215 2442466 2401782 2377517 2302376
2990 2302376 2205086 2227878 2270133 2238780 2226071 2153555 2129525 2083137 2113675 2093004 2026333
2979 2026333 2039316 2039795 2016835 1962876 1824389 1789496 1762753 1750460 1771164 1752174 1681002 1585466
2967 1585466 1584590 1527766 1547094 1563276 1556395 1579498 1560416 1467034 1443731 1424926 1412055 1387166
2955 1387166 1363105 1393934 1400062 1369307 1327505 1303613 1366590 1332734 1252565 1192904 1167995 1169838
2943 1169838 1169297 1173486 1166610 1124774 1083664 1088798 1091412 1066054 1082748 1077040 1058929 982154 995222
2930 995222 1026368 975022 964935 1073226 1064808 1006937 989291 983441 1021481 1007723 1018893 1029713
2918 1029713 991861 955804 937033 957814 939958 925031 937950 914565 880944 856096 840651
2907 840651 823071 814392 802613 819500 887212 887661 869412 867428 845566 872715 868699 824997 809347
2894 809347 803910 767471 714761 796478 781455 790515 715339 673065 687118 707208 766873 696888
2882 696888 686065 644079 645043 700785 733208 646419 614806 628963 695701 700340 660646 685756
2870 685756 656523 651652 628310 608649 734433 645781 621532 678123 676450 637347 628483 700279
2858 700279 672121 645038 619940 644061 650099 605810 625508 626619 636750 668200 658736 667163
2846 667163 693672 664495 610391 575633 589279 607289 559227 601951 643110 606803 584062 590812
2834 590812 561573 637272 633395 523645 511850 529080 554102 537699 569498 566338 503507 605613
2822 605613 613023 565346 542103 535296 580438 549299 553910 544400 524752 486456 474456 492010
2810 492010 526428 492930 538100 456943 511184 538009 495189 517893 505511 510961 559807 566187
2798 566187 532522 518655 447302 412514 421175 430336 399273 403382 351457 332491 351595 340395
2786 340395 305990 375478 365371 334834 364776 350836 339857 302943 296757 301587 345254 330095
2774 330095 317751 288816 209999 225852 309491 289298 316316 318141 309955 285889 287590 351558
2762 351558 352970 360951 321151 316736 302706 239440 241762 324992 340040 373232 349621 276904
2750 276904 259384 321077 323220 314848 245440 266430 326510 289928 240193 299844 269843 287116
2738 287116 256949 227092 208419 270745 269112 203961 237010 212918 176638 158466 142638 181149
2726 181149 228211 269202 241389 231696 171692 185617 241442 221570 196987 228521 232923 250369
2714 250369 204579 153775 173098 160618 163714 186219 252878 237686 212613 185969 191011 163186
2702 163186 174204 169106 174311 107206 153550 160651 172606 187422 183753 157989 169875 216617
2690 216617 236237 216851 132886 134572 172976 166099 190160 182659 169892 184656 126265 184281
2678 184281 252509 206148 161758 113482 130445 135703 142873 184395 161449 97657 158764 129022
2666 129022 95402 60530 90606 119235 167694 119845 152099 173370 165647 186016 158701 78956
2654 78956 131137 161748 71956 138900 145863 126333 120451 84071 38346 86860 116085 55464
2642 55464 14371 51125 88814 42337 34236 54318 77576 64359 67896 94793 80178 127645
2630 127645 110642 14447 -40656 -14684 17450 37723 64260 52105 21373 -4695 28657 33665
2618 33665 8702 58932 48854 8913 76081 98117 53487 74355 42557 78679 90669 -1378
2606 -1378 4371 88840 54150 58269 44286 74664 26804 95456 210603 174474 115869 74790
2594 74790 52935 104888 136836 52194 45473 58445 62556 119329 52486 49504 32370 17748
2582 17748 40166 27963 -1730 19544 17437 28334 -15356 -20821 -714 14369 5767 15595 4269
2569 4269 25934 55981 58410 9757 -60453 -28632 17429 34330 -10394 21027 62531 -21008
2557 -21008 -50111 -11063 -52896 21664 33816 54230 1177 -26897 -41126 -29306 -15577 -46931
2545 -46931 -18084 -5470 -29399 -11559 -3918 349 -29422 24855 -11021 -96959 -125336 -67509
2533 -67509 -33368 -76250 -1303 -22313 -18192 -2204 -31438 -28186 -15171 -52447 -44545 3673
2521 3673 101890 147328 29660 -16768 18687 66894 -21778 -3549 27022 -4315 17374 -47565
2509 -47565 -81664 -70133 -67379 -90002 -71502 13839 -12973 -30558 -36631 -20198 -2273 -16757
2497 -16757 -5163 -33126 9665 -22495 -21292 -35683 -24120 -80221 -38654 44311 -16319 -37305
2485 -37305 -12191 19227 -691 1626 -39068 -18990 49972 -1523 -62148 711 2109 -40771
2473 -40771 31265 2924 -19042 -33692 -52010 -354 -2039 22268 32099 90885 17094 -16822
2461 -16822 -54505 -39116 -78810 -82400 -58361 -84540 -19091 -30403 -14141 -57676 -107595 -17034
2449 -17034 14211 30799 13526 55876 19791 -378 -22511 -36280 -4732 22304 -14300 14598
2437 14598 46970 53335 43961 49950 60761 32969 13006 2263 14996 -24796 -12807 -18724 45906
2424 45906 2787 -17127 -50418 24351 98136 117332 61271 -7949 -3262 18819 62724 27772
2412 27772 36198 38507 42352 46512 77285 77096 66970 135801 150928 168908 143350 98982 78611
2399 78611 151996 121378 131135 149685 180663 180058 223260 203780 204718 135864 134066 163877 132546
2386 132546 129104 171138 250280 299184 356981 343704 338535 293297 284979 334425 395959 421496
2374 421496 426818 439347 441143 468439 456226 468669 562291 600375 611069 615723 650955 713430
2362 713430 804275 813691 866457 897900 959848 1059727 1143791 1230077 1279184 1406674 1526037
2351 1526037 1677478 1794968 2016740 2250061 2507684 2785240 3080103 3409984 3781455 4247777
2341 4247777 4691610 5101022 5628456 6214432 7022121 8098755 9531722 11043833 12407439
2332 12407439 14195297 15999099 17272430 18696120 18746893 16501458 14233567 12564522
2324 12564522 11204860 10006094 9041111 8220289 7551482 6847679 6349716 5864271 5441320
2315 5441320 4968367 4535306 4163847 3801623 3467948 3187412 2917985 2704786 2560640 2413325
2305 2413325 2307505 2158126 2013932 1925358 1761135 1665533 1569992 1532027 1421459 1380507
2295 1380507 1365239 1250012 1152168 1122904 1087121 1015562 947229 931959 909785 841106 802266
2284 802266 762272 732035 670206 719822 700670 644853 570647 535252 560635 581916 515741 492348
2272 492348 431042 408308 358392 422493 423802 366928 393226 441399 364973 415472 404741 335356
2260 335356 375186 434719 356061 301662 279170 310914 326869 313998 301509 242736 260874 232983
2248 232983 245479 158361 199968 202077 185840 238058 185476 126356 54457 129811 173708 136067
2236 136067 140710 157988 93947 120599 148751 181479 149060 129840 140970 123358 146075 145993
2224 145993 131533 148483 107688 127180 142889 178536 184449 186430 151048 145074 110844 94184
2212 94184 148460 90421 76326 75030 15733 -17093 27205 5556 -17875 -6254 49990 51465
2200 51465 81580 102334 116674 106273 148495 145149 78305 32173 52896 72963 23681 54148
2188 54148 46047 50037 108961 116357 79939 60776 108775 105672 83308 62833 77613 71860 13880
2175 13880 38338 -5087 -93948 -49870 -5684 82932 135020 150868 66088 18012 -1291 29343
2163 29343 -24590 -10248 40073 47766 36111 28398 15807 -5307 -40262 -40430 61201 106365
2151 106365 -14026 1786 1226 29940 72689 89697 85810 -3502 27006 22922 31629 12002
2139 12002 7521 5707 -35266 13296 103087 35790 -19630 3629 -56370 -56212 -15880 -48322 -66698
2126 -66698 -29268 18880 -38865 -15777 30142 9374 -16786 -16267 22673 -35430 -44438 -30799
2114 -30799 -42915 -55437 22366 16900 58261 69880 39998 116271 108448 35833 -16976 53966
2102 53966 34055 36209 -30349 -47213 -53677 -76620 -4841 41921 20716 -20250 -29092 -11123
2090 -11123 52369 107848 34526 -57820 -36418 4089 -10792 3489 -3191 -30182 -16635 -29043
2078 -29043 -43145 7750 -10063 -27499 -33667 30543 50145 64809 25719 5056 22552 58348
2066 58348 25951 -26321 -22350 -13512 -4758 45446 47529 29117 26126 20951 62589 52867 -16828
2053 -16828 19006 -8047 -20929 -67295 -52811 -34802 -25740 10066 -39280 -40523 -25487 -49612
2041 -49612 -41914 -49813 -62777 -19164 -8361 -62501 -49674 -35058 -20604 2514 -71326 -126014
2029 -126014 -148627 -108898 -87459 -38580 -6567 -2159 -71461 -23296 -47004 -39967 -54281 -102711
2017 -102711 -71050 -44421 -19479 23733 -44414 -25569 -48787 -35401 -14680 -33068 -4766 -6416
2005 -6416 9078 -65207 -86880 -66775 -63793 -97220 -106285 -57369 -44382 -66304 -119752 -55051
1993 -55051 22165 1846 9082 -22339 -42048 -55637 -94665 -81631 -52206 -48801 -26424 -43910
1981 -43910 -52425 -20266 -33734 -37311 -31073 -65605 -65709 -49699 -56024 -51249 2086 22427 -54759
1968 -54759 -47854 -105949 -152114 -70480 -27211 -40181 -9769 57918 12077 -59174 -42865 -64955
1956 -64955 -8174 169 -26638 -38405 -61688 -99055 -69499 -9495 -13219 -61555 14831 40978
1944 40978 -16719 -61702 -40175 21626 -26414 3284 -46055 -109919 -54827 -78393 -28320 -35033
1932 -35033 -115015 -115762 -61740 -31738 -38632 2885 30731 -2491 -40672 -24268 -27022 -38330 -45268
1919 -45268 -53279 -77251 19388 59434 -38030 -103735 -68096 -13511 -25050 9607 -13381 -15324
1907 -15324 -19590 -81623 -91038 -90112 -98820 -23083 -42959 -92709 32646 28769 8093 -10635 -20682
1894 -20682 -66353 -10230 -12764 -32206 -36600 -83354 -129110 -129767 -97943 -70865 -129312 -150494 -169203
1881 -169203 -70482 13221 -95029 -130249 -104018 -100302 -5968 -58482 -69832 -20297 -16624 -17980
1869 -17980 16839 87019 31421 -31516 -23448 -1391 -27573 -46377 -28501 -71103 -88665 -119806
1857 -119806 -67799 -19322 -14219 20651 -17067 4259 -27663 -13875 -9318 -49778 -21641 -589
1845 -589 -42344 -48047 -57094 -65620 -23749 -26584 -55142 -49923 -75572 -76699 -29150 -38732 -63591 -24455
1831 -24455 -40408 -87985 -137947 -96467 -38232 -39265 -62986 -13447 -31200 -73857 -37244 -11564
1819 -11564 -12787 7581 -22268 -21500 -32351 -35317 -29411 -41027 -32575 -91727 -84154 -12575 -28396
1806 -28396 -81579 -79519 -34667 14033 -62160 -98651 -75614 7851 50299 -40675 -42457 -48616
1794 -48616 -65350 -39973 -10717 24973 15261 59756 -31547 15437 2104 -24453 -5590 -22290
1782 -22290 -42247 -34130 -6889 -56929 -42318 -60801 -16921 -76419 -12161 40254 -2346 -46620
1770 -46620 16954 -21467 -18984 17269 -34644 -35198 -26576 -49445 -54634 -19705 -40456 -78751 -84834
1757 -84834 -35943 -26300 -43070 -32509 -93516 -34685 -51943 -45597 -24343 -90166 -170206 -152456
1745 -152456 -108892 -148271 -85215 -64457 -39463 -113112 -65624 -90165 -77701 -67185 -102578 -93445
1733 -93445 -68792 -121814 -67935 68473 -5002 24094 58595 34110 -52867 895 -15407 -21230
1721 -21230 -48916 -34855 5693 7959 -26730 -39604 -17648 -20689 -25136 -103017 -57576 -12783
1709 -12783 -13489 -34023 -41568 -7654 -64524 -35524 -68289 -88110 -37178 -19511 -53872 -47200 -379
1696 -379 24088 2427 -4394 -65567 -145395 -30555 -25088 -2312 -49976 -52559 28363 11397 -14335
1683 -14335 25446 22331 2852 -41803 -52934 2536 -20522 -48802 -10807 -34878 -39970 -33567
1671 -33567 -36710 -63854 -106851 -109114 -92851 -81617 -64284 -31191 -12938 -14482 -135670 -93283
1659 -93283 -16417 -11848 -33844 -43537 -19061 -43546 -41249 7033 65923 4122 -26912 -29432 -27788
1646 -27788 -80363 -42571 -27406 5718 -63568 -53222 -48186 -76004 -123781 -37687 -16941 -21698
1634 -21698 -7054 1118 -24203 -39034 -122759 -108220 -31042 -27544 -46539 -145882 -107119 -54927
1622 -54927 -31475 30267 40423 -62888 -68838 -61848 -36384 -54175 -141399 -50645 -14333 -61801
1610 -61801 -34593 -71279 -117632 -27601 -14859 -25678 12549 -36027 -41137 9154 -32603 -51067
1598 -51067 -44232 4398 -29768 -37603 10312 -38322 -48810 -94909 -34700 -6726 15122 -21406
1586 -21406 7236 -26988 -13622 -46181 -58340 5361 14211 -10019 -65927 -39577 -53520 -112675
1574 -112675 -76439 -98468 -77161 1852 22556 -8658 -1578 -49377 -8970 3881 3163 -890
1562 -890 -3747 -57085 -67656 -11471 10221 4949 27220 -25468 -6689 -11127 -32523 -2616 -25482
1549 -25482 -15628 3966 -59593 -21392 -12377 -21017 -35817 -29528 -32307 -46416 -16123 17294 -62652
1536 -62652 -67982 -7509 -47295 -65862 -74710 -35898 15724 -49991 -95138 -3620 -23769 33824
1524 33824 15928 -63515 -29871 -1920 43459 35330 -36391 -70561 -31571 7115 -14907 -73768
1512 -73768 -21969 17284 -14859 -41272 -74535 -25684 35056 8190 -53109 -43602 -117542 -33352
1500 -33352 3441 -20948 -125162 -150159 -110179 -113023 -124379 -24356 -19895 -45035 -44345 -29808
1488 -29808 -60345 -48367 -38203 -57922 -46674 -19142 -21048 -3665 25427 -38390 -12298 -31818
1476 -31818 30513 11670 3073 87243 54308 19676 12617 55142 22903 -20649 -30984 -93179
1464 -93179 -57304 4609 -7884 -35038 -90403 -130128 -55012 8875 -20099 48614 77617 17502
1452 17502 -14636 -69616 -66234 -8212 -14139 -59011 -75438 -44355 15230 14145 -52406 -15351
1440 -15351 -52138 -67664 -48433 -33148 3754 -48467 -50711 -13013 -50503 -36892 -67014 -90892
1428 -90892 -19574 6791 18234 12588 -75503 -106209 -68462 -65438 -99156 -47533 -30002 -74013
1416 -74013 -34006 35598 9561 6203 -10865 -4888 -16733 -84047 -36318 -32975 -81025 -55690
1404 -55690 -9657 -48331 -52726 -2743 34328 22312 -61767 -76992 -30324 -39617 -13257 26585
1392 26585 -31722 -90022 -36555 -18531 -19275 -109561 -98276 -57682 -51306 34762 38728 69737 88409
1379 88409 7919 63157 30524 -34483 14719 38403 19138 20810 35961 63478 96568 26688
1367 26688 26768 38153 2374 34959 -57488 -95416 -19727 -25470 -71592 -87038 -65646 -31016 -5111
1354 -5111 -2873 -14487 -32097 -33903 -23927 -65657 27301 24406 -5247 -147 52379 59431 -27191
1341 -27191 26072 28882 5555 5411 -18821 -4122 -28985 -24567 -25118 -14705 -41210 -50194 -20716
1328 -20716 47292 9286 22090 -28837 38616 70813 5767 56002 10879 -43764 -22654 53152
1316 53152 5143 23875 -38989 -25619 -50331 -25057 21519 -11765 -30332 -3072 38532 22745
1304 22745 1765 -24082 -13763 -10931 -48800 -93257 -79383 -13639 18192 -56084 14755 17073
1292 17073 -24522 -36271 -31953 37967 52891 -2800 36526 -5063 17205 36732 29160 1532
1280 1532 -27436 -62213 -50666 16968 -18550 -61896 -36914 29553 -14171 20881 -15425 -26735
1268 -26735 191 -42544 -4611 -29074 -71777 42263 31151 -9424 -50951 14744 -12618 44403
1256 44403 25163 55198 62080 -49444 -62153 20573 -1809 -62810 -145810 -120866 -137440 -37892
1244 -37892 -18114 -55619 -31979 -15487 993 34237 36681 -23612 -25183 -48958 -49367 1642 29560
1231 29560 -63431 -65498 -18640 15143 -45379 -72662 4357 22737 -7246 75016 34710 -50255
1219 -50255 -58847 -25057 11556 34716 -39287 -54860 -12642 -25214 -44621 245 42207 29480
1207 29480 -27020 -100617 -23438 39285 37097 4351 -45787 -63049 -70232 -38588 -8688 49854
1195 49854 58013 31271 -9391 -18788 -18443 -72862 -122252 -33338 33487 33271 -61354 -68064 -22897
1182 -22897 -7677 -10492 -20669 46148 6900 3745 -10962 19372 29780 23690 28067 -15263 -6395
1169 -6395 26336 35840 42116 86770 75831 80378 -5871 -16492 47419 95431 59136 46672 44815
1156 44815 11699 6706 -8902 -54385 -17313 -36579 -96330 -109291 -105618 -69271 -24783 -25185 -28300
1143 -28300 -3082 -31536 -52862 -53692 10857 2513 -44168 -53199 -56598 13814 26267 1607 -1686
1130 -1686 66824 85816 1941 28713 119349 43433 -15641 1451 -59454 39983 86057 73828
1118 73828 41059 1581 7928 11765 33238 39617 55148 19510 6720 5565 56 15170 -19044
1105 -19044 15471 51821 27501 40135 -11643 -2635 24709 -82260 -45400 -39900 -13466 -23651
1093 -23651 -85344 -61708 -26547 -34481 -15676 -12007 -37066 -10593 47256 23535 -75198 -10632
1081 -10632 55653 75669 52667 -5918 -16027 35102 -26349 35628 75430 26520 56350 41614
1069 41614 -4483 -6753 26529 -189 64012 34885 -51636 -56893 -21956 -52444 21013 26622
1057 26622 -35708 -40772 -20153 93286 66576 23755 35622 51317 11335 -10020 15984 -5097
1045 -5097 43743 45788 -40620 -10066 886 23845 -8474 7485 32631 50668 43320 7639
1033 7639 24818 -23343 -65066 -49446 -14641 -32161 -5330 -6028 -29326 -44058 -46045 44812 5774
1020 5774 -27837 -22362 -22162 7385 51079 49053 16506 -17015 -44107 12368 -10096 24933 -10453
1007 -10453 18210 44880 17982 28502 -54068 -38631 26385 -2025 35356 -8152 -11065 -76313
995 -76313 -106149 -55141 -33054 20254 -6703 18645 -151 -101329 -26095 64896 57867 45237
983 45237 4187 8993 17502 20254 33992 -80194 -19742 -28268 -64837 -67128 -54912 -30200 -1748
970 -1748 33642 -11248 -6009 20881 6707 -35272 17715 23921 2252 14853 70159 50753 -2332
957 -2332 33734 19818 -3408 619 33287 69583 26756 -5179 -82121 -56796 -9264 21216
945 21216 21671 -11922 -58376 -69326 -69715 9856 -5889 -16445 58399 99698 62611 85829 8977
932 8977 -21872 -44514 -19118 29583 -64933 -26884 -70812 -75426 -18516 -61896 -50215 -17054
920 -17054 10508 4507 10130 18649 -4769 44452 57633 21649 8386 -2365 38261 33813 49660
907 49660 25176 -7380 -35495 -12341 16995 -56945 -31755 -76034 -75741 -21207 -44165 -3021
895 -3021 -28830 -21599 44065 549 15557 44245 8141 -729 -6019 -14091 -35451 26512 31978
882 31978 23007 49893 -14848 -33524 -46862 -40310 -61655 -77964 8324 20192 -22764 21803
870 21803 9158 1250 -7893 3871 -6523 -44354 23542 82969 11345 -14824 -71505 -50584
858 -50584 2533 -28714 -59349 -51649 -96699 -107927 -19995 89646 54213 -7997 32331 43011
846 43011 -4699 12043 14531 -18000 12768 -16847 -57844 56877 114863 105823 34525 31959
834 31959 46764 8349 37199 91803 71185 -21278 -63692 -48765 41618 4198 16834 29229
822 29229 50752 14306 -92786 -23321 41175 13488 9283 -49734 12183 73042 96158 58660
810 58660 55482 22484 -22240 6867 22049 29904 22408 36338 21858 -16725 17644 19922 16268
797 16268 -8426 -20889 -29221 11787 -28307 -34443 75047 59617 -20766 19873 -55914 -67682
785 -67682 -46276 -9816 44166 5045 -17426 -23278 -5195 -48769 20020 4838 39491 -7619
773 -7619 971 8298 -22662 -72776 -18665 46689 36226 39168 19673 10138 30852 31302 1481
760 1481 33164 79320 18308 12724 -1830 76868 48155 -9421 39619 53788 32552 -19749
748 -19749 42413 90761 51260 25187 13630 55450 65469 53302 58522 101052 69302 6608
736 6608 2210 -28959 -14768 32724 120192 97814 72168 71764 75174 77812 67666 26173 -20320
723 -20320 -32936 -20306 -20599 -30172 19366 -71997 -55408 -16846 11940 80946 98078 60569 -21900
710 -21900 -59040 -4784 46568 -65130 -57338 -76317 -13302 -10878 -36128 -29472 15220 -16184
698 -16184 -28983 -44921 -60365 5943 50677 48219 80602 86285 66562 35449 4839 -7209
686 -7209 2169 -1168 23181 674 -22342 450 29870 37659 90516 99184 37873 110850 61442
673 61442 39650 62121 16894 23611 79322 113471 102761 43500 32670 3524 32001 -859
661 -859 -1822 -18270 -32392 39701 -888 9479 27273 -6014 -45048 37596 59156 24636 47630
648 47630 70135 58677 7205 -2356 15018 15983 -1220 31704 68967 45177 61061 83503 45218
635 45218 68111 19961 -57015 -72730 -65708 -31621 -16648 -8940 999 16852 -17327 1032 52276
622 52276 16696 -58253 -29618 6681 9949 -19951 -45165 -107912 -43403 1778 23665 12727
610 12727 46276 59033 -27089 2111 19645 37585 98323 65958 -21995 17813 44524 43484
598 43484 -37841 46910 33499 -12954 -26314 -14095 11763 4662 -51623 -30202 -64080 -25929
586 -25929 15989 -16003 -28704 -9515 -22495 25285 10410 52504 74524 49370 54028 99116
574 99116 117153 26923 37523 23709 -6616 27372 41867 33719 9012 49374 73739 36049
562 36049 38774 -8763 19559 -18698 -41167 -25407 9174 35440 67178 101101 119965 94551
550 94551 33985 -17937 5374 -172 34898 6132 64984 79545 36956 58378 90639 119634
538 119634 97670 91141 100591 83906 48759 22370 99860 92520 69364 61430 40175 60168 9438
525 9438 27680 75861 35497 7840 13471 29711 8229 -3217 -14947 39737 30355 -51991 -49916
512 -49916 26848 51572 43078 23551 -40556 -78343 -72892 -61570 -16619 47801 12017 31527
500 31527 62387 16447 -13712 -59240 -49133 6732 25561 17545 -27621 784 72876 100510
488 100510 51240 13888 -80621 -51069 -2785 11238 13421 5532 -16340 21778 13269 25373
476 25373 25113 -122 9172 8034 39233 -4485 -30065 2352 36302 69566 41568 59677 67444
463 67444 16364 -52277 -87915 -50834 -16814 3552 17129 58629 53357 36540 35042 35598 93210
450 93210 76370 38534 -24738 3223 46748 13083 46461 28154 -2661 -15388 37177 63448
438 63448 42539 30831 18420 15350 -11499 27487 112196 78876 77625 22519 28414 83892 91243
425 91243 11504 18086 65894 27817 -48007 -25217 37656 52666 40907 3383 -9932 -10812 26411
412 26411 13169 41459 81746 45015 98797 134286 50499 -1601 -15290 -32518 -17494 -38591
400 -38591 -52850 11500 25064 -60317 -79905 -69469 -31976 -8963 50827 79197 69940 37963
388 37963 31022 67337 89628 82039 -11022 83 41488 59385 60537 15149 -32401 41646 65988
375 65988 -16677 -23470 -9409 17532 -3316 -22179 -21831 3563 47921 12785 31965 -10649 -64437
362 -64437 -58655 -37999 -65150 45666 55984 59208 51230 -33567 -39828 34875 20885 28663 8032
349 8032 4921 44369 8435 -22662 16920 73221 9950 -458 47089 54066 105173 123598 44518
336 44518 67623 80690 56612 88079 79809 2262 -78292 -64734 -14152 8344 -450 -18162
324 -18162 13735 -48421 -57619 -9940 -55256 -79805 -80536 17537 31970 21113 62568 103387 54897
311 54897 -23883 8662 -6873 21756 -30510 -18219 -31050 -9142 11250 26041 -6218 -10588
299 -10588 26051 9162 16273 15567 40107 35041 67041 36266 18449 -27195 -10316 16351 20820
286 20820 13282 -20557 -18508 37083 75520 63611 10736 7578 70720 62064 40768 70875 74114
273 74114 17098 57960 44819 53644 55694 79659 67938 81561 54940 44917 49068 25750 17094
260 17094 65555 80302 101923 80096 33244 64153 -5198 -54031 -37736 -13472 35863 49478
248 49478 38761 -9363 -2620 -48695 -38704 -36658 -39423 -7525 29346 33970 5505 -23863 -10021
235 -10021 -7839 -4319 55842 32158 -9889 -12692 -31261 -65550 6204 -15795 31167 52703 22114
222 22114 35139 32616 52456 19018 -34188 -49519 -53663 22562 44413 30292 69039 36950
210 36950 -4948 -8872 -16395 -45730 -56222 -37552 -33709 -570 -48596 16238 13871 6532 20411
197 20411 61657 32560 -11974 -12003 -654 11277 34172 33024 58394 36458 -3768 39813 68836
184 68836 -4041 -16599 -4201 25338 31346 13203 18384 -9586 -14849 -26237 -42083 -23879 -41504
171 -41504 -18808 -10034 25249 26790 6074 31319 44114 -2378 -38531 12792 13748 16109 -14594
158 -14594 52565 52070 11421 22915 61811 86185 44492 32836 102970 70304 38969 40457 6416
145 6416 33067 67701 45451 4138 13155 72794 35429 35204 49476 56254 41588 65511 3435
132 3435 24369 71919 68352 71732 51052 15285 5193 52166 59214 21310 -4249 9091 13815
119 13815 58743 26084 -10469 -18924 15598 35064 -25419 -24655 40362 65618 70983 49642 26703
106 26703 25432 14015 11223 -15822 -3605 26210 46999 38167 50846 50030 1426 11343 20417
93 20417 38865 44553 41664 82989 11456 36153 2003 15472 14959 -1730 27620 23945 9122
80 9122 21668 19665 -703 -51180 -43134 -18049 -19025 -34023 11611 50055 54619 63417 51761 75968
66 75968 -12760 664 -13823 -47280 1767 36824 47619 35503 -8933 12079 23275 32021
54 32021 4659 4784 10028 -2091 26711 52266 34273 -9856 -19057 9018 -9901 15549 26233
41 26233 2018 13393 37957 67716 53294 45028 8446 -6369 -14547 21493 65024 56728 7560
28 7560 -19222 -27725 -14321 22127 -22401 -57800 -36902 -9741 25001 82225 56553 16051 -12677
15 -12677 25658 76131 31822 33890 45595 33248 45974 10782 40163 33546 28171 25381 70081
2 70081 69097 -3144
0 -3144
$$ Imaginary data points
##PAGE= N=2
##DATA TABLE= (X++(I..I)), XYDATA
16383 -985896 -983494 -987234 -983721 -970867 -956864 -880740 -837132 -820652 -817460 -841312 -775835 -716913
16371 -716913 -658691 -700594 -740115 -668334 -614530 -624620 -567032 -557420 -507914 -517756 -502169 -435103
16359 -435103 -457565 -460297 -362651 -372227 -367104 -362316 -326404 -285703 -293957 -281361 -282473 -295539 -208680
16346 -208680 -151939 -136532 -97516 -65200 -111048 -107657 -99650 -112117 -69385 1162 21077 19621
16334 19621 64351 83603 95996 119172 160164 208622 223909 239013 287352 283580 312480 302454
16322 302454 282153 334114 349054 412779 439265 451009 425435 456668 473344 495756 502594 479212
16310 479212 502706 575254 613978 644347 694521 706917 705447 674912 702891 732914 752877 762855
16298 762855 747783 803036 767526 774349 818536 849599 896713 935944 930550 942874 993822 968602
16286 968602 944797 979282 998745 1022137 999434 1019997 1068774 1067958 1081255 1118658 1155503 1150461
16274 1150461 1246163 1187933 1168309 1195755 1186985 1177192 1239560 1256955 1274705 1316661 1331280 1324857
16262 1324857 1370499 1340526 1333156 1285130 1306150 1421287 1437218 1399214 1412682 1455923 1485830
16251 1485830 1498643 1508963 1453198 1571551 1549750 1489997 1579178 1607660 1571916 1586735 1660596
16240 1660596 1658984 1675235 1660029 1650235 1659134 1667749 1721425 1725284 1682848 1729808 1795248 1759621
16228 1759621 1737991 1717703 1736137 1764798 1806217 1800074 1773897 1851345 1849132 1837122 1854557 1861967
16216 1861967 1898148 1928171 1956832 1945571 1904265 1887155 1887784 1937881 1974972 1976273 1940119 1897674
16204 1897674 1953908 2005500 1989239 1997343 2043146 2012881 2035070 2117662 2123005 2113730 2092468 2134087
16192 2134087 2112568 2139096 2134602 2122331 2156730 2136989 2084141 2152688 2214090 2222548 2166258 2151681
16180 2151681 2170050 2196040 2185624 2161965 2185280 2214893 2247246 2280632 2307428 2315211 2323349 2255460
16168 2255460 2210069 2262511 2279384 2256906 2328796 2330028 2278626 2325230 2279403 2326849 2338354
16157 2338354 2319389 2300561 2264415 2333357 2359380 2372251 2357010 2293490 2309352 2329931 2342412
16146 2342412 2383426 2401732 2393708 2396758 2387709 2364086 2406506 2381644 2360109 2403359 2389914 2396920
16134 2396920 2395275 2353924 2365770 2417880 2423533 2465362 2484433 2472528 2469317 2434142 2476040 2423397
16122 2423397 2408301 2426787 2396242 2422894 2447988 2528068 2475137 2418447 2421899 2491845 2439999
16111 2439999 2389376 2415163 2457843 2491668 2510623 2498689 2476764 2549738 2530956 2537983 2492692
16100 2492692 2424092 2478127 2500712 2460583 2489105 2455499 2428427 2436392 2484046 2519695 2537533
16089 2537533 2468754 2489037 2519183 2497463 2543916 2539347 2595266 2611400 2585023 2537801 2507951
16078 2507951 2517618 2504906 2606355 2576540 2549616 2484982 2491248 2567129 2544007 2493986 2471739
16067 2471739 2499348 2474740 2517473 2487245 2533141 2552081 2530433 2555224 2562356 2586633 2548568
16056 2548568 2553522 2523453 2579324 2578373 2619403 2645328 2564545 2538870 2568094 2537576 2518961 2528864
16044 2528864 2543483 2565998 2570827 2659497 2617976 2554727 2554019 2556387 2559016 2603697 2653976 2581659
16032 2581659 2572865 2649709 2668209 2683818 2693425 2637089 2566895 2592979 2546633 2522028 2540496 2551858
16020 2551858 2531885 2536778 2489919 2510530 2537704 2562062 2520696 2569553 2614586 2559812 2601735
16009 2601735 2571098 2559346 2608108 2583335 2596820 2564402 2553630 2540635 2556312 2587021 2601803
15998 2601803 2625626 2605207 2624151 2631744 2672880 2630789 2591998 2539366 2588726 2584235 2608045 2617368
15986 2617368 2602731 2630683 2700356 2658443 2645313 2642078 2628792 2607605 2610815 2614203 2598106 2596188
15974 2596188 2579026 2604341 2648668 2661998 2584850 2590879 2608015 2651284 2646580 2604478 2581810 2546777
15962 2546777 2521506 2517664 2582251 2671560 2575028 2566337 2588115 2572590 2557617 2564677 2657806 2655921
15950 2655921 2636870 2601587 2644677 2660940 2635144 2607751 2629601 2640655 2637330 2613326 2653883
15939 2653883 2663846 2680241 2705083 2632940 2603983 2618783 2623172 2569710 2590557 2638608 2685332 2672805
15927 2672805 2627997 2569405 2567045 2609316 2629180 2556668 2518551 2506860 2534413 2551896 2634710
15916 2634710 2570221 2591393 2677369 2624124 2581889 2612892 2606596 2594639 2655411 2611534 2689512
15905 2689512 2695105 2686833 2620384 2643300 2654978 2619384 2580185 2562954 2591307 2534718 2537067 2524733
15893 2524733 2566587 2597962 2630167 2636203 2630398 2660089 2675118 2662903 2647207 2659639 2625638 2575773
15881 2575773 2597396 2674277 2608912 2603342 2656407 2635032 2628473 2639038 2647112 2697193 2664412 2623516
15869 2623516 2657190 2607938 2630092 2626835 2596140 2628380 2592083 2572564 2622815 2665214 2607087
15858 2607087 2597784 2600720 2579968 2626265 2628343 2617314 2587236 2579713 2562591 2605394 2621129 2661120
15846 2661120 2649826 2658062 2638231 2611783 2636933 2597234 2670511 2670897 2586760 2559441 2572994 2606011
15834 2606011 2590988 2634898 2634712 2629070 2596235 2582950 2573529 2585318 2551123 2582719 2613670 2623569
15822 2623569 2655178 2641864 2635072 2641617 2654470 2638884 2656302 2670439 2673507 2674998 2699367 2726372
15810 2726372 2721209 2706991 2711019 2708259 2692316 2635659 2596836 2655218 2644639 2629182 2682740 2662291
15798 2662291 2650002 2652439 2659485 2679548 2673663 2644928 2620674 2603460 2635187 2624124 2665962 2679667
15786 2679667 2656830 2677329 2685150 2646568 2577854 2568455 2574733 2582336 2638489 2625344 2631800 2684884
15774 2684884 2709654 2729259 2648471 2626944 2619273 2583823 2661614 2672274 2672997 2603807 2645595 2615225
15762 2615225 2705299 2707375 2703976 2739763 2705381 2630878 2646431 2658591 2645847 2666327 2650904 2645445
15750 2645445 2615108 2659047 2666456 2699158 2725148 2639337 2610102 2662338 2695311 2685366 2673200 2654259
15738 2654259 2675268 2719861 2709098 2663288 2669729 2721900 2688472 2681916 2769447 2769262 2705531 2718440
15726 2718440 2687409 2661214 2586634 2592904 2596298 2647654 2668132 2658753 2704321 2693605 2685539 2647016
15714 2647016 2615225 2640606 2692699 2673109 2666512 2682279 2665405 2613537 2588778 2663161 2668533 2658155
15702 2658155 2667038 2678821 2647815 2637162 2649093 2723732 2679256 2737810 2783135 2736363 2681765
15691 2681765 2633425 2658059 2725637 2706572 2635609 2650567 2667986 2668806 2672920 2682334 2680605 2700494
15679 2700494 2682110 2677358 2678973 2662933 2627273 2639056 2664862 2678202 2718415 2645522 2645355 2698649
15667 2698649 2689347 2691439 2664450 2661733 2646603 2701085 2682579 2649612 2724331 2741216 2704823 2750565
15655 2750565 2680799 2668144 2679035 2665373 2702420 2680075 2709323 2634423 2668120 2740635 2774831
15644 2774831 2729451 2693588 2705576 2693822 2684715 2664470 2664533 2631082 2663578 2686474 2640724 2721934
15632 2721934 2686857 2667504 2644773 2719314 2680985 2675271 2740407 2729752 2708795 2706368 2679678 2637459
15620 2637459 2626773 2674712 2687834 2722218 2743977 2668817 2626190 2612550 2657982 2651821 2653325 2765589
15608 2765589 2757479 2699750 2726304 2697316 2739146 2718600 2712109 2678496 2662909 2634449 2669721 2682054
15596 2682054 2721212 2719288 2754618 2748522 2713082 2750981 2714943 2670102 2706002 2681875 2687245 2730723
15584 2730723 2714574 2695671 2719422 2716680 2751951 2749906 2733482 2731598 2715706 2612184 2687564 2746393
15572 2746393 2712348 2686051 2694737 2727314 2732576 2724541 2727975 2762169 2754783 2735995 2717522 2757577
15560 2757577 2742414 2691671 2618256 2693519 2711691 2648927 2643401 2667433 2751532 2740479 2754051
15549 2754051 2776582 2723011 2699481 2687400 2662028 2690378 2646714 2705994 2714276 2732472 2742559
15538 2742559 2742826 2733132 2673620 2693354 2716053 2662751 2583106 2664564 2704261 2717109 2699806 2710941
15526 2710941 2724168 2791419 2825657 2721272 2638769 2674237 2688167 2764961 2737159 2727964 2776799
15515 2776799 2788547 2777002 2748795 2727709 2754170 2768362 2752979 2736182 2686405 2654584 2673572
15504 2673572 2728702 2733729 2718035 2667411 2711215 2709741 2712682 2759544 2789393 2798248 2808702 2744199
15492 2744199 2715628 2717324 2667666 2624063 2629296 2688086 2687320 2739956 2712136 2670274 2720740 2725653
15480 2725653 2737027 2739735 2725779 2754402 2715279 2771730 2748479 2706848 2773099 2763679 2729109 2664253
$$ [...]
##END NTUPLES=NMR SPECTRUM
##END=
