##TITLE=1H_DE-80H_X3
 200.13MHz, d2o
 8 sc
 
 19ns.26.2.2025
##JCAMPDX= 6.0         $$ Bruker NMR JCAMP-DX V2.0
##DATA TYPE= NMR SPECTRUM
##DATA CLASS= NTUPLES
##ORIGIN= UXNMR, Bruker Analytische Messtechnik GmbH
##OWNER= pz
$$ XWIN-NMR		Version 3.5
$$ Wed Oct  1 12:40:43 2025 Russian Standard Time (UT+4h)  Yarkov@DPX200
##.OBSERVE FREQUENCY= 200.1313
##.OBSERVE NUCLEUS= ^1H
##.ACQUISITION MODE= SIMULTANEOUS
##.ACQUISITION SCHEME= undefined
##.AVERAGES= 8
##.DIGITISER RES= 18
##SPECTROMETER/DATA SYSTEM= spect
##.PULSE SEQUENCE= zg30
##.SOLVENT NAME= DMSO
##.SHIFT REFERENCE= (INTERNAL, DMSO, 0, 15.4924)
##AUDIT TRAIL= $$ (NUMBER, WHEN, WHO, WHERE, WHAT)
$$ ##TITLE= Audit trail, XWIN-NMR		Version 3.5
$$ ##JCAMPDX= 5.01
$$ ##ORIGIN= Bruker BioSpin GmbH
$$ ##OWNER= Yarkov
$$ C:/Bruker/XWIN-NMR/data/yarkov2/nmr/H-C/1/pdata/1/auditp.txt
$$ ##AUDIT TRAIL=  $$ (NUMBER, WHEN, WHO, WHERE, WHAT)
(   1,<2025-10-01 12:39:37.20 +0400>,<Yarkov>,<DPX200>,
      <created by zg, POWCHK disabled, PULCHK disabled
       configuration hash MD5:
       00 E9 B6 7A A2 85 ED C7 34 08 36 98 17 FE 4E 26
       data hash MD5: 16K
       11 52 11 55 5D 9C 65 7E 9A 2C 58 94 F9 20 1A 8E>)
(   2,<2025-10-01 12:39:40.75 +0400>,<Yarkov>,<DPX200>,
      <Start of raw data processing
       efp BC_mod = 2 LB = 0.25 FT_mod = 6 PKNL = 1 PHC0 = -2076.254 PHC1 = 16.19097 SI = 16K 
       data hash MD5: 16K
       48 14 14 5B FE FA E3 D2 95 9F 79 90 90 F7 C5 70>)
(   3,<2025-10-01 12:39:48.89 +0400>,<Yarkov>,<DPX200>,
      <abs ABSG = 5 
       data hash MD5: 16K
       8E 31 82 1E 82 5A 95 E1 90 68 07 4F 2E CF 21 0F>)
(   4,<2025-10-01 12:40:05.23 +0400>,<Yarkov>,<DPX200>,
      <pk PHC0 = 5.915184 PHC1 = -2.399999 
       data hash MD5: 16K
       3E A8 EA 69 1C 0E F6 7F 83 ED A8 6F 58 B5 A6 CB>)
(   5,<2025-10-01 12:40:09.31 +0400>,<Yarkov>,<DPX200>,
      <abs ABSG = 5 
       data hash MD5: 16K
       02 FE A6 6F 67 8C 23 C4 DC F0 31 AC EB 2C 78 76>)
$$ ##END=
$$ 
$$ hash MD5
$$ 9C 5A 40 2D 76 B2 CB 30 D1 52 F3 4E EF F6 C3 05
##$RELAX= 
##$RELAX= 
##$RELAX= 
##$RELAX= 
##$RELAX= 
##$RELAX= 
$$ Bruker specific parameters
$$ --------------------------
##$DU= <C:/Bruker/XWIN-NMR>
##$EXPNO= 1
##$NAME= <H-C>
##$PROCNO= 1
##$TYPE= <nmr>
##$USER= <yarkov2>
##$AMP= (0..31)
100 100 100 100 100 100 100 100 100 100 100 100 100 100 100 100 100 100 
100 100 100 100 100 100 100 100 100 100 100 100 100 100 
##$AQSEQ= 0
##$AQ_mod= 1
##$AUNM= <au_zg>
##$AUTOPOS= <>
##$BF1= 200.13
##$BF2= 200.13
##$BF3= 200.13
##$BF4= 200.13
##$BF5= 200.13
##$BF6= 200.13
##$BF7= 200.13
##$BF8= 200.13
##$BYTORDA= 1
##$CFDGTYP= 0
##$CFRGTYP= 5
##$CHEMSTR= <none>
##$CNST= (0..31)
1 1 145 1 1 1 1 1 1 1 1 1 1 1 1 1 1 1 1 1 1 1 1 1 1 1 1 1 1 1 1 1 
##$CPDPRG= <>
##$CPDPRG1= <>
##$CPDPRG2= <>
##$CPDPRG3= <>
##$CPDPRG4= <mlev>
##$CPDPRG5= <mlev>
##$CPDPRG6= <mlev>
##$CPDPRG7= <mlev>
##$CPDPRG8= <mlev>
##$CPDPRGB= <>
##$CPDPRGT= <>
##$D= (0..31)
0 0.7 0 0 0 0 0 0 0 0 0 0.03 0 0 0 0 0 0 0 0 0 0 0 0 0 0 0 0 0 0 0 0 
$$ [...]
##$SUBNAM3= <"">
##$SUBNAM4= <"">
##$SUBNAM5= <"">
##$SUBNAM6= <"">
##$SUBNAM7= <"">
##$SUBNAM8= <"">
##$SUBNAM9= <"">
##$SW= 18.0517328524113
##$SWIBOX= (0..15)
0 0 2 0 0 0 0 0 0 0 0 0 0 0 0 0 
##$SW_h= 3612.71676300578
##$TD= 16384
##$TD0= 1
##$TE= 0
##$TE2= 300
##$TE3= 300
##$TEG= 300
##$TL= (0..7)
0 120 120 120 120 120 120 120 
##$TP= (0..7)
150 150 150 150 150 150 150 150 
##$TP07= 0
##$TPNAME0= <>
##$TPNAME1= <>
##$TPNAME2= <>
##$TPNAME3= <>
##$TPNAME4= <>
##$TPNAME5= <>
##$TPNAME6= <>
##$TPNAME7= <>
##$TPOAL= (0..7)
0.5 0.5 0.5 0.5 0.5 0.5 0.5 0.5 
##$TPOFFS= (0..7)
0 0 0 0 0 0 0 0 
##$TUNHIN= 0
##$TUNHOUT= 0
##$TUNXOUT= 0
##$USERA1= <user>
##$USERA2= <user>
##$USERA3= <user>
##$USERA4= <user>
##$USERA5= <user>
##$V9= 5
##$VALIST= <valist>
##$VCLIST= <CCCCCCCCCCCCCCC>
##$VD= 0
##$VDLIST= <DDDDDDDDDDDDDDD>
##$VPLIST= <PPPPPPPPPPPPPPP>
##$VTLIST= <TTTTTTTTTTTTTTT>
##$WBST= 1024
##$WBSW= 4
##$XGAIN= (0..3)
0 0 0 0 
##$XL= 0
##$YL= 0
##$YMAX_a= 353383
##$YMIN_a= -268176
##$ZGOPTNS= <>
##$ZL1= 120
##$ZL2= 120
##$ZL3= 120
##$ZL4= 120
##$ABSF1= 15.49238
##$ABSF2= -2.559469
##$ABSG= 5
##$ABSL= 3
##$ALPHA= 0
##$AQORDER= 0
##$ASSFAC= 0
##$ASSFACI= 0
##$ASSFACX= 0
##$ASSWID= 0
##$AUNMP= <proc_1d>
##$AZFE= 0.1
##$AZFW= 0.1
##$BCFW= 0
##$BC_mod= 2
##$BYTORDP= 0
##$COROFFS= 0
##$CY= -3
##$DATMOD= 1
##$DC= 0
##$DFILT= <>
##$DTYPP= 0
##$F1P= 0
##$F2P= 0
##$FCOR= 1
##$FTSIZE= 16384
##$FT_mod= 6
##$GAMMA= 0
##$GB= 0
##$INTBC= 1
##$INTSCL= 3.241238e-09
##$ISEN= 128
##$LB= 0.25
##$LEV0= 0
##$LPBIN= 0
##$MAXI= 10000
##$MC2= 0
##$MEAN= 0
##$ME_mod= 0
##$MI= 1.114404
##$NCOEF= 0
##$NC_proc= -7
##$NLEV= 6
##$NOISF1= 3.799351
##$NOISF2= 2.8
##$NSP= 0
##$NTH_PI= 0
##$NZP= 0
##$OFFSET= 15.49238
##$PC= 1
##$PHC0= -2070.339
##$PHC1= 13.79097
##$PH_mod= 1
##$PKNL= yes
##$PPARMOD= 0
##$PSCAL= 0
##$PSIGN= 0
##$REVERSE= no
##$SF= 200.130005868364
##$SI= 16384
##$SIGF1= 3
##$SIGF2= 2
##$SINO= 0.751879
##$SIOLD= 32768
##$SREGLST= <19F.Aceton>
##$SSB= 0
##$STSI= 16384
##$STSR= 0
##$SW_p= 3612.71676300578
##$SYMM= 0
##$S_DEV= 0
##$TDeff= 16384
##$TDoff= 0
##$TI= <>
##$TILT= no
##$TM1= 0
##$TM2= 0
##$TOPLEV= 0
##$USERP1= <user>
##$USERP2= <user>
##$USERP3= <user>
##$USERP4= <user>
##$USERP5= <user>
##$WDW= 1
##$XDIM= 16384
##$YMAX_p= 511464211
##$YMIN_p= -526389
$$ End of Bruker specific parameters
$$ ---------------------------------
##NTUPLES= NMR SPECTRUM
##VAR_NAME=  FREQUENCY,     SPECTRUM/REAL,   SPECTRUM/IMAG
##SYMBOL=    X,             R,               I
##VAR_TYPE=  INDEPENDENT,   DEPENDENT,       DEPENDENT
##VAR_FORM=  AFFN,          ASDF,            ASDF
##VAR_DIM=   16384,         16384,           16384
##UNITS=     HZ,            ARBITRARY UNITS, ARBITRARY UNITS
##FACTOR=    0.220516191357247, 1,           1
##FIRST=     3100.4901287758, 0,             0
##LAST=      -512.226634229984, 0,           0
##MIN=       -512.226634229984, -526389,     0
##MAX=       3100.4901287758, 511464211,     0
$$ Real data points
##PAGE= N=1
##DATA TABLE= (X++(R..R)), XYDATA
$$ [...]
7483a02556j3307J55860L6514J486j25127J2522N5696K4582J25620p3818P484
7472A04956j38388k2398O5608l8677j7452l166l2623p6539K1306J15620o2365
7461h4118R1865l2519n1764l1863J04476K3202p7606J33409j6015j5950R4808
7450A37925N3255K8092j07263M787P2683q9302J37031r8650j3711L8839p0438
7439I3248k5224k7119J2908O9422L362n0075J7355P4983J18485p8682q8060J10677
7427B31280J66754j13314m4488j30339l1815P6311j10506k3619J35097P775k33252
7416g0116n5915P9665P1683j9856P3829L4715J78299q7329R8136j69490q2273
7405E1348N3040N2701l0444M3548J34062j92568j45394K8305J23056K2027P0261
$$ plain form
7483 -102556 -115863 39997 76511 77997 -47130 -34608 21088 45670 171290 97472 104956
7472 104956 -33432 -55830 9778 -28899 -46351 -49517 -82140 -158679 -137373 -21753 -84118
7461 -84118 7747 -24772 -76536 -108399 -3923 19279 -58327 75082 59067 43117 137925
7450 137925 191180 219272 112009 116796 189479 100177 237208 138558 124847 163686 93248
7439 93248 68024 40905 53813 123235 126597 76522 93877 168860 287345 208663 120603 231280
7427 231280 398034 284720 240232 109893 78078 154389 43883 20264 155361 163136 -70116
7416 -70116 -126031 -46366 25317 5461 79290 114005 292304 204975 303111 133621 51348
7405 51348 104388 157089 126645 170193 304255 111687 -33707 -5402 117654 139681 209942
7394B09942J47705m5203o0964o2682J5430r0987L5236M6649P546J06471M9702
7383C58845j41151O718m6297M2354K1505o7801k4454K13588P2978l5114j26171
7372B75000j13179J05047J52635P9740j36946K323J2615L8308j4720k9021j18004
7361B53798R2527J01587k1406j4772O1929R2612r749q9031J71214J23051J6431
7350G78191j54209J25108J17038J5377J07386m8602m8949Q5691m2454K6209M1380
7339A002166j34441J1030J15709k6486p1859O1682K4105L7979l057n8911R2114
7328A050031K0412K6611P6427N2922K7689Q6116J23551Q0601R5547M3502L4786
7317A718195k0417r9496J50611J91449j07921R7609N4204j3115P3340R8061L3344
$$ plain form
7394 209942 357647 312444 251480 188798 204228 113241 148477 195126 202672 309143 358845
7383 358845 217694 224412 178115 220469 241974 174173 149719 363307 436285 401171 275000
7372 275000 161821 266868 419503 499243 362297 364620 377235 415543 400823 371802 253798
7361 253798 346325 447912 426506 411734 473663 566275 556526 467495 638709 761760 778191
7350 778191 623982 749090 866128 881505 988891 940289 891340 977031 934577 960786 1002166
7339 1002166 867725 878755 994464 967978 896119 957801 981906 1019885 1016828 957917 1050031
7328 1050031 1070443 1097054 1173481 1226403 1254092 1340208 1463759 1544360 1639907 1683409 1718195
7317 1718195 1697778 1598282 1748893 1940342 1832421 1930030 1984234 1971119 2044459 2142520 2175864
7306B175864L8529Q8659L7087P5585l3012k4707M1878Q9281k4645J47435k4706
7295B587248j45626M2773R1618m4393J37897l7434l0223n279J02464K6907N3033
7284B778985J17646P4836M4165k8549O8654k6618Q2081K5729p5056k0671Q6336
7273C127538j34963j79278J49118K18165J3523o590j17908L7088o5385j47043
7263B894265j18261Q153l1063M6790J01717r8670q2589P3829o0802j53710Q6146
7252B665805J3844K5712l5972K4412j81829k7201Q5662K0084m132q3703O3004
7241B565686j2329j25720r0585j6107l2426j51070K0329N6503j67190j78064j5247
7230A853780k62683j5615n3377j53538M051j31040p5447K2154m2576j56025m5588
$$ plain form
7306 2175864 2214393 2303052 2340139 2415724 2382712 2358005 2399883 2489164 2464519 2611954 2587248
7295 2587248 2441622 2484395 2576013 2531620 2669517 2632083 2601860 2596581 2699045 2725952 2778985
7284 2778985 2896631 2971467 3015632 2987083 3055737 3029119 3111200 3136929 3061873 3041202 3127538
7273 3127538 2992575 2813297 2962415 3180580 3194103 3187513 3069605 3106693 3041308 2894265
7263 2894265 2776004 2784157 2753094 2799884 2901601 2802931 2720342 2794171 2733369 2579659 2665805
7252 2665805 2679649 2705361 2669389 2693801 2511972 2484771 2570433 2590517 2586385 2502682 2565686
7241 2565686 2553357 2427637 2337052 2320945 2288519 2137449 2157778 2214281 2047091 1869027 1853780
7230 1853780 1591097 1575482 1522105 1368567 1372618 1241578 1166131 1188285 1145709 989684 944096
7219I44096P2686L3039m3728O3011m4715n0139r4134j30161p674K83947j82882
7208H43346p4912J4303k6456m4931O861J8170n217M6927N0680K1694m3813j83998
7196F22654p24J01273j18064j37886R9336K26629K8799l8772j6847N477O7121
7185H38996k6582N196Q0317m1300p0198J36227J81271M7485k1064l1127O3850
7174A163071k0230K6958q7276k3607J1917O140J8522o6716n1660n8524L9106P9167
7162A036868J49651j02790l2668J09650m9199j48980k926L023p8349j9931q321
7151H56028q9618Q6068r957q2134k4602M4473J5814j16638j22139J50064J35902
7140H43261j66173J68329L9714p119K5808Q0021N6397k2498J65190M5359n5965
$$ plain form
7219 944096 1016782 1049821 1006093 1069104 1024389 974250 880116 749955 742281 1026228 843346
7208 843346 768434 782737 756281 711350 718211 736381 731164 778091 828771 850465 806652 622654
7196 622654 621930 723203 605139 467253 566589 793218 822017 783245 766398 771875 838996
7185 838996 812414 817610 897927 856627 786429 922656 1103927 1151412 1130348 1099221 1163071
7174 1163071 1142841 1169799 1082523 1058916 1070833 1076973 1095495 1028779 977119 918595 957701 1036868
7162 1036868 1186519 1083729 1051061 1160711 1111512 962532 959606 962629 884280 864349 856028
7151 856028 766410 852478 842521 760387 735785 780258 796072 679434 557295 707359 843261
7140 843261 677088 845417 885131 878012 903820 983841 1040238 1017740 1182930 1228289 1172324
7129A172324J40521K2591m7025m3970N7096M955P8433O3216J04237q5784j20005
7118A346589P3902J87139J28222O7418P1178l2372P5047J06598K1084l3903K18142
7107B229044R1379J29035K29559J7239J97574J14244Q8882K80223J32556K0093
7097C529828Q6102J00015J91816R777N8324N4947K32446K44879K74260L99911
7087E182305M39979P72879M91833K3570J66557L59333M14603K21501n65938o17345
7077F889277m08354o76057n56136m27289m47711l09027k26996j43120j61798j21475
7067C411314j45264R7172o9305N0213Q948j27657p0054k3136j66875k28051M3246
7056B780551o8581p0152Q526j82566L1249J39083k54865r9414q4412R953J5147
$$ plain form
7129 1172324 1312845 1335436 1288411 1244441 1301537 1306492 1384925 1448141 1552378 1466594 1346589
7118 1346589 1420491 1607630 1735852 1803270 1874448 1842076 1917123 2023721 2044805 2010902 2229044
7107 2229044 2320423 2449458 2679017 2696256 2893830 3008074 3096956 3377179 3509735 3529828
7097 3529828 3615930 3715945 3907761 3917538 3975862 4030809 4263255 4508134 4782394 5182305
7087 5182305 5622284 6395163 6886996 6910566 7077123 7436456 7851059 8072560 7506622 6889277
7077 6889277 6480923 5804866 5248730 4821441 4373730 4064703 3837707 3694587 3532789 3411314
7067 3411314 3266050 3363222 3293917 3344130 3353078 3225421 3155367 3132231 2965356 2737305 2780551
7056 2780551 2711970 2641818 2650344 2467778 2499027 2638110 2383245 2283831 2199419 2209372 2224519
7045B224519P4101J13155M4274K0357q7530R73J00838l8505J21171j010Q2027
7034B654370K18409N5587Q9475J8877J34096J86619J05610L06635J82212L2622
7024C984512j8288P2609N0171K4789K85916N3122J37882J31657K51890L72350
7014E346610M55762M37100L00231K16088J64121M05536J54633k26976n81269n63734
7004F108102n03614n42394m66132l33904m70582k15128j25738j78062k55763q1057
6994B935728L1805p9110l55l1895J7318P420O2994Q6802J0485J06578J07685L6122
6982C291577J58104J42409Q0420J13414O1403L1819K32200J84067N6733l1849
6972D320297L71629L83685M45114O15549R68058Q97470j74498n52419k79881m28699
$$ plain form
7045 2224519 2298620 2411775 2456049 2476406 2388876 2389849 2490687 2452182 2573353 2572343 2654370
7034 2654370 2872779 2928366 3017841 3036718 3170814 3357433 3463043 3769678 3951890 3984512
7024 3984512 3966224 4038833 4089004 4113793 4399709 4452831 4590713 4722370 4974260 5346610
7014 5346610 5802372 6239472 6539703 6755791 6919912 7325448 7480081 7253105 6671836 6108102
7004 6108102 5604488 5062094 4595962 4262058 3791476 3576348 3450610 3272548 3016785 2935728
6994 2935728 2967533 2888423 2888068 2856173 2873491 2880911 2943905 3030707 3041192 3147770 3255455 3291577
6982 3291577 3449681 3592090 3672510 3785924 3847327 3879146 4111346 4295413 4352146 4320297
6972 4320297 4691926 5075611 5520725 6136274 7104332 8001802 7827304 7274885 6995004 6566305
6962F566305l34194l10373l63768q3107K15522M37830R47802N28641o41649o00664
6952F362345n56704n55686m24204p35311m77192l13253k25721l14609k37836m7228
6942B474601k29504o3295L1518m6393m7549L7304j1304p297p5913l4709J13853
6931B141312K3113O8270J51480J56607l0388K5711J59381o4725k1774K57101O2055
6920B928143J38205K28851J23511Q0854p2793K25178O2741J70478K21461J80853
6910D287482J03378L49731O50296P52611J095935J40469m44498n34488m50486
6901E950430l74927k18485j83857j21896j7094M19806P33236P33556k74555o79926
6891E966288l81220n86622n02983m53131n31698m07383l02447l09574l31115k46245
$$ plain form
6962 6566305 6232111 5921738 5557970 5474863 5690385 6128215 7076017 7604658 6963009 6362345
6952 6362345 5805641 5249955 4825751 4090440 3613248 3299995 3074274 2759665 2521829 2474601
6942 2474601 2245097 2181802 2213320 2166927 2119378 2156682 2145378 2138081 2062168 2027459 2141312
6931 2141312 2164425 2232695 2384175 2540782 2510394 2536105 2695486 2630761 2608987 2866088 2928143
6920 2928143 3066348 3295199 3418710 3499564 3426771 3651949 3714690 3885168 4106629 4287482
6910 4287482 4390860 4740591 5390887 6143498 7239433 7379902 6935404 6400916 5950430
6901 5950430 5575503 5357018 5173161 5051265 5034171 5453977 6187213 6920769 6646214 5966288
6891 5966288 5585068 4998446 4495463 4042332 3510634 3103251 2800804 2491230 2160115 1913870
6881A913870k673j69027j04296j03922j14425q0989J24029k7324p0823j71222
6871A193198J9772O7950K4345k19702j35436M0077L5301k3627q7659J21165j5151
6860A020233o9914k1106J246p7513J3603k9798P0195j6732m9575J41962q9918
6849H92683j8767j2346j78289n868K27730K5776j00283Q4135O9889j14200J4834
6838H85294J07862q0M9983J2474m0073R0575J23844j5584n5681K7224N151j28709
6826A062280j8828K07136j23500n333P3733k4319m2436K51453r5055q513P6645
6815A353263j08735J8418J00209o6199N0354J57064K6813q6732M042J72361o5573
6804A555285O8379J68616Q0504J60203J66393j41452J62367J77977P9852J93188
$$ plain form
6881 1913870 1911197 1742170 1637874 1533952 1419527 1338538 1462567 1435243 1364420 1193198
6871 1193198 1212970 1280920 1305265 1085563 950127 990204 1025505 1001878 914219 1035384 1020233
6860 1020233 950319 929213 930459 852946 866549 836751 906946 890214 840639 982601 892683
6849 892683 873916 861570 683281 677413 905143 930919 830636 914771 984660 870460 885294
6838 885294 993156 993076 1043059 1055533 1015460 1106035 1229879 1214295 1158614 1185838 1190989 1062280
6826 1062280 1043452 1250588 1127088 1121755 1195488 1171169 1128733 1380186 1285131 1276618 1353263
6815 1353263 1244528 1262946 1363155 1296956 1347310 1504374 1531187 1444455 1448497 1620858 1555285
6804 1555285 1623664 1792280 1872784 2032987 2199380 2057928 2220295 2398272 2478124 2671312
6794B671312O3266k1874N3798L80658K20586J01193R8992J28097M9095O4752J24045
6783C933920Q3583R0048O4134K9192L67037O96285P57658P33837K72043R4276
6773G122013K30427K60992K00706k50302n99608n03744n36971n02691l15871k89319
6763D815632m72049l09676k63481q8295o3274p5353R436r1483o3997J05858M8060
6752C551378K6012P2413O5713J59657J56899R1091J65293M781J05J88685K35108
6741D717135J75720J24429K27087K62434L78267O02095O61018Q41246M29427J78180
6731H597038K06330M92366L43246k3035m26896m03211k65647l39104m00742l31797
6721G448548l13620o7551r0832J30594K60711L63017Q25083J221942M03188n69375
$$ plain form
6794 2671312 2734578 2712704 2766502 3147160 3367746 3468939 3567931 3696028 3745123 3809875 3933920
6783 3933920 4017503 4107551 4171685 4200877 4567914 5264199 6021857 6755694 7027737 7122013
6773 7122013 7352440 7613432 7814138 7563836 6964228 6460484 5923513 5420822 5104951 4815632
6763 4815632 4343583 4033907 3770426 3682131 3618857 3543504 3552940 3461457 3397460 3503318 3551378
6752 3551378 3577390 3649803 3715516 3875173 4032072 4123163 4288456 4293237 4293342 4482027 4717135
6741 4717135 4892855 5017284 5244371 5506805 5885072 6487167 7148185 7989431 8418858 8597038
6731 8597038 8803368 9295734 9638980 9615945 9189049 8785838 8520191 8181087 7780345 7448548
6721 7448548 7134928 7067377 6976545 7107139 7367850 7730867 8555950 9777892 10181080 9611705
6711I611705n37646l37752l76045k98866k16788n2428L1858K57267N71021R35663
6701I587989R5042n93038l24935m85225n68677n01130l52086k19938J4175j84284
6691F467893L0726L19701M79701Q42770J122760r0860p21702n93268m73076l68918
6681G015727l35709k98151j55260m005K46407P68867O11754n36957n43654n71484
6671F197535o15512m27964m92222m81786m58867m21869k23909j84400k14037k20303
6661B456666j60282J012r730j22094j02575J023q1180r9293o4179N9336J23062
6650B001766j14339j40473L7798r5959m5739J01867P4682m7019j4947N7591K1721
6639A836949m3077o3523K8617Q1558J58521J6283j36578k1297O5338j7456K3345
$$ plain form
6711 9611705 9074059 8736307 8360262 8061396 7844608 7792180 7824038 8081305 8652326 9587989
6701 9587989 9683031 9089993 8765058 8279833 7711156 7210026 6857940 6638002 6652177 6467893
6691 6467893 6498619 6818320 7298021 8140791 9263551 9172691 8450989 7857721 7384645 7015727
6681 7015727 6680018 6381867 6226607 6222602 6469009 7237876 7849630 7312673 6769019 6197535
6671 6197535 5582023 5154059 4661837 4180051 3721184 3299315 3075406 2891006 2676969 2456666
6661 2456666 2296384 2297396 2287666 2165572 2062997 2064020 1982840 1883547 1819368 1878704 2001766
6650 2001766 1887427 1746954 1784752 1688793 1643054 1744921 1819603 1772584 1757637 1815228 1836949
6639 1836949 1793872 1730349 1758966 1840524 1999045 2015328 1878750 1857453 1922791 1905335 1928680
6628A928680J60100K9660r4012Q996l6079L555q6709N0680K5433r1905J1638r1866
6616A818171j16244K14488R9382j86338k3750L0200Q432L641P6403r4041J47580
6605A977924K6146k1013J64011n8103j3999L1465J20638N070j18255k5823l8669
6594B049392Q2804J77206j41314Q4009J24975L9304P2552J1015j76501k5337j9567
6583B278538K7162q6280J42879P8463k3418P1743J45299L6760j04769P1196l4337
6572B603236p3832q5967O6611L2102P0079r561m7689J14115R4252o4052K5205
6561B724499R3602Q4119M8020R9848N5062p99J17012J53928R0003K61075P3596
6550C799965P3717O692K11747J90316O9004J39358J41423J93163K52972J10966
$$ plain form
6628 1928680 2088780 2118440 2024428 2033424 1997345 2000900 1914191 1964871 1990304 1898399 1910037 1818171
6616 1818171 1701927 1916415 2015797 1829459 1805709 1835909 1844341 1847982 1924385 1830344 1977924
6605 1977924 2004070 1983057 2147068 2088965 2074966 2106431 2227069 2232139 2113884 2088061 2049392
6594 2049392 2132196 2309402 2168088 2252097 2377072 2416376 2488928 2499943 2323442 2298105 2278538
6583 2278538 2305700 2219420 2362299 2440762 2417344 2489087 2634386 2671146 2566377 2637573 2603236
6572 2603236 2529404 2443437 2510048 2542150 2612229 2602668 2554979 2669094 2763346 2699294 2724499
6561 2724499 2818101 2902220 2950240 3050088 3105150 3104351 3221363 3375291 3465294 3726369 3799965
6550 3799965 3873682 3880374 4092121 4282437 4351441 4490799 4632222 4825385 5078357 5189323
6540E189323K23414K79880J52795J24911K79912K87204K17418K80748K40384L29514
6530G605503L27026L32264L57170L55103O43705O12083O71042N92821L82911j42334
6520A1737294l59327n50268p08865o68279o54812n16041n31460m78893l06934
6511F962415l66144l25204j29257n4476o1608K5927j67120j84661k8916k30577
6501E440379j54015j28512j40234K6921q7335j18867j1336k10209r7038J11419
6491D631173N2942M1382j4080j7233j77226j37316J28656J19143k9707p9709N346
6480D523371r9552K5323N9111n1943J39246M4462J28660J03477Q4751J37930o3354
6469E031482l2699K1513M3422j09124J24550J25260J8227k7716K2560R2253J9401
$$ plain form
6540 5189323 5412737 5692617 5845412 5970323 6250235 6537439 6754857 7035605 7275989 7605503
6530 7605503 7932529 8264793 8621963 8977066 9620771 10232854 10903896 11496717 11879628 11737294
6520 11737294 11377967 10827699 10118834 9450555 8795743 8279702 7748242 7269349 6962415
6511 6962415 6596271 6271067 6141810 6087334 6025726 6051653 5884533 5699872 5670956 5440379
6501 5440379 5286364 5157852 5017618 5044539 4957204 4838337 4827001 4616792 4519754 4631173
6491 4631173 4684115 4725497 4711417 4694184 4516958 4379642 4508298 4627441 4597734 4518025 4523371
6480 4523371 4423819 4449142 4508253 4456310 4595556 4640018 4768678 4872155 4956906 5094836 5031482
6469 5031482 4998783 5020296 5063718 4954594 5079144 5204404 5222631 5194915 5217475 5309728 5329129
6458E329129L6397K08873J51456K5964K5016J64399M9404L7866R8052J11834J72375
6447F410765m1193m5000J82875O296R8712Q4222J45786Q3855M7668Q8822o3020
6436F999788j2947Q0952k2065P4347Q1707J12033O1580J56345Q5986J11590J28840
6425G858156J00309n3312J36910O5018k2072K29413o4028R8064L6441R7538R1953
6414H574390Q2162K75469Q9584J74394J67864Q2729J81050J82840J91037m1007
6404I960512J5199P7003J96374R5057Q7999J15371J11791J57643K38936m2674
6394A1013211J92999J07574o0028O3258J47789K19799O3272M9741K327L42315
6384A2142257K01073J41530J49706P3126J31966K20836J80662K07734K82654K16089
$$ plain form
6458 5329129 5365526 5574399 5725855 5751819 5776835 5941234 5990638 6028504 6126556 6238390 6410765
6447 6410765 6369572 6324572 6507447 6513743 6612455 6696677 6842463 6926318 6973986 7062808 6999788
6436 6999788 6986841 7067793 7045728 7120075 7201782 7313815 7375395 7531740 7617726 7729316 7858156
6425 7858156 7958465 7905153 8042063 8107081 8085009 8314422 8250394 8348458 8384899 8482437 8574390
6414 8574390 8656552 8932021 9021605 9195999 9363863 9446592 9627642 9810482 10001519 9960512
6404 9960512 9975711 10052714 10249088 10344145 10432144 10547515 10659306 10816949 11055885 11013211
6394 11013211 11206210 11313784 11253756 11317014 11464803 11684602 11747874 11797615 11799942 12142257
6384 12142257 12343330 12484860 12634566 12707692 12839658 13060494 13241156 13448890 13731544 13947633
6374A3947633J23841J61224K53481q8498J34778L12958J17157J77239N6409J82098
6364A5378320J81362O8522J45248L30680K45064K50873J53289K28038L08966L71119
6354A7661481L62945K81342K17214M25326M42277N17461N52147M24647N65606
6345B1450446M36406M84659O86875N61726N76654P81911P57298P58133P37016
6336B7231124Q28608R75645R71354R18132J067258J176469J317162J177485J187982
6327C6851219J308482J608831J665071J675128K266872K625007K661941K739439
6319E3401990K336489J611435J033814Q67084R06252J393246J677098K059030
6311F5286438K282950K085527J500266R92601Q74331R13408J181946J550415J936365
$$ plain form
6374 13947633 14071474 14232698 14486179 14397681 14532459 14845417 14962574 15139813 15196222 15378320
6364 15378320 15559682 15628204 15773452 16104132 16349196 16600069 16753358 16981396 17290362 17661481
6354 17661481 18024426 18305768 18522982 18948308 19390585 19908046 20460193 20884840 21450446
6345 21450446 21886852 22371511 23058386 23620112 24196766 24978677 25735975 26494108 27231124
6336 27231124 28059732 29035377 30006731 30924863 31992121 33168590 34485752 35663237 36851219
6327 36851219 38159701 39768532 41433603 43108731 45375603 48000610 50662551 53401990
6319 53401990 55738479 57349914 58383728 59250812 60157064 61550310 63227408 65286438
6311 65286438 67569388 69654915 71155181 72147782 73022113 73935521 75117467 76667882 78604247
6302G8604247K305168K887975K903478K249246J610196J102384J178030J431976
6294I4272700K008700K998732M268131N954523P454695Q039268P327530M455566
6286A36779845N04937l412317n940121o414408o115776n297340m214248l124694
6278A02765878k069243r67446M4601Q88923J772482K845970M264270N562716N999790
6269A21107941M989156L190571J737099L98247j580487m535618o827986p942101
6261A10536822p737515p170901o284018n105417l969828l149744k225616j250177
6253G3643606p79543k98565L21618M90378R84683J317920J663198J884785K133126
6244H1361206K335854K671537L238322L748513M606098N297677O330817O834582
$$ plain form
6302 78604247 80909415 83797390 86700868 88950114 90560310 91662694 92840724 94272700
6294 94272700 96281400 99280132 103548263 109502786 116957481 124996749 132324279 136779845
6286 136779845 137284782 133872465 127932344 121517936 115402160 110104820 105890572 102765878
6278 102765878 100696635 99729189 99773790 100662713 102435195 105281165 109545435 115108151 121107941
6269 121107941 126097097 129287668 131024767 131423014 129842527 125306909 118478923 110536822
6261 110536822 102799307 95628406 89344388 84238971 80269143 77119399 74893783 73643606
6253 73643606 72864063 72565498 72887116 73377494 74362177 75680097 77343295 79228080 81361206
6244 81361206 83697060 86368597 89606919 93355432 97961530 103259207 109590024 116424606
6236A16424606O576601M998202L001635J280179m03293k430666m524478n897237
6228A19025549o240969n740804m961602m124098l032377k139041j224062n96686
6220I0965910K64479J295036K514432L979870N285892N377223M478385J878710
6212A16039937j432036m101284o278835o912968p092545o479135n505133m442817
6204G3795184l387494k376811j760911j725123j968313k237190k414344k301998
6196E5623000k128263j729830j179828q34456n16235m48411p61579j357839j761692
6187D4904867j852597j674181j340942r99908q31764q40430r50092j357603j706783
6178C3350567j943487j971591j838595j453529j378715j291223j054530q35492
$$ plain form
6236 116424606 123001207 127999409 131001044 132281223 131877930 129447264 124922786 119025549
6228 119025549 112784580 107043776 102082174 97958076 94925699 92786658 91562596 90965910
6220 90965910 91230389 92525425 95039857 99019727 104305619 109682842 114161227 116039937
6212 116039937 114607901 110506617 104227782 97314814 90222269 83743134 78238001 73795184
6204 73795184 70407690 68030879 66269968 64544845 62576532 60339342 57924998 55623000
6196 55623000 53494737 51764907 50585079 49750623 49234388 48785977 48024398 46666559 44904867
6187 44904867 43052270 41378089 40037147 39037239 38205475 37365045 36414953 35057350 33350567
6178 33350567 31407080 29435489 27596894 26143365 24764650 23473427 22418897 21583405
6170B1583405r09906p82180q47040m75756m46757o66411n46111n68952n71459
6161A5768833m08954m47330l13248l13655l87277j70454m28834j76664j04159
6152A3018258j57657j70730k81590k29722j37747k79136k75792j77736k68592
6143A1039556p2699j23760l09261k17940m548m8444j38544j76067k08776j41479
6133I598038j36609k73002k09691p4907j70506j91413l39646k63379k22178l23609
6123G393098k69007o4172k82850j46991j47082j74296j11513n2328j09248q8746
6113E946865q4004j04675j9517j93970j28745q7604o5666j19476L7254p7649j00227
6102E002586k38355o3314J11591L3670j57437o0165K8156j28683K3217p9183m8449
$$ plain form
6170 21583405 20673499 19891319 19044279 18568523 18121766 17455355 16909244 16340292 15768833
6161 15768833 15359879 14912549 14599301 14285646 13898369 13727915 13299081 13122417 13018258
6152 13018258 12860601 12689871 12408281 12178559 12040812 11761676 11485884 11308148 11039556
6143 11039556 10966857 10843097 10533836 10315896 10311348 10262904 10124360 9948293 9739517 9598038
6133 9598038 9461429 9188427 8978736 8903829 8733323 8541910 8202264 7938885 7716707 7393098
6123 7393098 7124091 7059919 6777069 6630078 6482996 6308700 6197187 6144859 6035611 5946865
6113 5946865 5862861 5758186 5738669 5544699 5415954 5328350 5262684 5143208 5180462 5102813 5002586
6102 5002586 4764231 4700917 4812508 4846178 4688741 4628576 4656732 4528049 4551266 4472083 4423634
6091D423634R213l8839k4217j4632r8051Q451O9403j6028q4479P367j4750o1064
6079D166008p8105O2291q8342J10293J88168n1347j15650q954l6527n1535K0476
6068D116776j17374r4373P2098j0471p578k0028Q181J7580k9515j1720N2901n0756
6056C925721N1643j14607r9987R9801J8934k4311N4318n562j24999o8614o6796
6045C645541K5258O3367o1191N0589K4812j64863l4981m884O7118M2604J0289
6034C663659n4867J68026K34748k00358j94349K02804K9352K7358j8703L0187
6024C887857J16200J2747J50680l9580J02310l525j40003O3179p8139O1613J12448
6013D245787l6957P481J56386L831j53171n5153J11777j7294K6969J00948M3869
$$ plain form
6091 4423634 4432847 4394008 4369791 4355159 4257108 4265559 4334962 4318934 4234455 4241822 4227072 4166008
6079 4166008 4087903 4150194 4061852 4172145 4360313 4308966 4193316 4184362 4147835 4096300 4116776
6068 4116776 3999402 3905029 3977127 3966656 3959078 3939050 3947231 3964811 3935296 3923576 3976477 3925721
6056 3925721 3977364 3862757 3762770 3862571 3881505 3857194 3911512 3905950 3780951 3712337 3645541
6045 3645541 3670799 3734166 3672975 3723564 3748376 3583513 3548532 3543648 3610766 3653370 3663659
6034 3663659 3608792 3776818 4011566 3811208 3616859 3819663 3849015 3876373 3857670 3887857
6024 3887857 4004057 4016804 4167484 4127904 4230214 4226689 4086686 4149865 4071726 4133339 4245787
6013 4245787 4208830 4216311 4372697 4376528 4223357 4168204 4279981 4262687 4289656 4390604 4434473
6002D434473M4883J80749k3974J2996J70678O3620M9689P1769M3291K7799K764
5991E078737P9825J59482K37169J14465O5928N5054K2139J17267q6016j28335
5981E715715m5467J06480J18354J52763J98340J18328J6888l6918J82073L69927
5971F896483K31329J63436J97925J89077K68289J71780J6036K11272K50811J89244
5961H785682N9285K85487L94973J74842L03309L88698L06459L39143M04555L47264
5951A1789697M10744L02673K48972J24063j28617l54561l65732m52670m82261
5942A1092308l91428m32143m23806m44472n28088l81654k95600k04070k75620
5933G715427m02487j68434k77043j73787j15386o5754j01980o6831p353j00335
$$ plain form
6002 4434473 4479356 4660105 4636131 4649127 4819805 4883425 4933114 5004883 5048174 5075973 5078737
5991 5078737 5158562 5318044 5555213 5669678 5735606 5790660 5812799 5930066 5844050 5715715
5981 5715715 5670248 5776728 5895082 6047845 6246185 6364513 6381401 6344483 6526556 6896483
5971 6896483 7127812 7291248 7489173 7678250 7946539 8118319 8134355 8345627 8596438 8785682
5961 8785682 8844967 9130454 9525427 9700269 10003578 10392276 10698735 11037878 11442433 11789697
5951 11789697 12200441 12503114 12752086 12876149 12747532 12392971 12027239 11574569 11092308
5942 11092308 10700880 10268737 9844931 9400459 8872371 8490717 8195117 7991047 7715427
5933 7715427 7312940 7144506 6867463 6693676 6578290 6512536 6410556 6343725 6336372 6236037
5923F236037j36872N6563J5501k05561k6003j53855j85238o0314j38031j02493
5913E299734o126l1687M780j06595o4149M029q0941n510o2051J5897J17344N5755
5901E140480q8696m6354J62444J6725P5101k6498o6783m5259O7467J7471K8185
5890E234283m9272R6281J13171j6976J07054N703j2237n3561n0197o7779P8797
5879E385267J56166M7340j61656k6058n7601k3432K1382q2794M7760K9155K5857
5868E361386j54374K7231M9419k51676j66645P2516P5834q3812k9256n812l4422
5857D860389j590K1663j22093o2378L4448n425J5219M6395J0117k7713l3804p9986
5845D655242m373J35337q604K6908P5427L9810l6240O8355J1312J25437k6913
$$ plain form
5923 6236037 6099165 6155728 6171229 5965668 5939665 5785810 5600572 5540258 5402227 5299734
5913 5299734 5293608 5261921 5266701 5160106 5095957 5099986 5019045 5013535 4951484 4967381 5084725 5140480
5901 5140480 5051784 5005430 5167874 5184599 5259700 5233202 5166419 5121160 5188627 5206098 5234283
5890 5234283 5185011 5281292 5394463 5377487 5484541 5490244 5478007 5424446 5374249 5306470 5385267
5879 5385267 5541433 5588773 5427117 5401059 5343458 5320026 5341408 5258614 5306374 5335529 5361386
5868 5361386 5207012 5234243 5283662 5031986 4865341 4937857 5013691 4929879 4900623 4894811 4860389
5857 4860389 4858799 4880462 4758369 4695991 4730439 4725014 4740233 4786628 4796745 4769032 4735228 4655242
5845 4655242 4650869 4786206 4777602 4804510 4879937 4919747 4883507 4951862 4963174 5088611 5061698
5834E061698L4497J30179k2855L6165J2649n1410P5520m0690j0157J02779M0439
5823E368814R7592j6640M456J5125n3529N0249J31874o5105l5099L8612o4087
5812E472262m693p4383J7791m4117J43598K01281N5508l1967Q577J81396p117
5801E918136k3126J41686M8487m1984o8094J5271r9526M6331N1300J37624J35804
5790F261909j46262L036m3096L9000J74494R4018L0333K40800J3282p2875N6110
5779F650749O6017P3262N8628J46606J65804j16102r6509K7863K74356J34486
5769G385160m0103J04999K88195R8986J90319J10355j2917M8494M8065J94269
5759H415822R8075Q3706N6136Q4219J14488k131J29757q265P4753k149J59577
$$ plain form
5834 5061698 5096195 5226374 5203519 5239684 5252333 5200923 5276443 5235753 5225596 5328375 5368814
5823 5368814 5466406 5449766 5454222 5469347 5415818 5466067 5597941 5532836 5497737 5536349 5472262
5812 5472262 5467569 5393186 5410977 5366860 5510458 5711739 5767247 5735280 5743857 5925253 5918136
5801 5918136 5895010 6036696 6085183 6043199 5975105 5990376 5890850 5937181 5988481 6126105 6261909
5790 6261909 6115647 6118683 6075587 6114587 6289081 6383099 6413432 6654232 6667514 6594639 6650749
5779 6650749 6716766 6790028 6848656 6995262 7161066 7044964 6948455 6976318 7250674 7385160
5769 7385160 7345057 7450056 7738251 7837237 8027556 8137911 8124994 8173488 8221553 8415822
5759 8415822 8513897 8597603 8653739 8737958 8852446 8850315 8980072 8971807 9046560 9044411 9203988
5748I203988L22864r037Q3512R1040M7104K29196J27553n8859R8351R4770P171
5737A0237653J44310J35493R0274J32096J00461l4060L22014P2305P1939N5319
5727A1327804j3028J72488l9377J48641J91453J39331J23469M6538K57341J68112
5717A2522772l4328J4633l8103K1611o7349N7246r8478k23321l2739m6681k05288
5706A1869975M3149J00074Q860p2841P519J5939O8059J92911k5856j31135J78443
5695A2255097J33988M5817N9460J9079N2324J84966J21538K24083J53558P5188
5685A3325098o744m6217n5862M0352k149J4734o9170K2841O4855J40051J55745
5674A3583534p0876J13918K22163J07556J60169K44310R7280J80321J39679J48042
$$ plain form
5748 9203988 9526852 9517815 9601327 9692367 9739471 9968667 10096220 10037361 10135712 10230482 10237653
5737 10237653 10381963 10517456 10607730 10739826 10840287 10806227 11128241 11200546 11272485 11327804
5727 11327804 11314776 11487264 11447887 11596528 11787981 11927312 12050781 12097319 12354660 12522772
5717 12522772 12488444 12503077 12464974 12486585 12419236 12476482 12378004 12154683 12121944 12075263 11869975
5706 11869975 11913124 12013198 12022058 11949217 11956736 11972675 12040734 12233645 12207789 12076654 12255097
5695 12255097 12389085 12434902 12494362 12513441 12565765 12750731 12872269 13096352 13249910 13325098
5685 13325098 13318354 13272137 13216275 13256627 13254478 13269212 13200042 13222883 13287738 13427789 13583534
5674 13583534 13512658 13626576 13848739 13956295 14116464 14360774 14458054 14638375 14778054 14926096
5664A4926096P257K52462K02400J16031R3578K18537K67083K22373L02345M06763
5654A7014925J51904M6066L59907L71552K57759K48439J95857K69328M09286M15501
5644A9740524L67985L98340M90773M44440M87125L31408L53907N85570O01594
5635B3801666M66474M96130P01892P06366N90636P00079P36907P33606P40499
5626B9674255R25090Q02014Q40011Q64554R47540J034851J104801J073673J128944
5617C8395733J337341J491127J565572J750747J968936K098051K407696K213311
5609E3228514K337758K455057K641235K760367K997809L318211L567225L916882
5601G7223058L979214M212959M349231M298887M394102M596867M654024M648854
$$ plain form
5664 14926096 14933353 15185815 15388215 15504246 15597824 15816361 16083444 16305817 16608162 17014925
5654 17014925 17166829 17212895 17572802 17944354 18202113 18450552 18646409 18915737 19325023 19740524
5644 19740524 20108509 20506849 20997622 21442062 21929187 22260595 22614502 23200072 23801666
5635 23801666 24268140 24764270 25466162 26172528 26763164 27463243 28200150 28933756 29674255
5626 29674255 30599345 31401359 32241370 33105924 34053464 35088315 36193116 37266789 38395733
5617 38395733 39733074 41224201 42789773 44540520 46509456 48607507 51015203 53228514
5609 53228514 55566272 58021329 60662564 63422931 66420740 69738951 73306176 77223058
5601 77223058 81202272 85415231 89764462 94063349 98457451 103054318 107708342 112357196
5593A12357196M984738M980984N165044N346769N738743O080920O521583P046225
5585A58222202P563818Q052008Q377727Q804676R344363R704171Q932149P171962
5577B26173076L611651m769l162306n529301p219268q316286r101172r794437
5569A86657188j0142418j0352604j0055484r506380q732987p967544o867178o282903
5561A16749690n953877o008673o103135o078379n844428n814229n580199n249069
5553G0117701n152665m760230m432770m119774l589190l034244k830604k645932
5545C9552292k340145k114055j976151j778298j496771j433063j244113j179076
5537B5990620j150886j014786q31534o62865o62879n38900p12734o45586o50515
$$ plain form
5593 112357196 117341934 122322918 127487962 132834731 138573474 144654394 151175977 158222202
5585 158222202 165786020 173838028 182215755 191020431 200364794 210068965 219001114 226173076
5577 226173076 229784727 229779958 226617652 221088351 213869083 205552797 196451625 186657188
5569 186657188 176514770 166162166 156106682 146600302 137867315 129899771 123032593 116749690
5561 116749690 110795813 104787140 98684005 92605626 86761198 80946969 75366770 70117701
5553 70117701 64965036 60204806 55772036 51652262 48063072 45028828 42198224 39552292
5545 39552292 37212147 35098092 33121941 31343643 29846872 28413809 27169696 25990620
5537 25990620 24839734 23824948 22993414 22330549 21667670 21128770 20416036 19770450 19119935
5528A9119935l13711l98904m24649l66283l35057l26105k45458j75876l57281
5519A6176611j37830l04603l34793m17722l38425l03949k58889k98978j70148
5510A3611274k81782k22708j49661l42874k92106l87761j87932j37792P530j15183
5500A1501005j16332k15318j56998j05298j67139j30941j17000j65731p5160k09927
5490A0041161j79028k30535p5580j92434j8859o8677k63678k19330j17203r0480
5480H585357k40399k9360q1036m0298K6835j77010k40290r0680o8179m3729j98873
5469G402338j29501l9119j50050l10851M0876O3743j44520r7216p2337j67160
5459F396203P1633o0757r4536o7656m5811j28550m5963J5688p5820J2415o6253
$$ plain form
5528 19119935 18806224 18407320 17982671 17616388 17281331 16955226 16709768 16533892 16176611
5519 16176611 16038781 15734178 15399385 14981663 14643238 14339289 14080400 13781422 13611274
5510 13611274 13329492 13106784 12957123 12614249 12322143 11934382 11746450 11608658 11616188 11501005
5500 11501005 11384673 11169355 11012357 10907059 10739920 10608979 10491979 10326248 10251088 10041161
5490 10041161 9862133 9631598 9556018 9363584 9344725 9276048 9012370 8793040 8675837 8585357
5480 8585357 8344958 8315598 8234562 8194264 8221099 8044089 7803799 7713119 7644940 7601211 7402338
5469 7402338 7272837 7233718 7083668 6772817 6813693 6877436 6732916 6635700 6563363 6396203
5459 6396203 6467836 6407079 6312543 6244887 6199076 6070526 6024563 6040251 5964431 5976846 5910593
5448E910593l5228N5638j59555j97156j5762K7302p9236o9782o9545M6174M7207
5437E460650j13632Q081M4916J30961n7789m2680k7105o3016J37548K7m5830l0118
5425E402013J59584l4719q7330R6251J37690q586j72053r807m7455j990N5959
5414E489557J37502r858l6414L5285R7118j1510k9025J54954K39973m8179P1838
5403F091241J94655O3210J01906M3155N0401J20111L1589j58552j12904j74684
5393F250128k4989r8314o1320M9883L797p4883k1735m2340q2240O6118J25537
5382F089642k150m7430m9072O7444R9287Q9950L8093P1611K76096l1002R9523
5371F701992K27218N5230P1553J66518K61360L03695K71388K13239L20809K10986
$$ plain form
5448 5910593 5875365 5931003 5771448 5574292 5558530 5585832 5506596 5436814 5367269 5413443 5460650
5437 5460650 5347018 5355099 5400015 5530976 5473187 5430507 5403402 5340386 5477934 5477961 5432131 5402013
5425 5402013 5561597 5526878 5439548 5535799 5673489 5664903 5492850 5483043 5435588 5433598 5489557
5414 5489557 5627059 5617201 5580787 5616072 5713190 5701680 5672655 5827609 6067582 6019403 6091241
5403 6091241 6285896 6349106 6451012 6494167 6544568 6664679 6696268 6537716 6424812 6250128
5393 6250128 6225139 6126825 6065505 6115388 6119185 6044302 6022567 5980227 5897987 5964105 6089642
5382 6089642 6087492 6040062 5990990 6058434 6157721 6247671 6285764 6357375 6633471 6602469 6701992
5371 6701992 6929210 6984440 7055993 7222511 7483871 7787566 8058954 8272193 8593002 8803988
5361H803988J93649L81472M08398L13500L39636K76757O7798L33282M84236P66428
5351A2369144J354767J958558J402673O03964m01521j713073j769030j538016
5343A2267466j217447r47090q05961o84288o73151l29533k14493j99997k54593
5334F940913k68038j88878j56495P7944n3076j67455q0097j03920q2680q8283
5324E829935j39426q9455Q988m57j47122j4165l034n3393R4038l7952n8161M8498
5312E438294p0079Q3007Q6989R0040N9356m8899R339J30080J56641o9215j76310
5301E689243n9993J34675K3961N2080J69111N8469P3318n459k556l4003p4437
5290F024409k9660N0287J34282M6179j49346p3036O7115J3062J26172p936k4447
$$ plain form
5361 8803988 8997637 9379109 9787507 10101007 10440643 10717400 10785198 11118480 11602716 12369144
5351 12369144 13723911 15682469 17085142 17689106 17287585 15574512 13805482 12267466
5343 12267466 11050019 10102929 9296968 8612680 7939529 7609996 7395503 7195506 6940913
5334 6940913 6672875 6483997 6327502 6405446 6352370 6184915 6104818 6000898 5918218 5829935
5324 5829935 5690509 5601054 5610042 5609585 5462463 5448298 5445264 5391871 5485909 5447957 5389796 5438294
5312 5438294 5368215 5451222 5538211 5628251 5687607 5638708 5648047 5778127 5934768 5865553 5689243
5301 5689243 5629250 5763925 5787886 5839966 6009077 6067546 6140864 6135405 6132849 6098846 6024409
5290 6024409 5994749 6045036 6179318 6225497 6076151 6003115 6070230 6083292 6209464 6201528 6177081
5279F177081J49939O4638k0928J63637J64932q5567k22679J62564R382R9305J29771
5268F792075o409K0134J01154Q4013J114K9978q9233j31049j27752M1683l0396
5257F685312j10176j35367l8869O8848q2407Q1102j5218J09177j37743o7122n8517
5246F299020o1401J22858J715k1794o5320r7420M4619Q0207K0832J73050M5374
5235F541740M0990J19639J47511j6960Q8117P3346j00276k0791O4019K2012J95629
5224G154976J55958J24375N6040j6653J12676P6577O6807J65451K2536O4247Q0982
5213H063972R7779J51476Q4642L6574J85446K15812J42093n1075L865L0030l0299
5202H930315o6123q4348K370J64625J32712P9683M8194M8183K4701n6063R9637
$$ plain form
5279 6177081 6327020 6391658 6370730 6534367 6699299 6613732 6391053 6553617 6562999 6662304 6792075
5268 6792075 6785666 6805800 6906954 6990967 6992081 7022059 6932826 6801777 6674025 6715708 6685312
5257 6685312 6575136 6439769 6400900 6469748 6387341 6468443 6453225 6562402 6424659 6357537 6299020
5246 6299020 6237619 6360477 6362192 6340398 6275078 6177658 6222277 6302484 6323316 6496366 6541740
5235 6541740 6582730 6702369 6849880 6832920 6921037 6994383 6894107 6873316 6937335 6959347 7154976
5224 7154976 7310934 7435309 7491349 7474696 7587372 7663949 7730756 7896207 7918743 7982990 8063972
5213 8063972 8161751 8313227 8397869 8434443 8619889 8835701 8977794 8926719 8930584 8960614 8930315
5202 8930315 8864192 8779844 8782214 8946839 9079551 9159234 9207428 9255611 9280312 9224249 9323886
5191I323886J82406p5192J71328K70789Q0173k8834j33083n073K37237J21098
5181A0144735L1817J18305P7108J09991N9232N3322K42257K19960j4849J18576
5171A1160454L75689J86901J69950J78893n0938m3567K06447m7955M6443n0004
5161A2132313K33922K38899N6036J00686J07792K41096J27348K01208J89723P9632
5151A3708655J2356K7404J43210O8165J37165J32887J53475Q8935J03647K05208
5141A4781107K50693M02070M02581L04049L35086L08035N58757N14430L77124
5132A8233932L80385L68467N67274K90594N17642M73053L47239M10134M87784
5123B2076504N32320L51528N46957O90461N51236O11777N71186O27157M68408
$$ plain form
5191 9323886 9506292 9431100 9602428 9873217 9953390 9924556 9791473 9786400 10023637 10144735
5181 10144735 10176552 10294857 10371965 10481956 10541188 10594510 10836767 11056727 11041878 11160454
5171 11160454 11536143 11723044 11892994 12071887 12020949 11977382 12183829 12135874 12182317 12132313
5161 12132313 12366235 12605134 12661170 12761856 12869648 13110744 13238092 13439300 13629023 13708655
5151 13708655 13721011 13748415 13891625 13959790 14096955 14229842 14383317 14472252 14575899 14781107
5141 14781107 15031800 15433870 15836451 16140500 16475586 16783621 17342378 17856808 18233932
5132 18233932 18614317 18982784 19550058 19840652 20358294 20831347 21178586 21588720 22076504
5123 22076504 22608824 22960352 23507309 24197770 24749006 25360783 25931969 26559126 27027534
5114B7027534M98318M38221K44310M71030N20301L27987N02374O36281Q73165
5105C1539521J224004J298561J239930J397156J279375J351681J560141J488159
5097D2378528J158508J284152J226462Q08214J02458M37501J115676J692578J857948
5088E2062025K539310L965375O936971J0793370J4160509L962066o584675q406503
5080G9428448q741433p413472p147290o420924n648425m104046l030497k503565
5072C4418796j971889j327453j209959j044731r46073p01539p94569n64322o72883
5063B5185378k61118l65443m47531m74283m21609k91004k33320k51580l10691
5054B2128799k56416j35199j92041k66134n9934n1318o3052k1024n4698o8034
$$ plain form
5114 27027534 27525852 27964073 28208383 28679413 29199714 29527701 30030075 30666356 31539521
5105 31539521 32763525 34062086 35302016 36699172 37978547 39330228 40890369 42378528
5097 42378528 43537036 44821188 46047650 46855864 46958322 47395823 48511499 50204077 52062025
5088 52062025 54601335 58566710 65503681 76297051 90457560 94419626 87834951 79428448
5080 79428448 70687015 63273543 56126253 49705329 44056904 39952858 36922361 34418796
5072 34418796 32446907 31119454 29909495 28864764 27918691 27217152 26422583 25858261 25185378
5063 25185378 24924260 24558817 24111286 23637003 23215394 22924390 22691070 22439490 22128799
5054 22128799 21872383 21737184 21545143 21279009 21219075 21167757 21104705 21083681 21028983 20960949
5044B0960949j7140N9394l1541m1077j099J14617K08825P5254R3989J85670R5483
5033B1703324J90571J00172J09486J54551R5624L00635K72514J62267M90836M25230
5023B4005210L27839J07182M8019J42096J58859k9583J78424L64768K98333L04967
5013B5906114K27056J76309M08561N18011M13521M60619M95505N19830M91547
5004B9617073M27332L34133L55325N44870L67623M53776M09903M51867M90941
4995C3452843N51032M88462O31904O32446P27626Q91675N02631L20126L69117
4986C8567862L55331L30085M07194O65081O01571O32647R07284Q84998J070910
4977D4422963J271859J189867M93825N1434J62632N6752J39581N3151j00243o4813
$$ plain form
5044 20960949 20943809 21003203 20971662 20930585 20929486 21044103 21252928 21328182 21422171 21607841 21703324
5033 21703324 21893895 21994067 22103553 22258104 22353728 22654363 22926877 23089144 23579980 24005210
5023 24005210 24333049 24440231 24488250 24630346 24789205 24759622 24938046 25302814 25601147 25906114
5013 25906114 26133170 26309479 26718040 27236051 27649572 28110191 28605696 29125526 29617073
5004 29617073 30044405 30378538 30733863 31278733 31646356 32100132 32510035 32961902 33452843
4995 33452843 34003875 34492337 35124241 35756687 36484313 37375988 37878619 38198745 38567862
4986 38567862 38923193 39253278 39660472 40325553 40927124 41559771 42467055 43352053 44422963
4977 44422963 45694822 46884689 47378514 47429948 47592580 47649332 47788913 47842064 47741821 47677008
4967D7677008r7484M704K68155J0803J42077L29858M56636N82210N23109N79689
4957E0476765O45115Q71759Q79400J075162Q36913J021960J222320J114459J116928
4948E9260781Q57387J063534J028358R97510J031774J115746J214225J224118
4940F7793433J234810J210847J274403J331466J301978J660663J843801J913252
4932G9564653K099822K216160K425166K764946L096563L571520L827413M012403
4924A03578646M557096M666578N160008N549468O056689O459358O950558P247311
4916A50225712P671261P773365Q306418Q414864Q484993Q726373Q868785Q950400
4908B17422171R169482R301574R339514R592450J0172223J0889005J2358596J4055295
$$ plain form
4967 47677008 47579524 47584228 47852383 47863186 48005263 48335121 48791757 49373967 49897076 50476765
4957 50476765 51121880 51993639 52873039 53948201 54785114 55807074 57029394 58143853 59260781
4948 59260781 60118168 61181702 62210060 63207570 64239344 65355090 66569315 67793433
4940 67793433 69028243 70239090 71513493 72844959 74146937 75807600 77651401 79564653
4932 79564653 81664475 83880635 86305801 89070747 92167310 95738830 99566243 103578646
4924 103578646 108135742 112802320 117962328 123511796 129568485 136027843 142978401 150225712
4916 150225712 157896973 165670338 173976756 182391620 190876613 199602986 208471771 217422171
4908 217422171 226591653 235893227 245232741 254825191 264997414 275886419 288245015 302300310
4900C02300310J5565290J6967470J7776834J7536886J6300195J3294508Q553427
4893D08294920K732998l239363r335698j5882542k1920791k5395228k6968203
4886C08286093k6961227k5531986k3622334k1362315j8814388j6549985j4377550
4879A61066308j2243498j0556800q950784p411890o187382n169624m281421m006854
4871A02258055l585832l439079l510358l645627l212978l108670k832749k463061
4863G6459701k337827k243790j956463j961674j869933j702949j594238j538760
4855F1254067j450883r72420r72424p22191n81467m75981n10600l74942l62216
4846E4830943n42428m41143n65091n57659l40766k02408K113m17309l33060k93831
$$ plain form
4900 302300310 317865600 334833070 352609904 370146790 386446985 399741493 408294920
4893 408294920 411027918 407788555 398452857 382570315 360649524 335254296 308286093
4886 308286093 281324866 255792880 232170546 210808231 191993843 175443858 161066308
4879 161066308 148822810 138266010 129315226 121903336 115715954 110546330 106264909 102258055
4871 102258055 98672223 95233144 91722786 88077159 84864181 81755511 78922762 76459701
4863 76459701 74121874 71878084 69921621 67959947 66090014 64387065 62792827 61254067
4855 61254067 59803184 58830764 57858340 57136149 56554682 56078701 55568101 55193159 54830943
4846 54830943 54288515 53847372 53282281 52724622 52383856 52181448 52183561 51766252 51433192 51139361
4836E1139361o4201J39052J36562K31111J95907J14799K66820L31273M73293M96777
4826E3460754N47129O55602N97705J051486Q71532Q22649R69630R75074Q78376
4817F0829937J048542R77554R30433J211443J216038J508246J750212J625877
4809G1098282J739485J371275J013332N54236N11271M47584Q22547J240396J494158
4800H0292566J847680K096163K218919J915344J290620P98434j38405o93578j314106
4791H8313637j602236k053815k336144k531232k335638k306232k369089k164750
4783G0614501k030841j802110j797567j573343j240121j464900j435044j315631
4775E7954944j385618r91852r95984j095439r27869o81285n81280n93512p47054
$$ plain form
4836 51139361 51075160 51214212 51350774 51581885 51777792 51892591 52159411 52490684 52963977 53460754
4826 53460754 54007883 54663485 55261190 56312676 57184208 58006857 58976487 59951561 60829937
4817 60829937 61878479 62856033 63786466 64997909 66213947 67722193 69472405 71098282
4809 71098282 72837767 74209042 75222374 75776610 76287881 76735465 77558012 78798408 80292566
4800 80292566 82140246 84236409 86455328 88370672 89661292 90459726 90321321 89627743 88313637
4791 88313637 86711401 84657586 82321442 79790210 77454572 75148340 72779251 70614501
4783 70614501 68583660 66781550 64983983 63410640 62170519 60705619 59270575 57954944
4775 57954944 56569326 55577474 54581490 53486051 52558182 51876897 51295617 50702105 49955051
4766D9955051o62253n07755n28023n17079k81373k73865l51399l23588l26153
4757D6183563o9860r4169k1818L0229l0566j01437J21018M5179K06714K44506
4747D6513359K42647K48772J77121J60559J58691j3174J86603J25483K49743M22253
4737D8472057K98966L67042L23896M58093O67281M30855M88526N84209M78224
4728E2569149N42612N04179O89540P26564N58041O69705P70889J035322Q20995
4719E8886996J028377R49059J019273J392314J246691J200493J428325J682347
4711F8833875J799726J792400J981907K424881K605885K842338L303255L766795
4703H9351062M141279M493971M502531M854469N616883O992512P954805P892868
$$ plain form
4766 49955051 49292798 48785043 48257020 47739941 47458568 47184703 46833304 46509716 46183563
4757 46183563 46113703 46019534 45997716 46027945 45997379 45895942 46016960 46062139 46268853 46513359
4747 46513359 46756006 47004778 47181899 47342458 47501149 47487975 47674578 47800061 48049804 48472057
4737 48472057 48771023 49138065 49461961 49920054 50587335 51018190 51506716 52090925 52569149
4728 52569149 53111761 53615940 54305480 55032044 55590085 56259790 57030679 58066001 58886996
4719 58886996 59915373 60864432 61883705 63276019 64522710 65723203 67151528 68833875
4711 68833875 70633601 72426001 74407908 76832789 79438674 82281012 85584267 89351062
4703 89351062 93492341 97986312 102488843 107343312 112960195 119952707 127907512 135800380
4695A35800380P437072P143924P040291P575058Q017365Q434333Q580772Q793150
4687A98822345Q368419N597661K998610N726231Q447201J1385558J3536376J9305169
4679B74187570K9191171M5758987O4885951P3332296K4108236k8818499m3197501
4672D39448211m6147970m1718631m0060261l5974310l1737071k4091635j7410685
4665B02307648j2962416r901425o742936m892135k684645j598885j38275Q38068
4657A64224999K143339L206668M266180M418575M697691M965525N362322N324718
4649A98610017N755350N612453N654108N755336N642522M812462M384887M900486
4641B41127621O327641Q673720J1670192J4903439J8907888K2303808K4477914
$$ plain form
4695 135800380 143237452 150381376 157421667 164996725 173014090 181448423 190029195 198822345
4687 198822345 207190764 212788425 215787035 221513266 229960467 241346025 254882401 274187570
4679 274187570 303378741 349137728 414023679 487355975 511464211 482645712 439448211
4672 439448211 393300241 351581610 311521349 275547039 243809968 219718333 202307648
4665 202307648 189345232 179443807 172700871 167808736 165124091 163525206 163386931 164224999
4657 164224999 166368338 169575006 173841186 178259761 182957452 187922977 193285299 198610017
4649 198610017 204365367 209977820 215631928 221387264 227029786 231842248 236227135 241127621
4641 241127621 247455262 256128982 267799174 282702613 301610501 323914309 348392223
4634C48392223K7848313L0613515K4741936P717339r489453j8206133k1923445
4627C89694295k4667794k6486872k6841331k6286140k4498036k1691107j8081364
4620B21141651j4834419j1819382r022475o419607l485680j001969R36567R24316
4612A76419002j993950m968266o761184p815233q664320r334060r597158r293380
4604A17991451q832867q045008p189536o098464n286546m775083m041743l453798
4596G0268406l089631k820787k498766k077716j824784j734219j533089j633460
4588E3055954j429914j403288j183843j335278j245468j305644j373833j188891
4580D2589795j116159j050334r50430p98357o54877q35599p59481p27789p04004
$$ plain form
4634 348392223 376240536 406854051 431595987 439313326 429823873 411617740 389694295
4627 389694295 365026501 338539629 311698298 285412158 260914122 239223015 221141651
4620 221141651 206307232 194487850 185465375 179045768 175560088 174558119 175494686 176419002
4612 176419002 174425052 169456786 162695602 154880369 146216049 136881989 127284831 117991451
4604 117991451 109158584 101113576 93924040 87825576 82539030 77763947 73722204 70268406
4596 70268406 67178775 64357988 61859222 59781506 57956722 56222503 54689414 53055954
4588 53055954 51626040 50222752 49038909 47703631 46458163 45152519 43778686 42589795
4580 42589795 41473636 40423302 39472872 38674515 38019638 37184039 36424558 35696769 34992765
4571C4992765p66909o56301o21323o02722m71014j73447j72902j05256j25689
4562C1297202o1677l5822k83770o3636j18393l06084k60931r8184j36488j16283
4552B9815934j18733l44395n26489l71967k77812k12558j56402j05707j42033
4543B7559838j94097k08231O9341l9500J58219L14185L18997M45819M38191N14938
4533B9377700K73029J73529P7014J9312j44159R371j52370j18825k7334N7450
4523B9544717J58815L71270M33006L94928N07521O71991O25814N82945N53253
4514C3844260M43441O91933P98249O52552O07234K23485j44063k99502o05566
4505C6212023n05378n14016l67451l44008o65223m62915k92442k00917r7435m377
$$ plain form
4571 34992765 34225856 33569555 32948232 32345510 31874496 31701049 31528147 31422891 31297202
4562 31297202 31235525 31199703 30915933 30852297 30733904 30427820 30166889 30068705 29932217 29815934
4552 29815934 29697201 29352806 28826317 28454350 28176538 27963980 27807578 27701871 27559838
4543 27559838 27365741 27157510 27226851 27187351 27345570 27659755 27978752 28424571 28862762 29377700
4533 29377700 29650729 29824258 29901272 29920584 29776425 29785796 29633426 29514601 29487267 29544717
4523 29544717 29703532 30074802 30507808 30902736 31410257 32082248 32708062 33291007 33844260
4514 33844260 34287701 34979634 35777883 36430435 37037669 37261154 37117091 36817589 36212023
4505 36212023 35706645 35192629 34825178 34481170 33815947 33353032 33060590 32859673 32762238 32757861
4495C2757861P8050L23540J68734R883N2355J73458N95065J160783J114982J401116
4485C7835827J553030J970914K760324L317518K635484K66847j752740k802700
4477D5784504l321630l344831l342008l201501k751586k556097k174575j703392
4469B3388884j547952j231457j119940p41058q43157o63302l58770m96366l51028
4460A6035854m81892m64972k71440k76286k58194j59522j45054k00478k57870
4451A3520146j76301j55356k74188j67428k8974k5890k8921l3444O1723J66966
4441A2858333J06472L16799M06532J42161K86967N0279l9880k10036j58010k11606
4431A3548011j87787k05330j76505j11679n0227k4834K01735J24575K05857L81931
$$ plain form
4495 32757861 32835911 33159451 33328185 33338068 33390423 33563881 34158946 35319729 36434711 37835827
4485 37835827 39388857 41359771 44120095 47437613 50073097 50339944 48587204 45784504
4477 45784504 42462874 39118043 35776035 32574534 29822948 27266851 25092276 23388884
4469 23388884 21840932 20609475 19489535 18748477 17905320 17242018 16883248 16386882 16035854
4460 16035854 15553962 15088990 14817550 14541264 14283070 14123548 13978494 13778016 13520146
4451 13520146 13343845 13188489 12914301 12746873 12717899 12692009 12663088 12629644 12691367 12858333
4441 12858333 12964805 13281604 13688136 13830297 14117264 14167543 14127663 13917627 13759617 13548011
4431 13548011 13360224 13154894 12978389 12866710 12816483 12791649 12993384 13117959 13323816 13705747
4421A3705747K78652J49005K8319j83911n4571k54732j95218k73400k55967k89646
4411A2654278j81949j02727k37018J3542J33703M7058M7531J75451M8665o4323
4401A2534211j19125p6711o0003R829l3619l8175r1137o5726j50809k43798k7793
4390A1637144j14813l70821l17555j54935j50442k03975q2513k30643j09280O1162
4380I963329m4430n4046p4387j81102j89817Q7280j14421l14116r3806k5139m1386
4369H917959J2053r2333q8524o2048P8265O3404k5067P50Q1339L13799K83539
4358I483136J93880p1841r0091j78370l09762m32462j57953o4469j2487j19395
4348H240186J8829k4400m271j84395R0591N6585n4257M5831M4831K3008r2352
$$ plain form
4421 13705747 13984399 14133404 14161723 13977812 13923241 13668509 13473291 13199891 12943924 12654278
4411 12654278 12472329 12369602 12132584 12146126 12279829 12326887 12374418 12549869 12598534 12534211
4401 12534211 12415086 12338375 12278372 12288201 12254582 12216407 12125270 12059544 11908735 11664937 11637144
4390 11637144 11522331 11151510 10833955 10679020 10528578 10324603 10242090 10011447 9902167 9963329
4380 9963329 9918899 9864853 9790466 9609364 9419547 9506827 9392406 9078290 8984484 8959345 8917959
4369 8917959 8930012 8837679 8749155 8687107 8765372 8828776 8803709 8804459 8885798 9199597 9483136
4358 9483136 9677016 9605175 9515084 9336714 9026952 8594490 8436537 8372068 8359581 8240186
4348 8240186 8259015 8234615 8230344 8045949 8136540 8193125 8138868 8184699 8229530 8252538 8160186
4337H160186O8030M7912k01354m5003J91587J34643J79593P8023J05107R1940
4327H810664q538j66868l781o1027j2484Q3283j3403r0069N0158k29576k73341
4316H085018k32528k08287j36035j1212j0959O1944r2516j88282M1792L2996j00867
4305G241064J8561k2124q2578j05639K6195j06926m2202P9631J92060N6663j19731
4294G134974O1138q9068k222K5078J00299j1639J00269J33136K14681l8727K8949
4283G656868L54763L92510L25922Q09011R55265k79755n19070m43114m18143k63014
4273H571243l52347n91972m13138m31074m59473k08757r9112j53449j07643n7224
4263E697054j67315k5563l7444j18134j00778n877O5122j22012k20410m0413j11131
$$ plain form
4337 8160186 8228216 8276128 8074774 8029771 8221358 8356001 8535594 8613617 8718724 8810664
4327 8810664 8802126 8635258 8631477 8570450 8557966 8641249 8627846 8537777 8587935 8358359 8085018
4316 8085018 7852490 7644203 7508168 7496956 7485997 7547941 7455425 7267143 7308935 7341931 7241064
4305 7241064 7259625 7237501 7154923 7049284 7075479 6968553 6926351 7005982 7198042 7254705 7134974
4294 7134974 7196112 7107044 7104822 7129900 7230199 7218560 7318829 7451965 7666646 7627919 7656868
4283 7656868 8011631 8404141 8730063 9539074 10494339 10214584 9695514 9252400 8834257 8571243
4273 8571243 8218896 7626924 7213786 6782712 6323239 6114482 6015370 5861921 5754278 5697054
4263 5697054 5529739 5504176 5466732 5348598 5247820 5241943 5307065 5185053 4964643 4924230 4813099
4252D813099p8222j8348Q1748P0968M8962k7908r8848o7551Q493L7703j04830
4241D665266K1494l8904R532K5230o1477l4596o5861R5400J02855L3624l9807
4230D712756K9615N150k52084J8022M0048K4064q2912j0632L8319j9880J73368
4219D675834m6393N1576o1257P3621J28605l0744o5511n3521k481Q5743J9493
4208D774965n0359O9732J16494m3614J150M6507L1118j79378O3607J26767M2198
4197D999187k42733P5242N335k0223j67202O5563L7539L6077K6128p5710j3322
4186D725881N5950J85914j4022k1516m8578j0031P7877Q1753L954M7571K6879
4175E111632Q7265J01380r5226j08923m6359K7236M4386M9058K16219J01316J06756
$$ plain form
4252 4813099 4734877 4716529 4798277 4869245 4918207 4890299 4791451 4723900 4732393 4770096 4665266
4241 4665266 4686760 4647856 4657388 4682618 4621141 4586545 4520684 4616084 4718939 4752563 4712756
4230 4712756 4742371 4747521 4495437 4513459 4553507 4577571 4494659 4484027 4522346 4502466 4675834
4219 4675834 4629441 4681017 4619760 4693381 4821986 4791242 4725731 4672210 4669729 4755472 4774965
4208 4774965 4724606 4794338 4910832 4867218 4868368 4914875 4945993 4766615 4830222 4956989 4999187
4197 4999187 4756454 4831696 4837031 4816808 4649606 4715169 4752708 4788785 4814913 4739203 4725881
4186 4725881 4781831 4967745 4953723 4932207 4883629 4873598 4951475 5033228 5037182 5084753 5111632
4175 5111632 5198897 5300277 5205051 5096128 5049769 5077005 5121391 5170449 5386668 5487984 5594740
4164E594740J09747J29198J23264P8585J10077M5744j18312K9901K4119J4894
4154F141957j92880q8201j20184P3194j33489q8279l0469N1382P0325k083P3751
4143E755024J43723r0504O7825m4241P9432J71702K22050Q6139Q1925J67632J49856
4132F790563J32125J77980J20181j01908L1393M6585k22086k63465j83790n3578
4122F474000l9617j13562k56515M2674N3944m1903l679k2054j20233J5619Q187
4111E996861J78244J91913J8066J99657k2439l190j6768J8528m3056p3026k8832
4100F415958O2113k2808r2453J4803N5582J39536r1842J3051r1204k22900L9911
4089F219747n1227k4093p453l6551o3812j6590j70465n046J39056R8771n8043
$$ plain form
4164 5594740 5704487 5833685 5956949 6035534 6145611 6191355 6073043 6102944 6127063 6141957
4154 6141957 5949077 5860876 5740692 5813886 5680397 5592118 5561649 5613031 5683356 5681273 5755024
4143 5755024 5898747 5808243 5876068 5831827 5911259 6082961 6305011 6391150 6473075 6640707 6790563
4132 6790563 6922688 7100668 7220849 7118941 7150334 7196919 6974833 6711368 6527578 6474000
4122 6474000 6434383 6320821 6064306 6106980 6160924 6119021 6115342 6093288 5973055 5988674 5996861
4111 5996861 6175105 6367018 6385084 6584741 6562302 6559112 6542344 6560872 6517816 6444790 6415958
4100 6415958 6478071 6455263 6362810 6377613 6433195 6572731 6480889 6493940 6402736 6179836 6219747
4089 6219747 6168520 6144427 6136974 6100423 6036611 6020021 5849556 5844510 5983566 6082337 6024294
4078F024294J49922j19525j11912n0790O5488m6735J8209m09j63657r8788K806
4067E668903p2198j2372j29268o0663p9373k6289o3538m9123N139m2269j0957
4056E127992l9572l6474N8628L3572m1441K2852K3594J14609m0268k3190J09589
4045E309891J70355n291J7942l5243o8621J07020J26503M0355J56430J03132j11591
4034E810882n2618J66190O9099M868k0070N3893J09777L7641p1717q0826P3137
4023F100256j4215j72274m2473J6523k5516J02799J89172J4688K015J21237P7973
4012F370185J9150k4694m191J2437m3438k09834J2233K2570J06806j2939q7144
4001F161141J87489K38306L61786K02950N4951p2751k47942r9284l9505j96432
$$ plain form
4078 6024294 6174216 6054691 5942779 5891989 5957477 5910742 5928951 5928542 5764885 5666097 5668903
4067 5668903 5596705 5584333 5455065 5394402 5315029 5288740 5225202 5176079 5181218 5138949 5127992
4056 5127992 5088420 5051946 5110574 5144146 5102705 5125557 5149151 5263760 5223492 5200302 5309891
4045 5309891 5480246 5474955 5492897 5457654 5389033 5496053 5622556 5662911 5819341 5922473 5810882
4034 5810882 5758264 5924454 5993553 5998421 5978351 6032244 6142021 6179662 6107945 6027119 6100256
4023 6100256 6086041 5913767 5871294 5887817 5862301 5965100 6154272 6168960 6170975 6292212 6370185
4012 6370185 6389335 6364641 6360450 6372887 6329449 6119615 6131848 6154418 6261224 6248285 6161141
4001 6161141 6348630 6586936 6948722 7151672 7206623 7133872 6885930 6786646 6747141 6550709
3991F550709k2954j09327k28154j3022j78602j00038J00558K6243p5123Q7960
3981F038250j3856p0451k39680m6967m4964j29466n2107K0585K9259J046r537
3970E482112q7101J498M4919l5388J07654j19053n5524Q2173k4352k3242k00497
3959E173199j40366j867Q8383j30675r262j5641J21037P7099m7623m8660q9027
3948D976597o4786j9913P4839J16574j15871J03327J7837O1099J55528J1725j59762
3937E157194j8048n3413J47183L9692q5709R4788P6189j339J11385R213l12084
3926E165051o7455R5321M5200M7219Q7141N0694J26760P9671J7011k1363M51J8219
3914E643920k2584L0844L147J04946M4853o5335Q4083k5959P3275J47949m5120
$$ plain form
3991 6550709 6527755 6418428 6190274 6177252 5998650 5898612 5999170 6025413 5950290 6038250
3981 6038250 6024394 5953943 5714263 5667296 5622332 5492866 5440759 5461344 5490603 5491649 5482112
3970 5482112 5395011 5396509 5441428 5406040 5513694 5394641 5339117 5421290 5396938 5373696 5173199
3959 5173199 5032833 5030966 5119349 4988674 4979412 4963771 5084808 5161907 5114284 5065624 4976597
3948 4976597 4911811 4891898 4966737 5083311 4967440 5070767 5088604 5149703 5305231 5316956 5157194
3937 5157194 5139146 5085733 5232916 5272608 5186899 5281687 5357876 5356537 5467922 5477135 5165051
3926 5165051 5097596 5192917 5238117 5285336 5372477 5423171 5549931 5629602 5646613 5625250 5625701 5643920
3914 5643920 5621336 5652180 5655327 5760273 5805126 5739791 5823874 5797915 5871190 6019139 5974019
3903E974019L8786k7438P664R5564J00576r3957p6803J02483J60161J2167j3281
3892F279941p467K7749J15557J6809N8656j4252l4287J25609J31568k0244r8806
3881F580833o9897K6837N1045r869M2695o5762j8348J63432J14932j2438o4697
3870F738763j17580J35956j06567l7396P8553j5288R4110J3313J21447O8176Q8900
3859G062387r0113M7318m5931q268Q2121O1876j2789k2610l7241q0351o4941M9354
3847F940812J34121J27231J6537j39716j11119K8187J11860K5452R7780n0812
3837G180333K8065J1900n395j8669j74341j2525M5068J01658p3798k0005p5022
3826F987269J95999j25642M6941O6619j15500j07033m8230l1598l9546L557O9303
$$ plain form
3903 5974019 6012805 5985367 5993031 6088595 6189171 6095214 6018411 6120894 6281055 6293222 6279941
3892 6279941 6272474 6300223 6415780 6432589 6491245 6476993 6442706 6568315 6699883 6679639 6580833
3881 6580833 6510936 6537773 6588818 6578949 6621644 6555882 6537534 6700966 6815898 6803460 6738763
3870 6738763 6621183 6757139 6650572 6613176 6691729 6676441 6770551 6783864 6905311 6973487 7062387
3859 7062387 6972274 7019592 6973661 6965393 7047514 7109390 7096601 7073991 7036750 6956399 6891458 6940812
3847 6940812 7074933 7202164 7218701 7078985 6967866 6996053 7107913 7133365 7231145 7180333
3837 7180333 7208398 7220298 7214903 7196234 7021893 7009368 7054436 7156094 7082296 7062291 6987269
3826 6987269 7183268 7057626 7104567 7171186 7055686 6948653 6900423 6868825 6829279 6832836 6902139
3815F902139o1344j89062J35720j14904j67220P2153l2643k8983Q6861R2591m8528
3804F646780Q5509l4478p7551J16015Q9591j05823m9987p5179l1305N6801n6438
3793F563935m9848J12866J20955n5834P182r4918P2961R894o0988J2425J62395
3782F801025J8880L540j50578p4262K03073Q8011M419J36935o3285Q1423L1427
3771G080608n0798q064P8440Q3911k6240J8802l4329o1463J27148J2865p1912
3760G148968P5045J24343K161k8169j5861k7417N9838J10317L2159P2044N5491
3749G608919J07183L0759q5254J2567l8195J98979J92530Q6827n6411J5417J51069
3738H224390l6775J6747P4553o7061L700P9567R5204l3769j0686j2785q8742R783
$$ plain form
3815 6902139 6840795 6651733 6787453 6672549 6505329 6577482 6544839 6515856 6602717 6695308 6646780
3804 6646780 6732289 6697811 6620260 6736275 6825866 6720043 6670056 6594877 6563572 6620373 6563935
3793 6563935 6514087 6626953 6747908 6692074 6699256 6604338 6677299 6687193 6626205 6638630 6801025
3782 6801025 6819905 6823445 6672867 6598605 6801678 6889689 6894108 7031043 6967758 7049181 7080608
3771 7080608 7029810 7021746 7100186 7184097 7157857 7176659 7142330 7080867 7208015 7220880 7148968
3760 7148968 7224013 7348356 7350517 7322348 7306487 7279070 7338908 7449225 7481384 7553428 7608919
3749 7608919 7716102 7746861 7661607 7674174 7635979 7834958 8027488 8114315 8057904 8073321 8224390
3738 8224390 8187615 8204362 8278915 8211854 8215554 8295121 8390325 8356556 8345870 8333085 8244343 8254126
3726H254126J10148J104J27949K9174r2289p9996J6349J53502K2308J09634N0933
3715H702942m746J82726P9026J23654P5505M9864M7387o4231P2552K01815O5571
3704I532065J41361K00457J11652K3139k55157j06071o0611j31981l8423l7069
3694I379362j13580l6617q7630r0631R6758l8604M9323J4969O594J37304m6100
3683I271148Q3331j57430m4061L51258k5932K3394O2024m6522J37574J14824K25698
3672I995306R12j9644J57587j5814n2272j45011r9198q6657M8613m2691r0232
3661I650899K15725j69453q2629n3832j3989R7506q6335m9600J28621N3769k5019
3650I665663k4877L7953k9557l9398P5371J90399m1801P9054K4918J9340k0341
$$ plain form
3726 8254126 8364274 8365378 8493327 8522501 8430212 8350216 8366565 8520067 8542375 8652009 8702942
3715 8702942 8698196 8880922 8959948 9083602 9159107 9208971 9256358 9192127 9264679 9466494 9532065
3704 9532065 9673426 9873883 9985535 10008674 9753517 9647446 9586835 9454854 9416431 9379362
3694 9379362 9265782 9229165 9141535 9050904 9147662 9109058 9158381 9173350 9179944 9317248 9271148
3683 9271148 9354479 9197049 9152988 9504246 9478314 9501708 9563732 9517210 9654784 9769608 9995306
3672 9995306 9996218 9976574 10134161 10118347 10066075 9921064 9821866 9735209 9783822 9741131 9650899
3661 9650899 9866624 9697171 9614542 9560710 9546721 9644227 9557892 9508292 9636913 9690682 9665663
3650 9665663 9640786 9678739 9649182 9609784 9685155 9875554 9833753 9912807 9937725 9957065 9936724
3639I936724N2487j2726n2831k7420J6710J59184J10963J16552K1438r87K5089
3628A0345183O0138O6104J13926J18934J26072k8384K14146O8539M9541M4398
3618A1178597M9829Q092j56J56291J55800m0813Q4934P9963j351J65288J68878
3607A2005352l5386J27631J68560m1489r9586K14182J89531k510N3440J78380
3597A2758105L9123J38483R1929J34931J22109K58357K25717j9403J45931O3029
3587A3958311J37484j25589o242N8839p054J48184L9009P6546R3276J02231J24000
3576A4598995K14150N6114L962J58188O3503Q6773K24067R6286J740J94572K68160
3565A5966510K65727P2986M9129J44296K27677K07762L10170J75268J60559K14919
$$ plain form
3639 9936724 9989211 9976485 9923654 9896234 9912944 10072128 10183091 10299643 10321081 10320094 10345183
3628 10345183 10405321 10471425 10585351 10704285 10830357 10801973 11016119 11084658 11134199 11178597
3618 11178597 11228426 11236518 11236362 11392653 11548453 11507640 11592574 11672537 11671186 11836474 12005352
3607 12005352 11969966 12097597 12266157 12224668 12125082 12339264 12528795 12526285 12579725 12758105
3597 12758105 12797228 12935711 13027640 13162571 13284680 13543037 13768754 13749351 13895282 13958311
3587 13958311 14095795 13970206 13963964 14022803 14015749 14163933 14202942 14279488 14372764 14474995 14598995
3576 14598995 14813145 14869259 14873221 15031409 15094912 15181685 15405752 15502038 15503778 15698350 15966510
3565 15966510 16232237 16305223 16354352 16498648 16726325 16934087 17244257 17419525 17580084 17795003
3555A7795003J26511K66734Q1974K41422N3224K84345J68392K17129L01048J77976
3545A9713758K78997J76145L60701L00280L11197L11633L02258K42709J47533
3536B2145211K43292K59996M15947N25111L00121M16603K72653L43581O91450
3527B5613965M51058L00856L03992N44875N07246L41411M43836N58237N41005
3518B9606481O38980P48671P47653O45221N57217O21065O31021O07755N25386
3509C5329450O83077N82213P53012Q79494O79533Q47002J081724R46709J154611
3500D2936825J117690J024705J132280J211362J181669J402760J306905J423101
3492E2737297J405494J355129J341769J479518J375193J300038J386961J421447
$$ plain form
3555 17795003 17921514 18188248 18270222 18511644 18564868 18849213 19017605 19234734 19535782 19713758
3545 19713758 19992755 20168900 20529601 20829881 21141078 21452711 21754969 21997678 22145211
3536 22145211 22388503 22648499 23064446 23589557 23889678 24306281 24578934 24922515 25613965
3527 25613965 26065023 26365879 26669871 27214746 27721992 28063403 28507239 29065476 29606481
3518 29606481 30245461 30994132 31741785 32387006 32944223 33565288 34196309 34804064 35329450
3509 35329450 36012527 36594740 37347752 38227246 38906779 39753781 40835505 41782214 42936825
3500 42936825 44054515 45079220 46211500 47422862 48604531 50007291 51314196 52737297
3492 52737297 54142791 55497920 56839689 58319207 59694400 60994438 62381399 63802846
3484F3802846J488746J465367J405289J656596J417564J529957J757512J879356
3476G6403233J862638J832895K028199J837563J686215J400800Q54832Q1736k69843
3467H7718268r31276j401905j483940j841908k013925k229490k471320k143854
3459G3200650k576456k478249k216848k099546j896150j840650j536155j493695
3451E7062901j358666j424032j246682j252333j192026j209722j212998r33397
3443D7233045j043061j080160q82468q27536r43747p86448q66430q57944q55047
3434C9090204o96820p56225q14271o91488p26886p61898n60904n91704n45348
3425C2944660o16570p24773o26837m48406m21323n36302m80778l54415l47271
$$ plain form
3484 63802846 65291592 66756959 68162248 69818844 71236408 72766365 74523877 76403233
3476 76403233 78265871 80098766 82126965 83964528 85650743 87051543 87906375 87988111 87718268
3467 87718268 86786992 85385087 83901147 82059239 80045314 77815824 75344504 73200650
3459 73200650 70624194 68145945 65929097 63829551 61933401 60092751 58556596 57062901
3451 57062901 55704235 54280203 53033521 51781188 50589162 49379440 48166442 47233045
3443 47233045 46189984 45109824 44227356 43399820 42456073 41669625 40803195 39945251 39090204
3434 39090204 38393384 37637159 36822888 36131400 35404514 34642616 34081712 33490008 32944660
3425 32944660 32328090 31603317 30976480 30528074 30106751 29570449 29089671 28735256 28387985
3416B8387985l66428m66563k94740k66155l19601j12731K7965R7505O327k59703
3406B6433861n07502n42681m35037n90709l21433k27402m15029m08267l30433
3397B2655368j09517j48540j58471j88128k75633j67234P172q5861j55760k61502
3387B1111894j06660j4912p7247k0728j34365M8664q5811m1984J51154M10295
3377B1240300M88041K74390j68525m83671o50770o60477m01974l30989l30768
3368A8975557l55524l31072l76405K9850j36289j60861j93966l09691j8637p7805
3358A7045157j51484k19952k00067R6838j78462o6409J1801k2539j68107n7487
3348A6089289j846O7219R0467J47120K19614k70598j89020k64051m23603l59010
$$ plain form
3416 28387985 28021557 27554994 27260254 26994099 26674498 26561767 26589732 26687237 26693564 26433861
3406 26433861 25926359 25383678 24948641 24357932 24036499 23809097 23394068 22985801 22655368
3397 22655368 22545851 22397311 22238840 22050712 21775079 21607845 21615017 21529156 21373396 21111894
3387 21111894 21005234 20990322 20913075 20892347 20757982 20806646 20720835 20678851 20830005 21240300
3377 21240300 21728341 22002731 21834206 21350535 20699765 20039288 19637314 19306325 18975557
3368 18975557 18620033 18288961 17912556 17942406 17806117 17645256 17451290 17141599 17122962 17045157
3358 17045157 16893673 16673721 16473654 16570492 16392030 16325621 16337422 16314883 16146776 16089289
3348 16089289 16087443 16154662 16245129 16392249 16611863 16341265 16152245 15888194 15464591 15105581
3338A5105581k32846j26913j49993k06136j41386k0500o2190j70784n1815o4432
3328A3878586j59668R7472l1894M0332r3560k10615l9582k4347k7746q8572j04624
3317A3235782K9851J18430n4526n059q6997q1131Q4796r7179j37147k00761L8898
3306A2844957r672j48278l5153j22981J7676n4871n1953j39239m4075o6082M815
3295A2195144N4697m4489m7805n5110q5385j82368n09k8343o1610J3019j92027
3284A1565214J5384K4282k03023P1302O8934p7673l8935q5482j00888k2508j46705
3273A1069902J21230o66j49086K9155l346l4898K4361j84151j38120K09924j93476
3262A0750829J4903J98413r3343r4896q3066j53014K21071R8696j10264L8108
$$ plain form
3338 15105581 14872735 14745822 14595829 14389693 14248307 14227807 14165617 13994833 13943018 13878586
3328 13878586 13718918 13816390 13784496 13824828 13731268 13520653 13481071 13456724 13428978 13340406 13235782
3317 13235782 13265633 13384063 13329537 13324478 13237481 13156350 13241146 13143967 13006820 12806059 12844957
3306 12844957 12835285 12687007 12651854 12528873 12546549 12491678 12439725 12300486 12256411 12190329 12195144
3295 12195144 12249841 12205352 12157547 12102437 12017052 11834684 11834175 11805832 11744222 11757241 11565214
3284 11565214 11580598 11604880 11401857 11473159 11542093 11464420 11425485 11340003 11239115 11216607 11069902
3273 11069902 11191132 11190466 11041380 11070535 11067189 11032291 11056652 10872501 10734381 10944305 10750829
3262 10750829 10765732 10964145 10870802 10775906 10692840 10539826 10760897 10859593 10749329 10787437
3252A0787437P3786J72227M1885j10118O4623j64846j0251n1984k9377Q2740p1848
3241A0784274j04394m7205O0215o5862k3065J22951l190L1895J31747j60507J14036
3230A0840895J38299m6801J31813J30681K3621K7988J26412J09584P5126O7054
3220A1624672J12577R6606J4991O6622Q5670j31819p1783n6757J6194P8396J88781
3209A2024150M2995M1214J44922M6974J46154J54879J20879J19096Q4528J75678
3199A3101469M1450N6389J71992K27128K55478j6368J12051J84841J94198j6790
3189A4311838J84521p035Q8672L57420J53620J61038K24974J91568K60429J04483
3179A6031528L54431K59791K51538K66741M15043J97794L42839L28953K50279
$$ plain form
3252 10787437 10861223 11033450 11075335 10965217 11029840 10864994 10854743 10802759 10773382 10856122 10784274
3241 10784274 10679880 10632675 10692890 10627028 10603963 10726914 10723724 10755619 10887366 10726859 10840895
3230 10840895 10979194 10932393 11064206 11194887 11218508 11246496 11372908 11482492 11557618 11624672
3220 11624672 11737249 11833855 11848846 11915468 12001138 11869319 11797536 11740779 11756973 11835369 12024150
3209 12024150 12067145 12108359 12253281 12300255 12446409 12601288 12722167 12841263 12925791 13101469
3199 13101469 13142919 13199308 13371300 13598428 13853906 13837538 13949589 14134430 14328628 14311838
3189 14311838 14496359 14489324 14577996 14935416 15089036 15250074 15475048 15666616 15927045 16031528
3179 16031528 16385959 16645750 16897288 17164029 17579072 17776866 18119705 18448658 18698937
3170A8698937L21147L37183M54697K83129M43967M49118M01622L99431N09032
3161B2298263N48688M71855M74586N97712O41673N24031M02350K36589M54142
3152B6649889N76564N45643L70819M00937M41560M14326M83464L90558M38482
3143C0712242N24263N18015L85040L05967M55867O05905N93769P88987N75642
3134C5465697P40623Q80041J043866Q72955R47460P83417Q18212Q26113L24711
3125D2703095J51710l7304k65610k51191j86011m15056l75602k71980m79237k66439
3115D0306375j36009k10048j09471N3121Q7496J73363K51562L26525K25839K24990
3105D1193743J83805L43071J63037K6402J3263k03056j67638l47695m28582n07588
$$ plain form
3170 18698937 19020084 19357267 19811964 20095093 20539060 20988178 21389800 21789231 22298263
3161 22298263 22846951 23318806 23793392 24391104 25032777 25556808 25959158 26195747 26649889
3152 26649889 27226453 27772096 28142915 28543852 28985412 29399738 29883202 30273760 30712242
3143 30712242 31236505 31754520 32139560 32445527 32901394 33507299 34101068 34890055 35465697
3134 35465697 36206320 37086361 38130227 39003182 39950642 40734059 41552271 42378384 42703095
3125 42703095 42854805 42817501 42551891 42300700 42114689 41699633 41324031 41052051 40572814 40306375
3115 40306375 40170366 39960318 39850847 39903968 39991464 40164827 40416389 40742914 40968753 41193743
3105 41193743 41377548 41720619 41883656 41910058 41923321 41720265 41552627 41204932 40776350 40268762
3095D0268762p69377r61371r02950q46007q71179q32909q32619r42831n95208
3086C2714311p16653p15148n89045m39506m23952m41096k19364n34703m88334
3077B8146510n30382l41282n26651n52702o26942q72919q53892n67374q17035
3068B2457331q14404p80565p44065q19720o65230o36941p04531n87296o21159
3059A6083420n15494m96666l44278n14617m13710l48115j32843m00099l67975
3050A2549623k57755l59709k12925j71520l47931l21074k60263k37774j68335
3041A0212337j50746l13577m04136l13599j08208j38574j81978l28136j21962
3032H151421r3438l7932j45231l16850j78838j13684J808l7291k08864q3984j66948
$$ plain form
3095 40268762 39499385 38538014 37635064 36789057 35917878 35084969 34252350 33309519 32714311
3086 32714311 31997658 31282510 30693465 30253959 29830007 29388911 29169547 28634844 28146510
3077 28146510 27616128 27274846 26748195 26195493 25568551 24695632 23841740 23274366 22457331
3068 22457331 21642927 20862362 20118297 19298577 18633347 17996406 17291875 16704579 16083420
3059 16083420 15567926 15071260 14726982 14212365 13798655 13450540 13317697 12917598 12549623
3050 12549623 12291868 11932159 11719234 11547714 11199783 10878709 10618446 10380672 10212337
3041 10212337 10061591 9748014 9343878 9030279 8922071 8783497 8601519 8273383 8151421
3032 8151421 8057983 8020051 7874820 7557970 7379132 7265448 7267256 7229965 7021101 6937117 6770169
3021F770169j59083j61979j27829j13401r7292J53885n7048j52594N0047j44261
3011E960614j97862m829J0589n9846q569j50581r6983R345k45546j29880o6419
3000E020033j12940o3215Q9926m2404k47503r2101j49131j33199J44986k908k21887
2989D189657P66j04329n3082P8816n8506k2152r8461m1909o6867L0355k8668O242
2977C831862j23837m3964j95108j1288P9175K301n0645k37262N4403K930o2685
2966C245882j3100k7530j20593J7963j0620L2169L8726k9537q7509J33042j34692
2955C044201p3758k808R9606n8904q9476l757j53530j19511M2253L020k3356n6475
2943B607505n0972M665p2650N1414R8901j02820l9996l7403j1513J20638o1876
$$ plain form
3021 6770169 6611086 6449107 6321278 6207877 6110585 6264470 6207422 6054828 6104875 5960614
3011 5960614 5762752 5757923 5768512 5708666 5700097 5549516 5452533 5461878 5216332 5086452 5020033
3000 5020033 4907093 4843878 4933804 4891400 4643897 4551796 4402665 4269466 4414452 4411544 4189657
2989 4189657 4190423 4086094 4033012 4111828 4053322 4031170 3932709 3890800 3823933 3854288 3825620 3831862
2977 3831862 3708025 3664061 3468953 3457665 3536840 3539141 3488496 3251234 3305637 3308567 3245882
2966 3245882 3232782 3205252 3084659 3102622 3092002 3124171 3162897 3133360 3045851 3178893 3044201
2955 3044201 2970443 2967635 3067241 3008337 2918861 2915104 2761574 2642063 2684316 2687336 2663980 2607505
2943 2607505 2556533 2561198 2488548 2539962 2638863 2536043 2496047 2458644 2447131 2567769 2505893
2932B505893K2479q0356K2975M9676M4042j95402J12674K4766o1240q6689J02970
2921B461788J61492j74336j99263j2436K7799K02982l2023q2193j2962m7276j03303
2910B190269L9723R0651p5016o6412n4255N9099N9937j60507o2410K9819Q9634
2899B140532J73732n3370j77494m0501J29603J232K176M7498n9535k6894p296
2888B129683O1707N7417j0168n7119q5458p0919k525L7816l4232k7571M7340j4751
2876B031220P5970l7748l5600O5101j15208l4653J03499l9271m5354J28233j4707
2865B081482j1916p9626K9387j69659q932M2650p2364J8979N0115j02342K00651
2854A978425M5394m8444j08266k4801o346k0235J42288K1595j32641N8727J42597
$$ plain form
2932 2505893 2528372 2448016 2470991 2520667 2564709 2369307 2481981 2506747 2445507 2358818 2461788
2921 2461788 2623280 2448944 2249681 2237245 2265044 2468026 2436003 2353810 2340848 2293572 2190269
2910 2190269 2229992 2320643 2245627 2179215 2124960 2184059 2243996 2083489 2021079 2050898 2140532
2899 2140532 2314264 2260894 2083400 2042899 2172502 2173734 2175910 2223408 2163873 2136979 2129683
2888 2129683 2191390 2248807 2238639 2181520 2096062 2025143 2022618 2060434 2026202 1998631 2045971 2031220
2876 2031220 2107190 2069442 2033842 2098943 1983735 1949082 2052581 2013310 1967956 2096189 2081482
2865 2081482 2069566 1989940 2019327 1849668 1840736 1883386 1811022 1830001 1880116 1777774 1978425
2854 1978425 2023819 1975375 1867109 1842308 1835962 1815727 1958015 1979610 1846969 1905696 2048293
2843B048293j40496m5521K4141l2259J47503l9022n1278j05900L2063J9157q6309
2832A770372R6499q3450J80054P8636l3030j74383l98j52928O1289M0635K8139
2821A811435Q4748j82942k0419K2053J2586j12994r5434O9030J12245L9768o940
2810A733136p3661n8948L8238j15989Q3210O4258o6362J8624L9838m5676o4123
2799A552545l8405Q8572J04539q1629K1291J8266j0350n8156l2851p5054K9097
2788A517865o7655R9k9888m8783K9022P7107j4742r0775P0216R3614L3699K5874
2776A595653P468k38186p3881O7845J11564r3563o4329J26299j1110j8655m0587
2765A368518K2813n7160j84319P753J44590K9334q0792P7839P342R4361j01722
$$ plain form
2843 2048293 1907797 1862276 1886417 1854158 2001661 1962639 1911361 1805461 1837524 1856681 1770372
2832 1770372 1866871 1783421 1963475 2042111 2009081 1834698 1834300 1681372 1742661 1783296 1811435
2821 1811435 1896183 1713241 1692822 1714875 1727461 1614467 1519033 1588063 1700308 1740076 1733136
2810 1733136 1659475 1600527 1638765 1522776 1605986 1670244 1603882 1622506 1662344 1616668 1552545
2799 1552545 1514140 1602712 1707251 1625622 1646913 1665179 1654829 1596673 1563822 1488768 1517865
2788 1517865 1450210 1450309 1420421 1371638 1400660 1477767 1463025 1372250 1442466 1536080 1569779 1595653
2776 1595653 1603121 1364935 1291054 1358899 1470463 1376900 1312571 1438870 1427760 1409105 1368518
2765 1368518 1391331 1334171 1149852 1157605 1302195 1331529 1250737 1328576 1335918 1430279 1328557
2754A328557o0476R5669m1583N6850o0806N6600o9902P2864L3518N4524K2945
2743A488760k17358j17147j5804R4490K8237j94062j31633P6952J31318P2236
2733A215989r7006K0258o23m7200J71925N9001r0752M1852l6831o9281l9520M2601
2721A170413m145p7005k017j46293P6822J34990N6102q4134J04264r3130j07644
2710A028223J4432P6974m5560M2476J61359k9155j15541j35570J28727m9474r9837
2699I77054M2775J438K45517j00841o7254P5298o8188j02574r4300J12839k0679
2688A001085j7736n5417l6586J23146j0224J4542K5654p2765K4852N893K4168
2677A026612m4119j04336o4984l2306j5284R4366j19270J09228L6624j8465P9748
$$ plain form
2754 1328557 1268081 1363750 1322167 1379017 1318211 1374811 1304909 1377773 1411291 1465815 1488760
2743 1488760 1271402 1154255 1138451 1232941 1261178 1067116 935483 1012435 1143753 1215989
2733 1215989 1118983 1139241 1138618 1091418 1263343 1322344 1231592 1273444 1236613 1167332 1127812 1170413
2721 1170413 1166268 1089263 1087246 940953 1017775 1152765 1208867 1124733 1228997 1135867 1028223
2710 1028223 1042655 1119629 1074069 1116545 1277904 1248749 1133208 997638 1126365 1076891 977054
2699 977054 1019829 1021267 1266784 1165943 1098689 1173987 1105799 1003225 908925 1021764 1001085
2688 1001085 983349 927932 891346 1014492 1004268 1018810 1044464 971699 996551 1002444 1026612
2677 1026612 982493 878157 813173 780867 765583 859949 740679 849907 886531 868066 947814
2666I47814j40658j665O6770j07932O4428J09259m958k11680K7396o8648J00490
2655G80616n917O1630j46635K2047m1810K0768J26544q5625j1590L2132l4432
2644G17728J6499J9633k2468P8128l3795J23084j7507o4107O8401o6216m3279
2633G76101N7943L5630j27852l9423O6402R3293K7990k7314O5315j20123r7353
2622G10609K0795l1652k6720J10391q1103j32131J32859M4001m7856Q8039j9508
2611G67724j2616r6603M340N333k711m0206J12410R0517O8957j35650j9198n1494
2599F90803J18085R1149k56034J9676R523N2805K9787M8388M0110l8796J65837
2588I71333k7342m7350m4705j62331m16R9291j3563N3192n8128J9212p3410N4096
$$ plain form
2666 947814 807156 805491 872261 764329 828757 938016 933058 721378 748774 680126 780616
2655 780616 774699 836329 689694 711741 669931 690699 817243 731618 720028 752160 717728
2644 717728 734227 753860 731392 809520 775725 898809 881302 817195 885596 819380 776101
2633 776101 834044 869674 741822 702399 768801 862094 890084 862770 928085 807962 710609
2622 710609 731404 699752 673032 783423 702320 570189 703048 747049 699193 787232 767724
2611 767724 755108 658505 662845 668178 665467 625261 737671 828188 897145 761495 742297 690803
2599 690803 808888 900037 644003 663679 673202 726007 755794 804182 844292 805496 971333
2588 971333 943991 896641 851936 689605 689189 788480 774917 828109 769981 789193 715783 769879
2576G69879j0739J0332r864r5690J37027J5879j45154J13850j01206j7396J22877
2565G89795p2016o5275n383P7585j9957j06302K09948J22544r3165j39571J3876
2554G12079P6090K3575O894m9123m6856k1746j26649R3536J32389p6977Q5916
2543H09128j52847j68522J93696J4568R1822J41188j83011j02232K8062N7244
2533G29096j11601R5820J73354j15893q3593K3097j3562J16445n6113p973l735
2522G45342K32226n6663k10098l9092M083L8599r0228q6442J54719l2344R031
2511F69133O2469n8339O1977M756R9948P915J5710Q2039K6603P5730j69836n9930
2499H18175K2853Q8804m6823Q8219n436q2360m8031m7599j5705J53220L5j26589
$$ plain form
2576 769879 759140 769472 759608 663918 800945 816824 671670 785520 684314 666918 789795
2565 789795 717779 652504 647121 724706 704749 598447 808395 930939 837774 698203 712079
2554 712079 788169 811744 818638 769515 722659 700913 574264 667800 800189 723212 809128
2543 809128 656281 487759 681455 696023 787845 929033 746022 643790 671852 729096
2533 729096 617495 713315 886669 770776 687183 710280 696718 813163 757050 749077 745342
2522 745342 977568 920905 710807 671715 675798 714397 624169 537727 692446 660102 669133
2511 669133 731602 673263 735240 739996 839944 847859 863569 945608 972211 1047941 878105 818175
2499 818175 841028 929832 883009 971228 965792 883432 835401 787802 772097 925317 925352 798763
2487G98763J59057n1612L6291J7128k0677P0506q6492r9669O2293P5729r469K5901
2475I77749O1287P552j01255L2815Q247q443P7728j7309q6616J3470J32714O4433
2463A162372p518j8376J9358K0431q2347j82722n5748M0490j17170J01405Q5774
2452I65949J05249J16343o2943p3338K9368n2876r2849J20581M5452m2382N201
2441A063755j0145K16035M737m7204n2837J8654J3189L2766n2549p3337j9180
2430A093884l865J3959K8250O2094J16431O4941o3875k006j66630m5528n1298
2419A046357J03071R1405J15376p1516l2705R6701m1132k2864J93435L143k1757
2408A459514j40955J27395Q2761J6606l2900K9173R0206Q2372m4816k5353m4128
$$ plain form
2487 798763 957820 906208 942499 959627 938950 1009456 922964 823295 885588 961317 951848 977749
2475 977749 1039036 1046588 945333 978148 986395 977952 1055680 1038371 951755 965225 1097939 1162372
2463 1162372 1154854 1136478 1155836 1176267 1093920 911198 855450 895940 778770 880175 965949
2452 965949 1071198 1187541 1124598 1051260 1080628 1027752 934903 1055484 1100936 1058554 1063755
2441 1063755 1053610 1269645 1274382 1227178 1174341 1192995 1206184 1238950 1186401 1113064 1093884
2430 1093884 1090019 1103978 1132228 1194322 1310753 1375694 1311819 1309813 1143183 1097655 1046357
2419 1046357 1149428 1240833 1356209 1284693 1251988 1348689 1307557 1284693 1478128 1481271 1459514
2408 1459514 1318559 1445954 1528715 1545321 1512421 1541594 1631800 1714172 1669356 1644003 1599875
2397A599875J3050j01228J11794J42407l2423q173K4950J17031o4669l1610J96030
2386A967034n4411j20114R6800J87313j06854j54266K09471k5278M3797K25762
2376B269254J55550M9893K1863M7864Q2769J81308J12643J26674L8776Q3847p9675
2365C090766J49939K53282J24569K75886J43066J37509J87943L89586L60060M31585
2355E544191M53107L83851M61033L64523L47171M14153L06855M05354N19282M97919
2345I697439N24994R8539k15073j75820r5390K15776M44653M10108O06559N84119
2335A2095904R39815J445819J878801K791592N014483L086472j448478k415833
2327B3388575k123822j084270k06722k24739j650804j778172k017758j818348
$$ plain form
2397 1599875 1612925 1511697 1623491 1765898 1733475 1725302 1750252 1867283 1802614 1771004 1967034
2386 1967034 1912623 1792509 1889309 2076622 1969768 1815502 2024973 1999695 2043492 2269254
2376 2269254 2424804 2474697 2496560 2544424 2627193 2808501 2921144 3047818 3086594 3170441 3090766
2365 3090766 3240705 3493987 3618556 3894442 4037508 4175017 4362960 4752546 5112606 5544191
2355 5544191 5997298 6381149 6842182 7206705 7553876 7968029 8274884 8680238 9199520 9697439
2345 9697439 10222433 10320972 10105899 9930079 9834689 10050465 10495118 10905226 11511785 12095904
2335 12095904 13035719 14481538 16360339 19151931 24166414 27252886 25804408 23388575
2327 23388575 21264753 20180483 19973761 19749022 18098218 16320046 14302288 12483940
2319A2483940j731483j508261j068940r21373q52855o37642o23025m10883l09010
2310D420468l21890l21857l25519k62793r5084j63818k58951j78866k19534j66089
2300B106067j36384j87812m8459l1324j41466j51137J1231J7464p8539k3044Q5123
2289A421720k10644j24945L5492r410p6340k4235L333p4745N0240p8772l5638
2278H76056m2730R6040n4677j02208o9200r426k5612P0851p1737R6406m794r0433
2266F68536j24797r125k0005M0726l8244Q8965l7552L47K9078n5832o0375N9692
2254E41414p6836M3766R2906q2301k3506N3480n4389J01705O2916j1503k3236
2243F24416o4002n5121j10604k7556N6518J4046p9225K38082k1901m7223K6784
$$ plain form
2319 12483940 10752457 9244196 8175256 7253883 6401028 5763386 5140361 4729478 4420468
2310 4420468 4098578 3776721 3451202 3188409 3093325 2929507 2670556 2491690 2272156 2106067
2300 2106067 1969683 1781871 1733412 1702088 1560622 1409485 1420716 1438180 1359641 1336597 1421720
2289 1421720 1211076 1086131 1121623 1112213 1035873 1011638 1014971 940226 990466 911694 876056
2278 876056 833326 929366 874689 772481 703281 693855 668243 739094 667357 763763 758969 668536
2266 668536 543739 534614 514609 555335 517091 606056 568504 568851 597929 542097 481722 541414
2254 541414 464578 508344 601250 518949 495443 548923 494534 596239 659155 647652 624416
2243 624416 560414 505293 394689 367133 423651 437697 358472 596554 574653 527430 554214
2232E54214k5187K5909j2905k9627L3969k23996Q7246K1208r5595O0389J20659
2221E16284J0624j68850M746R0945M8226k1166J0568o9059J5343m5248O266l8416
2209C60263L9271p0903l5123k838J8395J5193P286n0459j12642J21991P4459Q6746
2197D51639N006j19065M5023J7561j8456o9413j2431M6416m2021l5909L8996N3457
2185C60803P725Q1300l2835k3397o0170j7581o3560k6847K4573M6384J3302M7454
2173C57151q2316j8565J586R8142J26093n094o4131q161j46038o9093K4234p4457
2161A39351J06256K0308K3716J28279J33931j10671j36675L7653J1984J2988n4681
2150C12439M5265k3759m0197l720r6571L2504m8963K5524J99162P8864j63094
$$ plain form
2232 554214 529027 554936 542031 512404 546373 322377 409623 430831 335236 395625 516284
2221 516284 526908 358058 362804 453749 501975 480809 491377 422318 437661 392413 398679 360263
2209 360263 399534 328631 293508 290670 309065 324258 331544 281085 168443 290434 364893 451639
2197 451639 456645 337580 382603 400164 381708 312295 299864 346280 304259 268350 307346 360803
2185 360803 368528 449828 416993 393596 333426 315845 252285 225438 250011 296395 309697 357151
2173 357151 274835 256270 257856 355998 482091 476997 412866 404705 258667 189574 213808 139351
2161 139351 245607 265915 289631 417910 551841 441170 304495 342148 354132 367120 312439
2150 312439 357704 333945 293748 290028 193457 225961 176998 202522 401684 480548 317454
2139C17454o1984l5719k5231J20512J03813p2591m5794J0871J02008R3298k0092
2128D86545k6803j61456j0981J08677k20987l7696o6264L4806J39307N4042Q44
2117C00034j1597l927o9833Q4879m6019J6561K6178n2821K2436O5059p4920R397
2105B65427j1192J4563n5822M2170J58553K6333j18865q7345K6298Q549K6261
2094B94930K6440R403J48147l6518q0029n5578J2316p4798P3313M9164m0454l1331
2082B95005q0157l088O9384P940j21255K0850N5210Q5168P564O5736P9382k3042
2070D58697p3738j6493k8310P2841q7010J24356J816M674o837O4333k28144p7417
2058B08768J14066R0227j07559q362n172n0742k6829r5649J14786j0588o5733
$$ plain form
2139 317454 255470 219751 194520 315032 418845 346254 300460 311331 413339 506637 486545
2128 486545 459742 298286 287305 395982 174995 137299 71035 105841 245148 299190 300034
2117 300034 288437 284510 214677 299556 253537 270098 296276 243455 265891 330950 256030 265427
2105 265427 254235 268798 212976 255146 413699 440032 321167 233822 260120 268669 294930
2094 294930 321370 330773 478920 442402 362373 306795 319111 244313 317626 366790 326336 295005
2082 295005 214848 211760 281144 289084 167829 188679 243889 329057 336621 402357 481739 458697
2070 458697 384959 368466 340156 412997 325987 450343 452159 456833 449996 514329 286185 208768
2058 208768 322834 413061 305502 297140 291968 241226 214397 118748 233534 222946 157213
2047A57213n2468J20613J8852J00912L4186o144m8965n6705M062o3726P0268J4435
2035B92533m061Q3987n4795j16568n0382J23815m3360N9488K4698o0948j03794
2024A50613M1053J25j284o6277j12120J00918N9358j39665R7650l7761N6937j7783
2012A31764n1630J00227O5627Q9213L0025k23797k2616J06620n998J00524p2293
2001B47666j66133Q3212L1102k8790k1463l3282K6771r6733R2379O2170R362N6721
1989B62982J05182p8766o0321j76145L0950J08711M6774o9910k1859q3455o5056
1978i13K917m8904J39333P8380k8583q0182o1327O3939J9855M0215R3468J01098
1966C19296j61743o5609J62632m6405l6896K8789K3059J28334o1052q138N9336
$$ plain form
2047 157213 104745 225358 244210 345122 379308 373164 324199 267494 271556 207830 278098 292533
2035 292533 288472 372459 317664 201096 150714 274529 231169 290657 315355 254407 150613
2024 150613 191666 191791 190507 124230 12110 113028 172386 32721 130371 92610 149547 131764
2012 131764 80134 180361 245988 335201 365226 141429 118813 225433 219435 319959 247666
2001 247666 81533 164745 195847 167057 145594 112312 139083 42350 134729 196899 206261 262982
1989 262982 368164 289398 229077 52932 83882 192593 239367 169457 147598 64143 -913
1978 -913 2004 -46900 92433 170813 142230 62048 721 64660 84515 124730 218198 319296
1966 319296 157553 91944 254576 208171 171275 200064 223123 351457 290405 282267 341603
1955C41603j4913N2838j34202j2236j65053p0189N4068L0745J45926O3681k8878
1944B63390n7659P6388K1018l4843k5620j06412r8665O5428r2897j8492J06959
1933I8595R6485q4258j36241Q9238J00642J3878M7675L9696m9314n8940K3024
1922A80480q5470O5210M7679J7463Q7587k1526J7499j06913j57871R224J17205
1911A70567M8583l1866J1939j19600j00284O2678J70205J31362j18032l2136m2076
1900A51340j3177J0540n4691L4738Q1955L0164j4m00R6315j87859K7425j26392
1888D9944n6667J27224J5023O3920m5188l4024J11934k0194p235R564j19819o8028
1876B6454m420P8426m442P9764O4013p4871Q97N680O5729r6832m2240J15748p6308
$$ plain form
1955 341603 326690 379528 245326 233090 68037 -2152 51916 82661 228587 292268 263390
1944 263390 205731 282119 303137 268294 242674 136262 37597 103025 10128 -8364 98595
1933 98595 195080 110822 -25419 63819 164461 178339 226014 265710 216396 157456 180480
1922 180480 95010 160220 207899 225362 312949 291423 308922 202009 44138 53362 170567
1911 170567 219150 187284 199223 79623 -20661 42017 212222 343584 225552 193416 151340
1900 151340 138163 148703 94012 128750 210705 240869 240855 240455 336770 148911 176336 49944
1888 49944 -6723 120501 135524 199444 154256 120232 232166 211972 204737 214301 94482 26454
1876 26454 22034 100460 96018 175782 239795 164924 165821 171501 237230 140398 98158 213906 137598
1863A37598k0301J05921j10731j14263J26027P0461Q2800j66953o0221j4720o2647
1852b7029J08931n4439m605J18635k7465P6832j04758p4486K1118J00965j45800
1841a2101n4055R5013j54228P5317J15250p4702l7061L8773k3745L2723O0762
1830F1946J13564K4179j18317j1963L2741K119n8219l4035J07111O403m4748j33907
1818e3126K21938Q6690j35242M6109p4452k1385O7111L9095p3948j66Q0304L60
1806A83288j04451j03071k9346L404K25307O4027j70468N2405K1259R905J03145
1795B55404q9740n2151p6728R1625o460q282k8621q0489K09424r6676m5857J4294
1783H5743K1675p887j48807J12494O054J8819O566o3341L5876p463m8363P3017
$$ plain form
1863 137598 117297 223218 112487 -1776 124251 194712 277512 110559 50338 35618 -27029
1852 -27029 81902 27463 22858 141493 114028 190860 86102 11616 32734 133699 -12101
1841 -12101 -66156 28857 -125371 -50054 65196 -9506 -46567 -7794 -31539 1184 61946
1830 61946 175510 199689 81372 69409 102150 104269 46050 12015 119126 125529 80781 -53126
1818 -53126 168812 255502 120260 166369 91917 70532 137643 176738 102790 102624 182928 183288
1806 183288 78837 -24234 -53580 -50176 175131 239158 68690 121095 142354 152259 255404
1795 255404 165664 113513 36785 128410 121950 113668 85047 4558 213982 117306 71449 85743
1783 85743 107418 99531 -49276 63218 69272 88091 94657 31316 67192 59729 11366 84383
1771H4383o2516l3337M978L7113J68317q7980o9987k865L6425j4660m6331M3115
1759E6655l9298J0879j2875K5144j2694K4100r291m4757O6829j13691J21022N5639
1747A27662L3583P7045j2215j25439J4061P2428j21710L8370N974j25198m2769
1736e8208O2025R1133K5031q2446L1829m3764k1402R2000l1344N8309O2865R1847
1724B77875j17608r1007J6269j4437Q452o104K4235P8182L4570m6990n3988j04189
1712E260p606J50361j3606J20268K740J9716q0627j02440K3213R3373m3474O0189
1700B27367n7482L7516j5846j02297N908M820P3007n746m1786p3044P2746o5995
$$ plain form
1771 84383 21867 -11470 -6492 30621 198938 110958 40971 38106 74531 59871 13540 56655
1759 56655 17357 28236 15361 40505 27811 51911 42620 -2137 64692 -48999 72023 127662
1747 127662 161245 238290 226075 100636 114697 187125 65415 103785 109759 -15439 -58208
1736 -58208 3817 94950 119981 37535 69364 25600 4198 96198 64854 123163 186028 277875
1724 277875 160267 69260 85529 71092 79544 73440 97675 175857 210427 163437 109449 5260
1712 5260 -2346 148015 134409 254677 257417 277133 196506 94066 117279 210652 167178 227367
1700 227367 169885 207401 191555 89258 95166 99986 172993 167247 125461 52417 125163 59168
$$ [...]
##END NTUPLES=NMR SPECTRUM
##END=
