##TITLE=1H_DE-80H_X3
 200.13MHz, d2o
 8 sc
 
 19ns.26.2.2025
##JCAMPDX= 6.0         $$ Bruker NMR JCAMP-DX V2.0
##DATA TYPE= NMR SPECTRUM
##DATA CLASS= NTUPLES
##ORIGIN= UXNMR, Bruker Analytische Messtechnik GmbH
##OWNER= pz
$$ XWIN-NMR		Version 3.5
$$ Mon Sep 29 13:30:25 2025 Russian Standard Time (UT+4h)  Yarkov@DPX200
##.OBSERVE FREQUENCY= 200.1313
##.OBSERVE NUCLEUS= ^1H
##.ACQUISITION MODE= SIMULTANEOUS
##.ACQUISITION SCHEME= undefined
##.AVERAGES= 8
##.DIGITISER RES= 18
##SPECTROMETER/DATA SYSTEM= spect
##.PULSE SEQUENCE= zg30
##.SOLVENT NAME= CDCl3
##.SHIFT REFERENCE= (INTERNAL, CDCl3, 0, 15.4836)
##AUDIT TRAIL= $$ (NUMBER, WHEN, WHO, WHERE, WHAT)
$$ ##TITLE= Audit trail, XWIN-NMR		Version 3.5
$$ ##JCAMPDX= 5.01
$$ ##ORIGIN= Bruker BioSpin GmbH
$$ ##OWNER= Yarkov
$$ C:/Bruker/XWIN-NMR/data/yarkov2/nmr/H-C/1/pdata/1/auditp.txt
$$ ##AUDIT TRAIL=  $$ (NUMBER, WHEN, WHO, WHERE, WHAT)
(   1,<2025-09-29 13:29:26.45 +0400>,<Yarkov>,<DPX200>,
      <created by zg, POWCHK disabled, PULCHK disabled
       configuration hash MD5:
       00 E9 B6 7A A2 85 ED C7 34 08 36 98 17 FE 4E 26
       data hash MD5: 16K
       A5 23 B9 7C 8E 46 CE 8A 1C 44 74 D8 34 D5 75 49>)
(   2,<2025-09-29 13:29:32.70 +0400>,<Yarkov>,<DPX200>,
      <Start of raw data processing
       efp BC_mod = 2 LB = 0.25 FT_mod = 6 PKNL = 1 PHC0 = -2074.233 PHC1 = 19.79097 SI = 16K 
       data hash MD5: 16K
       2A C1 D7 61 DB 0E 71 D7 7A 35 0D F2 59 18 E0 D2>)
(   3,<2025-09-29 13:29:41.37 +0400>,<Yarkov>,<DPX200>,
      <abs ABSG = 5 
       data hash MD5: 16K
       3C 64 00 8D 17 62 EB 6D 82 7E 93 75 35 C1 03 83>)
(   4,<2025-09-29 13:29:52.06 +0400>,<Yarkov>,<DPX200>,
      <pk PHC0 = -4.62151 PHC1 = -3.6 
       data hash MD5: 16K
       1C B0 C3 68 13 81 92 BD 89 C5 A2 94 A6 CC 81 00>)
$$ ##END=
$$ 
$$ hash MD5
$$ 04 52 7C 3B 7E 0F 28 7A 49 23 AD 55 CB 9F FD 2A
##$RELAX= 
##$RELAX= 
##$RELAX= 
##$RELAX= 
##$RELAX= 
##$RELAX= 
$$ Bruker specific parameters
$$ --------------------------
##$DU= <C:/Bruker/XWIN-NMR>
##$EXPNO= 1
##$NAME= <H-C>
##$PROCNO= 1
##$TYPE= <nmr>
##$USER= <yarkov2>
##$AMP= (0..31)
100 100 100 100 100 100 100 100 100 100 100 100 100 100 100 100 100 100 
100 100 100 100 100 100 100 100 100 100 100 100 100 100 
##$AQSEQ= 0
##$AQ_mod= 1
##$AUNM= <au_zg>
##$AUTOPOS= <>
##$BF1= 200.13
##$BF2= 200.13
##$BF3= 200.13
##$BF4= 200.13
##$BF5= 200.13
##$BF6= 200.13
##$BF7= 200.13
##$BF8= 200.13
##$BYTORDA= 1
##$CFDGTYP= 0
##$CFRGTYP= 5
##$CHEMSTR= <none>
##$CNST= (0..31)
1 1 145 1 1 1 1 1 1 1 1 1 1 1 1 1 1 1 1 1 1 1 1 1 1 1 1 1 1 1 1 1 
##$CPDPRG= <>
##$CPDPRG1= <>
##$CPDPRG2= <>
##$CPDPRG3= <>
##$CPDPRG4= <mlev>
##$CPDPRG5= <mlev>
##$CPDPRG6= <mlev>
##$CPDPRG7= <mlev>
##$CPDPRG8= <mlev>
##$CPDPRGB= <>
##$CPDPRGT= <>
##$D= (0..31)
0 0.7 0 0 0 0 0 0 0 0 0 0.03 0 0 0 0 0 0 0 0 0 0 0 0 0 0 0 0 0 0 0 0 
##$DATE= 1759138165
##$DBL= (0..7)
120 120 120 120 120 120 120 120 
##$DBP= (0..7)
150 150 150 150 150 150 150 150 
##$DBP07= 0
##$DBPNAM0= <>
##$DBPNAM1= <>
$$ [...]
##$SUBNAM3= <"">
##$SUBNAM4= <"">
##$SUBNAM5= <"">
##$SUBNAM6= <"">
##$SUBNAM7= <"">
##$SUBNAM8= <"">
##$SUBNAM9= <"">
##$SW= 18.0517328524113
##$SWIBOX= (0..15)
0 0 2 0 0 0 0 0 0 0 0 0 0 0 0 0 
##$SW_h= 3612.71676300578
##$TD= 16384
##$TD0= 1
##$TE= 0
##$TE2= 300
##$TE3= 300
##$TEG= 300
##$TL= (0..7)
0 120 120 120 120 120 120 120 
##$TP= (0..7)
150 150 150 150 150 150 150 150 
##$TP07= 0
##$TPNAME0= <>
##$TPNAME1= <>
##$TPNAME2= <>
##$TPNAME3= <>
##$TPNAME4= <>
##$TPNAME5= <>
##$TPNAME6= <>
##$TPNAME7= <>
##$TPOAL= (0..7)
0.5 0.5 0.5 0.5 0.5 0.5 0.5 0.5 
##$TPOFFS= (0..7)
0 0 0 0 0 0 0 0 
##$TUNHIN= 0
##$TUNHOUT= 0
##$TUNXOUT= 0
##$USERA1= <user>
##$USERA2= <user>
##$USERA3= <user>
##$USERA4= <user>
##$USERA5= <user>
##$V9= 5
##$VALIST= <valist>
##$VCLIST= <CCCCCCCCCCCCCCC>
##$VD= 0
##$VDLIST= <DDDDDDDDDDDDDDD>
##$VPLIST= <PPPPPPPPPPPPPPP>
##$VTLIST= <TTTTTTTTTTTTTTT>
##$WBST= 1024
##$WBSW= 4
##$XGAIN= (0..3)
0 0 0 0 
##$XL= 0
##$YL= 0
##$YMAX_a= 72402
##$YMIN_a= -56886
##$ZGOPTNS= <>
##$ZL1= 120
##$ZL2= 120
##$ZL3= 120
##$ZL4= 120
##$ABSF1= 15.49568
##$ABSF2= -2.55617
##$ABSG= 5
##$ABSL= 3
##$ALPHA= 0
##$AQORDER= 0
##$ASSFAC= 0
##$ASSFACI= 0
##$ASSFACX= 0
##$ASSWID= 0
##$AUNMP= <proc_1d>
##$AZFE= 0.1
##$AZFW= 0.1
##$BCFW= 0
##$BC_mod= 2
##$BYTORDP= 0
##$COROFFS= 0
##$CY= -3
##$DATMOD= 1
##$DC= 0
##$DFILT= <>
##$DTYPP= 0
##$F1P= 0
##$F2P= 0
##$FCOR= 1
##$FTSIZE= 16384
##$FT_mod= 6
##$GAMMA= 0
##$GB= 0
##$INTBC= 1
##$INTSCL= 3.241238e-09
##$ISEN= 128
##$LB= 0.25
##$LEV0= 0
##$LPBIN= 0
##$MAXI= 10000
##$MC2= 0
##$MEAN= 0
##$ME_mod= 0
##$MI= 1.114404
##$NCOEF= 0
##$NC_proc= -8
##$NLEV= 6
##$NOISF1= 3.799351
##$NOISF2= 2.8
##$NSP= 0
##$NTH_PI= 0
##$NZP= 0
##$OFFSET= 15.48356
##$PC= 1
##$PHC0= -2078.854
##$PHC1= 16.19097
##$PH_mod= 1
##$PKNL= yes
##$PPARMOD= 0
##$PSCAL= 0
##$PSIGN= 0
##$REVERSE= no
##$SF= 200.130007633383
##$SI= 16384
##$SIGF1= 3
##$SIGF2= 2
##$SINO= 0.751879
##$SIOLD= 32768
##$SREGLST= <19F.Aceton>
##$SSB= 0
##$STSI= 16384
##$STSR= 0
##$SW_p= 3612.71676300578
##$SYMM= 0
##$S_DEV= 0
##$TDeff= 16384
##$TDoff= 0
##$TI= <>
##$TILT= no
##$TM1= 0
##$TM2= 0
##$TOPLEV= 0
##$USERP1= <user>
##$USERP2= <user>
##$USERP3= <user>
##$USERP4= <user>
##$USERP5= <user>
##$WDW= 1
##$XDIM= 16384
##$YMAX_p= 278687194
##$YMIN_p= -1354524
$$ End of Bruker specific parameters
$$ ---------------------------------
##NTUPLES= NMR SPECTRUM
##VAR_NAME=  FREQUENCY,     SPECTRUM/REAL,   SPECTRUM/IMAG
##SYMBOL=    X,             R,               I
##VAR_TYPE=  INDEPENDENT,   DEPENDENT,       DEPENDENT
##VAR_FORM=  AFFN,          ASDF,            ASDF
##VAR_DIM=   16384,         16384,           16384
##UNITS=     HZ,            ARBITRARY UNITS, ARBITRARY UNITS
##FACTOR=    0.220516191357247, 1,           1
##FIRST=     3098.72490263294, 0,            0
##LAST=      -513.991860372845, 0,           0
##MIN=       -513.991860372845, -1354524,    0
##MAX=       3098.72490263294, 278687194,    0
$$ Real data points
##PAGE= N=1
##DATA TABLE= (X++(R..R)), XYDATA
$$ [...]
7612D52804P9025k62993J55702J97882J56613J19861k79662J62183R7829l01601
7602E77643k8686J58979l5433l28119L7009k7793Q1834k1838K13280n2871p9780
7591D94225J31328r2126P7609J03746j20411l5587j56987K3264r1620n1822K12173
7580D93792k10484J07432q5118p6539O4205J6659P9441Q5745k5990j9049J5350
7569D45444N6104J40400o4060J04447R2047o3060j27758n9340p4251N981L8429
7558D94383l57189R9881K31976k47597J60633J10660j5644L62819j45536n5537
7548F38849r3530j79454J28818J96689r1455J18646j82266J65628o1969l46883
7538B93073j42348Q5686j01381K67780L24032n4679j39835P8197J07152k48500
$$ plain form
7612 452804 531829 268836 424538 622420 779033 898894 619232 781415 879244 577643
7602 577643 548957 707936 672503 344384 381393 353600 435434 413596 626876 574005 494225
7591 494225 625553 533427 611036 714782 594371 558784 401797 425061 333441 281619 493792
7580 493792 283308 390740 305622 229083 293288 309947 389388 475133 449143 430094 445444
7569 445444 501548 641948 577888 682335 774382 711322 583564 524224 449973 455954 494383
7558 494383 137194 237075 469051 221454 382087 492747 477103 839922 694386 638849
7548 638849 545319 365865 494683 691372 599917 718563 536297 701925 639956 293073
7538 293073 150725 236411 135030 402810 726842 672163 532328 610525 717677 469177
7528D69177k06116J28851p1852R7538O7212j27599q9144L30016n1162K21796q7048
7517F81669j87436j44696l2128J201K37202J68453k36329j8195J22679n0773j63561
7506C78086l4009J11964J87045Q4900k46873j94534L03904l14287n0957K52558
7496D77797q4656J19131j35585K9398J57582k56580J26653J5674j34755j5142
7486B99517M3736N8286j90217j63193P4572J94583p6207m3613P5416J45191J54201
7475E72272J45146q8409k93818k6212o3449O7258Q655j97013R2297J78876j92543
7464B03060K71397j06650J26189J6413P8344Q2714P6357n5724j29273l61197K46984
7453D48614j58283K9994J87576P0054M64774j83927l33873q7231j59011J25674
$$ plain form
7528 469177 263061 391912 320060 417598 484810 357211 268067 598083 546921 768717 681669
7517 681669 494233 349537 317409 318610 555812 724265 487936 469741 592420 541647 378086
7506 378086 344077 456041 643086 727986 481113 286579 590483 276196 225239 477797
7496 477797 393141 512272 376687 406085 563667 307087 433740 449414 314659 299517
7486 299517 343253 401539 211322 48129 122701 317284 241077 197464 272880 418071 572272
7475 572272 717418 629009 335191 308979 245530 312788 321443 124430 216727 395603 203060
7464 203060 474457 367807 493996 510409 588753 671467 747824 692100 562827 201630 448614
7453 448614 290331 320325 507901 577955 1042729 858802 524929 437698 278687 404361
7443D04361r7338M6484K73206j80515O3403k50982L35831Q9631p5152l45086L7250
7432C01093J75028j03477L2729J08157l1519k85912M3917J11696J72966K26697
7422G51375m7478j33398L45417k96112j15507j85945n7931K34078Q0958N1906
7412F27363j48760k1099J39694p4434J70009O0161j49362k7410N0002j77484j36014
7401C12666J40340k6229Q7461J14215L4512l66309j18939J89168L50052k95073
7391D21864k81806K91082K04022q6630j29101L9646L69811J50769k77275k01547
7381E00835J50401j7773J09650O0531q8477j05551j39185l05036L90674J91313
7371G47382l9001k5548J5684J49541n3889p9961j20766J33373l5191m1148J7165
$$ plain form
7443 404361 307023 353507 626713 446198 509601 258619 594450 684081 608929 263843 301093
7432 301093 476121 372644 405373 513530 482011 196099 240016 351712 524678 751375
7422 751375 703897 570499 915916 619804 504297 318352 260421 494499 575457 627363
7412 627363 478603 457504 597198 522764 692773 752934 603572 576162 626164 448680 312666
7401 312666 453006 426777 514238 628453 662965 296656 177717 366885 716937 421864
7391 421864 140058 431140 635162 548532 419431 459077 828888 979657 702382 500835
7381 500835 651236 633463 743113 803644 715167 609616 470431 165395 556069 747382
7371 747382 708381 682833 698517 848058 794169 714208 593442 726815 691624 650476 667641
7360F67641J52054N4981o8346k50475j55587j842j0785p7468k2356j1102K32308
7349E09023j1655J76392n1518N0151j67435r6558o4241N6975J20906q004j61968
7338C52068j36613P6826m4955O5174K30415J30371k39526j43708K41075K88396
7328H19523m2820Q6260K27506j28298k06460n2623j09527K24321j50920L6503
7318G03465k7003j88357m3915N4901k3500J2883K53158M0848o1386l53618q4617
7307B82859J20486O4270p3124k42197K85833J03271K02056Q8868j39375m7524
7297F45423j00286J6971k6475O6613J72949m8945q7195J2803j9024P8406L1129
7286G42369j50254L9961L7195l30368K00922L19909k08244R9525L2099l8905p5985
$$ plain form
7360 667641 819695 874676 806330 555855 400268 398426 387641 310173 287817 276715 509023
7349 509023 497368 673760 622242 672393 504958 408400 344159 401134 522040 514036 352068
7338 352068 215455 292281 247326 312500 542915 673286 433760 290052 531127 819523
7328 819523 776703 862963 1090469 962171 755711 703088 593561 817882 666962 703465
7318 703465 676462 488105 444190 499091 475591 488474 741632 782480 721094 367476 282859
7307 282859 403345 467615 394491 152294 438127 541398 743454 832322 692947 645423
7297 645423 545137 562108 535633 602246 775195 726250 639055 651858 632834 711240 742369
7286 742369 592115 632076 669271 338903 539825 859734 651490 751015 783114 744209 668224
7275F68224N1675j50539O4821J03129l24995M8847M4541K41830L70698j648k53141
7264H63442m4344l42761j06423J19320r6579K62084J81361p6255l59613J46833
7254E47065J39375J0949k39963J09861K74315J27359o2989l25257j79731M1079
7244D42063K89643k30777J58836J694K3695J95980K2983Q3999k01931k93341o0571
7233D32273n6374Q0185l1215J73775J11475K218p5045k52074L31331j88591J78720
7222G06678L24218n23787o2374K53843K2920J50201M2829p0580R3931O1617k22705
7211G76791k33548j47754p9700N6795O4940k51448P2810K38688L23710j18735
7201G02549M004M591j42681J28964j59178L25139j08130j04631j34029P3812N4148
$$ plain form
7275 668224 719899 569360 634181 737310 412315 461162 505703 747533 1118231 1116583 863442
7264 863442 819098 476337 369914 489234 392655 654739 836100 759845 400232 547065
7254 547065 686440 697389 457426 567287 841602 968961 905972 580715 400984 442063
7244 442063 731706 500929 659765 661459 685154 881134 904117 988116 786185 492844 432273
7233 432273 375899 456084 424869 598644 710119 712337 637292 385218 716549 527958 706678
7222 706678 1030896 507109 444735 698578 721498 871699 914528 843948 937879 999496 776791
7211 776791 543243 395489 315789 372584 437524 186076 258886 497574 821284 702549
7201 702549 706553 711144 568463 697427 538249 863388 755258 650627 516598 590410 644558
7190F44558j83635L2158j4858l9081M8373k01142J27374J28662P0050J91817j88748
7179F15528M3625J0184Q6633p4748p9668k08225j29089m2946J87865J41227J52275
7168G02661N5582j50807p4907J49526J41949m168j5041L3791p7175j260J05887
7157H66038l41633K26084p3273K76848M3364j28517K03268J29248p0149L5907
7147A167185j71027j74451P7383J18967J87630q0977j38841k30667M7716J31534
7137I34452J4348L04178j55049K1597j09068k04731j03J72753J1455o9499J29813
7126A050146Q2990P3666J53414K23269R5963O579k77943j37202N24007L10749
7116B105638L7141K9014K35507K40155L08720K58769J97518P7286Q9851K0100
$$ plain form
7190 644558 460923 493081 478223 439142 487515 286373 413747 542409 612459 804276 615528
7179 615528 659153 669337 755970 681222 601554 393329 264240 221294 409159 550386 702661
7168 702661 758243 607436 532529 682055 824004 819836 804795 838586 761411 760151 866038
7157 866038 524405 750489 677216 954064 997428 868911 1072179 1201427 1131278 1167185
7147 1167185 996158 821707 899090 1018057 1205687 1124710 985869 755202 802918 934452
7137 934452 948800 1252978 1097929 1119526 1010458 805727 805624 978377 989832 920333 1050146
7126 1050146 1133136 1206802 1360216 1583485 1679448 1686027 1408084 1270882 1794889 2105638
7116 2105638 2142779 2171793 2407300 2647455 2956175 3214944 3412462 3489748 3579599 3599699
7106C599699K10213j60149O562j38895m07783m364M718q6688n55084k53122j63964
7095B051143j53082k4187K27881m7879r563j78580R9493j61390M3393p19j0578
7084A835932j73987r5817l11543M9572K1312J18316j56836K36708J74046k14561
7074A483142R9326j70787O2464j90107j79180r7223j35612K32251l6542Q9505
7064A157237J67214j08390q9199J18602K6934J12300J50273k8680N3529j89616
7054A370204n8225k9527J35552p1161K396K29710J06985j73180J33816L15952
7044A962522o6658K24774P1024K74423K36366j09652J42950J68489J60785K21655
7034C286678N707j10572J0541R3835k86748q9455k374L3235l91394l10415k16253
$$ plain form
7106 3599699 3809912 3649763 3656325 3517430 3109647 3105283 3110001 3023313 2468229 2215107 2051143
7095 2051143 1898061 1873874 2101755 2053876 2044313 1865733 1965226 1803836 1847229 1846510 1835932
7084 1835932 1661945 1566128 1254585 1304157 1325469 1443785 1286949 1523657 1697703 1483142
7074 1483142 1582468 1411681 1474145 1284038 1104858 1007635 872023 1104274 1067732 1157237
7064 1157237 1324451 1216061 1126862 1245464 1272398 1384698 1534971 1506291 1559820 1370204
7054 1370204 1311979 1282452 1418004 1346843 1349239 1578949 1685934 1512754 1646570 1962522
7044 1962522 1895864 2120638 2191662 2466085 2702451 2592799 2735749 2904238 3065023 3286678
7034 3286678 3292385 3181813 3192354 3286189 2999441 2909986 2907612 2940847 2549453 2239038 2022785
7023B022785k54508l38343p431J29164K390m8578r7517N9096p2003r3964N380
7012A306471j97438k03506J1388K73280N2898j40172R6226m76335M6205k50070
7002E18947K14061K86300p7252k7930J53917J82960j82172r5166J01832j9609
6992A055888K5025J15324P1598k37874J73163K30813q637r1062j74639k07565
6982I52034Q8804K95386N4315k51385j27898N9425k03158j35522K3131j00066
6972F55066J61150o15p5822o5147J9900L24732p0782N3465m6960j96162J88947
6961I47772j14962J30771J83038k19836o1972k35265j31546K8898j33669L32870
6951G26099J62339j37768R2916K18491j07666J89008k94307k31569J73969K40505
$$ plain form
7023 2022785 1768277 1429934 1422503 1551667 1554057 1505479 1407962 1467058 1395055 1301091 1306471
7012 1306471 1109033 905527 916915 1190195 1243093 1102921 1199147 722812 769017 518947
7002 518947 733008 1019308 942056 914126 1068043 1251003 1068831 973665 1075497 1055888
6992 1055888 1080913 1196237 1267835 1029961 1203124 1433937 1425300 1334238 1159599 952034
6982 952034 1040838 1336224 1390539 1139154 1011256 1070681 867523 732001 755132 655066
6972 655066 816216 815601 739779 674632 694532 1019264 948482 1001947 954987 758825 947772
6961 947772 832810 963581 1146619 926783 864811 629546 498000 526898 393229 726099
6951 726099 888438 750670 843586 1062077 954411 1143419 849112 617543 791512 1032017
6941A032017M8846k8673l54096m1119J79534k1621P9145R2159k098o792m1908
6930I35394J17509q6933j34254k54577N798K95660J9384P1247K4917r421k41084
6919G43640J18862j93045l0442J53479p260K2780P1256j87458j52376P620K5804
6908E72860Q3592K99296K06503k49798j99031J12889p1476J92052J01664j78563
6898H69988R5484J76400r963l97334k2347L5780J13247J68926p8125K49415J21021
6887A322492j76802l33818K47798k10309j90319p3224K54726J40300p9429M3892
6877I45307j9919L9369J43861O3421j61991k08923J06726n3558l5467j35714J89247
6866H72359k36758j764J89891J43353J27255l38336q0185P9221L39512j46656
$$ plain form
6941 1032017 1080863 1052190 698094 656975 836509 814888 894033 986192 984094 977302 935394
6930 935394 1052903 965970 831716 577139 582937 878597 897981 969228 994145 984724 743640
6919 743640 862502 669457 639015 792494 785234 808014 879270 691812 539436 547056 572860
6908 572860 656452 955748 1162251 912453 713422 826311 754835 946887 1048551 869988
6898 869988 965472 1141872 1131909 734575 712228 748008 861255 1030181 952056 1201471 1322492
6887 1322492 1145690 811872 1059670 849361 659042 585818 840544 980844 901415 945307
6877 945307 925388 964757 1108618 1172039 1010048 801125 907851 854293 818826 683112 872359
6866 872359 635601 633837 823728 967081 1094336 756000 675815 755036 1094548 947892
6856I47892k10260K80024r6427J14623n9559l37249n2712J36057R5145J13948
6846I31482p1672k70520j0749R7651k58300J23856K16859M8919m2619K06827O9615
6835A041349j19152J41377P695j81844j54110J48700j48046K34388J71811R4759
6825A236927j251k1939L5561O8697r1808q1551k1658L4465R4420J0672L85652
6814A648187K6580j95340J03224k3505k259L2571J74634q4482n6128K60052K08836
6803B092370j62701K09377K28544j5810M74710M33940r2500K92436L59809R9738
6793C919913j13813k53815k53930l22165j60572J19731l16749j26891j18448r7219
6783B276042j27227k09178O3750K43290k52429k04747O2481j06863r9998J10531
$$ plain form
6856 947892 737632 1017656 921229 1035852 976293 639044 586332 722389 817534 931482
6846 931482 859810 589290 578541 676192 417892 541748 758607 807526 764907 971734 1041349
6835 1041349 922197 1063574 1071269 889425 735315 884015 735969 970357 1142168 1236927
6825 1236927 1235676 1213737 1249298 1317995 1226187 1144636 1122978 1157443 1251863 1262535 1648187
6814 1648187 1674767 1479427 1582651 1559146 1556887 1589458 1764092 1679610 1623482 1883534 2092370
6803 2092370 1929669 2139046 2367590 2351780 2826490 3260430 3167930 3460366 3820175 3919913
6793 3919913 3806100 3552285 3298355 2976190 2815618 2935349 2618600 2491709 2373261 2276042
6783 2276042 2148815 1939637 2003387 2246677 1994248 1789501 1851982 1745119 1645121 1755652
6773A755652k31017j23249K00629R0827j6254J91607q1884j1419J38658J00984
6763B014534K08017J29071L12817R739p3095K59168K47582J65047L13119L06380
6753C892379j0366J24946o2826k82739n5122n9158r4009k37935l17972j68319
6743B728879k0053j64042j82010K62247J0977l60338k85776k3795K73381l94732
6733A844738k01480J22380Q9000j44245j23701j20680P4859M3556k09177J43085
6723A518335Q6937p1639J75648n5939k11540J35366L27868l88053M917K2264j81215
6712A362949j637O3374j62042p8580K79895Q418j811J55013j04243q3057L5050
6701A473329J4353J07925j87025K94511q7651j35501p7914j57674K86157N0722
$$ plain form
6773 1755652 1524635 1401386 1602015 1692842 1676588 1868195 1786311 1774892 1913550 2014534
6763 2014534 2222551 2351622 2664439 2674178 2601083 2860251 3107833 3272880 3585999 3892379
6753 3892379 3882013 4006959 3944133 3661394 3606272 3547114 3453105 3215170 2897198 2728879
6743 2728879 2708826 2544784 2362774 2625021 2635998 2275660 1989884 1966089 2239470 1844738
6733 1844738 1643258 1765638 1854638 1710393 1586692 1466012 1540871 1584427 1375250 1518335
6723 1518335 1605272 1533633 1709281 1653342 1441802 1577168 1905036 1516983 1521900 1544164 1362949
6712 1362949 1361312 1424686 1262644 1184064 1463959 1472377 1470566 1625579 1521336 1438279 1473329
6701 1473329 1487682 1595607 1408582 1703093 1615442 1479941 1402027 1244353 1530510 1581232
6691A581232p5249j08371K4640J15600q4917J04860Q2226n2239J61358j05039
6681A644101n9553K80406m2567Q295K571j82688j2534o7035K04909p1206k08997
6670A495702j37249J65739K88403l33826j58082L14325M712M3274r7912l4092
6660A550994q1202J5963N0895p2276O0290J91404L0566p6422j05960J43431j07573
6649A600110k56526J65372K8173L29474k51715k35370J55636M23790j73330l04035
6639A481579L6583K4887p3382j39207L46354N2625m40855J05078m2278o1182K09788
6628A499990N2816P4362k41352k4235J20788J84401j24464q4887J14683J11503
6618A683605n6723j20466N2788K33302P4624o3230j02670J90151K51418k32038
$$ plain form
6691 1581232 1505983 1397612 1422252 1537852 1452935 1557795 1640021 1587782 1749140 1644101
6681 1644101 1584548 1864954 1822387 1830682 1833253 1650565 1638031 1570996 1775905 1704699 1495702
6670 1495702 1358453 1524192 1812595 1478769 1320687 1635012 1639724 1682998 1585086 1550994
6660 1550994 1469792 1485755 1536650 1464374 1524664 1716068 1746634 1670212 1564252 1707683 1600110
6649 1600110 1343584 1508956 1537129 1866603 1614888 1379518 1535154 1958944 1785614 1481579
6639 1481579 1518162 1543049 1469667 1330460 1676814 1729439 1288584 1393662 1351384 1290202 1499990
6628 1499990 1552806 1627168 1385816 1361581 1482369 1666770 1542306 1457419 1572102 1683605
6618 1683605 1626882 1506416 1559204 1792506 1867130 1803900 1701230 1891381 2142799 1910761
6608A910761j29258n9373j36028K21962P1009M0231q1323P4998K01827l3157Q6005
6597B167654p9420M3850J15791K480L6148j45961k3968M5663p9113J57736p3974
6586B166886N369k8764K14505J4459n7728K46294q5456n2729K1114j26304l3339
6575B284307K71908M0944j81784K55883L98236J81548p0733j14596Q6885L9820
6565C192418j63741L15107K95186J0684J21449k2930k48406M2428j6459m10282
6555C115454n363m6641J43025m6136k37919j23916p7997l36J43308L4929k45271
6544B653137n2464m8815o477J06485k80686n66J01089J8656J9313j04202P5520
6533B480990l12115p4823N66271n090k05927o3180N4353j17073o3495K53788m2052
$$ plain form
6608 1910761 1781503 1722130 1586102 1808064 1879073 1919304 1837981 1912979 2114806 2081649 2167654
6597 2167654 2088234 2132084 2247875 2250355 2286503 2140542 2116574 2162237 2083124 2240860 2166886
6586 2166886 2172255 2143491 2357996 2372455 2314727 2561021 2475565 2422836 2443950 2317646 2284307
6575 2284307 2556215 2597159 2415375 2671258 3069494 3251042 3180309 3065713 3152598 3192418
6565 3192418 3028677 3343784 3638970 3649654 3771103 3748173 3499767 3542195 3525736 3115454
6555 3115454 3110091 3063450 3206475 3160339 2922420 2798504 2720507 2720171 2863479 2898408 2653137
6544 2653137 2600673 2551858 2545381 2651866 2371180 2370614 2471703 2490359 2509672 2405470 2480990
6533 2480990 2168875 2094052 2660323 2655233 2449306 2386126 2440479 2323406 2259911 2513699 2471647
6522B471647p0086j23478k6950m2029R8160O727P2777k17428k2628k05513K99429
6511B240628R666r501M6491N5374K10565l9367q786j98410j21844J87658K02616
6500B575090r265r8694K4759K23073r0966o3517J76725L3179j38641R631l2433
6489B608941p5101M27150q8638j66364j02767j9861J1583j96552J82683M4277
6479B625351q8713R8116J5282J62815J45703k20780K22494N7196k5772N1808j95775
6468B847725J30666L2802k28672P5468L41460O1196k04551L15928k69951N7640
6458C159711J09406J27749N7852n0637r3166K60900j21293j5431K58037k94611
6448C398517L6173K30678j24827M5887M4749Q9803J67990j1565j29966J46123
$$ plain form
6522 2471647 2401561 2278083 2251133 2209104 2307264 2313991 2386768 2169340 2146712 1941199 2240628
6511 2240628 2250294 2240793 2287284 2342658 2553223 2513856 2505070 2306660 2184816 2372474 2575090
6500 2575090 2565825 2467131 2491890 2714963 2623997 2560480 2737205 2770384 2631743 2641374 2608941
6489 2608941 2533840 2960990 2872352 2705988 2603221 2583360 2594943 2398391 2581074 2625351
6479 2625351 2536638 2634754 2650036 2812851 2958554 2737774 2960268 3017464 2991692 3043500 2847725
6468 2847725 2978391 3011193 2782521 2857989 3199449 3260645 3056094 3372022 3102071 3159711
6458 3159711 3269117 3396866 3454718 3404081 3310915 3571815 3450522 3435091 3693128 3398517
6448 3398517 3434690 3665368 3540541 3586428 3631177 3720980 3888970 3877405 3747439 3893562
6438C893562r9146K51611J31295j75000J88503j96089K95469K20322M0451r0629
6428D460349j2651K16581N6650j37917J73733J8706R0510L39744J06202p490J4404
6417E318821J34677J30596j1723K55118J05522l0427J86882J84591Q5193J49966
6407F509216M9330M68723L649o2659k3419K96198N83331N3021M38530K35235K3782
6396H574937M57015K65336K07343K71513L12926N02662M36851N04553N87683M81125
6386A2601944P30089Q79897Q39811Q54698J075727J587604R93233J284571J251603
6377B2099177R02138J001762J155739N18528Q37294P88590R89849J154823J253588
6368C0701488J411388J321882J162088J014435Q60319R94816P78512R26041P63635
$$ plain form
6438 3893562 3794416 4046027 4177322 4002322 4190825 3994736 4290205 4510527 4550978 4460349
6428 4460349 4447698 4664279 4720929 4583012 4756745 4775451 4865961 5205705 5311907 5304417 5318821
6417 5318821 5453498 5584094 5572371 5827489 5933011 5902584 6089466 6274057 6359250 6509216
6407 6509216 6558546 7027269 7030918 6968259 6944840 7241038 7824369 7877390 8315920 8551155 8574937
6396 8574937 9031952 9297288 9504631 9776144 10089070 10591732 11028583 11533136 12120819 12601944
6386 12601944 13332033 14211930 15051741 15906439 16982166 18569770 19563003 20847574 22099177
6377 22099177 23001315 24003077 25158816 25677344 26514638 27303228 28293077 29447900 30701488
6368 30701488 32112876 33434758 34596846 35611281 36471600 37466416 38244928 39170969 39934604
6359C9934604P51401J433793J224355J137997R59191J018248J549230J665604
6351D9674423J879008L272148L887190M180523M641797M664428M336151L479622
6343H0015290K260030Q09260l40552j661341k940333k828722k449146j681446
6335G1183040r95900k81320O61892J561159K400068K887440L503636L642083L932707
6326H8494805M110610L214414K086349J64534m75781k018664l311298l941301
6318H8323668m393197m278069m038913l362459k888850k486212j291249r07022
6310F4677697k54063J93691J199479J091067K094504K956426L484123M011991
6302G9454915M330464L895210L401917K903861J548525L36157r60871j915337
$$ plain form
6359 39934604 40686005 42119798 43344153 44482150 45441341 46459589 48008819 49674423
6351 49674423 51553431 54825579 58712769 62893292 67535089 72199517 76535668 80015290
6343 80015290 82275320 83084580 82744028 81082687 78142354 75313632 72864486 71183040
6335 71183040 70187140 69905820 70567712 72128871 74528939 77416379 80920015 84562098 88494805
6326 88494805 92605415 95819829 97906178 98070712 97594931 95576267 92264969 88323668
6318 88323668 83930471 79652402 75613489 72251030 69362180 66875968 65584719 64677697
6310 64677697 64423634 64617325 65816804 66907871 69002375 71958801 75442924 79454915
6302 79454915 83785379 87680589 91082506 93986367 95534892 95871049 94910178 92994841
6294I2994841k956783l701734l921162l215273l641000k429602j714449j137054
6286G0277784m92346N66258J020560J716647K404433K202206K014826J327890
6278H1038258N42726j043405k513083l754346m232360m243573m336865l587353
6270E7869999l100505k424613k144249j751700j894893j356925r66543j006416
6262D3224155j071547j115741j074462j241029r24488r90839j038024j426778
6254C4341247j060160j119620j044981j389147j061403j138681q17252n18156
6246B6191847n54883j110496j186694r33544j055311j434600j105830j126034
6238A7684455j278973j054580j218854o69541q19036p14070n58144l05379p78727
$$ plain form
6294 92994841 90038058 86336324 82415162 79199889 75558889 73129287 71414838 70277784
6286 70277784 69785438 70351696 71372256 73088903 75493336 77695542 79710368 81038258
6278 81038258 81580984 80537579 78024496 74270150 70037790 65794217 61457352 57869999
6270 57869999 54769494 52344881 50200632 48448932 46554039 45197114 44230571 43224155
6262 43224155 42152608 41036867 39962405 38721376 37796888 36806049 35768025 34341247
6254 34341247 33281087 32161467 31116486 29727339 28665936 27527255 26710003 26191847
6246 26191847 25636964 24526468 23339774 22406230 21350919 19916319 18810489 17684455
6238 17684455 16405482 15350902 14132048 13462507 12643471 11929401 11371257 11065878 10287151
6229A0287151k75201m99463o83713l32330k65219j78179k73073k64356j14215
6220G401402j24723j38135l36098j28550k20302k03068k52728j0247n721l0204
6210E951626j45183m18806R8367m1559o7783M77j6742k17174l30119J20433j97200
6199D736337m02112l6665J76457Q826j09791k02047k17020m9453J27183k12420
6189C819295k12305k61001J39527L18041l10280j81492J81635m9550o5029O4365
6179C443206m02870o9403J91941o0499m6807L4628k04567j00093j08836j23494
6169B553206K60725j16989p4303Q2481l279j41657J25087O9557l09919J00631
6159B545540l416M3817k10320m0891J63000m32838j1473K33379j83996k93946
$$ plain form
6229 10287151 10011950 9512487 8828774 8496444 8231225 8053046 7779973 7515617 7401402
6220 7401402 7276679 7138544 6802446 6673896 6453594 6250526 5997798 5987551 5981830 5951626
6210 5951626 5806443 5387637 5486004 5444445 5376662 5377139 5360397 5143223 4813104 4933537 4736337
6199 4736337 4334225 4297560 4474017 4482843 4373052 4171005 3953985 3904532 4031715 3819295
6189 3819295 3606990 3345989 3485516 3803557 3493277 3311785 3493420 3443870 3378841 3443206
6179 3443206 3040336 2970933 3162874 3102375 3055568 3090196 2885629 2785536 2676700 2553206
6169 2553206 2813931 2696942 2622639 2705120 2701841 2560184 2685271 2754828 2444909 2545540
6159 2545540 2542124 2585941 2375621 2334730 2497730 2064892 2053419 2286798 2102802 1808856
6149A808856N2498J1272J37795M3516l40249k59985R5325J44414L9585r1460J9243
6138A660810K2452K25309M1661k92037k44650m7534K84114j94457N7792k5406
6128A488054q5929R8427p7920k32023p2190K45556Q0029J39096j32224M8700K2591
6117A522167p9207k11377j12486R3408j20277J42895j37545L63586o1128j6706
6107A383330p4675k29929K58308J30704j24741m2738L9657J01100l9526k03521
6097A197969k6207K42848k83977J09299J039k12404l4592O7342K60877j21993
6087A200201j20581J00209J21599k8876J63994j17591O7193j2923p6204L4493
6077A331514j62404J19281K3279N6807L9667J56870k96902k93656O0022J17526
$$ plain form
6149 1808856 1861354 1872626 2010421 2053937 1713688 1453703 1549028 1693442 1733027 1641567 1660810
6138 1660810 1683262 1908571 1950232 1658195 1413545 1366011 1650125 1455668 1513460 1488054
6128 1488054 1402125 1500552 1422632 1190609 1118419 1363975 1444004 1583100 1450876 1499576 1522167
6117 1522167 1442960 1231583 1119097 1212505 1092228 1235123 1097578 1461164 1400036 1383330
6107 1383330 1308655 1078726 1337034 1467738 1342997 1300259 1339916 1441016 1401490 1197969
6097 1197969 1171762 1414610 1130633 1239932 1240971 1028567 993975 1061317 1322194 1200201
6087 1200201 1079620 1179829 1301428 1272552 1436546 1318955 1386148 1373225 1297021 1331514
6077 1331514 1169110 1288391 1311670 1368477 1408144 1565014 1268112 974456 1034478 1152004
6067A152004o7852J58917P1803M16090k44251j65776J5950J15235j12355o2457
6057A277308R0916p8919j51712p4603J50827K31272j64282j93308M43187k9538
6047A501148Q5800J29443k57204k71108K90527N5674j02375J84559o9790j72700
6037A373974j36279j96134M4533M02294J88285j17619l6154p2373J67907j84529
6027A433905P0576o1823P2803L42850J13309j99738k82221k61064P3509j14055
6017A188051K21571k12571L52108J40674J4817o6790j61754J68536k4618j48069
6007A471955q2491K66150J75237J31662J4548O7279m16123K66558K60721k99411
5997A856085j8797j38763R0601K01277L25941j47447K54285n1970k5316J9495
$$ plain form
6067 1152004 1084152 1243069 1314872 1730962 1486711 1320935 1336885 1452120 1339765 1277308
6057 1277308 1368224 1289305 1137593 1062990 1213817 1445089 1280807 1087499 1530686 1501148
6047 1501148 1586948 1716391 1459187 1188079 1478606 1534280 1431905 1616464 1546674 1373974
6037 1373974 1237695 1041561 1086094 1488388 1676673 1559054 1522900 1450527 1618434 1433905
6027 1433905 1504481 1442658 1515461 1858311 1971620 1771882 1489661 1228597 1302106 1188051
6017 1188051 1409622 1197051 1549159 1689833 1704650 1637860 1476106 1644642 1620024 1471955
6007 1471955 1389464 1655614 1830851 1962513 1977061 2044340 1628217 1894775 2155496 1856085
5997 1856085 1837288 1698525 1789126 1990403 2316344 2168897 2423182 2371212 2345896 2365391
5987B365391o1945k7313k03219j29741M01602J10832L4496k7976L17079J90606
5977B969812p7613J9506P5475M2283R8754J7134l34995l8007J6870P6801k17698
5966B648322k0003l00725j95636K14788m8060k93560K59540J41690m10811l61200
5956A634345n3723J21769J96794l16418k25191J08815Q3413k81160J59249k3033
5946A404860k88812Q4961R7531J85886K03574j22957j52179O6662j06607J46669
5936A519588M6009j0097K0066p5304J35391O8420j06511j85054j05726J2123l0356
5925A288549k8757Q4490L1111N0708q1179R6442M9793J42448J42012k21496K43009
5914A797130j3727k92355o1720J52005P1971q6251L4149K02964O23257k72495
$$ plain form
5987 2365391 2303446 2276133 2072914 1943173 2344775 2455607 2490103 2462127 2779206 2969812
5977 2969812 2892199 2911705 2987180 3029463 3128217 3145351 2810356 2772349 2789219 2866020 2648322
5966 2648322 2628319 2327594 2131958 2346746 2298686 2005126 2264666 2406356 1995545 1634345
5956 1634345 1580622 1702391 1899185 1582767 1357576 1466391 1549804 1268644 1427893 1404860
5946 1404860 1116048 1201009 1298540 1484426 1688000 1565043 1412864 1479526 1372919 1519588
5936 1519588 1565597 1555500 1575566 1500262 1635653 1704073 1597562 1412508 1306782 1318905 1288549
5925 1288549 1259792 1344282 1375393 1426101 1344922 1441364 1491157 1633605 1775617 1554121 1797130
5914 1797130 1783403 1491048 1429328 1581333 1653304 1567053 1601202 1804166 2427423 2154928
5904B154928q6084Q6164j19240l0823K51119k8944J20097k79655k31594j08112
5894A727856j35900j20617K42638r1544K3849l5716J19206N2017k97134J49703
5884A634358M6646l14482j86176K94445J86167k38353j56282k81343m1261L64922
5874A308641R693n4458q198K97066K04746k43681k85233o2797K88966L41989J00587
5863A897321l0556k32123r5013K8226o074R7954j7013n9618j20815l27875J96966
5852A331380k02872l0881J52569N2021J23753q8911l9006Q9799m1880j20081J73701
5841A399592q3592k15515L40556M5350J78427m0656o9832J61508o6190K0104K03645
5830A873397k1601J41672j84656k66226r4606N1724J61687N2264j55583J70363
$$ plain form
5904 2154928 2068844 2155008 2035768 2004945 2256064 2227120 2347217 2067562 1835968 1727856
5894 1727856 1591956 1471339 1713977 1622433 1646282 1610566 1729772 1781789 1484655 1634358
5884 1634358 1681004 1366522 1180346 1474791 1660958 1422605 1266323 984980 943719 1308641
5874 1308641 1318334 1263876 1255678 1552744 1757490 1513809 1228576 1165779 1454745 1796734 1897321
5863 1897321 1866765 1634642 1539629 1567855 1561781 1659735 1642722 1583104 1462289 1134414 1331380
5852 1331380 1128508 1097627 1250196 1302217 1425970 1337059 1298053 1387852 1345972 1225891 1399592
5841 1399592 1316000 1100485 1441041 1486391 1664818 1624162 1554330 1715838 1649648 1669752 1873397
5830 1873397 1851796 1993468 1808812 1542586 1447980 1499704 1661391 1713655 1558072 1728435
5820A728435J2973J92593k59335j33115K23919l09807j8624K52992J1250k06272
5810A495009R5708M9035l9377L7816p5419j04447J10914K6382K3069K5078J09604
5799A753372J26544j3090J56033k02747k21270N1115L94378n6908J15427R4640
5789B197494j40871J17309m9867J08672l05147j8658K36490O9428j93076r4209
5779A927565J18938M9457P5588p8074k0732j1631k5486K07348K7572k5491k08205
5768B036849p6132J17437j12094J95115r1377O3632L821j67254j54451j55692
5758A659854L1144J44411Q7673J32714N5784o0917l2457J72659j97472K4674Q449
5747B026516J20519K42765l39341Q0927n1412l526J87897r8568j99121L86729
$$ plain form
5820 1728435 1741408 1934001 1674666 1541551 1765470 1455663 1437039 1690031 1701281 1495009
5810 1495009 1590717 1639752 1600375 1638191 1562772 1458325 1569239 1595621 1618690 1643768 1753372
5799 1753372 1879916 1866826 2022859 1820112 1598842 1649957 2044335 1987427 2102854 2197494
5789 2197494 2056623 2173932 2124065 2232737 1927590 1908932 2145422 2214850 2021774 1927565
5779 1927565 2046503 2095960 2171548 2093474 2072742 2061111 2035625 2242973 2270545 2245054 2036849
5768 2036849 1960717 2078154 1966060 2161175 2069798 2133430 2137251 1969997 1815546 1659854
5758 1659854 1690998 1835409 1923082 2055796 2111580 2050663 2018206 2190865 1993393 2018067 2026516
5747 2026516 2147035 2389800 2050459 2131386 2079974 2076448 2264345 2165777 1966656 2353385
5737B353385j07945k13470K65337k12448o8486K23767M2716r4900K06807J33309
5727B528072j23211k8551R2021R7010J67073l02379p5380J42598L1479R4492L1003
5716B654227j19377Q4268L3811k08791l3225o355K43660r7428Q8562K6427Q4214
5705B749993r953L83467k13640J04201K37014J23204k09293o1372M7946j31770
5695C019797J48755L21841k09707N7250J28415l7065K4760R2079L18820J97627
5685D062572m6890j73207M0378J97090J29559k56178r8835N11094J43124M2453
5675D551160o3518L27657M7721j07995K48102q902k581J22143L53295K42553j11470
5664E598165J02440L38965K04810j23458k22163L34787N16336L27210K33952m8818
$$ plain form
5737 2353385 2245440 2031970 2297307 2084859 2016373 2240140 2282856 2187956 2394763 2528072
5727 2528072 2404861 2376310 2468331 2565341 2732414 2430035 2354655 2497253 2528732 2623224 2654227
5716 2654227 2534850 2619118 2652929 2444138 2410913 2404558 2648218 2550790 2639352 2665779 2749993
5705 2749993 2740040 3123507 2909867 3014068 3251082 3374286 3164993 3103621 3151567 3019797
5695 3019797 3168552 3490393 3280686 3337936 3466351 3429286 3454046 3546125 3864945 4062572
5685 4062572 4015682 3842475 3882853 4079943 4209502 3953324 3854489 4365583 4508707 4551160
5675 4551160 4487642 4815299 4863020 4755025 5003127 4994225 4991644 5113787 5467082 5709635 5598165
5664 5598165 5700605 6039570 6244380 6120922 5898759 6233546 6749882 7077092 7311044 7262226
5654G262226L0481J65122K59771K79981J03386N23608K67114P1656j43649L17549
5644I137245K68893M33361M88793Q22822M60763L43894L48942M63381O04413P31676
5634A4104183P21809M86394N43648R22925J091681J045403J093355J055020J082490
5625B2146908J459700J670201J954040J841811K171849K397370K320279K843156
5617C8805314L244724L375795L956468M340143M944873N543426O107339O498886
5609G6816968O907094P664339P819262Q060728Q326862P810640P367436O184824
5601A36958153M535626L281653J417520o21992k152598l478095m828757o020007
5593A29091503o614239o947907p156783p335650p490365p427148p081375o342970
$$ plain form
5654 7262226 7292707 7457829 7717600 7997581 8100967 8624575 8891689 8963345 8819696 9137245
5644 9137245 9406138 9839499 10328292 11151114 11611877 11955771 12304713 12768094 13372507 14104183
5634 14104183 14825992 15312386 15856034 16778959 17870640 18916043 20009398 21064418 22146908
5625 22146908 23606608 25276809 27230849 29072660 31244509 33641879 35962158 38805314
5617 38805314 42050038 45425833 49382301 53722444 58667317 64210743 70318082 76816968
5609 76816968 83724062 91388401 99207663 107268391 115595253 123405893 130773329 136958153
5601 136958153 141493779 144775432 146192952 145570960 143418362 139940267 135111510 129091503
5593 129091503 122477264 115529357 108372574 101036924 93546559 86119411 79038036 72695066
5585G2695066o261925n684264m811639m625051m066906l631712l439182l156941
5577C7017446k630008k500593k495824j892912j748530j867929j516751j279607
5569B1085292j292935j045557j014068j098330r78070p59907l38618o32344r11215
5560A3014248l57137o63374m03894j45410n82684n22301l13544l36119k67197
5551I422588m42519k78120j04283k69404k51269l79195j98270k67792j36542j96338
5541F898856Q2767o8824n23140J28183J98395k75806m95826m4234M0334k87966
5531E652739k59827j84062j33590R2330j15416j14303J00737J11318j59625k56496
5521D733805j88338Q7441p428j92516k50211q4134k5233J06420k4412j51562r8207
$$ plain form
5585 72695066 66433141 60748877 55937238 51312187 47245281 43613569 40174387 37017446
5577 37017446 34387438 31886845 29391021 27498109 25749579 23881650 22364899 21085292
5569 21085292 19792357 18746800 17732732 16634402 15656332 14896425 14557807 13925463 13014248
5560 13014248 12657111 11993737 11589843 11444433 10861749 10339448 10025904 9689785 9422588
5551 9422588 8980069 8701949 8597666 8328262 8076993 7697798 7499528 7231736 7095194 6898856
5541 6898856 6981623 6912799 6389659 6517842 6716237 6440431 5944605 5900371 5940705 5652739
5531 5652739 5392912 5208850 5075260 5167590 5052174 4937871 5038608 5149926 4990301 4733805
5521 4733805 4545467 4632908 4625480 4432964 4182753 4098619 4073386 4179806 4155394 4003832 3905625
5510C905625j63031j1847l14441j78056K22886M7272l5473N8600j60763q0868
5500C289904k31536k73208L6135J99402p5297j11413L46452k61387k59080j9332
5490B640640P3011l8355r152J2142l0928m935J38357j45198J84862k67150k53204
5479B300090r816k13032m9966K88127r1447K8175J7678P6639l4140P4089J92323
5468B578720n7230J31853l6299j71962p449L14341q2422K35535j96073J2457J5515
5457B736986L37131l26765j0385J41553k22265l06159K8712L1419j81907n7898
5447B170422N4112L8045j50718j82734K75590j40593m3396L29474l00109j89910
5437A860183j95422M4674j30743L58686j41996Q0643L456L9299j46498o2418j12798
$$ plain form
5510 3905625 3742594 3730747 3416306 3238250 3461136 3508408 3472935 3531535 3370772 3289904
5500 3289904 3058368 2785160 2821295 3020697 2945400 2833987 3180439 2919052 2659972 2640640
5490 2640640 2713651 2675296 2666144 2678286 2647358 2642423 2780780 2635582 2820444 2553294 2300090
5479 2300090 2290274 2077242 2027276 2315403 2223956 2252131 2269809 2346448 2312308 2386397 2578720
5468 2578720 2521490 2653343 2617044 2445082 2437633 2751974 2669552 2905087 2709014 2721471 2736986
5457 2736986 3074117 2747352 2736967 2878520 2656255 2350096 2378808 2410227 2228320 2170422
5447 2170422 2224534 2262579 2111861 1929127 2204717 2064124 2020728 2350202 2050093 1860183
5437 1860183 1664761 1709435 1578692 1937378 1795382 1876025 1879481 1918780 1772282 1709864 1597066
5426A597066j78737K75565p8242J06610N2483j02406j89070R7725M8043P8282
5416A707319R357j23163R1212J49361j65559J16516K14337r5662k30384l01383
5406A371951j7606J72675M1375R2172Q8768p7664p458Q0589J26816k7860p5193
5395A768565J88371J56138j60308m06247j04015J36686J81933Q8734L1816J09060
5385A990733j82762R9052n3605j87758j70044q3461K14826j44402Q939j41838
5375A349680R6656r780n1511M7743q176K35561m9059j46154l6547j56115O4745
5364A337043o6901Q5402J20405j06931m44331J64748K4353k15657J46463N8430
5354A103024J29789n6237J2417J2910j66324j8851n7940K27006L17198j50800
$$ plain form
5426 1597066 1418329 1693894 1615652 1722262 1774745 1672339 1483269 1580994 1629037 1707319
5416 1707319 1716676 1593513 1684725 1834086 1668527 1785043 1999380 1903718 1673334 1371951
5406 1371951 1354345 1527020 1568395 1660567 1749335 1671671 1664213 1744802 1871618 1843758 1768565
5395 1768565 1956936 2113074 1952766 1546519 1442504 1579190 1761123 1849857 1881673 1990733
5385 1990733 1807971 1907023 1853418 1665660 1495616 1412155 1626981 1482579 1491518 1349680
5375 1349680 1446336 1436556 1385045 1432788 1424612 1660173 1611114 1464960 1428413 1272298 1337043
5364 1337043 1270142 1355544 1475949 1369018 924687 1089435 1113788 898131 1044594 1103024
5354 1103024 1232813 1176576 1188993 1201903 1035579 1016728 958788 1185794 1502992 1352192
5344A352192m4068K46760j11847p8663J65558j2392l76975j6110Q9280j30529
5334A083206K45521k39085O328p2718j73928L64864Q7506J24123n9591j21238
5324A244988J4825m6872n005j30471Q5605J49742K3177J61158J02347j86256r8009
5313A315229p3205J51594O786O3510L0642J47576Q0128m2856l9264R9441j71350
5302A568231r3279j19897l6190K46395M40184j67839o47J83331j69560J61856
5292B012585p528R541M0043l1791k38347P0326P760J72386J05021m65245q5070
5281A589681J23931L6294J34609j45519K50225Q191K8900J18294k10974j7592
5271A916040k10593O0829j82744J56642L7103L39307m5902j97448k32950j81P6851
$$ plain form
5344 1352192 1308124 1554884 1443037 1364374 1529932 1517540 1140565 1124455 1213735 1083206
5334 1083206 1328727 1089642 1095970 1023252 849324 1214188 1301694 1425817 1366226 1244988
5324 1244988 1259813 1212941 1207936 1077465 1163070 1312812 1335989 1497147 1599494 1413238 1315229
5313 1315229 1242024 1393618 1400404 1463914 1494556 1642132 1722260 1679404 1640140 1739581 1568231
5302 1568231 1474952 1355055 1318865 1565260 2005444 1837605 1836958 2020289 1850729 2012585
5292 2012585 2005057 2014598 2054641 2022850 1784503 1854829 1862589 2034975 2139996 1674751 1589681
5281 1589681 1713612 1749906 1884515 1738996 1989221 1997412 2026312 2144606 1933632 1916040
5271 1916040 1705447 1766276 1583532 1740174 1777277 2116584 2070682 1873234 1640284 1640103 1716954
5260A716954O3176J57058j16970M0291j482j72258K31230K23889Q8220j09784
5250B120324o237J28062J30142r6124J3655p6713J74594J46048j56549l8721l84575
5239A953906O1664J42753L04548r8604k1577O3330M8415j12787O7547J6117l2209
5228B393103R5948N0369j81403J25795R2401J61056P9243J35829J57796k6439
5218C083698j96085n9189n3790j02774n3815K40321N7789j30965K7089j25841
5208B686438k6941K09309J30128j03514O3036J05245J8802j47940l9794J59061
5198C053830r1686j4J61184j08837K5356k29514M2464J78651j9738N7573l9888
5187C029381J9447l79576l5273J33199L5183l05277Q0990J9708j33638K9030J32760
$$ plain form
5260 1716954 1780130 1937188 1820218 1860509 1859027 1686769 1917999 2141888 2230108 2120324
5250 2120324 2114087 2242149 2372291 2276167 2289822 2213109 2387703 2533751 2377202 2338481 1953906
5239 1953906 2015570 2158323 2462871 2364267 2342690 2406020 2454435 2341648 2409195 2425312 2393103
5228 2393103 2489051 2539420 2358017 2483812 2576213 2737269 2816512 2952341 3110137 3083698
5218 3083698 2887613 2828424 2774634 2671860 2618045 2858366 2916155 2785190 2812279 2686438
5208 2686438 2659497 2868806 2998934 2895420 2958456 3063701 3082503 2934563 2894769 3053830
5198 3053830 2962144 2962130 3123314 3014477 3039833 2810319 2852783 3031434 3011696 3069269 3029381
5187 3029381 3048828 2669252 2633979 2767178 2802361 2497084 2578074 2597782 2464144 2493174 2625934
5176B625934K36765M0517R4677k9159M781J54361Q0943l2793n8243K35821M2993
5165C396597j24716k62597k9182o4323J91234K03986r367q0862L3429j18556J56604
5154C292247L52174J98820o0438Q825P7883L3998K78452j96605J05459J27602
5144D218417M3646k76291P3698J44845j79766M1042J13316O137J43242J9697L50677
5133D698660k70629j84558O6218K34597L07798L97392O29760K34466J175K37191
5123F352070o0734r7627o5097l26938j51754j37553r2171j24747m41858j86893
5113D666698l7638J21426k77498k40862J54970M647J74719J0545j72940o9194
5103D334873K404k3512L8938J05214L72k1888l40523L6997K54164L0311Q0243
$$ plain form
5176 2625934 2862699 2903216 2997893 2968734 2973515 3127876 3208819 3176026 3117783 3353604 3396597
5165 3396597 3271881 3009284 2980102 2915779 3107013 3310999 3301632 3220770 3254199 3135643 3292247
5154 3292247 3644421 3843241 3782803 3791628 3869511 3903509 4181961 3985356 4090815 4218417
5144 4218417 4262063 3985772 4059470 4204315 4024549 4065591 4178907 4185044 4328286 4347983 4698660
5133 4698660 4428031 4243473 4309691 4544288 4852086 5249478 5879238 6113704 6114879 6352070
5123 6352070 6291336 6193709 6128612 5801674 5649920 5512367 5420196 5295449 4853591 4666698
5113 4666698 4629060 4750486 4472988 4232126 4387096 4391743 4566462 4577007 4404067 4334873
5103 4334873 4337277 4313765 4352703 4457917 4458289 4436401 4095878 4132875 4387039 4417350 4497593
5092D497593j09607l04452j0132q9407P5388M4961L6847Q2959O3468m8577P8035
5081D317076N7417j59322k68579k1852L69058k9084J07735o6054K13941q3853
5071D436483j14659R7822q6262l9734K03328l6698r1234j84055J30765j69007
5061D146749M2222L81990J42582K026k2725J58192J41915N3356k70398N8007J71329
5050E005245Q9209K78721p3033Q7936J08603r0346J89674O7493K09633K24225
5040F097360J55414J57319N40034K56086K23252M37457l2067M63874J95659R9395
5030H593783N1017P978j72606J29551M26863K7675r0506K04860j38938m2653K08223
5019I205247J6902J32539J82503J09052J49044M30454M43129K02746J6494M71641
$$ plain form
5092 4497593 4387986 4083534 4073402 3983995 4059383 4104344 4141191 4224150 4287618 4239041 4317076
5081 4317076 4374493 4215171 3946592 3924740 4293798 4264714 4372449 4306395 4520336 4436483
5071 4436483 4321824 4419646 4333384 4293650 4496978 4460280 4369046 4184991 4315756 4146749
5061 4146749 4188971 4570961 4713543 4715569 4692844 4851036 4992951 5046307 4775909 4833916 5005245
5050 5005245 5094454 5373175 5300142 5388078 5496681 5406335 5596009 5663502 5873135 6097360
5040 6097360 6252774 6410093 6950127 7206213 7429465 7866922 7834855 8298729 8494388 8593783
5030 8593783 8644800 8652778 8480172 8609723 9036586 9064261 8973755 9178615 9039677 8997024 9205247
5019 9205247 9222149 9354688 9537191 9646243 9795287 10225741 10668870 10871616 10888110 11359751
5009A1359751L27708K99038J5299J01020L30415K61385L36747N64300R5174r0534
4999A3600303K35983L64413K06109K55109J19220K37776K15432M15337O67696
4990A6317378K80292J65793O36488N59598J84394M63098O90026M83968L85929
4981B0166964N85496M44559O09176O61195K27789N21511N37707O48352M94363
4972B4897112M74125P37190N62316P84807O18414N73524Q31017P54069N98271
4963C0830845Q92075J269470J251667J359993J582297J571424J773681J709632
4955D2241084J929053K167467K767017K925442L018765L365958L565381L602125
4947F5582292M316088M595810M683066M836110N389148N744861O034172O706541
$$ plain form
5009 11359751 11687459 11986497 12001796 12102816 12433231 12694616 13031363 13595663 13690837 13600303
4999 13600303 13836286 14200699 14406808 14661917 14781137 15018913 15234345 15649682 16317378
4990 16317378 16597670 16763463 17399951 17959549 18143943 18607041 19297067 19781035 20166964
4981 20166964 20752460 21197019 21806195 22467390 22695179 23216690 23754397 24402749 24897112
4972 24897112 25371237 26108427 26670743 27455550 28073964 28647488 29478505 30232574 30830845
4963 30830845 31722920 32992390 34244057 35604050 37186347 38757771 40531452 42241084
4955 42241084 44170137 46337604 49104621 52030063 55048828 58414786 61980167 65582292
4947 65582292 69898380 74494190 79177256 84013366 89402514 95147375 101181547 107888088
4939A07888088O924472P569772Q076354Q381690R055680R312648R602401J0082082
4931A76893187J0626049J0456679R581556Q816641P383313N239058K820317o1029
4923B31755771k504699m320759o116195p292958p780370q031057q530520q688534
4915A78490679q867746r222315r409606r921208r805561r424088r228072p951222
4907A04660861p154622o609881n907382n112514m599305m306347l557628l517681
4899F3895501k412167k248419k411115j723008j744532j446623j544563j737250
4891D8627824j690372j766724j468384j822929j816604j611857j923492j285109
4883C5242353j289214j318622j392014j033046p55295m13749j056307q27158l10527
$$ plain form
4939 107888088 114812560 122382332 130458686 138840376 147896056 157208704 166811105 176893187
4931 176893187 187519236 197975915 207557471 216374112 223757425 228996483 231816800 231755771
4923 231755771 229251072 224930313 218814118 211521160 203740790 195709733 187179213 178490679
4915 178490679 169622933 160400618 150991012 141069804 131264243 121840155 112612083 104660861
4907 104660861 97506239 90896358 84988976 79876462 75277157 70970810 67413182 63895501
4899 63895501 61483334 59234915 56823800 55100792 53356260 51909637 50365074 48627824
4891 48627824 46937452 45170728 43702344 41879415 40062811 38450954 36527462 35242353
4883 35242353 33953139 32634517 31242503 30209457 29454162 29040413 27984106 27156948 26846421
4874B6846421n11298r04557q79687n62827p57047p14485o64783n76627p69445
4865B0505665n65202k55189o42610p34208k87010m15369m61828n70292l68303
4856A6205654k96023l02728j33054k49531N6110J66736L83446l35544r6435J15163
4846A5513794j39605j73768n10580m37558k02392k91189n37645k18242n16416
4837A2486399o32358k49223O0190o8385o1454o06379l01311l2170r3003l64227
4827A0138079l38296k90482K9119O8270N862J19886j69664k63698k93239p6331
4817H929506k54916M4379J54580r3982j83942K57208j04335k31444P845r9734
4807H425165L25650q0816k94316M4052P8568N4041P369M7894J01203J23569l7426
$$ plain form
4874 26846421 26335123 25430566 24550879 23988052 23231005 22516520 21851737 21275110 20505665
4865 20505665 19940463 19685274 19042664 18308456 18021446 17606077 17144249 16573957 16205654
4856 16205654 15909631 15606903 15473849 15224318 15280428 15447164 15830610 15495066 15398631 15513794
4846 15513794 15374189 15200421 14689841 14252283 14049891 13758702 13221057 13002815 12486399
4837 12486399 11854041 11604818 11665008 11596623 11535169 10928790 10627479 10595309 10502306 10138079
4827 10138079 9799783 9509301 9538420 9606690 9612552 9732438 9562774 9299076 9005837 8929506
4817 8929506 8674590 8718969 8873549 8779567 8595625 8852833 8748498 8517054 8524899 8425165
4807 8425165 8750815 8669999 8375683 8419735 8498303 8552344 8559713 8607607 8708810 8832379 8794953
4796H794953K18669R9071J41816J74172J38507K73404J33153r9359K11107J21706
4786A0207199j02900J32051N3724n2092K48016R4199L1147J62389J2660L06553
4776A1092946J19700M19934K32839L98810K5811J74212M30278l7204J64678K81029
4766A3303033L322K55179N40230M0019L35539P09401O09885N53497N08543L21612
4756A7180260P57730R36505R32971L60029P07533Q24780Q05884J544829J274780
4747B5325301J718821J115905J194395J441647J503691K170352K227936K395395
4739C9093443K829104K970927L104880L507859M108720M838988N295919N887906
4731G1637746O572334P160299Q279525R472201J1655816J4501526J8472687K3642185
$$ plain form
4796 8794953 9013622 9112693 9254509 9428681 9567188 9840592 9973745 9874386 10085493 10207199
4786 10207199 10104299 10236350 10290074 10237982 10485998 10580197 10611344 10773733 10786393 11092946
4776 11092946 11212646 11632580 11865419 12264229 12290040 12464252 12894530 12857326 13022004 13303033
4766 13303033 13306355 13561534 14101764 14141783 14477322 15186723 15796608 16350105 16858648 17180260
4756 17180260 17937990 18874495 19807466 20167495 20875028 21699808 22505692 24050521 25325301
4747 25325301 27044122 28160027 29354422 30796069 32299760 34470112 36698048 39093443
4739 39093443 41922547 44893474 47998354 51506213 55614933 60453921 65749840 71637746
4731 71637746 78210080 85370379 93649904 103122105 114777921 129279447 147752134 171394319
4723A71394319K6377807K5574894K3278974J8258839J0935047K867314l501873
4716B75185321j8631821k8319090k4702799k3276473j9532994j5352061j2088060
4709A33282023j1091362r956170r554335q759456p994331o696894n717394n281359
4701F8230722m397132l526399l439071l302502k873585k471615k065504j981553
4693D4173361j651667j492180r84762p19734l67688m94007k09498O4134o4657
4684C8253302K48030N71352P14152N54984P09404R32568J240576J320937J592657
4675D6137962J855245J721345K123620K793392K871628L237068L742486L936091
4667F8418837M760339N207727O008241O914161P240695P898071R597242J1483058
$$ plain form
4723 171394319 197772126 223347020 246625994 264884833 275819880 278687194 275185321
4716 275185321 256553500 228234410 203531611 180255138 160722144 145370083 133282023
4709 133282023 122190661 112234491 102680156 93920700 85926369 79229475 73512081 68230722
4701 68230722 63833590 60307191 56868120 53565618 50692033 48220418 46154914 44173361
4693 44173361 42521694 41029514 40044752 39325018 38957330 38463323 38253825 38317959 38253302
4684 38253302 38501332 39072684 39786836 40341820 41051224 41983792 43224368 44545305 46137962
4675 46137962 47993207 49714552 51838172 54631564 57503192 60740260 64482746 68418837
4667 68418837 73179176 78386903 84395144 91309305 98550000 106448071 116045313 127528371
4659A27528371J3641186J6220313J8729525K1633831K2621292K0860266J7675341
4652B58910125J1967024N499576n55523p644382j5904767k0324313k0689205j9433677
4644A91824858j7307764j4772162j3263702j1533394j0616347j0013761r277268
4637A05040460q354035p582520o488015n703225n373708m845643m771584m302346
4629E7619384m187676l684699l402339k745483k372131k621619k096319j856165
4621C4652953j873297j512256j552214j237153j055892j071330j293854j050920
4613B4006037r72759p34101r56924o66474m51011o54950q50532r32138n30808
4604A7256340k90502n37966m55621n93094o59517p30908p48824l45546j46622
$$ plain form
4659 127528371 141169557 157389870 176119395 197753226 220374518 241234784 258910125
4652 258910125 270877149 276376725 275821202 268176820 252272053 231947740 211258535 191824858
4644 191824858 174517094 159744932 146481230 134947836 124331489 114317728 105040460
4637 105040460 96686425 89103905 82615890 76912665 71538957 66693314 61921730 57619384
4629 57619384 53431708 49747009 46344670 43599187 41227056 38605437 36509118 34652953
4621 34652953 32779656 31267400 29715186 28478033 27422141 26350811 25056957 24006037
4613 24006037 23033278 22299177 21342253 20675779 20224768 19569818 18719286 17787148 17256340
4604 17256340 16965838 16427872 15972251 15379157 14719640 13988732 13239908 12894362 12747740
4595A2747740l34984l54452j23179l20815m37007m74538l27685k80986k96247
4586I797847k57498l2536R979l22542k89373l8548j86432j54231j65184k04850
4576H156632n9947k59225J01208n1611k10343q5958k29141m9655j76042p8609
4566G057309l03386K7228j93626J1247m3485l52854l9090j61585n8772j94999
4556E747987r1869J56834k20447k43409J35349R4645L4723j04963r54J77706J39902
4545E825504p0962K9013K23187K4214j62205l34430J95274K14459o948J70628
4535F107734J80410p6758L0176K96700N2427J96533J10335k00692P4943j26763
4525F645045k27848K6598k24565K96286p7666L1050J65087K6152K53633K1459
$$ plain form
4595 12747740 12412756 12058304 11935125 11614310 11177303 10702765 10375080 10094094 9797847
4586 9797847 9540349 9507813 9517792 9195250 8905877 8867329 8680897 8526666 8361482 8156632
4576 8156632 8096685 7837460 7938668 7887057 7676714 7590756 7361615 7311960 7135918 7057309
4566 7057309 6753923 6781151 6587525 6598772 6555287 6202433 6163343 6001758 5942986 5747987
4556 5747987 5656118 5812952 5592505 5349096 5484445 5579090 5613813 5508850 5507896 5685602 5825504
4545 5825504 5754542 5783555 6006742 6030956 5868751 5534321 5729595 5944054 5937106 6107734
4535 6107734 6288144 6211386 6241562 6538262 6590689 6787222 6897557 6696865 6771808 6645045
4525 6645045 6417197 6443795 6219230 6515516 6437850 6468900 6633987 6660139 6913772 6935231
4515F935231J04146r5263k41543l51449k48863l76533j73997l51232k85262n01567
4505D413668m00508K649k15714j84430k18743k61907j22258l1107p8767k19J00332
4494C002996l23733j46233l3582n5454O4744j41126N590J02727k70117k26803
4484A979009k7719k94029p8764o3439k03640K3486K06492O1755k27750L3710K11179
4473A620290J00852o532j1537p7546j99269J62959j11173N4368m6840J1644j52228
4462A344988L89460o3233o4030K56993j88761j2001L3777j14472r1358j34586
4452A356777n3414j04662J83843J80329j21296j42833j17161K00097k7001j58106
4442A196573k1130K75101J20836j74959K44967J30505k70696j88586J87289L36586
$$ plain form
4515 6935231 7039377 6944114 6702571 6351122 6102259 5725726 5551729 5200497 4915235 4413668
4505 4413668 4013160 4015809 3800095 3615665 3396922 3135015 3012757 2981650 2902883 2902664 3002996
4494 3002996 2679263 2533030 2499448 2443994 2508738 2367612 2373202 2475929 2205812 1979009
4484 1979009 1951290 1657261 1578497 1515058 1311418 1334904 1541396 1603151 1375401 1409111 1620290
4473 1620290 1721142 1714610 1703073 1625527 1426258 1589217 1478044 1532412 1485572 1497216 1344988
4462 1344988 1734448 1671215 1607185 1864178 1675417 1663416 1697193 1582721 1491363 1356777
4452 1356777 1303363 1198701 1382544 1562873 1441577 1298744 1181583 1381680 1354679 1196573
4442 1196573 1175443 1450544 1571380 1396421 1641388 1771893 1501197 1312611 1499900 1836486
4432A836486L3450J55321O6856k99243k10657O8257r780j38288j98344L48880
4422A652938l13723J43200L49955j90639O8027K2963j32617J82891l09881l34419
4412A138695Q9645K60445O2570M6019L4762M6349K34504K6447r2026K7342R437
4401A884189K40448J12729n8968j48931k89543k07133M4648l1138o3090p9276
4391A403935k91296O5355J66344q164k15309k2436J37923M2086k70814o2251K30899
4380A176272R2206k78550j84544m1657J13836N2648R1746L734j53959R3748J58416
4369A123896k55801k47983J53144K59699J18826o7425K10688m6079m2974L8862
4359A244853J11539N9054k05672J30675K66183K62806J44260J05918j18510q2044
$$ plain form
4432 1836486 1869936 2025257 2092113 1792870 1582213 1650470 1640690 1502402 1304058 1652938
4422 1652938 1339215 1482415 1832370 1641731 1709758 1732721 1600104 1782995 1473114 1138695
4412 1138695 1228340 1488785 1551355 1597374 1632136 1678485 1912989 1939436 1847410 1874752 1884189
4401 1884189 2124637 2237366 2178398 2029467 1739924 1532791 1577439 1546301 1483211 1403935
4391 1403935 1112639 1177994 1344338 1336174 1120865 1098429 1236352 1278438 1007624 945373 1176272
4380 1176272 1268478 989928 805384 763727 877563 930211 1021957 1025691 871732 965480 1123896
4369 1123896 868095 620112 773256 1032955 1151781 1084356 1295044 1248965 1205991 1244853
4359 1244853 1356392 1415446 1209774 1340449 1606632 1869438 2013698 2119616 2001106 1919062
4349A919062m9340m4701p1500K45871k8302N8193J31449p8029j70380P0262k49377
4338A733208p5564o654k59237m5455j17925o1334k09288N286J67077L7078J4942
4327A182134J84409p8933j89696k02061K31535j090j89269R6933j12597N2169
4317I73534q3999K7054N9177K17130o7315p9408J93906j15996R2226R3762N524
4306A315595J46970L4528N7952L5073J55919r7234j17822p7342r2902J12606P5438
4295A548781j63746M4787K02275P9448J16651j40282j01151L22407l35493j7119
4285A556558K09437J69964J01578K609j24342j27118K01834k42308L49505P0275
4275B167992J44480k51614j19353L01829K31283J337j47609j78239M25771J87448
$$ plain form
4349 1919062 1869722 1825021 1753521 1999392 1971090 2029283 2160732 2082703 1912323 1982585 1733208
4338 1733208 1657644 1650990 1391753 1346298 1228373 1167039 957751 963037 1130114 1167192 1182134
4327 1182134 1366543 1287610 1097914 895853 1127388 1126298 937029 1033962 921365 973534
4317 973534 889535 916589 975766 1192896 1125581 1046173 1240079 1124083 1216309 1310071 1315595
4306 1315595 1462565 1497093 1555045 1590118 1746037 1648803 1530981 1453639 1360737 1473343 1548781
4295 1548781 1385035 1429822 1632097 1711545 1828196 1687914 1586763 1909170 1573677 1556558
4285 1556558 1765995 1935959 2037537 2040146 1915804 1788686 1990520 1748212 2097717 2167992
4275 2167992 2312472 2060858 1941505 2243334 2474617 2475954 2328345 2150106 2575877 2763325
4265B763325q2346J48312J60592J34924Q1485m2656p7613J24519J41318N8466
4255C410326J27575q5255J06127M4277Q887M13808Q5729J31927L33023J66136
4245D742560q2038K0320L66375M21725J72234j95181q7858M49729O56342K1366
4235F485574j3323J26156J75686K76411J28022J86571L03193J12312O6413L21369
4225H168384J90245J29344K12737K46278O6717K17354K06346J0131K67986O20846
4215A0336368K53257m366N4655j5213K44427J23983M28579M44626j17248j86654
4205A1562414N8279J88614P5447p4850j76625J96304M12030k76612L7253J77303
4195A2179557k67724j32754q4299J86118N7708J02789k63737k19789J27160L3498
$$ plain form
4265 2763325 2680979 2829291 2989883 3124807 3206292 3163636 3086023 3210542 3351860 3410326
4255 3410326 3537901 3452646 3558773 3603050 3611937 4025745 4111474 4243401 4576424 4742560
4245 4742560 4660522 4680842 5047217 5468942 5641176 5445995 5358137 5807866 6464208 6485574
4235 6485574 6472251 6598407 6774093 7050504 7178526 7365097 7668290 7780602 7847015 8168384
4225 8168384 8358629 8487973 8700710 8946988 9013705 9231059 9437405 9447536 9715522 10336368
4215 10336368 10589625 10585259 10639914 10624701 10869128 10993111 11421690 11866316 11749068 11562414
4205 11562414 11620693 11809307 11884754 11809904 11633279 11829583 12241613 11965001 12002254 12179557
4195 12179557 11911833 11779079 11694780 11880898 11938606 12041395 11777658 11557869 11685029 11718527
4185A1718527m00735M8104J01923j54123k84639K23334k86191l71122r6373N6377
4175A0555082R6228l79386k08890o6766l98006k89855P6754j70758l23250l59014
4165H532139m17746p6289l38217j95105J41386l1541m07776j14760L8885m66030
4155F664946j67779k63245j03566l17563o0351k6659R5640j53747k59983l49312
4145E058381j97926P1101L23587k33446m47879k69533j52478Q5944j29532r7337
4135D010882l6859l37028k07084j38884k61613L9500q6514Q1486O7854n9917m17627
4124B654196r2630N8264O1143Q5921l1087j62110J2895j43738Q3563j13704k2491
4113B390222j77150p5991r9219O1123P6510n78805J20007Q4711N6959K0295J14314
$$ plain form
4185 11718527 11317792 11365896 11467819 11313696 11029057 11252391 10966200 10595078 10498705 10555082
4175 10555082 10651310 10271924 10063034 9996268 9598262 9308407 9385161 9214403 8891153 8532139
4165 8532139 8114393 8038104 7699887 7504782 7646168 7614627 7206851 7092091 7130976 6664946
4155 6664946 6497167 6233922 6130356 5812793 5752442 5725783 5821423 5667676 5407693 5058381
4145 5058381 4860455 4931556 5255143 5021697 4573818 4304285 4151807 4237751 4108219 4010882
4135 4010882 3974023 3636995 3429911 3291027 3029414 3068914 2982400 3063886 3131740 3071823 2654196
4124 2654196 2561566 2619830 2680973 2766894 2735807 2573697 2586592 2442854 2526417 2412713 2390222
4113 2390222 2213072 2137081 2037862 2098985 2175495 1596690 1716697 1801408 1858367 1878662 1992976
4102A992976k33542j24847j22576k60630j13484J76005J18958j12695J36905k8135
4092A428935K15113l24426j75594L37931p838j47996j00328J7675K9264J04123
4082A376859j0105m158j52056k8752J9981N2533j5613j51169j47365l9446o475
4071H94234q9935O3840j23252j16638J0632L59600j45177k18329k10282n9506
4061C65187J17221J41040Q8548r2347K2290L70518j03973n3707n8746j29327J61588
4050H28292j63919J39018k9806k43432j9380J86577p4858J71692j22258q9076
4040E82850m4630Q3703k3974p0405k55848J19485P5365k49407J22295K84735j09665
4029E14504j16087j66215q811p2390o1376J66109J54572j07057J67224k27353
$$ plain form
4102 1992976 1759434 1634587 1512011 1251381 1137897 1313902 1432860 1320165 1457070 1428935
4092 1428935 1644048 1319622 1144028 1481959 1474121 1326125 1225797 1243472 1272736 1376859
4082 1376859 1366754 1362596 1210540 1181788 1201769 1254302 1238689 1087520 940155 900709 894234
4071 894234 804299 868139 744887 628249 638881 998481 853304 634975 424693 365187
4061 365187 482408 623448 711996 619649 641939 1012457 908484 854777 796031 666704 828292
4050 828292 664373 803391 773585 530153 510773 697350 622492 794184 671926 582850
4040 582850 538220 621923 597949 527544 271696 391181 466546 217139 339434 624169 514504
4029 514504 398417 232202 223391 151001 89625 255734 410306 303249 470473 243120
4019B43120n7363M2636l1890Q658j79233J43452J68267k19119j39317k9959K8649
4008b2099J96564j49957J12536j42433j13374k5122K38775j89776k3604J54460
3998C5970l5991q6447j5806l6916j5394p6800K25753m7103n2559m9237l3843J0669
3986a77704J90683J09998k49300R8785k04768J69270N7067N9371Q8732l22177
3976a80043R4137K2793j11471Q2945J98279o160j1573n882j24380O9861j84823
3965a56317M36138k94869j6065J01020p6739K75810j21101l03457o4138J49805
3955f9913m2172P290j46912J51000K52049q2934r6219k0575K2272J34859j85421
3944g6676r7098J13328M1842p5711J05725M2275j61661k35518K04129M379K43447
$$ plain form
4019 243120 185757 228393 196503 205161 25928 169380 337647 118528 -20789 -50748 -22099
4008 -22099 174465 24508 137044 -5389 -118763 -143885 94890 -94886 -118490 35970
3998 35970 -21 -86468 -102274 -139190 -154584 -231384 -5631 -52734 -105293 -154530 -188373 -177704
3986 -177704 12979 122977 -126323 -27538 -232306 -63036 -5969 53402 142134 -180043
3976 -180043 -85906 -63113 -174584 -91639 106640 100480 88907 83025 -41355 28506 -156317
3965 -156317 279821 -15048 -31113 69907 -6832 268978 147877 -155580 -219718 -69913
3955 -69913 -112085 -104795 -251707 -100707 151342 68408 -27811 -48386 -26114 108745 -76676
3944 -76676 -173774 -60446 -18604 -94315 11410 53685 -107976 -343494 -139365 -134986 108461
3933A08461n9818j62004O412K8304l3909k6843q3044N7889p5847J8073J23403
3922i8923K11272o6618P2223J0573j10563n9727k19771J08345J44561O2692j42005
3911h7941l02852J5741R5673m6965l5271L05319Q2199o9693J09302k32525p2424
3900b39437Q9000l0727n878K3056r3399P3584J90271J18426j55628N9306p8417
3889d9843j16962R97K01585J0900J22564K7173j75941M303j07467k82878R9686
3878b65883j9371j02985m9524R2273K25607M6980K34032j39854l65130Q1268K2911
3867b39676O6882K36428j0549l80664n3009M30837j49626J2016J55178q7236J07267
3856H7848Q5409l48106J39823L00925k96856J14985n8313J39629L0638j97960
$$ plain form
3933 108461 48643 -113361 -106949 -78645 -112554 -139397 -222441 -164552 -240399 -222326 -98923
3922 -98923 112349 45731 117954 128527 17964 -41763 -261534 -153189 -8628 54064 -87941
3911 -87941 -390793 -375052 -279379 -326344 -361615 -56296 25903 -43790 65512 -167013 -239437
3900 -239437 -150437 -181164 -187042 -163986 -257385 -183801 6470 124896 -30732 28574 -49843
3889 -49843 -166805 -165808 35777 46677 169241 196414 20473 24776 -82691 -365569 -265883
3878 -265883 -285254 -388239 -437763 -345490 -119883 -72903 161129 21275 -343855 -262587 -239676
3867 -239676 -172794 63634 53085 -327579 -380588 50249 -99377 -87361 67817 -19419 87848
3856 87848 173257 -174849 -35026 265899 -30957 84028 25715 165344 195982 -1978
3846a978j64689O6789M13757p3661j46275k6566M113j81329j65797J20400J32013
3835b3223l05537l52693K05198o6123J97770Q3741j53184N3628K57725q1089m9660
3824b33447J73785J51449k95748j67537K69219j0057J68818j04469j79503l9960
3814b67450j9399K51434R7994l0089k34176J63683P0033k24101k544r2731k9292
3803c16638Q2944J74260k65698q5669K85728M1539o1450j42437r8579K27416L0590
3792a27994k89673J11120N6704k2591J32747k6823N7490R9952J0759j9502K00000
3781A82189j66568Q7188P8993m02206J38027J17363l1900L7182j65948k15056
3771c40736K64306K15608o7576j06088J64034K41763j61753K89277k74475k40850
$$ plain form
3846 -1978 -166667 -99878 313879 240218 93943 67377 71490 -109839 -275636 -155236 -23223
3835 -23223 -328760 -681453 -476255 -542378 -344608 -260867 -414051 -360423 -102698 -183787 -233447
3824 -233447 -59662 91787 -203961 -371498 -102279 -112336 56482 -47987 -227490 -267450
3814 -267450 -286849 -35415 62579 32490 -201686 -38003 32030 -192071 -194615 -287346 -316638
3803 -316638 -233694 -59434 -325132 -410801 -125073 -83534 -144984 -287421 -386000 -158584 -127994
3792 -127994 -417667 -306547 -249843 -272434 -139687 -166510 -109020 -9068 1691 -17811 182189
3781 182189 15621 102809 181802 -220404 -82377 34986 3086 40268 -125680 -340736
3771 -340736 -76430 139178 71602 -34486 129548 371311 209558 498835 224360 -16490
3761a6490N8136N7899J98214q5860P3130J82497N6602k19484j62674J05951J76973
3750D24894o7310j74421J18674J10395j32254j65088j1303j74970k12075L60453
3740G6995J87847k99613K4692L94093r6964p1163l10803k35104M09233j66977
3730h7764J08867J74465n3467O2088k94418j16088l8171J15913J27209n6449j10809
3719a68624J7989J15304L4426o8785K5783M8527m5825j20396n0355K4192l9440
3708b27204J24121J35481P438l6111q9783j43268R8786K49041m6372r9159j60271
3697a87301J56941K41655m37974K35814K52373j48046l47192J41480m4495O760
3687a29985n6883j6763J5916Q3460n7603J14511J86698K02074k84277R3828j38731
$$ plain form
3761 -16490 41646 99545 297759 211899 285029 467526 524128 304644 141970 247921 424894
3750 424894 357584 183163 301837 412232 279978 114890 103587 -71383 -283458 76995
3740 76995 264842 -34771 -10079 384014 287050 215887 -94916 -330020 79213 -87764
3730 -87764 21103 195568 142101 204189 -90229 -206317 -244488 -128575 -1366 -57815 -168624
3719 -168624 -150635 -35331 -905 -69690 -43907 4620 -41205 -161601 -211956 -187764 -227204
3708 -227204 -103083 32398 39836 3725 -86058 -229326 -130540 118501 72129 -27030 -187301
3697 -187301 -30360 211295 -226679 9135 261508 113462 -233730 -92250 -136745 -129985
3687 -129985 -186868 -203631 -187715 -104255 -161858 -47347 139351 341425 57148 150976 12245
3676A2245J09194J1425j42088j24008J9868J4818j25797J57013J05853l32015
3666b93492M0741K38883L8252K1863j60023r1938k20872K24966L3779K00510j53136
3655a20467k5932k28213K86586N0453K3293o5641n2172l4765P1840m3226Q2788
3644e5456J25181j09236k72702P9632j424M4650K11462K6749k34387Q0296J52763
3633D7528j38136R1407M5507r9037k81417M5568K75379J26247Q7837l24812P6151
3622d7778j21070K79010j790k6068K17925J18872j90273J00484j37658k20793
3612b9139j3576K3667Q908p0473L9109J40770J25242l60221k1545J68286K44982
3601B56010j05820j25528J43357L846r3002R7055j81155K09049K0160k23496k43562
$$ plain form
3676 12245 121439 132864 -9224 -133232 -113364 -98546 -224343 -67330 38523 -293492
3666 -293492 -252751 -13868 24384 46247 -113776 -205714 -426586 -201620 -167841 32669 -120467
3655 -120467 -146399 -374612 -88026 -37573 -14280 -79921 -132093 -166858 -95018 -138244 -55456
3644 -55456 69725 -39511 -312213 -232581 -234005 -189355 22107 48856 -185531 -105235 47528
3633 47528 -90608 799 46306 -52731 -334148 -288580 -13201 113046 200883 -123929 -47778
3622 -47778 -168848 110162 108372 82304 300229 419101 228828 329312 191654 -29139
3612 -29139 -42715 -19048 -10140 -80613 -41504 99266 224508 -135713 -157258 11028 256010
3601 256010 150190 24662 168019 171865 78863 175918 -5237 203812 223972 476 -243086
3590b43086J62890Q4091j47917J05039J12819J61358n641j05910r0745K94945
3580C27843k35150N0942K96400j03373r5996l5036j4405L7621j59742L65240M9288
3569D83632k67280J96262k92994K53233K66947k39999j28055J21457j21428K40227
3559E12002N8915L9062j01374Q371J72596L929j09255j7990L341k02315K44893
3548F12175K69251k25811L1320L3149j05892J432J51893Q8362R038L0000R9079
3537I93996m5826l1224r7809P5515J85160K35173j05227p323j39446o1711K41176
3526A242454l1447l2999J4715Q2813j9308l2320N6013n87q1124l16329L63498
3515A245379M46016J46088K9308O2136j10815j24119J62798K39311J55512J45394
$$ plain form
3590 -243086 -80196 3895 -144022 -38983 73836 235194 229553 123643 32898 327843
3580 327843 92693 143635 440035 336662 240666 205630 191225 228846 69104 434344 483632
3569 483632 216352 412614 119620 372853 639800 399801 271746 393203 271775 512002
3559 512002 570917 609979 508605 516976 689572 693501 584246 566256 569597 367282 612175
3548 612175 881426 655615 686935 720084 614192 615624 767517 855879 864917 894917 993996
3537 993996 948170 916946 819137 894652 1079812 1314985 1209758 1202435 1062989 1001278 1242454
3526 1242454 1211007 1178008 1192723 1275536 1256228 1223908 1279921 1279334 1198210 881881 1245379
3515 1245379 1691395 1837483 1866791 1928927 1818112 1693993 1856791 2096102 2251614 2397008
3505B397008J37623j83585J16474o7224l3975m4716K28182p1128j03070K64872
3495B640461K146J17664K06698K65517l00241m4944L45953L09245L25267K18639
3485D086405K16630r1618M1815M32854L78571M6197K65587M72860K4502J40894
3475F014697J58112j96974J81388K53112J59592k04315j75243j18838p5631L9409
3465F035309k17255l03091k90415k57985m76081n647j9708k14393n3224l43724
3455C853786l38665K1762n7359L7386K78691n40772q0655j42050k44352P6720
3445B864492K53344q7410O8875J67847m1317j37053j26912j78494j54491J9709
3435B648590p0724l72323j24788L49356j60472k75352j44023j39822m2776k7559
$$ plain form
3505 2397008 2534631 2351046 2467520 2400296 2366321 2321605 2549787 2478659 2375589 2640461
3495 2640461 2642607 2760271 2966969 3232486 2932245 2887301 3233254 3542499 3867766 4086405
3485 4086405 4303035 4211417 4253232 4686086 5064657 5110854 5376441 5849301 5873803 6014697
3475 6014697 6172809 5975835 6157223 6410335 6569927 6365612 6190369 6071531 5995900 6035309
3465 6035309 5818054 5514963 5224548 4966563 4490482 4484835 4465127 4250734 4197510 3853786
3455 3853786 3515121 3536883 3479524 3516910 3795601 3254829 3174174 3032124 2787772 2864492
3445 2864492 3117836 3030426 3099301 3267148 3225831 3088778 2961866 2783372 2628881 2648590
3435 2648590 2577866 2205543 2080755 2430111 2269639 1994287 1850264 1710442 1667666 1640107
3425A640107j47128K96524j51902j64697n0453K6871J47013l17984L58973J44740
3415A782064P5478l69115m35847J18692J44022J3105l454j34915l3842j60362
3405I95826J99423K58963k55024r4685j45854m193j13891j94752N719K80148M6189
3394I77869N0170p3297k53469J01553L27003q8827N6046m43255k63942J40220
3384E30071O5196J60121m82547J2165K68715K66113j23955l11890J74945j09459
3374D49475q8085J72194j07439M1743l9021j46690K5292K38528n2438j52630O681
3363C47610o9775L6159J96492O7419j95452j43797J00024j05519J7231N5091k17892
3352H7591Q9912J39401n9143q6873J1183R2473k07299N7938J71421j39353j26157
$$ plain form
3425 1640107 1492979 1789503 1637601 1472904 1422451 1449322 1596335 1278351 1637324 1782064
3415 1782064 1857542 1488427 1052580 1171272 1315294 1328399 1324945 1190030 1156188 995826
3405 995826 1195249 1454212 1199188 1104503 958649 954456 840565 645813 651532 931680 977869
3394 977869 1028039 954742 701273 802826 1129829 1041002 1097048 653793 389851 530071
3384 530071 595267 755388 272841 285006 553721 819834 695879 383989 558934 449475
3374 449475 361390 533584 426145 467888 428867 282177 307469 545997 493559 340929 347610
3363 347610 277835 313994 510486 577905 382453 238656 338680 233161 250392 305483 87591
3352 87591 177503 316904 257761 170888 182071 274544 67245 125183 296604 157251 31094
3341C1094M3493K74795k71641p1097L15111R1953j78117J38185M3407J19315j97895
3330C38603M668p5236K1419J55498J9839j87983j15490K2982N3197j34791O6512
3319A69218Q6851q8011J48405J8184o8224m5284j9492q3659j3496J65065o6185
3308B03372k06122k74153J32224K50813J74547R0272k76160p5279j11712o3483
3298a55681p6401K45925N0157k41171j84136Q6631M49887o2836j1450j93278J88717
3287I6364q7267l11500M51802O4451k76587k3981K08108k45249L78955J91185
3277D46281m76808q5719O9090J57276K63650l01612l6399J97183j09439L6515
3267A60018k1089J03575k98409q9345J66014J9347k2746J21139O0686M9469R2557
$$ plain form
3341 31094 74587 349382 77741 6644 321755 413708 235591 373776 417183 536498 338603
3330 338603 343271 268035 289454 444952 464791 276808 161318 184300 237497 102706 169218
3319 169218 256069 168058 316463 334647 266423 221139 201647 117988 104492 269557 203372
3308 203372 -2750 -276903 -144679 106134 280681 370953 94793 19514 -92198 -155681
3298 -155681 -232082 13843 64000 -177171 -361307 -274676 175211 112375 100925 -92353 96364
3287 96364 9097 -302403 149399 213850 -62737 -86718 121390 -123859 255096 446281
3277 446281 -30527 -116246 -47156 110120 373770 72158 35759 232942 123503 160018
3267 160018 138929 242504 -55905 -145250 20764 40111 17365 138504 199190 248659 341216
3256C41216k40730o6841J19651Q3507q4053m44983j00953J88631r9299J43851
3246a60003J47818q0433j88260K35789j38263M9362K41406l6848r5930J73706
3236A48344o767k24149l16501N4673J04514q0751L726L58670J9564k05220k9251
3225a73148L32378P5488k66326r7572O8625J83605j27244k36686o8901J2561j08225
3214d05445J26726J57196L32587j54706m5362j57772O6871L43491m3196r7970
3204A22420j89574L38990L4801p9411r2945j21579J7066o9172L810k30004J2447
3193b53151Q6311L21457J94998k78497R6228Q4025J61339J75215j63662j20457
3183C03806Q2054o0805K0030j37772R3193K28363o3700q8207K61056J33852l16409
$$ plain form
3256 341216 100486 33645 153296 236803 152750 -292233 -393186 -204555 -303854 -160003
3246 -160003 -12185 -92618 -280878 -45089 -183352 -133990 107416 70568 -25362 148344
3236 148344 141577 -82572 -399073 -344400 -239886 -320637 -316911 41759 61323 -143897 -173148
3225 -173148 159230 234718 -31608 -129180 -60555 123050 -4194 -240880 -309781 -297220 -405445
3214 -405445 -278719 -121523 211064 56358 10996 -146776 -79905 263586 220390 122420
3204 122420 -67154 271836 306637 227226 134281 12702 29768 -39404 -35594 -265598 -253151
3193 -253151 -166840 154617 349615 71118 167346 251371 412710 587925 424263 303806
3183 303806 385860 325055 345085 207313 300506 528869 465169 376962 638018 771870 455461
3172D55461j7534o173j5868J6640Q2280J43125M5719j93396J28015P094O8207
3161G13570N6370J52505j49966n9002L40641P9733K690L0343J61884J89411l5212
3150A482967K446L408j2004L11620k17871m7476K55864r5314N0221J4529K7859
3139A776249l8910M42392N7899o7898J59479J78110K19710R6850J29239r4472
3129B858648o9399J28602j93315k34382J4221L2228j83012j73435J69745j43901
3119B206000k22642J46786j14145l05528J55682J24125r8612P610R569J80709
3109B089554K54474J43612k07845k0404l0164p7853Q7856J45859P184N6289P0017
3098B518579j74125j26122j30638J01314j15169k83556M6405r9296k79079K1726
$$ plain form
3172 455461 437927 431754 415886 432526 514806 657931 703650 510254 638269 645363 713570
3161 713570 769940 922445 772479 713477 1054118 1133851 1136541 1166884 1328768 1518179 1482967
3150 1482967 1485413 1488821 1476817 1788437 1570566 1523090 1778954 1683640 1733861 1748390 1776249
3139 1776249 1737339 2179731 2237630 2169732 2329211 2507321 2727031 2823881 2953120 2858648
3129 2858648 2789249 2917851 2724536 2490154 2504375 2536603 2353591 2180156 2349901 2206000
3119 2206000 1983358 2130144 2015999 1710471 1866153 1990278 1891666 1899276 1908845 2089554
3109 2089554 2344028 2487640 2279795 2259391 2229227 2151374 2239230 2385089 2392273 2448562 2518579
3098 2518579 2344454 2218332 2087694 2189008 2073839 1790283 1836688 1737392 1458313 1480039
3088A480039K01153k04997o371J27213Q1063K8202n9154j18472j2471J1339l7279
3077A490265L2731O8342q9662l39628j29692l19955J58093j09112j59699J11818
3067G13501M8701J0763j7507q8261l5041k2563m9071L3721J34145p7386P2873
3056G23875l12796k12746J60331M6326m4092J32103j45269j52094p8781K0283
3046A37140q3343K1254j286K8731k13108q54n118J1739j8411p502K13757j3344
3034F9655M4033r4082j37215j02193j35167J328J12317j4636o5391P4472n4835
3023c01714k14412j26563L12442L7770r1212K60486l40146k3169K24261L50713
3013H8456r8348l22436k21754O3049p9147N1903K5527m9500J07280K16602l9801
$$ plain form
3088 1480039 1681192 1476195 1469824 1597037 1678100 1706302 1647148 1528676 1516205 1527544 1490265
3077 1490265 1522996 1591338 1501676 1162048 1032356 712401 870494 761382 601683 713501
3067 713501 762202 772965 755458 667197 632156 609593 560522 594243 728388 651002 723875
3056 723875 411079 198333 358664 404990 360898 493001 347732 195638 116857 137140
3046 137140 53797 75051 73765 102496 -110612 -111466 -116584 -104845 -123256 -130758 82999 69655
3034 69655 113688 19606 -117609 -219802 -354969 -353641 -241324 -255960 -321351 -246879 -301714
3023 -301714 -516126 -642689 -330247 -292477 -383689 -123203 -463349 -486518 -262257 88456
3013 88456 -9892 -332328 -554082 -491033 -570180 -518277 -492750 -542250 -434970 -218368 -258169
3002b58169N5418N8555K39698k63934k92813J02871K15065j80268j01341K01259
2992b23659l01610j5788R9754m4963r5073L00668J87121k03945r2653r2648l7510
2981e20306P2627K29079k99687k88383P9821L81755k35876j53952K30781m2596
2971e46737j25346J4471J62918J7054J73383j81428k74989j73294O048J65694
2961g62226J67960l6981j03182K4199K73267j39949m4934n1820J63357R365R9500
2950d01444O4900k84320L9879l6141j09710j60398Q9377J33112K35244j63326
2940e92827R8368r9585Q4887n6992K9770O6906j83313l4413j05260J92624J71471
2929d28364J0653q2149J58287k5531Q341l15927n3044n0197J33768j08684l6395
$$ plain form
3002 -258169 -202751 -144196 95502 -168432 -461245 -358374 -143309 -323577 -424918 -223659
2992 -223659 -525269 -541057 -441303 -486266 -581339 -280671 -93550 -297495 -390148 -482796 -520306
2981 -520306 -447679 -218600 -518287 -806670 -726849 -345094 -580970 -734922 -504141 -546737
2971 -546737 -672083 -657612 -494694 -477640 -304257 -485685 -760674 -933968 -927920 -762226
2961 -762226 -594266 -631247 -734429 -710230 -436963 -576912 -621846 -673666 -510309 -500944 -401444
2950 -401444 -336544 -620864 -580985 -617126 -726836 -887234 -797857 -664745 -429501 -592827
2940 -592827 -494459 -594044 -509157 -566149 -536379 -469473 -652786 -687199 -792459 -599835 -428364
2929 -428364 -417711 -499860 -341573 -367104 -358763 -674690 -727734 -777931 -644163 -752847 -789242
2918g89242J54238k3122p4380R0824j30509o5374K03391J00510R7119N3098j01420
2907d84867j18521K05702k35525j1758j79814J01586r8618r3120K62930Q2634
2897e69371j12086j65214K8442Q9872J65030p8016N9734r1468J07568j25168J58347
2886e32330j3466J14979j25525j07859k27351O2315L23429j63977Q029Q7273o4374
2875f38857j26366p667o143K33153j46196R0250j03578j51399j21678K97494j58761
2864h39748q7215J88740k4376K82113j89687o4409j33153J70295o3665J52192
2854f08913k5885J62076P3572o7763N7336K02562j22597j18396J04426k52863
2844e96445N0930k29275J41467q3338n7611P7930K97005p9782k1837m2750j33457
$$ plain form
2918 -789242 -635004 -658126 -732506 -641682 -772191 -837565 -634174 -533664 -436545 -383447 -484867
2907 -484867 -603388 -397686 -633211 -644969 -824783 -723197 -821815 -914935 -652005 -569371
2897 -569371 -681457 -846671 -818229 -728357 -563327 -641343 -581609 -673077 -565509 -690677 -532330
2886 -532330 -545796 -430817 -556342 -664201 -891552 -829237 -505808 -669785 -661756 -574483 -638857
2875 -638857 -765223 -772890 -779033 -545880 -692076 -601826 -705404 -856803 -978481 -680987 -839748
2864 -839748 -926963 -738223 -762599 -480486 -670173 -734582 -867735 -697440 -761105 -608913
2854 -608913 -634798 -472722 -399150 -466913 -409577 -207015 -329612 -448008 -343582 -596445
2844 -596445 -545515 -774790 -633323 -716661 -774272 -696342 -399337 -479119 -500956 -543706 -677163
2833f77163J7425L28923q066n3041k36894k94492K13793N0009j39862k5355K98631
2822e26092n6501l31400K6909J43444L28427M9861k38003M0928j44951N1426J28571
2811e27381J35778l6542j19914j88305l0890J03125j73053l6058O7198J11754
2801f94288K71981J49387l9389j10361n7784M7371J5457j14967k91724j35096
2791i59413K53713R746j21639J11077J49550N3043k44741j65799r71m8840m6564
2780a010838K46728k41076K8841K79210Q8121J29377j90478n9695k3361m5356
2770g98527j78082J55949J30200q720J41480j80013K14966J00612l34994j92430
2760i49559R0486j3567n5902M10560j12111j65453k32039O8847K50859j31904
$$ plain form
2833 -677163 -659738 -330815 -338881 -391922 -628816 -923308 -709515 -659506 -799368 -824723 -526092
2822 -526092 -582593 -913993 -887084 -743640 -415213 -365352 -603355 -562427 -707378 -655952 -527381
2811 -527381 -391603 -428145 -548059 -736364 -767254 -664129 -837182 -873240 -806042 -694288
2801 -694288 -422307 -272920 -312309 -422670 -480454 -433083 -417626 -532593 -824317 -959413
2791 -959413 -705700 -695954 -817593 -706516 -556966 -503923 -748664 -914463 -915434 -964274 -1010838
2780 -1010838 -764110 -1005186 -976345 -697135 -609014 -479637 -670115 -729810 -753171 -798527
2770 -798527 -976609 -820660 -690460 -699180 -557700 -737713 -522747 -422135 -757129 -949559
2760 -949559 -859073 -872640 -928542 -517982 -630093 -795546 -1027585 -958738 -707879 -839783
2750h39783O5184j43579M76506Q0830k22362j33355p3927j20575J57321j25360
2740h79100j88433K27726K65964J71160l22961P3505J93639k92101k80048J69137
2730h61512M6959N897M5807m8530j83782o495J03183J46494m5222L17020J35291
2719c44890l7870j75442k47001o0007J2850o9297K36920R8512O3588j73504k26310
2708i22451R3267K96304P9957k95866J7759j7506m4742K20000R8987o5283J67287
2697c72287m4338l12769j85767L21932J53686M4839J02731k73347O8175J5376
2687d81769o3501J49262J06957l95590L6911J4131J05293K5364l07037R3175O1383
2676f55421Q9972J98112J42974o0924j22526r8546j50556r0082r1782j39792J36681
$$ plain form
2750 -839783 -774599 -918178 -441672 -360842 -583204 -716559 -790486 -911061 -753740 -879100
2740 -879100 -1067533 -839807 -573843 -402683 -725644 -652139 -458500 -750601 -1030649 -861512
2730 -861512 -814553 -808656 -762849 -811379 -995161 -1001656 -898473 -751979 -797201 -480181 -344890
2719 -344890 -382760 -558202 -805203 -865210 -852360 -921657 -684737 -586225 -522637 -696141 -922451
2708 -922451 -829184 -532880 -452923 -748789 -731030 -748536 -793278 -573278 -474291 -539574 -372287
2697 -372287 -416625 -729394 -915161 -593229 -439543 -394704 -291973 -565320 -497145 -481769
2687 -481769 -545270 -396008 -289051 -684641 -647730 -633599 -528306 -502942 -809979 -716804 -655421
2676 -655421 -565449 -367337 -224363 -285287 -407813 -506359 -656915 -746997 -838779 -978571 -841890
2665h41890j70085M771M34259L32486m8385r5115j99952j94603N9632J62155j6921
2654e73648Q7083j16330k28565R4416n4045n323J14314J67090J12086p2488j12952
2643e88362l703L0970k69636M4554K23754j8336J7936Q2166k8433K71019P109
2632b30962j51403p754r6400j17527n5337K30615k31061j15584Q4296q746O1727
2621f38136K03724m5493j26850p2960N2507L42646q4900J1898J74680P4921r9107
2610b07070O18l08176k9371L45050J84684k48913j38955k48529L55761N4910J04834
2599a35157K24525n3442M6192p6260q2728j05779J56500j81344k61659J87250
2589b81902Q3607J64632p0275l0394K80634j12552N8561j08007j03096P6320l59709
$$ plain form
2665 -841890 -1011975 -1007204 -572945 -240459 -288844 -383959 -583911 -778514 -718882 -556727 -573648
2654 -573648 -486565 -602895 -831460 -737044 -791089 -796412 -682098 -515008 -402922 -475410 -588362
2643 -588362 -592065 -561095 -830731 -786177 -562423 -580759 -562823 -480657 -509090 -238071 -230962
2632 -230962 -382365 -390119 -486519 -604046 -659383 -428768 -659829 -775413 -691117 -699863 -638136
2621 -638136 -434412 -479905 -606755 -679715 -627208 -284562 -369462 -357564 -182884 -107963 -207070
2610 -207070 -206452 -514628 -543999 -198949 -14265 -263178 -402133 -650662 -294901 -239991 -135157
2599 -135157 89368 35926 82118 5858 -76870 -182649 -26149 -207493 -469152 -281902
2589 -281902 -198295 -33663 -103938 -134332 146302 33750 92311 -15696 -118792 -42472 -402181
2578d02181j61915m93k15233O5175J42585K1942k2395m1167J67478k2897k37477
2567g06578J47581P1975J45799L7776J12086k48451O5686k81258R9121l899P9751
2556d80411K43628J18694n2676l20306j1051p1098l8170j42619k12640J69244
2546g97405P9789r9217P6736L62202J13095k60847l77369r7087K58582N8070L186
2535f80265J74138J77481k68436k7433N2271M0368N2996j27564O3139k652L7830
2524e08127l2652j43943m0898K60102L39792r9832k23027R0925J9480J4371q8288
2513d12097j82230Q4001O7400J59320q0480N8833p4708q2202J86559J74129p8131
2502a79606j87379J78148k3684j16045k8267P5934J8786l6808L6007J47963N6550
$$ plain form
2578 -402181 -564096 -564589 -779822 -714647 -572062 -550120 -572515 -613682 -446204 -469101 -706578
2567 -706578 -558997 -487022 -341223 -303447 -191361 -439812 -374126 -655384 -556263 -560162 -480411
2556 -480411 -236783 -118089 -170765 -491071 -502122 -573220 -611390 -754009 -966649 -797405
2546 -797405 -717616 -816833 -740097 -377895 -264800 -525647 -903016 -1000103 -741521 -683451 -680265
2535 -680265 -506127 -328646 -597082 -624515 -572244 -531876 -478880 -606444 -543305 -545957 -508127
2524 -508127 -540779 -684722 -725620 -465518 -125726 -225558 -448585 -357660 -338180 -323809 -412097
2513 -412097 -594327 -510326 -442926 -283606 -364086 -305253 -379961 -462163 -275604 -101475 -179606
2502 -179606 -366985 -188837 -212521 -328566 -356833 -280899 -262113 -298921 -262914 -114951 -58401
2491e8401k48144m5957m4076R4091l1378l75911p1827M74379J3262o1115R6883
2480b58194M3818K85728M4758n73056l02149J59335R8895P1241L65726l9540j76352
2469b79790J03482n5783j14697O5937o8700l8395J48406J75945L2882j9898k26195
2458b76806L9321K85073k23278J93555J63090k19168n1127L6941J3708K2475J32388
2447A16172j09414o5561j44949J91901K51898j00043K69796j03872p0143k08014
2437B7771J0499J67787k86440r7532q9210K75745J01695n5754J60311m3459j01285
2426G0128J65725m2605n6596Q4617p1151o4710O4604J37862q0503p2374Q314J58947
2414C02258J62217M499J20537P6863j62462J94115J93581j04039j37131r9638
$$ plain form
2491 -58401 -306545 -352502 -396578 -302487 -333865 -709776 -781603 -307224 -293962 -355077 -258194
2480 -258194 -214376 71352 116110 -456946 -759095 -599760 -500865 -429624 -63898 -103438 -279790
2469 -279790 -176308 -232091 -346788 -280851 -349551 -387946 -239540 -63595 -30713 -50611 -276806
2458 -276806 -237485 47588 -175690 17865 180955 -38213 -89340 -52399 -38691 -16216 116172
2447 116172 6758 -58803 -203752 -11851 240047 140004 409800 305928 235785 27771
2437 27771 38270 206057 -80383 -177915 -267125 8620 110315 54561 214872 171413 70128
2426 70128 235853 193248 136652 221269 150118 85408 150012 287874 207371 134997 143311 302258
2414 302258 464475 468974 589511 666374 503912 698027 891608 787569 650438 550800
2404E50800J72443J42381K09663r3109j81399J6189N2741L46928j27386n9484
2394A029767R3336J84519m510J7983K06252j71025J80471N7932j9892L1257k167
2383A603923M05202L3254J65235K11879j64614O2277M2705L40496M05925J33294
2373C239576j3434J57153N20172Q5904K41517J19216L74803N89748L03619J56313
2363E774587M53258M32074M44581L72552M28109N70994P21865N82593Q99304P49457
2353A1429374Q04231J188511J239374J924892J690608J681690J680546J847410
2345B3486636K163003K246451K688638K639057K957634L772152M659805N818721
2337E0432097P566326R858545J2644196J2332218R566433N812578K546781N22780
$$ plain form
2404 550800 723243 865624 1075287 982178 800779 816968 869709 1216637 1089251 1029767
2394 1029767 1123103 1307622 1303112 1321095 1527347 1356322 1536793 1594725 1574833 1606090 1603923
2383 1603923 2009125 2042379 2207614 2419493 2254879 2317156 2359861 2700357 3106282 3239576
2373 3239576 3226142 3383295 3903467 3989371 4230888 4350104 4724907 5314655 5618274 5774587
2363 5774587 6227845 6659919 7104500 7477052 7905161 8476155 9198020 9780613 10679917 11429374
2353 11429374 12233605 13422116 14661490 16586382 18276990 19958680 21639226 23486636
2345 23486636 25649639 27896090 30584728 33223785 36181419 39953571 44613376 50432097
2337 50432097 57998423 67856968 80501164 92833382 102399815 108212393 110759174 111281954
2329A11281954j66628q578790j3420159j0684270r836834p509148o273367m615549
2321E0197209m229910l435488m059170l548634k973187k452490k136583j935427
2313B5426320k052931k031349k154460j670422j376917j155974j439520r60735
2305A2584012o50501j103695j159734n87461n00772n23232l67547k72330m88725
2296F930015m08852l24626n29678j49044l47679l74392l49518l45520j13844j77648
2286C809214k56682O9824J39252k51768l12012k5703k26151k33496l8440k74619
2276B399419P5444j08339o26149K21556j64676j20326m1809K44302l16538J0164
2266A573048M6193k23019j85030L887M6324j62803p5938L4365r3290L8351k00197
$$ plain form
2329 111281954 111115326 102536536 89116377 78432107 68595273 61086125 54812758 50197209
2321 50197209 45967299 42531811 38472641 34924007 31950820 29498330 27361747 25426320
2313 25426320 23373389 21342040 19187580 17517158 16140241 14984267 13544747 12584012
2305 12584012 11933511 10829816 9670082 9082621 8581849 8058617 7691070 7418740 6930015
2296 6930015 6521163 6196537 5666859 5517815 5170136 4795744 4446226 4100706 3986862 3809214
2286 3809214 3552532 3622356 3761608 3509840 3197828 3172125 2945974 2712478 2674038 2399419
2276 2399419 2474863 2366524 1740375 1961931 1797255 1676929 1635120 1879422 1562884 1573048
2266 1573048 1619241 1396222 1211192 1215079 1261403 1098600 1022662 1057027 963737 1002088 801891
2255H01891k07407J48298P0307P7480p9978m32549j57266R0637j31207K16978
2245C97184n7392p881K71387j09042k37512J99509J12124k01217n3524Q9833l7961
2234C65508J04404k83727P8540K5929j62146J8054K02774n8623j80073j9592N6173
2223A47221M2931j14976q5813m4092L3228n9687j33775j59139J41759O8399n117
2212a69061K8073n6592L2819r6392J76540r961k62709M9175L0728k2132n9357
2201c58869J44781J26555O8984r3109p1939j99526r3122j59231L12025J3800Q0861
2190b28790M9607j37339J1241J6878k31880J51173J67692J01452p1135j59298
2180c30399l70958J47408K0826j28907L67974n7828j66812p3522J59237K05458
$$ plain form
2255 801891 594484 742782 813089 890569 810591 378042 220776 311413 180206 397184
2245 397184 339792 331911 603298 494256 256744 456253 568377 367160 313636 403469 365508
2234 365508 469912 186185 264725 290654 128508 146562 349336 290713 110640 91048 147221
2223 147221 190152 75176 -10637 -54729 -21501 -81188 -214963 -374102 -232343 -163944 -169061
2212 -169061 -140988 -197580 -164761 -261153 -84613 -94574 -357283 -308108 -277380 -299512 -358869
2201 -358869 -214088 -87533 -18549 -111658 -183597 -383123 -476245 -635476 -323451 -309651 -228790
2190 -228790 -179183 -316522 -305281 -288403 -520283 -369110 -201418 -99966 -171101 -330399
2180 -330399 -701357 -553949 -533123 -662030 -294056 -351884 -518696 -592218 -432981 -227523
2170b27523j36854K1451j40054k07386K47559k96140j10604L8000n9941M0507
2160h30985k0760J14404N2959k5707M543O0687P9m2554P6838q6879M598k000o9808
2147g64585j14522K81330N4709j7063J11721j09591k17397K81466K02047q260
2137c00145l58738r4636o5703o0123Q0649R8049J19589j7546j92251q6252J16741
2126g60366J85921M0616N8707k76378J75610j09927m1071K22295k27368N7452
2116f74509L1936N5202N6810p1098k2619o4061m5768K890J58605K2335m9201J66315
2104d33163k75542m1705j56725J70998m7863j35227J67853O5165l5291Q3524k2830
2093f60806m5314n8805j80064J31170K05517R0911j26128o3591O7967r1678l51735
$$ plain form
2170 -227523 -364377 -342926 -482980 -690366 -442807 -738947 -849551 -811551 -871492 -830985
2160 -830985 -851745 -737341 -684382 -710089 -705546 -644859 -644780 -687334 -610496 -697375 -692777 -694777 -764585
2147 -764585 -879107 -597777 -543068 -560131 -448410 -558001 -775398 -493932 -291885 -300145
2137 -300145 -658883 -753519 -819222 -879345 -798696 -700647 -581058 -598604 -790855 -877107 -760366
2126 -760366 -574445 -533829 -475122 -751500 -575890 -685817 -726888 -504593 -731961 -674509
2116 -674509 -642573 -587371 -530561 -601659 -624278 -688339 -734107 -731217 -572612 -550277 -599478 -433163
2104 -433163 -708705 -750410 -907135 -736137 -784000 -919227 -751374 -686209 -721500 -637976 -660806
2093 -660806 -706120 -764925 -944989 -813819 -608302 -517391 -643519 -707110 -639143 -730821 -1082556
2082a082556P4770J70696L23341k1586j25665L4238J79591n0634J1767K53135
2072b32903j34392J27816j95427P2581L12137k16699j34379k2034L25809r6459
2062a93950L667O660j72675O0276Q3764k133J12580J96333k48691q4405j49372
2051c87946J88244m7167j1170k7847j76090k65766J32652L57234p6007j40391
2041d54254j50850j29293L9161J00303o0443j21431N5430O371P4262N2916j03443
2030f91271k26769J90551J81826k74246j52638J05587j31887P3332K68031l2001
2020f89485J62720n4324J01229o4269j76833r6248q9735r0133j1058j84549O8854
2009a123831J59405N7865M2677k586J4771Q1739j01540k38561L119o7544J8926
$$ plain form
2082 -1082556 -1007786 -837090 -513749 -535335 -661000 -626762 -447171 -497805 -486038 -232903
2072 -232903 -367295 -239479 -434906 -362325 -50188 -266887 -401266 -423300 -97491 -193950
2062 -193950 -190283 -183623 -356298 -296022 -212258 -214391 -101811 94522 -154169 -238574 -387946
2051 -387946 -199702 -246869 -258039 -285886 -461976 -727742 -595090 -237856 -313863 -454254
2041 -454254 -605104 -734397 -695236 -594933 -655376 -776807 -721377 -715006 -640744 -587828 -691271
2030 -691271 -918040 -727489 -545663 -819909 -972547 -866960 -998847 -925515 -657484 -689485
2020 -689485 -526765 -581089 -479860 -544129 -720962 -817210 -906945 -997078 -1008136 -1192685 -1123831
2009 -1123831 -964426 -906561 -863884 -866470 -851699 -769960 -871500 -1110061 -1106942 -1174486 -1155560
1998a155560J30931J49273p1583L5451k1515K1244m2468j2416l868J16337j0059
1987h64233j80964j26992K21644Q2917l8573J03197J73967j28949R88j90896L6555
1976i11339M13289j45474j71238j29116M04051j42280k13625j59188j67394J37149
1966a085165K8229p0935K53583L68250j35297M0217J02811j81526j63746j12958
1956i56537K42324J01961k60661j3006J34865J2076j31163Q9979M375j15138k11043
1945a101968j4986m2041L47175Q879K06526j24664L0457l6250J0725K35511M325
1934d76311J08854k60963k34352M4507J67857k23035k41942J83271K8050J24651
1924g79413K73325P7206M6764q2509j89046j32994K20028N3202j84181k13435
$$ plain form
1998 -1155560 -1024629 -875356 -946939 -911488 -933003 -911759 -954227 -966643 -970511 -854174 -864233
1987 -864233 -1045197 -1172189 -950545 -867628 -906201 -803004 -629037 -757986 -756998 -947894 -911339
1976 -911339 -498050 -643524 -814762 -943878 -539827 -682107 -895732 -1054920 -1222314 -1085165
1966 -1085165 -1056936 -1127871 -874288 -506038 -641335 -601118 -498307 -679833 -843579 -956537
1956 -956537 -714213 -612252 -872913 -885919 -751054 -738978 -870141 -780162 -775787 -890925 -1101968
1945 -1101968 -1116954 -1158995 -811820 -802941 -596415 -721079 -690622 -726872 -716147 -480636 -476311
1934 -476311 -367457 -628420 -862772 -818265 -650408 -873443 -1115385 -932114 -904064 -779413
1924 -779413 -506088 -428882 -382118 -464627 -653673 -786667 -566639 -513437 -697618 -911053
1914i11053o738J54337K39860k88099J30804r3938R931l87924r4682q4753K38925
1903a093330n9432J25061L17207k94745l9323K14151J38382m6061J7239j8994
1893g39845m0046j85516J17403m9160l448R7144j59056Q0892J74947j4253k09625
1882i30563P8318q9495J05986O6332L6339k57752j4078J5045k6292L09352k02368
1871i09176k53137L8221L00771p1j46173j12400R916l6029k0036n6219J97664
1860i86669R36J82037M9601K72805k30212l38765K30861K14983J7142n21323J62538
1849i46066J47678k36714P2128J77100j55610j4601L12822n0999j42166J22268
1839g14160J04874l54915K91696m1895R4393J30991k93747k0298J94539j09563
$$ plain form
1914 -911053 -917791 -763454 -523594 -811693 -680889 -774827 -764896 -1152820 -1247502 -1332255 -1093330
1903 -1093330 -1152762 -1027701 -710494 -1005239 -1044562 -830411 -692029 -738090 -720851 -739845
1893 -739845 -779891 -965407 -848004 -897164 -900612 -803468 -962524 -881632 -706685 -720938 -930563
1882 -930563 -852245 -941740 -835754 -769422 -733083 -990835 -1004913 -989868 -1016160 -706808 -909176
1871 -909176 -1162313 -1124092 -823321 -823392 -969565 -1081965 -1072049 -1108078 -1128114 -1184333 -986669
1860 -986669 -985733 -803696 -754095 -481290 -711502 -1050267 -819406 -604423 -587281 -1108604 -946066
1849 -946066 -798388 -1035102 -962974 -785874 -941484 -956085 -643263 -694262 -836428 -714160
1839 -714160 -609286 -964201 -672505 -714400 -620007 -489016 -782763 -803061 -608522 -718085
1829g18085m4676k3239j81154j12436K52436Q1715k60406J39360J45590J08467
1819f12428k71498L0833J96892j44936j41184M6580L87401J54180j33288j43297
1809f30745l81677L370J39731L05845l0038j69331p7733J33678Q2277l91088j8395
1798a034106J43710j1349J3613k06448j6663K90727L78354j00792j92502o7803
1788h03259J2332q1869l8522N9090n7588M4892K8826K8245r1170k1262O2724J70786
1776f86775J88027k99094k66734L82739j03589p6443n8314P672K65619J49079
1766d97813n01202l4514K24581P6461k07790k8218N0059J55381J20712J17704
1756e24639q5760j95424k02947l3410K58892J16624j15792p7769J85996l08659
$$ plain form
1829 -718085 -762761 -786000 -967154 -1079590 -827154 -745439 -1005845 -866485 -720895 -612428
1819 -612428 -883926 -853093 -656201 -801137 -942321 -895741 -508340 -354160 -487448 -630745
1809 -630745 -1012422 -1009052 -869321 -563476 -593514 -762845 -840578 -706900 -624623 -1015711 -1034106
1798 -1034106 -890396 -901745 -888132 -1094580 -1111243 -820516 -442162 -542954 -735456 -803259
1788 -803259 -790927 -872796 -911318 -852228 -909816 -864924 -836098 -807853 -899023 -920285 -857561 -686775
1776 -686775 -498748 -797842 -1064576 -681837 -785426 -861869 -920183 -912511 -646892 -497813
1766 -497813 -999015 -1033529 -808948 -732487 -940277 -968495 -918436 -763055 -642343 -524639
1756 -524639 -610399 -805823 -1008770 -1042180 -783288 -666664 -782456 -860225 -674229 -982888
1746i82888r592L36233j5107j70399j535p1786J39354j08537j70478J9374M3361
1735i92000K33269O9111J02198r8331o9477J28465k98411k6765O8152k39979m7083
1724a170851J00028j27587P0879J81122o7865O8055K6023J61741j83598j58530
$$ plain form
1746 -982888 -992480 -656247 -671354 -841753 -843288 -915074 -775720 -884257 -1054735 -1035361 -992000
1735 -992000 -758731 -689620 -587422 -685753 -755230 -626765 -925176 -951941 -883789 -1123768 -1170851
1724 -1170851 -1070823 -1198410 -1127531 -946409 -1014274 -946219 -920196 -758455 -942053 -1100583
$$ [...]
##END NTUPLES=NMR SPECTRUM
##END=
