##TITLE=1H_DE-80H_X3
 200.13MHz, d2o
 8 sc
 
 19ns.26.2.2025
##JCAMPDX= 6.0         $$ Bruker NMR JCAMP-DX V2.0
##DATA TYPE= NMR SPECTRUM
##DATA CLASS= NTUPLES
##ORIGIN= UXNMR, Bruker Analytische Messtechnik GmbH
##OWNER= pz
$$ XWIN-NMR		Version 3.5
$$ Fri Sep 19 14:53:22 2025 Russian Standard Time (UT+4h)  Yarkov@DPX200
##.OBSERVE FREQUENCY= 200.1313
##.OBSERVE NUCLEUS= ^1H
##.ACQUISITION MODE= SIMULTANEOUS
##.ACQUISITION SCHEME= undefined
##.AVERAGES= 8
##.DIGITISER RES= 18
##SPECTROMETER/DATA SYSTEM= spect
##.PULSE SEQUENCE= zg30
##.SOLVENT NAME= CDCl3
##.SHIFT REFERENCE= (INTERNAL, CDCl3, 0, 15.4836)
##AUDIT TRAIL= $$ (NUMBER, WHEN, WHO, WHERE, WHAT)
$$ ##TITLE= Audit trail, XWIN-NMR		Version 3.5
$$ ##JCAMPDX= 5.01
$$ ##ORIGIN= Bruker BioSpin GmbH
$$ ##OWNER= Yarkov
$$ C:/Bruker/XWIN-NMR/data/yarkov2/nmr/H-C/1/pdata/1/auditp.txt
$$ ##AUDIT TRAIL=  $$ (NUMBER, WHEN, WHO, WHERE, WHAT)
(   1,<2025-09-19 14:52:42.82 +0400>,<Yarkov>,<DPX200>,
      <created by zg, POWCHK disabled, PULCHK disabled
       configuration hash MD5:
       00 E9 B6 7A A2 85 ED C7 34 08 36 98 17 FE 4E 26
       data hash MD5: 16K
       8F 09 E0 7B B4 D5 3E 4F E6 6E B3 98 09 90 4D 45>)
(   2,<2025-09-19 14:52:46.84 +0400>,<Yarkov>,<DPX200>,
      <Start of raw data processing
       efp BC_mod = 2 LB = 0.25 FT_mod = 6 PKNL = 1 PHC0 = -1348.02 PHC1 = -1.209074 SI = 16K 
       data hash MD5: 16K
       5A 5C 81 1B BF 0D 91 13 8B 03 AB 14 05 7A 5C 50>)
$$ ##END=
$$ 
$$ hash MD5
$$ A4 2C BD E9 A1 7E 01 78 68 39 3B 03 0A 4A 88 6A
##$RELAX= 
##$RELAX= 
##$RELAX= 
##$RELAX= 
##$RELAX= 
##$RELAX= 
$$ Bruker specific parameters
$$ --------------------------
##$DU= <C:/Bruker/XWIN-NMR>
##$EXPNO= 1
##$NAME= <H-C>
##$PROCNO= 1
##$TYPE= <nmr>
##$USER= <yarkov2>
##$AMP= (0..31)
100 100 100 100 100 100 100 100 100 100 100 100 100 100 100 100 100 100 
100 100 100 100 100 100 100 100 100 100 100 100 100 100 
##$AQSEQ= 0
##$AQ_mod= 1
##$AUNM= <au_zg>
##$AUTOPOS= <>
##$BF1= 200.13
##$BF2= 200.13
##$BF3= 200.13
##$BF4= 200.13
##$BF5= 200.13
##$BF6= 200.13
##$BF7= 200.13
##$BF8= 200.13
##$BYTORDA= 1
##$CFDGTYP= 0
##$CFRGTYP= 5
##$CHEMSTR= <none>
##$CNST= (0..31)
1 1 145 1 1 1 1 1 1 1 1 1 1 1 1 1 1 1 1 1 1 1 1 1 1 1 1 1 1 1 1 1 
##$CPDPRG= <>
##$CPDPRG1= <>
##$CPDPRG2= <>
##$CPDPRG3= <>
##$CPDPRG4= <mlev>
##$CPDPRG5= <mlev>
##$CPDPRG6= <mlev>
##$CPDPRG7= <mlev>
##$CPDPRG8= <mlev>
##$CPDPRGB= <>
##$CPDPRGT= <>
##$D= (0..31)
0 0.7 0 0 0 0 0 0 0 0 0 0.03 0 0 0 0 0 0 0 0 0 0 0 0 0 0 0 0 0 0 0 0 
##$DATE= 1758279162
##$DBL= (0..7)
120 120 120 120 120 120 120 120 
##$DBP= (0..7)
150 150 150 150 150 150 150 150 
##$DBP07= 0
##$DBPNAM0= <>
##$DBPNAM1= <>
##$DBPNAM2= <>
##$DBPNAM3= <>
##$DBPNAM4= <>
##$DBPNAM5= <>
##$DBPNAM6= <>
##$DBPNAM7= <>
##$DBPOAL= (0..7)
0.5 0.5 0.5 0.5 0.5 0.5 0.5 0.5 
##$DBPOFFS= (0..7)
0 0 0 0 0 0 0 0 
##$DE= 6
##$DECBNUC= <off>
##$DECIM= 32
##$DECNUC= <off>
##$DECSTAT= 4
##$DIGMOD= 1
##$DIGTYP= 9
##$DL= (0..7)
0 120 120 120 120 120 120 120 
##$DP= (0..7)
$$ [...]
##$SUBNAM2= <"">
##$SUBNAM3= <"">
##$SUBNAM4= <"">
##$SUBNAM5= <"">
##$SUBNAM6= <"">
##$SUBNAM7= <"">
##$SUBNAM8= <"">
##$SUBNAM9= <"">
##$SW= 18.0517328524113
##$SWIBOX= (0..15)
0 0 2 0 0 0 0 0 0 0 0 0 0 0 0 0 
##$SW_h= 3612.71676300578
##$TD= 16384
##$TD0= 1
##$TE= 0
##$TE2= 300
##$TE3= 300
##$TEG= 300
##$TL= (0..7)
0 120 120 120 120 120 120 120 
##$TP= (0..7)
150 150 150 150 150 150 150 150 
##$TP07= 0
##$TPNAME0= <>
##$TPNAME1= <>
##$TPNAME2= <>
##$TPNAME3= <>
##$TPNAME4= <>
##$TPNAME5= <>
##$TPNAME6= <>
##$TPNAME7= <>
##$TPOAL= (0..7)
0.5 0.5 0.5 0.5 0.5 0.5 0.5 0.5 
##$TPOFFS= (0..7)
0 0 0 0 0 0 0 0 
##$TUNHIN= 0
##$TUNHOUT= 0
##$TUNXOUT= 0
##$USERA1= <user>
##$USERA2= <user>
##$USERA3= <user>
##$USERA4= <user>
##$USERA5= <user>
##$V9= 5
##$VALIST= <valist>
##$VCLIST= <CCCCCCCCCCCCCCC>
##$VD= 0
##$VDLIST= <DDDDDDDDDDDDDDD>
##$VPLIST= <PPPPPPPPPPPPPPP>
##$VTLIST= <TTTTTTTTTTTTTTT>
##$WBST= 1024
##$WBSW= 4
##$XGAIN= (0..3)
0 0 0 0 
##$XL= 0
##$YL= 0
##$YMAX_a= 98029
##$YMIN_a= -77674
##$ZGOPTNS= <>
##$ZL1= 120
##$ZL2= 120
##$ZL3= 120
##$ZL4= 120
##$ABSF1= 0
##$ABSF2= 0
##$ABSG= 0
##$ABSL= 0
##$ALPHA= 0
##$AQORDER= 0
##$ASSFAC= 0
##$ASSFACI= 0
##$ASSFACX= 0
##$ASSWID= 0
##$AUNMP= <proc_1d>
##$AZFE= 0.1
##$AZFW= 0.1
##$BCFW= 0
##$BC_mod= 2
##$BYTORDP= 0
##$COROFFS= 0
##$CY= -3
##$DATMOD= 1
##$DC= 0
##$DFILT= <>
##$DTYPP= 0
##$F1P= 0
##$F2P= 0
##$FCOR= 1
##$FTSIZE= 16384
##$FT_mod= 6
##$GAMMA= 0
##$GB= 0
##$INTBC= 1
##$INTSCL= 3.241238e-09
##$ISEN= 128
##$LB= 0.25
##$LEV0= 0
##$LPBIN= 0
##$MAXI= 10000
##$MC2= 0
##$MEAN= 0
##$ME_mod= 0
##$MI= 1.114404
##$NCOEF= 0
##$NC_proc= -9
##$NLEV= 6
##$NOISF1= 3.799351
##$NOISF2= 2.8
##$NSP= 0
##$NTH_PI= 0
##$NZP= 0
##$OFFSET= 15.48356
##$PC= 1
##$PHC0= -1348.02
##$PHC1= -1.209074
##$PH_mod= 1
##$PKNL= yes
##$PPARMOD= 0
##$PSCAL= 0
##$PSIGN= 0
##$REVERSE= no
##$SF= 200.130007634149
##$SI= 16384
##$SIGF1= 3
##$SIGF2= 2
##$SINO= 0.751879
##$SIOLD= 32768
##$SREGLST= <19F.Aceton>
##$SSB= 0
##$STSI= 16384
##$STSR= 0
##$SW_p= 3612.71676300578
##$SYMM= 0
##$S_DEV= 0
##$TDeff= 16384
##$TDoff= 0
##$TI= <>
##$TILT= no
##$TM1= 0
##$TM2= 0
##$TOPLEV= 0
##$USERP1= <user>
##$USERP2= <user>
##$USERP3= <user>
##$USERP4= <user>
##$USERP5= <user>
##$WDW= 1
##$XDIM= 16384
##$YMAX_p= 525984891
##$YMIN_p= -1594699
$$ End of Bruker specific parameters
$$ ---------------------------------
##NTUPLES= NMR SPECTRUM
##VAR_NAME=  FREQUENCY,     SPECTRUM/REAL,   SPECTRUM/IMAG
##SYMBOL=    X,             R,               I
##VAR_TYPE=  INDEPENDENT,   DEPENDENT,       DEPENDENT
##VAR_FORM=  AFFN,          ASDF,            ASDF
##VAR_DIM=   16384,         16384,           16384
##UNITS=     HZ,            ARBITRARY UNITS, ARBITRARY UNITS
##FACTOR=    0.220516191357247, 1,           1
##FIRST=     3098.7249026448, 0,             0
##LAST=      -513.991860360985, 0,           0
##MIN=       -513.991860360985, -1594699,    0
##MAX=       3098.7249026448, 525984891,     0
$$ Real data points
##PAGE= N=1
##DATA TABLE= (X++(R..R)), XYDATA
$$ [...]
7365A315690J39324j74578O3974L57989k0127k86668J40575j92165m746L67114
$$ 1315690 1455014 1280436 1344410 1702399 1682272 1395604 1536179 1344014 1339268 1706382
7355A706382J95896J40365k53074o2296K3835J4481j67010o6975J06062J35512
$$ 1706382 1902278 2042643 1789569 1727273 1751108 1765589 1598579 1531604 1637666 1773178
7345A773178L15625p2227J69624K28366k05401k76990N6400P0283P3495J99660
$$ 1773178 2088803 2016576 2186200 2414566 2209165 1932175 1988575 2058858 2132353 2332013
7335B332013l3834M3850k1492K05512K49659L26532J95496O9356k6795J58094
$$ 2332013 2298179 2342029 2320537 2526049 2775708 3102240 3297736 3367092 3340297 3498391
7325C498391J07294J30907R1768J24487J12986J17339K32900j77664k83627o3311
$$ 3498391 3605685 3736592 3828360 3952847 4065833 4183172 4416072 4238408 3954781 3891470
7315C891470j16403Q6479l8480j32601j70632j21J22880k14175j4054n9859o2839
$$ 3891470 3775067 3861546 3823066 3690465 3519833 3519712 3642592 3428417 3414363 3354504 3291665
7304C291665m19237j5452k16488j69293j94880J54669J42530J28902j38448j27774
$$ 3291665 2872428 2856976 2640488 2471195 2276315 2430984 2573514 2702416 2563968 2436194
7294B436194K8572l35033L6641j23598j98493J16637l5842j01771N1972q372k01172
$$ 2436194 2464766 2129733 2166374 2042776 1844283 1960920 1925078 1823307 1875279 1866907 1665735
7283A665735j9442J37474r1952m4471k76320J13181N7740q26M3227k95040J92918
$$ 1665735 1646293 1783767 1691815 1647344 1371024 1484205 1541945 1541119 1584346 1289306 1482224
7272A482224k42976k44458n3749K13693J83434Q6295l9777P3937r9386n7163j59449
$$ 1482224 1239248 994790 941041 1154734 1338168 1424463 1384686 1458623 1359237 1302074 1142625
7261A142625L972K5913j82327J07419n6818J00528L70724Q1100N316k03223K7196
$$ 1142625 1146597 1172510 990183 1097602 1040784 1141312 1512036 1593136 1598452 1395229 1422425
7250A422425j58265j83846j20497L76397J79602j90380K27466j7578M369l46405
$$ 1422425 1264160 1080314 959817 1336214 1515816 1325436 1552902 1535324 1539693 1193288
7240A193288J32960j18212K9121p7153o97K37362k8283k25032J0714r8775K3417
$$ 1193288 1326248 1208036 1237157 1160004 1159307 1396669 1368386 1143354 1154068 1055293 1078710
7229A078710L12639M5065o5183k7277j35992J94571r5547M5537P4307j10966J10776
$$ 1078710 1391349 1436414 1371231 1343954 1207962 1402533 1306986 1352523 1426830 1315864 1426640
7218A426640J58845P9307l7911K31683n5299J8396j89697k00102K4711l9160R9379
$$ 1426640 1585485 1664792 1626881 1858564 1803265 1821661 1631964 1431862 1456573 1417413 1516792
7207A516792k8764J75194R3403Q6067J5403q3346r946K68347P4737k90366r4727
$$ 1516792 1488028 1663222 1756625 1842692 1858095 1774749 1764803 2033150 2107887 1817521 1722794
7196A722794K70963j63445Q5596m7740K1936K83881M0202k87258K02526P8262
$$ 1722794 1993757 1830312 1915908 1868168 1890104 2173985 2214187 1926929 2129455 2207717
7186B207717P83J6551j09468M5865J04805J93325K80120j06391j91859K56042
$$ 2207717 2208500 2225051 2115583 2161448 2266253 2459578 2739698 2633307 2441448 2697490
7176B697490l29501q2096K28840j41944n6032j9553K52170p1817K2463R9163J84504
$$ 2697490 2367989 2285893 2514733 2372789 2316757 2297204 2549374 2477557 2500020 2599183 2783687
7165B783687J03108o2503m0260K88556Q6317J99767j13316k10959J41404j38094
$$ 2783687 2886795 2824292 2784032 3072588 3158905 3358672 3245356 3034397 3175801 3037707
7155C037707j52295K18731K67143j11232K26989R7079o331K28346J83361k55787
$$ 3037707 2885412 3104143 3371286 3260054 3487043 3584122 3577791 3806137 3989498 3733711
7145C733711K83720J00769M4793k2829L5878J91027L81539j34440P9793L78129
$$ 3733711 4017431 4118200 4162993 4140164 4176042 4367069 4748608 4614168 4693961 5072090
7135E072090N75099K69157P8931K31985K87005J41516K39859j92229J08063L05442
$$ 5072090 5647189 5916346 5995277 6227262 6514267 6655783 6895642 6703413 6811476 7116918
7125G116918M69279j12855J39252J34242J8714o1211j59076J77080J97676K36473
$$ 7116918 7586197 7473342 7612594 7746836 7765550 7704339 7545263 7722343 7920019 8156492
7115H156492J77949L68692K75915M24972M48364M75666P62438P47201Q80157J006294
$$ 8156492 8334441 8703133 8979048 9404020 9852384 10328050 11090488 11837689 12717846 13724140
7105A3724140R88993J388751J672448K245756K458621K976293L660586L558407
$$ 13724140 14713133 16101884 17774332 20020088 22478709 25455002 29115588 32673995
7097C2673995K424175J050816N85557M37467k10629j296242k802157l153244k947400
$$ 32673995 35098170 36148986 36734543 37172010 36961381 35665139 32862982 29709738 26762338
7088B6762338l236862k424431j972012j839629j114015r91252q38347j035167
$$ 26762338 23525476 21101045 19129033 17289404 16175389 15184137 14345790 13310623
7080A3310623r17294n93763n81117n49058k90166m10009l86241m51489j13890
$$ 13310623 12393329 11799566 11218449 10669391 10379225 9969216 9582975 9131486 9017596
7071I017596l97838l30483N8236k9081k99005j98658M767j07358O2030l3004m0679
$$ 9017596 8619758 8289275 8347511 8318430 8019425 7820767 7825534 7718176 7780206 7747202 7706523
7060G706523K35771j36760J21097p0363K90313M5518j51244l0823j185L02646
$$ 7706523 7942294 7805534 7926631 7856268 8146581 8192099 8040855 8010032 8008847 8311493
7050H311493l06023j61271K3562m0142M5430K97303J82608J55205J69828J53104
$$ 8311493 8005470 7844199 7867761 7827619 7873049 8170352 8352960 8508165 8677993 8831097
7040H831097O5362M04701M07917L81937L99914M78166P22656J012127J242328
$$ 8831097 8896459 9301160 9709077 10091014 10490928 10969094 11691750 12703877 13946205
7031A3946205J203915J513087K100286K487414K681392K809820K540756J542359
$$ 13946205 15150120 16663207 18763493 21250907 23932299 26742119 29282875 30825234
7023C0825234O54086J30393k41392q55051k251280k798499k641645k637281k401460
$$ 30825234 31479320 31609713 31368321 30513270 28261990 25463491 22821846 20184565 17783105
7014A7783105k151750j508110j461972j084046p49482q01447n66789m16869o73115
$$ 17783105 15631355 14123245 12661273 11577227 10827745 10026298 9459509 9042640 8369525
7005H369525j85803l46965o04606m38633n18604k45327k8265j95674m06738j98899
$$ 8369525 8183722 7836757 7232151 6793518 6274914 6029587 6001322 5805648 5398910 5200011
6995E200011j31545j19236l36556j28668J4253o4472k70937l4864J42874r5932
$$ 5200011 5068466 4949230 4612674 4484006 4498259 4433787 4162850 4127986 4270860 4174928
6985D174928n01008k41192K53723j02136J30170l09307m56328P7162Q8176k565
$$ 4174928 3673920 3432728 3686451 3584315 3714485 3405178 2948850 3026012 3114188 3111623
6975C111623J14745J0720k56702j18698J88444n3690k50093q7951L8721m5256
$$ 3111623 3226368 3237088 2980386 2861688 3050132 2996442 2746349 2658398 2697119 2651863
6965B651863k20566j86721J97521J47770k3308n6721k13340L9203J36483K25953
$$ 2651863 2431297 2244576 2442097 2589867 2566559 2509838 2296498 2335701 2472184 2698137
6955B698137p2286P2833j81407j00345r9188j10958m3063L73803j75142l5890
$$ 2698137 2625851 2698684 2517277 2416932 2317744 2206786 2163723 2537526 2362384 2326494
6945B326494l01021J2291J38767J11568P9116p8702j01419P583k46823J08503
$$ 2326494 2025473 2037764 2176531 2288099 2367215 2288513 2187094 2194677 1947854 2056357
6935B056357K88291J22516j44391j61163K52295j34379J0088j443K66282j35798
$$ 2056357 2344648 2467164 2322773 2161610 2413905 2279526 2289614 2288171 2554453 2418655
6925B418655j35326j54278J98627K5228J02794k49840J44364N3186K98876k72317
$$ 2418655 2283329 2129051 2327678 2352906 2455700 2205860 2350224 2403410 2702286 2429969
6915B429969l22043K32492J01983k95298m3848N32487L4500N4445N9607k08034
$$ 2429969 2107926 2340418 2442401 2147103 2103255 2635742 2670242 2724687 2784294 2576260
6905B576260j55455j69904K66702K68608j81392j93202k59114K37469p6954M8657
$$ 2576260 2420805 2250901 2517603 2786211 2604819 2411617 2152503 2389972 2313018 2361675
6895B361675J23841p3420K5218J01152l787k6794Q1956J25078J38368K19452O7007
$$ 2361675 2485516 2412096 2437314 2538466 2534679 2507885 2589841 2714919 2853287 3072739 3139746
6884C139746R8405l2702k31650k51780J10984l0901j29849K87246j02282n475
$$ 3139746 3238151 3205449 2973799 2722019 2833003 2802102 2672253 2959499 2857217 2851742
6874B851742j14275J96226J95683q3836l20542l80403K64543O0385P301J25678
$$ 2851742 2737467 2933693 3129376 3045540 2724998 2344595 2609138 2669523 2676824 2802502
6864B802502J39564K71234J28918l5815j87886J76048J87099k61924J86153P9114
$$ 2802502 2942066 3213300 3342218 3306403 3118517 3294565 3481664 3219740 3405893 3485007
6854C485007J72475j7723j15197P4945o7624J92208l2394j5566L5334o6591J02192
$$ 3485007 3657482 3639759 3524562 3599507 3531883 3724091 3691697 3676131 3711465 3644874 3747066
6843C747066J19638j30558J14152N4278K32320O8383L637K23113P8930J53732
$$ 3747066 3866704 3736146 3850298 3904576 4136896 4205279 4208916 4432029 4510959 4664691
6833D664691J99485J58389J30086L08374K01631K46970J66468J02313Q3230K57520
$$ 4664691 4864176 5022565 5152651 5461025 5662656 5909626 6076094 6178407 6261637 6519157
6823F519157K17594J70989R1454K47406q7552K49091K08461M7606O9495R1506
$$ 6519157 6736751 6907740 6999194 7246600 7159048 7408139 7616600 7664206 7733701 7825207
6813G825207N58160M910k42228j8227J98243J24918o4903R5729L12754J79319
$$ 7825207 8383367 8388277 8146049 8127822 8326065 8450983 8386080 8481809 8794563 8973882
6803H973882N02666L70362O26701J98782L71364Q73500O82475R86450J182890
$$ 8973882 9476548 9846910 10473611 10672393 11043757 11917257 12599732 13586182 14769072
6794A4769072J236630J795996J894481K304051K663228L379744L147688K457063
$$ 14769072 16005702 17801698 19696179 22000230 24663458 28043202 31190890 33647953
6786C3647953J291031Q36853K86656n99897j208335k194429k500529k914025k327659
$$ 33647953 34938984 35775837 36062493 35462596 34254261 32059832 29559303 26645278 24317619
6777B4317619k333949j912598j459825j168787j025355r41954o07415k05344n53563
$$ 24317619 21983670 20071072 18611247 17442460 16417105 15475151 14867736 14662392 14108829
6768A4108829o82450l25154n6470l91575j10109k17523j18168K34710j87529Q980
$$ 14108829 13426379 13101225 13044755 12653180 12543071 12325548 12207380 12442090 12254561 12263541
6758A2263541J25255L28119M31557O18051N38913Q80998J202444J330940J776076
$$ 12263541 12388796 12716915 13148472 13766523 14305436 15186434 16388878 17719818 19495894
6749A9495894K296323K483368K570127K746478K196049J202904L06332j12786
$$ 19495894 21792217 24275585 26845712 29592190 31788239 32991143 33297475 33184689
6741C3184689k64436j199921k260434k410485k815040l045786k580069j765832
$$ 33184689 32920253 31720332 29459898 27049413 24234373 21188587 18608518 16842686
6733A6842686j589741j462502r92215p27735o82548n20108r03386o59629m33736
$$ 16842686 15252945 13790443 12798228 12070493 11387945 10867837 9964451 9304822 8871086
6724H871086m49376m79554m36341n6799j81713k21349l07600m16331n34766n3831
$$ 8871086 8421710 7942156 7505815 7449016 7267303 7045954 6738354 6322023 5787257 5733426
6714E733426j28173k33671j26675k53883L8293j59930j56340j52135k15957L790
$$ 5733426 5605253 5371582 5244907 4991024 5029317 4869387 4713047 4560912 4344955 4348745
6704D348745J48602r8270n1974j71196K8784J202j84000n3388L0944j53386k05689
$$ 4348745 4497347 4399077 4347103 4175907 4204691 4205893 4021893 3968505 3999449 3846063 3640374
6693C640374l5357j27363J62885j45200J32229J76684j65729J94226r8484l07749
$$ 3640374 3605017 3477654 3640539 3495339 3627568 3804252 3638523 3832749 3734265 3426516
6683C426516q4998J02550k6244M6615n0962l1025J31616r099l11374k96779K07447
$$ 3426516 3341518 3444068 3417824 3464439 3413477 3382452 3514068 3504969 3193595 2896816 3104263
6672C104263K27309O1964K64862J51488k4583J14851J6822k6214K0738j144L3926
$$ 3104263 3331572 3393536 3658398 3809886 3785303 3900154 3916976 3890762 3911500 3910356 3944282
6661C944282k24961M2107J62943m6605K6937n09902j75929L01115j20362n4075
$$ 3944282 3719321 3761428 3924371 3877766 3904703 3394801 3218872 3519987 3399625 3345550
6651C345550k378j89696j84102K47155J70838o6071K63007J02606J05487m01511
$$ 3345550 3343172 3153476 2969374 3216529 3387367 3321296 3584303 3686909 3792396 3390885
6641C390885J09728J21250j16655O7717P0377q3070J08961k0979l38575l80273
$$ 3390885 3500613 3621863 3505208 3572925 3643302 3560232 3669193 3648214 3309639 2929366
6631B929366L69798N22392r2219q6893M9647K03823m409l21500j59788O1600L30963
$$ 2929366 3299164 3821556 3729337 3642444 3692091 3895914 3891505 3570005 3410217 3471817 3802780
6620C802780P5454o6916k67341m8999L45011L70955K5401l25367J14513K01056
$$ 3802780 3878234 3811318 3543977 3494978 3839989 4210944 4236345 3910978 4025491 4226547
6610D226547j66535l42951R1324J41678J71144k4040K62795L145J8919K64964
$$ 4226547 4060012 3717061 3808385 3950063 4121207 4097167 4359962 4363107 4382026 4646990
6600D646990o5210j45926j03121R3323L2596J38571n6095K10192J20008j26849
$$ 4646990 4581780 4435854 4332733 4426056 4458652 4597223 4541128 4751320 4871328 4744479
6590D744479j2433K54074K79307N079J50812J83814J82378j5954J1036K7979K2265
$$ 4744479 4732046 4986120 5265427 5270506 5421318 5605132 5787510 5771556 5782592 5810571 5832836
6579E832836L56109K39213P7371l7902L07182K75154j25756o9616K16362J56942
$$ 5832836 6188945 6428158 6505529 6467627 6774809 7049963 6924207 6854591 7070953 7227895
6569G227895L708N3101k40694r01J19266K41959L5K1427K75424J81482L80848
$$ 7227895 7231603 7284704 7044010 7043109 7162375 7404334 7404369 7425796 7701220 7882702 8263550
6558H263550K48863J9235N53898O54920Q60286O11797Q81796Q78602R13879Q73491
$$ 8263550 8512413 8531648 9085546 9740466 10600752 11212549 12094345 12972947 13886826 14760317
6548A4760317J026285J462887J557127J535812J065181N98643m10929p80220o54512
$$ 14760317 15786602 17249489 18806616 20342428 21407609 22006252 21595323 20815103 20160591
6539B0160591j223080j573006j060178j182315r89809p65310p80985q33171m98520
$$ 20160591 18937511 17364505 16304327 15122012 14132203 13366893 12585908 11752737 11254217
6530A1254217l12448m74293k60623k83245l76145m09179k88904l48701l84447
$$ 11254217 10941769 10467476 10206853 9923608 9547463 9138284 8849380 8500679 8116232
6521H116232j36115l67813l82389j63457m75224M1495j95678j12247n5588j44091
$$ 8116232 7980117 7612304 7229915 7066458 6591234 6632729 6437051 6324804 6269216 6125125
6511F125125j29577n07456M1617j68421M3951J31759j79144p0568j70373N6264
$$ 6125125 5995548 5488092 5529709 5361288 5405239 5536998 5357854 5287286 5116913 5173177
6501E173177r9603J0443k12318K31578L71761J06877k03274k57737j40322j52260
$$ 5173177 5073574 5084017 4871699 5103277 5475038 5581915 5378641 5120904 4980582 4828322
6491D828322J98453J84587L9455l26460J24846o6674P4859j48580K8249j32610
$$ 4828322 5026775 5211362 5250817 4924357 5049203 4982529 5057388 4908808 4937057 4804447
6481D804447p4866J72084q691J2152l31224Q5917J20068J1803l100K58400J80227
$$ 4804447 4729581 4901665 4892974 4905126 4573902 4659819 4779887 4791690 4788590 5046990 5227217
6470E227217j23562j34194J42137r9477j03173K11317j67062L1055J38826L3090
$$ 5227217 5103655 4969461 5111598 5012121 4908948 5120265 4953203 4984258 5123084 5156174
6460E156174K90824N9056k31154k35820J71619J39863N7929o2242P2422J36935
$$ 5156174 5446998 5506054 5274900 5039080 5210699 5350562 5408491 5346249 5418671 5555606
6450E555606p787R7040K71799J23945m1214l35907L0696L38815l1220R4408L47522
$$ 5555606 5547819 5644859 5916658 6040603 5999389 5663482 5694178 6032993 6001773 6096181 6443703
6439F443703J95284k4321o654j66035J6397J43747J99367J48171K7041j7840J33848
$$ 6443703 6638987 6614666 6608012 6441977 6458374 6602121 6801488 6949659 6976700 6958860 7092708
6428G092708l2955P5027K61622K29233O9239N0226K4577P3279K38096J52799j3867
$$ 7092708 7059753 7134780 7396402 7625635 7694874 7745100 7769677 7842956 8081052 8233851 8219984
6417H219984L11198J17998p4898Q9017J81757J09571M24894J25437J67426J63040
$$ 8219984 8531182 8649180 8574282 8663299 8845056 8954627 9379521 9504958 9672384 9835424
6407I835424J16714O0454K0725J41661L19653J66743J14169J17054J90003K13594
$$ 9835424 9952138 10012592 10033317 10174978 10494631 10661374 10775543 10892597 11082600 11296194
6397A1296194M15252L80457k6498K96398J93305J39880M44577K71656l4159L91811
$$ 11296194 11711446 12091903 12065405 12361803 12555108 12694988 13139565 13411221 13377062 13768873
6387A3768873L84827K81413L27887M38822K39952N76554L93966L90779L74349
$$ 13768873 14153700 14435113 14763000 15201822 15441774 16018328 16412294 16803073 17177422
6378A7177422M41989M67085K02698N55588O88636K70825O29100P43278N68184
$$ 17177422 17619411 18086496 18289194 18844782 19533418 19804243 20433343 21176621 21744805
6369B1744805N95082P04884P77698R06690J103528J243063J210685R42324J578259
$$ 21744805 22339887 23044771 23822469 24729159 25832687 27075750 28286435 29228759 30807018
6360C0807018J499767J770697J704774J699373J227742P47606N46682Q14588R67198
$$ 30807018 32306785 34077482 35782256 37481629 38709371 39456977 40003659 40818247 41785445
6351D1785445R54035J034637J058636J139619J121019J058856P73016L65425K32397
$$ 41785445 42739480 43774117 44832753 45972372 47093391 48152247 48925263 49290688 49523085
6342D9523085P58168J126380J658904J669085J617349J590915J632664J429276
$$ 49523085 50281253 51407633 53066537 54735622 56352971 57943886 59576550 61005826
6334F1005826J134428J606646J870001K479775L605291M028220M382446M754987
$$ 61005826 62140254 63746900 65616901 68096676 71701967 75730187 80112633 84867620
6326H4867620M496526L604545J689517n31165k233131l511074m372900m351601
$$ 84867620 89364146 92968691 94658208 94127043 91893912 88382838 84009938 79658337
6318G9658337l259809k268453j271154p45263K71542J103067J977569K736351
$$ 79658337 76398528 74130075 72858921 72113658 72385200 73488267 75465836 78202187
6310G8202187L510003M266374M595169M658665M243526K655059J161998J58144
$$ 78202187 81712190 85978564 90573733 95232398 99475924 102130983 103292981 103451125
6302A03451125j270691l219704m504478n401881n321710n118924m579559l708401
$$ 103451125 102180434 98960730 94456252 89054371 83732661 78613737 74034178 70325777
6294G0325777l283079k493515j956429j495746j234889r34901j84096J29632P65444
$$ 70325777 67042698 64549183 62592754 61097008 59862119 58927218 58743122 58872754 59638198
6285E9638198O71456Q65426J432118J915000K049738K543655L543141L790848
$$ 59638198 60309654 61175080 62607198 64522198 66571936 69115591 72658732 76449580
6277G6449580M143831M246354M921803M227362L260745J970582P89683k75452
$$ 76449580 80593411 84839765 89761568 93988930 97249675 99220257 100009940 99734488
6269I9734488k207093l147303m032682m396437m302935l702225k687244k312545
$$ 99734488 97527395 94380092 90347410 85950973 81648038 77945813 75258569 72946024
6261G2946024j357610n88341j097J285586J683101K192097L059002L316615L345171
$$ 72946024 71588414 71000073 70998976 72284562 73967663 76159760 79218762 82535377 85880548
6252H5880548K562070J465130o17068k368564l733133m581614m302339l944646
$$ 85880548 88442618 89907748 89290680 86922116 83188983 78607369 74305030 70360384
6244G0360384l099291k735651k698691j793388j223469j270059j380356j231023
$$ 70360384 67261093 64525442 61826751 60033363 58809894 57539835 56159479 54928456
6236E4928456j447246j343933j381295r03998p80561n88586m63595n94444p19816
$$ 54928456 53481210 52137277 50755982 49851984 49071423 48482837 48019242 47424798 46704982
6227D6704982l78906j101654j264044r43926r25414o38296n47106l27998k36274
$$ 46704982 46326076 45224422 43960378 43016452 42091038 41452742 40905636 40577638 40341364
6218D0341364n31240j075534j070703o50914p48180o32824l13538k59069M6323
$$ 40341364 39810124 38734590 37663887 37012973 36264793 35631969 35318431 35059362 35105685
6209C5105685K20956L66123L65233L17084m40192q96694q98110j106160j336967
$$ 35105685 35326641 35692764 36057997 36375081 35934889 35038195 34140085 33033925 31696958
6200C1696958j122727r65421j146578j102840o31573o79254r30675n20000k91979
$$ 31696958 30574231 29608810 28462232 27359392 26727819 26048565 25117890 24597890 24305911
6191B4305911n55908k96043j51018P4659k10157j61897l7460P0900j16189l97360
$$ 24305911 23750003 23453960 23302942 23377601 23167444 23005547 22968087 23038987 22922798 22525438
6181B2525438k38112k59941m29799k37038n1942k71686m8261l44052l83218k01078
$$ 22525438 22287326 22027385 21597586 21360548 21308606 21036920 20988659 20644607 20261389 20060311
6171B0060311j86418q4843p5150m0579m20631l26706J17190m00357l15384L4312
$$ 20060311 19873893 19789050 19713900 19673321 19252690 18925984 19043174 18642817 18327433 18361745
6161A8361745k77732Q7265o3806j30686j08411j76820j03618j9974P9930j58928
$$ 18361745 18084013 18171278 18107472 17976786 17868375 17691555 17587937 17567963 17647893 17488965
6151A7488965M4711j92321k35665k60917o8844L4620k91490k39423m48577m38683
$$ 17488965 17533676 17341355 17105690 16844773 16775929 16810549 16519059 16279636 15831059 15392376
6141A5392376m47885l89776k93890m45497n73444k49593j73171q24018k67121
$$ 15392376 14944491 14554715 14260825 13815328 13241884 12992291 12819120 11995102 11727981
6132A1727981l6880m16904j74996l11509n88552j28323j04534j286j31576m53543
$$ 11727981 11691101 11274197 11099201 10787692 10199140 10070817 9966283 9964997 9833421 9379878
6122I379878k39238k32265j18577k14168J56135j51316k37114j33137j9482l44576
$$ 9379878 9140640 8908375 8789798 8575630 8731765 8580449 8343335 8210198 8190716 7846140
6112G846140k5031R3444n6110J13022j16067l59809j39211q7055N1128m4755j38980
$$ 7846140 7821109 7914553 7858443 7971465 7855398 7495589 7356378 7269323 7320451 7275696 7136716
6101G136716k19037L09811n7539k1934j61700k69772J99031K04868L40399k93787
$$ 7136716 6917679 7227490 7169951 7148017 6986317 6716545 6915576 7120444 7460843 7167056
6091G167056K31245m2272l31358j98780k81329j28707J31642J97426m7369j16451
$$ 7167056 7398301 7356029 7024671 6825891 6544562 6415855 6547497 6744923 6697554 6581103
6081F581103p003r2552J4875o5223J98199J00622q6198j86984J43644J02631k44802
$$ 6581103 6574100 6481548 6496423 6431200 6629399 6730021 6643823 6456839 6600483 6703114 6458312
6070F458312O5602J84769l35623j7846K71133L7083L9535j11015j27659q078P0638
$$ 6458312 6523914 6708683 6373060 6355214 6626347 6663430 6702965 6591950 6464291 6456213 6526851
6059F526851J14643n0229Q7792K44775O2163j95608N5761J09079J8753M8552J29965
$$ 6526851 6641494 6591265 6679057 6923832 6985995 6790387 6846148 6955227 6973980 7022532 7152497
6048G152497k50315R5638J39449M6039L48366k25682Q4905L87948l7228K91767
$$ 7152497 6902182 6997820 7137269 7183308 7531674 7305992 7390897 7778845 7741617 8033384
6038H033384J93688L5464j10111l84286L12883J15845j75861j46850o4122K38650
$$ 8033384 8227072 8262536 8152425 7768139 8081022 8196867 8021006 7874156 7810034 8048684
6028H048684j47385j37921K21138K19577J49590J99395J24672L34994J91203J33574
$$ 8048684 7901299 7763378 7984516 8204093 8353683 8553078 8677750 9012744 9203947 9337521
6018I337521M89633M20294J33292O0099J12478O9109J47675o6482m9456j1714
$$ 9337521 9827154 10247448 10380740 10440839 10553317 10622426 10770101 10703619 10654163 10642449
6008A0642449L2817k80184N8503l4446k20K35781L4228k29677n5600K38524J51384
$$ 10642449 10675266 10395082 10453585 10419139 10418919 10654700 10688928 10459251 10403651 10642175 10793559
5997A0793559K17370r138M0095M07403J09913M62836M75458J43109m4368K05806
$$ 10793559 11010929 11001791 11041886 11449289 11559202 12022038 12497496 12640605 12596237 12802043
5987A2802043j7906j60551o4583l56214j53656M4556K43798K4669P5373J76672
$$ 12802043 12784137 12623586 12559003 12202789 12049133 12093689 12337487 12362156 12437529 12614201
5977A2614201q0114L20964J09708L00682L62481M64882N31829O64164P35285R15771
$$ 12614201 12534087 12855051 12964759 13265441 13627922 14092804 14624633 15288797 16024082 16939853
5967A6939853J124778Q06418J051811J384841R87524N61205R15472M00857j42637
$$ 16939853 18064631 18871049 19922860 21307701 22295225 22856430 23771902 24172759 24030122
5958B4030122j101091j180269j353890j151072j130132j179793j093179j068959
$$ 24030122 22929031 21748762 20394872 19243800 18113668 16933875 15840696 14771737
5950A4771737q83476l78947m97064o62643n89051m92468k04423l44818j82025
$$ 14771737 13888261 13509314 13012250 12349607 11760556 11268088 11063665 10718847 10536822
5941A0536822m56447j50767k90375l79873m08657m61685o8673J27052j66418m95641
$$ 10536822 10080375 9929608 9639233 9259360 8850703 8389018 8320345 8447397 8280979 7785338
5931G785338j74155k6791J26687j4728l22974q2500J36475j47668p9159m426j74858
$$ 7785338 7611183 7584392 7711079 7696351 7373377 7290877 7427352 7279684 7200525 7196099 7021241
5920G021241J0319j3193p6774N0431j28291J408O127j25448Q6448P5877L6485
$$ 7021241 7031560 7018367 6941593 6992024 6863733 6865141 6871268 6745820 6832268 6908145 6944630
5909F944630j2213K4824K51765M26l49256k34634J88160J8987j08231K2199k16356
$$ 6944630 6932417 6957241 7209006 7209432 6860176 6625542 6813702 6832689 6724458 6746657 6530301
5898F530301R1527M45755k3135L1259k8784N7017k9821j01322q1854O128j95063
$$ 6530301 6621828 7067583 7044448 7075707 7046923 7103940 7074119 6972797 6890943 6897071 6702008
5887F702008J78943K35849m3240L4258k24717n4002j0460Q92k59953J19755L6404
$$ 6702008 6880951 7116800 7073560 7107818 6883101 6829099 6818639 6819531 6559578 6679333 6715737
5876F715737Q869k28778j56868j6757J592J53769L63566k922m82681M9272M3642
$$ 6715737 6724606 6495828 6338960 6322203 6323795 6477564 6841130 6838208 6355527 6404799 6448441
5865F448441J07945j7566j84622j3201j42150q8180J46815J14274j07491j49267
$$ 6448441 6556386 6538820 6354198 6340997 6198847 6110667 6257482 6371756 6264265 6114998
5855F114998j54507N7491m0908J12669M1342K36177k7105M5709k84191j55733
$$ 6114998 5960491 6017982 5977074 6089743 6131085 6367262 6340157 6385866 6101675 5945942
5845E945942r7455n7935J07484Q8926M1084K22491m6953K9419J11922k24301L21734
$$ 5945942 5848487 5790552 5898036 5986962 6028046 6250537 6203584 6233003 6344925 6120624 6442358
5834F442358L74462J69673K7696K24552M2184J27461O8670J91523J89737K52112
$$ 6442358 6816820 6986493 7014189 7238741 7280925 7408386 7477056 7668579 7858316 8110428
5824H110428J62022j01469k01166K38900K7350o645K50643o0574J61130L04662
$$ 8110428 8272450 8170981 7969815 8208715 8236065 8229420 8480063 8419489 8580619 8885281
5814H885281k55294k15167l0382p122k58356n22r6727O8893L4489k31798M9338
$$ 8885281 8629987 8414820 8384438 8377316 8118960 8118438 8021711 8090604 8125093 7893295 7942633
5803G942633m7457q622M4471M3828L8467j74103K857j38484J97990J88243k19331
$$ 7942633 7895176 7886554 7931025 7974853 8013320 7839217 7842074 7703590 7901580 8089823 7870492
5792G870492k97437J38499N37033j45434R7881L98503K59262K29333K7163P8682
$$ 7870492 7573055 7711554 8248587 8103153 8201034 8599537 8858799 9088132 9115295 9193977
5782I193977K20792Q8498j40953Q8488k62176j72487j33861k61861j12156k68922
$$ 9193977 9414769 9503267 9362314 9450802 9188626 9016139 8882278 8620417 8508261 8239339
5772H239339J89597j16861q1127J86858K62481j04660r6898j26623n2483N0483
$$ 8239339 8428936 8312075 8230948 8417806 8680287 8575627 8478729 8352106 8299623 8350106
5762H350106J28433J83022R3219J88413J09265J07978J34924j40239J07869P761
$$ 8350106 8478539 8661561 8754780 8943193 9052458 9160436 9295360 9155121 9262990 9270751
5752I270751K38693R0131J93139L04218P8710J83877R4536J25096k25505p255
$$ 9270751 9509444 9599575 9792714 10096932 10175642 10359519 10454055 10579151 10353646 10346391
5742A0346391m09516J2647M49761k85454P9740K11081k26854K83599N6280J39084
$$ 10346391 9936875 9949522 10399283 10113829 10193569 10404650 10177796 10461395 10517675 10656759
5732A0656759L307n5644J7061R1161L81328K11128L07500K96563J14346K36127
$$ 10656759 10660066 10604422 10621483 10712644 11093972 11305100 11612600 11909163 12023509 12259636
5722A2259636L94309P0666J2278m7588l0435J13957j27944m3153p6075j394M1384
$$ 12259636 12653945 12724611 12736889 12689301 12658866 12772823 12644879 12601726 12525651 12524257 12565641
5711A2565641j14495Q1302K29696l6307N8933K98832L7678J5471K92543J29345
$$ 12565641 12451146 12532448 12762144 12725837 12784770 13083602 13121280 13136751 13429294 13558639
5701A3558639j01559J37799M08756l8585r7247L17264M49293L19942k60744J11551
$$ 13558639 13457080 13594879 14003635 13965050 13867803 14185067 14634360 14954302 14693558 14805109
5691A4805109j94394J79288K51798Q652j0574M17435J74906K15152K74564L56452
$$ 14805109 14610715 14790003 15041801 15050453 15039879 15457314 15632220 15847372 16121936 16478388
5681A6478388K56721P0983j33039J64193N52898J16153L89293K99565M65525M45133
$$ 16478388 16735109 16806092 16673053 16837246 17390144 17506297 17895590 18195155 18660680 19105813
5671A9105813M76815O81071L26799L29220M48178M66940M20027L06463O28553
$$ 19105813 19582628 20263699 20590498 20919718 21367896 21834836 22254863 22561326 23189879
5662B3189879N85908Q23188N86722M27033M66024O24915N4260J7451M05139K58863
$$ 23189879 23775787 24598975 25185697 25612730 26078754 26703669 26757929 26775380 27180519 27439382
5652B7439382M25059L40189J59786L21865L93095P63909N25930M38468Q30348
$$ 27439382 27864441 28204630 28364416 28686281 29079376 29843285 30369215 30807683 31638031
5643C1638031P33844O74673O36693P34389O70944Q84107J078485Q96533J030632
$$ 31638031 32371875 33046548 33683241 34417630 35088574 35972681 37051166 37947699 38978331
5634C8978331J110154J370148J614901Q52531J281601J740806J787176J875335
$$ 38978331 40088485 41458633 43073534 43926065 45207666 46948472 48735648 50610983
5626E0610983J439186J538569J506732J627361J154019J497946J812133J663482
$$ 50610983 52050169 53588738 55095470 56722831 57876850 59374796 61186929 62850411
5618F2850411J347854J362365J537661J436376J356622J977559J981887J775394
$$ 62850411 64198265 65560630 67098291 68534667 69891289 71868848 73850735 75626129
5610G5626129K712256K729278K919946L191627L831361M424879N220506N947204
$$ 75626129 78338385 81067663 83987609 87179236 91010597 95435476 100655982 106603186
5602A06603186O963480P513089Q469673R451631J0023038J0624381J0622999J0767048
$$ 106603186 113566666 121079755 129549428 139001059 149024097 159648478 170271477 181038525
5594A81038525J1004065J1603816J1642845J1617471J0727628Q506756N173390
$$ 181038525 192042590 203646406 215289251 226906722 237634350 246141106 251314496
5587B51314496J350124k260301n354908p684452q590886r448865j0211460j0817112
$$ 251314496 252664620 250404319 245049411 237364959 228774073 219325208 209113748 198296636
5579A98296636j1405465j2692208j2389066j1549792j0963670j0484694r156290
$$ 198296636 186891171 174198963 161809897 150260105 139296435 128811741 119655451
5572A19655451q063586p257098o294500n747036n257232m855205m349659m115426
$$ 119655451 111591865 104334767 98040267 92293231 87035999 82180794 77831135 73715709
5564G3715709l394999l583896l040481k794838k754375k455874k076654j961777
$$ 73715709 70320710 66736814 63696333 60901495 58147120 55691246 53614592 51652815
5556E1652815k073183j812879j719883j503705j312321j582115j138985j203752
$$ 51652815 49579632 47766753 46046870 44543165 43230844 41648729 40509744 39305992
5548C9305992r58388j175945q16793j130867r76408l21995m97873q86993r16963
$$ 39305992 38347604 37171659 36354866 35223999 34247591 33925596 33427723 32540730 31623767
5539C1623767l49090j33630m93773l55604l95553o86339m25935k52044K25769
$$ 31623767 31274677 31141047 30647274 30291670 29896117 29209778 28783843 28531799 28757568
5530B8757568M2124J4633M1642l2491p0767M2129J15238K27928L98424K70148
$$ 28757568 28799692 28814325 28855967 28823476 28752709 28794838 28910076 29138004 29536428 29806576
5520B9806576L54033P0332M4740j09463k33517j21351n31878o55964p11307n97522
$$ 29806576 30160609 30230941 30275681 30166218 29932701 29811350 29279472 28623508 27912201 27314679
5510B7314679o48332j076951o91715n73914q95709p37911r53205r06255p79740
$$ 27314679 26666347 25589396 24897681 24323767 23428058 22690147 21736942 20830687 20050947
5501B0050947q85381o77823k43883n04520k30668k20148m34613k14852o6911l75912
$$ 20050947 19165566 18487743 18243860 17739340 17508672 17288524 16853911 16639059 16572148 16196236
5491A6196236m31956k46421l05466O667p6149o3329q345l06679k0270q4390k34206
$$ 16196236 15764280 15517859 15212393 15219060 15142911 15079582 15071237 14764558 14744288 14659898 14425692
5480A4425692j03406l62909L9954l39926n22892k51204j10298j02530k64553l01941
$$ 14425692 14322286 13959377 13999331 13659405 13136513 12885309 12775011 12672481 12407928 12105987
5470A2105987j95142j59590m60340K9724k91447k86009j2660k85369j71746L4211
$$ 12105987 11910845 11751255 11290915 11320639 11029192 10743183 10730523 10445154 10273408 10307619
5460A0307619n206l51399r9965j33324j39727l01076K4880j54981O2942R6383
$$ 10307619 10302413 9951014 9851049 9717725 9577998 9276922 9301802 9146821 9209763 9306146
5450I306146m02052j70252n2722P1611l2237l2470r2900o6942n4489L0571j55223
$$ 9306146 8904094 8733842 8681120 8752731 8720494 8688024 8595124 8528182 8473693 8504264 8349041
5439H349041j02001J24128J58348j13020K8349j65483p0722j14348q4913O1976
$$ 8349041 8247040 8371168 8529516 8416496 8444845 8279362 8208640 8094292 8009379 8071355
5429H071355j88254k886m8454n8626K64297k31350K20004J20337J04301J20363
$$ 8071355 7883101 7880215 7831761 7773135 8037432 7806082 8026086 8146423 8250724 8371087
5419H371087L1375O9649k11369N888K55326J57986K30472L8518J03537k25963
$$ 8371087 8402462 8472111 8260742 8266630 8521956 8679942 8910414 8948932 9052469 8826506
5409H826506j80184L9888j95717O7359j94069j98316j67597r0773j69476J162
$$ 8826506 8646322 8686210 8490493 8557852 8363783 8165467 7997870 7907097 7737621 7738783
5399G738783j55580l7833j37732l52615j6474q6286K1278L62256l022j64167J3336
$$ 7738783 7583203 7545370 7407638 7055023 7038549 6952263 6973541 7335797 7332775 7168608 7181944
5388G181944J17937n9369q7694j44282J10446J85252j88354l06020L4958J61002
$$ 7181944 7299881 7240512 7152818 7008536 7118982 7304234 7115880 6809860 6844818 7005820
5378G005820j14865j77585L03239j05433j89507N493j32713P9115j13576J42682
$$ 7005820 6890955 6713370 7016609 6911176 6721669 6727162 6594449 6673564 6559988 6702670
5368F702670L31833J03806j38038l23499j06677N0915m7559J65486Q7145P8501
$$ 6702670 7034503 7138309 7000271 6676772 6570095 6621010 6573451 6738937 6826082 6904583
5358F904583K7816k56449m9253R1359j21050l5641J54057r4328p0338L1065j5911
$$ 6904583 6932399 6675950 6626697 6718056 6597006 6561365 6715422 6621094 6550756 6581821 6565910
5347F565910j89328K80719J5403K30850n9752j13309m8781k91722k29488l4347
$$ 6565910 6376582 6657301 6672704 6903554 6843802 6730493 6681712 6389990 6160502 6126155
5337F126155J3248J83075K9721O9205R0245J3880J13042l86761R1425k06428R7724
$$ 6126155 6139403 6322478 6352199 6421404 6511649 6525529 6638571 6251810 6343235 6136807 6234531
5326F234531P2073k39193J04062J50493k61289J56779J37876j31727M5754J40132
$$ 6234531 6306604 6067411 6171473 6321966 6060677 6217456 6355332 6223605 6269359 6409491
5316F409491N4715l1926k29751j11812M56799K37701l36484J80201j05683P5898
$$ 6409491 6464206 6432280 6202529 6090717 6547516 6785217 6448733 6628934 6523251 6599149
5306F599149K02385l8339j18808j64509N6078p4151K43223J31016o9522p4236
$$ 6599149 6801534 6763195 6644387 6479878 6535956 6461805 6705028 6836044 6766522 6692286
5296F692286K79258N8845K8806j15269j28977M5987O0330l6710J83762J31420
$$ 6692286 6971544 7030389 7059195 6943926 6814949 6860936 6921266 6884556 7068318 7199738
5286G199738n0314J70145N4791J60442L04953J86079k44381J960K7604N8871J58094
$$ 7199738 7149424 7319569 7374360 7534802 7839755 8025834 7781453 7783413 7811017 7869888 8027982
5275H027982J27709k09963n353J76001p9057l74167m8912J38792K201j90481Q6295
$$ 8027982 8155691 7945728 7940375 8116376 8037319 7663152 7614240 7753032 7755233 7564752 7651047
5264G651047J52298k30545J41629j55672r624r2787n7497K50770k04661j62042
$$ 7651047 7803345 7572800 7714429 7558757 7549133 7456346 7398849 7649619 7444958 7282916
5254G282916Q4683j03292L2737J39474J74573q0620R5524J54649K04670o767k29994
$$ 7282916 7367599 7264307 7297044 7436518 7611091 7530471 7625995 7780644 7985314 7978547 7748553
5243G748553M575K86025j3730J1009j81698N8665j98180K82179L47818m5909q9178
$$ 7748553 7753128 8039153 8025423 8036432 7854734 7913399 7715219 7997398 8345216 8299307 8210129
5232H210129L0004r2532Q7027K64482N9886n8872O7913J30356J4867L35755j6108
$$ 8210129 8240133 8147601 8234628 8499110 8558996 8500124 8568037 8698393 8713260 9049015 9032907
5221I032907L3973K73080L54975J77635N17954l51502J2882K3015k0676K61295
$$ 9032907 9066880 9339960 9694935 9872570 10390524 10039022 10051904 10074919 10054243 10315538
5211A0315538j63444J07659Q8450n41J16375n9599K29571n6570J12411l6520J11096
$$ 10315538 10152094 10259753 10348203 10347662 10464037 10404438 10634009 10577439 10689850 10653330 10764426
5200A0764426O0975p9072n8609J92621K86383J43792Q873J15124M6878K7137J73729
$$ 10764426 10825401 10746329 10687720 10880341 11166724 11310516 11319389 11434513 11481391 11508528 11682257
5189A1682257K76979L16539j77882l1876l6521L67922j48443j31367J8966l8404
$$ 11682257 11959236 12275775 12097893 12066017 12029496 12397418 12248975 12117608 12136574 12098170
5179A2098170k17855K73613M0927K5326r1975j17575K5664j38460N9271K35494
$$ 12098170 11880315 12153928 12194855 12220181 12128206 12010631 12036295 11897835 11957106 12192600
5169A2192600K90989Q2515L8041J67952M41419M34260N2350K63397L07994N5856
$$ 12192600 12483589 12566104 12604145 12772097 13213516 13647776 13700126 13963523 14271517 14327373
5159A4327373J10355M18461j09997K35693M47566q7529J42743J21717J51325r0562
$$ 14327373 14437728 14856189 14746192 14981885 15429451 15341922 15484665 15606382 15757707 15667145
5149A5667145K5122m9172m5104L55620J15077k07888J96839J0411K50996J10533
$$ 15667145 15692267 15643095 15597991 15953611 16068688 15860800 16057639 16068050 16319046 16429579
5139A6429579L22851K28511N92886L85122M10927N05283N45562K91906j7024k11678
$$ 16429579 16752430 16980941 17573827 17958949 18369876 18875159 19420721 19712627 19695603 19483925
5129A9483925L6396j02701J57601M99833M27851M26538K2635M1353j38896r590
$$ 19483925 19520321 19417620 19575221 20075054 20502905 20929443 20952078 20993431 20854535 20844945
5119B0844945K38154K79375N67323J44501q2976o6834J18089J14662p2771k410
$$ 20844945 21083099 21362474 21929797 22074298 21991322 21924488 22042577 22157239 22084468 22082058
5109B2082058j69851r6383m52859k33845K98320J25228J51374J82504L1852K19771
$$ 22082058 21912207 21815824 21362965 21129120 21427440 21552668 21704042 21886546 21918398 22138169
5099B2138169J15230J0420K27881J27404j60837J49948k24275K05132O7062M8747
$$ 22138169 22253399 22263819 22491700 22619104 22458267 22608215 22383940 22589072 22656134 22704881
5089B2704881L13127L39133Q1181R2811l5108R6943l2308J28983L49333K51986
$$ 22704881 23018008 23357141 23438322 23531133 23496025 23592968 23560660 23689643 24038976 24290962
5079B4290962J34003k24369l75313K08460J73676M06189M55728L27561K76227
$$ 24290962 24424965 24200596 23825283 24033743 24207419 24613608 25069336 25396897 25673124
5070B5673124M94045L00736K24337J07979K69600Q4691R5200M1886L04846j86360
$$ 25673124 26167169 26467905 26692242 26800221 27069821 27154512 27249712 27291598 27596444 27410084
5060B7410084k48403j17099r813m27513j54289J96341P005M24438J23507J32212
$$ 27410084 27161681 27044582 27034769 26607256 26452967 26649308 26656313 27080751 27204258 27336470
5050B7336470k63851L16269J43832M31923K17194L73992L50145M26608O56978
$$ 27336470 27072619 27388888 27532720 27964643 28181837 28555829 28905974 29332582 29989560
5041B9989560K86201N76587O19885J99278O04723M29060L99031N25083R34218
$$ 29989560 30275761 30852348 31472233 31671511 32276234 32705294 33104325 33629408 34563626
5032C4563626Q49047N64567N92448J169871R43694R25873Q63113R62504J216178
$$ 34563626 35412673 35977240 36569688 37739559 38683253 39609126 40472239 41434743 42650921
5023D2650921J494314J013588J282430J401890J271917J185530J056721P76134
$$ 42650921 44145235 45158823 46441253 47843143 49115060 50300590 51357311 52133445
5015E2133445O46119J031300O24949N62710O91581R10162R30521Q68057N15972
$$ 52133445 52779564 53810864 54435813 54998523 55690104 56600266 57530787 58398844 58914816
5006E8914816Q86277J256322J110858J334127J428155J309803J609770J829927
$$ 58914816 59801093 61057415 62168273 63502400 64930555 66240358 67850128 69680055
4998F9680055K044559K118980K194900K205362J744153J950218J867871J556539
$$ 69680055 71724614 73843594 76038494 78243856 79988009 81938227 83806098 85362637
4990H5362637J397225J133575J160498Q28864Q89369L953K1529k90166p59632
$$ 85362637 86759862 87893437 89053935 89882799 90772168 90776121 90797650 90507484 89747852
4981H9747852k62228k42899M1180J81593K52952N51707K13704Q84555M85101P73400
$$ 89747852 89485624 89242725 89283905 89465498 89718450 90270157 90483861 91368416 91853517 92626917
4971I2626917J024756Q52759J182492J588009J530137J333181J656812J286903
$$ 92626917 93651673 94504432 95686924 97274933 98805070 100138251 101795063 103081966
4963A03081966R50613O98152N23540L01077J74125k1059J37435M0473m47273l70364
$$ 103081966 104032579 104730731 105254271 105555348 105729473 105708414 105845849 105886322 105439049 105068685
4953A05068685l625m42413k84844J51002j44403O8784P12646J023494J260966
$$ 105068685 105065060 104622647 104337803 104488805 104344402 104413186 105125832 106149326 107410292
4944A07410292J208817J059457J862868J972577J821723K542827K425106K549800
$$ 107410292 108619109 109678566 111541434 113514011 115335734 117878561 120303667 122853467
4936A22853467K226248K861367K658965K711195K877367L386663L675309L749912
$$ 122853467 125079715 127941082 130600047 133311242 136188609 139575272 143250581 147000493
4928A47000493M196528M971878N639825O387432P078209Q101030Q830985R516229
$$ 147000493 151197021 156168899 161808724 168196156 175274365 183375395 192206380 201722609
4920B01722609J0553533J1170209J1635846J1931725J2083076J2213518J1732998
$$ 201722609 212276142 223446351 235082197 247013922 259096998 271310516 283043514
4913B83043514J0210580Q498595N643105K811207N708k462454m192530n868884
$$ 283043514 293254094 301752689 307395794 310207001 310212709 307750255 303557725 297688841
4905B97688841p672796q972465r624226j0367982j1659943j2461065j3369136
$$ 297688841 290016045 281043580 271419354 261051372 249391429 236930364 223561228
4898B23561228j3088203j2297592j1253264j0031388q863191p379896o020546
$$ 223561228 210473025 198175433 186922169 176890781 168027590 160647694 154627148
4891A54627148n097217m048149k964115j961304j109036m28606K45625R68887
$$ 154627148 149529931 145481782 142517667 140556363 139447327 139018721 139264346 140233233
4883A40233233J167399N07383r63685k068864l626230m306813m180430m602249
$$ 140233233 141400632 141908015 140944330 138875466 135249236 130942423 126761993 122159744
4875A22159744m578340m041434l531031l428488l779513k840161k813831k883108
$$ 122159744 117581404 113539970 110008939 106580451 102800938 99960777 97146946 94263838
4867I4263838k198406j928638j673175j149492r45084o47655l1748l46630k75054
$$ 94263838 92065432 90136794 88463619 87314127 86369043 85721388 85689640 85343010 85067956
4858H5067956K40269m3974j65170k17229m88653o93377q58966n99832p78509j055100
$$ 85067956 85308225 85264251 85099081 84881852 84393199 83699822 82840856 82241024 81462515 80407415
4848H0407415j606681j307693j448595j703831j677327j508308j915199j925832
$$ 80407415 78800734 77493041 76044446 74340615 72663288 71154980 69239781 67313949
4840F7313949j828304j571428j715748j744888j580189j211678j238177r08236
$$ 67313949 65485645 63914217 62198469 60453581 58873392 57661714 56423537 55515301
4832E5515301q14785p52114k07681o11288m79679o76106j73958n16154l09244
$$ 55515301 54700516 53948402 53740721 53129433 52649754 51973648 51799690 51283536 50974292
4823E0974292k01641j65018P893l19215n53909l24521l10422o0057l11139l73376
$$ 50974292 50772651 50607633 50615526 50296311 49742402 49417881 49107459 49047402 48736263 48362887
4813D8362887m10911o28784o47959p32030m91825n24327m04019n24422m73745
$$ 48362887 47951976 47323192 46675233 45943203 45451378 44927051 44523032 43998610 43524865
4804D3524865l30779m55363k28421j1410j40390k19100j14275k35640K99442M23905
$$ 43524865 43194086 42738723 42510302 42498892 42358502 42139402 42025127 41789487 42088929 42512834
4794D2512834j05103J98036J6973J59158N81956j0428j59499M87465N61836O40717
$$ 42512834 42407731 42605767 42622740 42781898 43363854 43353426 43193927 43681392 44243228 44883945
4784D4883945O54183P90892O1239O45127P96730M33998K67248K38678N12277P67086
$$ 44883945 45538128 46329020 46390259 47035386 47832116 48266114 48533362 48772040 49284317 50051403
4774E0051403K96994K62033L65573P0591K4837L53056J31162J65935Q5806N01536
$$ 50051403 50348397 50610430 50976003 51046594 51071431 51424487 51555649 51721584 51807390 52308926
4764E2308926M27413L08489K79606J10625L96517L68489L96938M91178P04759
$$ 52308926 52736339 53044828 53324434 53435059 53831576 54200065 54597003 55088181 55792940
4755E5792940L65954O32777M85504P02486O50273J032755P98955Q47188R58981
$$ 55792940 56158894 56791671 57277175 57979661 58629934 59662689 60461644 61308832 62267813
4746F2267813J305942J217195J250795J662457J835652K015037J841543K154202
$$ 62267813 63573755 64790950 66041745 67704202 69539854 71554891 73396434 75550636
4738G5550636J986303J459293J287423J204665J411129J338258P95182J213541
$$ 75550636 77536939 78996232 80283655 81488320 82899449 84237707 85032889 86246430
4730H6246430Q91385L90381M08858Q23183J349237J381320J228019J586212J657538
$$ 86246430 87137815 87528196 87937054 88760237 90109474 91490794 92718813 94305025 95962563
4721I5962563K670564K802882L058172L654690M506203M791907N574596N996015
$$ 95962563 98633127 101436009 104494181 108148871 112655074 117446981 123021577 129017592
4713A29017592O891173Q608061J0296247J2330513J5150696J8832933K3080993
$$ 129017592 135908765 144516826 154813073 167143586 182294282 201127215 224208208
4706B24208208K6263834K7618159L1709543L2213498J9286803n857851k3524328
$$ 224208208 250472042 278090201 309799744 342013242 361300045 355442194 331917866
4699C31917866l0120228k9919681k7465181k4520906j9480244j4881876j1369633
$$ 331917866 301797638 271877957 244412776 219891870 200411626 185529750 174160117
4692A74160117r320551p554656n994670m421860l647074l345588k258064j917550
$$ 174160117 164839566 157284910 151290240 146868380 143221306 139875718 137617654 135700104
4684A35700104j211757n16834k50379k67621L46290J080812J011633J385712J913491
$$ 135700104 134488347 133971513 133721134 133453513 133799803 134880615 135892248 137277960 139191451
4675A39191451J804727J510167J439326J280167J166097R53831R56530J229387
$$ 139191451 140996178 142506345 143945671 145225838 146391935 147345766 148302296 149531683
4667A49531683Q49740N57717Q22177J066947J105689J262738J508576J976071
$$ 149531683 150381423 150939140 151761317 152828264 153933953 155196691 156705267 158681338
4659A58681338K248635K695532L285801M368838M917429N234071O250588O999917
$$ 158681338 160929973 163625505 166911306 171280144 176197573 181431644 187682232 194682149
4651A94682149P668940R040740J0300480J1892777J4178582J6917740K0627251
$$ 194682149 202351089 211391829 221692309 233585086 247763668 264681408 285308659
4644B85308659K4646818K9596080L3582704L7130427L9489844L6466948K6088391
$$ 285308659 309955477 339551557 373134261 410264688 449754532 486221480 512309871
4637E12309871J3270994M04026j3533921k6842451l4832451l7090082l5181463
$$ 512309871 525580865 525984891 512450970 485608519 450776068 413685986 378504523
4630C78504523l1412996k6103867k0548922j6312502j2780187r716659p493706
$$ 378504523 347091527 320987660 300438738 284126236 271346049 261629390 254135684
4623B54135684n900856n373043o226250p026902q448431r523567r531226r285641
$$ 254135684 248234828 242861785 236635535 229608633 221160202 211636635 202105409 192819768
4615A92819768q386659p388668o722536n745890n488593n347165m441530m625324
$$ 192819768 184433109 177044441 170321905 164576015 159087422 153740257 149298727 144673403
4607A44673403m365075m079241l798800l376918l386187l033011k694207k552072
$$ 144673403 140308328 136229087 132430287 129053369 125667182 122634171 119939964 117387892
4599A17387892k503778k488787k162880k249023j985731j887350j729693j701275
$$ 117387892 114884114 112395327 110232447 107983424 105997693 104110343 102380650 100679375
4591A00679375j703761j344277j110699j150468j440610q74611n60409q58406
$$ 100679375 98975614 97631337 96520638 95370170 93929560 93054949 92494540 91636134
4583I1636134q88406n26875l96400n01321j022626j118356r74418q15764j100033
$$ 91636134 90747728 90220853 89824453 89323132 88300506 87182150 86207732 85391968 84291935
4574H4291935j029235p20912j090705j085479o89699o70675q16202p95401l77880
$$ 84291935 83262700 82541788 81451083 80365604 79675905 79005230 78189028 77393627 77015747
4565G7015747r30148j018134r40988o61465n81992l55528o08329l58181q8534
$$ 77015747 76085599 75067465 74126477 73465012 72883020 72527492 71919163 71560982 71472448
4556G1472448o30628l93164k81469l97289k85909j13878k45689j18076k99517
$$ 71472448 70841820 70448656 70167187 69769898 69483989 69370111 69124422 69006346 68706829
4547F8706829l02827n06743r86772o40209n26538p28023m07137k70953k89128
$$ 68706829 68404002 67897259 66910487 66270278 65743740 65015717 64608580 64337627 64048499
4538F4048499k35415k41621Q821M73443Q74341O16104Q82565J294925J333451
$$ 64048499 63813084 63571463 63580284 64053727 64928068 65544172 66426737 67721662 69055113
4529F9055113J368087J638061J945525K147730J991066K259934K632479K269310
$$ 69055113 70423200 72061261 74006786 76154516 78145582 80405516 83037995 85307305
4521H5307305K104267J362088P95120R3150Q0661m91519r51045j268406k079232
$$ 85307305 87411572 88773660 89568780 89661930 89742591 89251072 88300027 87031621 84952389
4512H4952389l050750l503001l594473l382871k997407k960575k452072j552932
$$ 84952389 81901639 78398638 74804165 71421294 68423887 65463312 63011240 61458308
4504F1458308r65919j298435q56680k21915L35427K54948M70076R85098P72787
$$ 61458308 60492389 59193954 58337274 58115359 58450786 58705734 59175810 60160908 60933695
4495F0933695Q61842J102113J165128J351506L60090j744750k809190l468130
$$ 60933695 61795537 62897650 64062778 65414284 65774374 64029624 61220434 57752304
4487E7752304l467725l096492k926492k613858k158422j745280j484542j353469
$$ 57752304 54284579 51188087 48261595 45647737 43489315 41744035 40259493 38906024
4479C8906024j377700j128956p20131o81644p28043q26180r79145n36527l04603
$$ 38906024 37528324 36399368 35679237 34997593 34269550 33443370 32464225 31927698 31623095
4470C1623095n80550l20351n26452l59307j27595m09141l70679m59208k13577
$$ 31623095 31042545 30722194 30195742 29836435 29708840 29299699 28929020 28469812 28256235
4461B8256235k72064j75242o1805j0526o9696l75536k43078l59050M4421k95886
$$ 28256235 27984171 27808929 27747124 27736598 27666902 27291366 27048288 26689238 26733659 26437773
4451B6437773l09629r7875j34516m62289o65113k81300J37015j91948l50411J20492
$$ 26437773 26128144 26030269 25895753 25433464 24768351 24487051 24624066 24432118 24081707 24202199
4441B4202199J51494J60516J14490j12303k10856K8354j99298k84213J2305j47619
$$ 24202199 24353693 24514209 24628699 24516396 24305540 24333894 24134596 23850383 23862688 23715069
4431B3715069k0120k9090m43908n8410j39441j53425L51045K08811K0452o6663
$$ 23715069 23694949 23665859 23221951 23163541 23024100 22870675 23221720 23430531 23450983 23384320
4421B3384320p325K83635J71978R2795L08358K78906L12673L97047L93988P18666
$$ 23384320 23376995 23660630 23832608 23925403 24233761 24512667 24825340 25222387 25616375 26335041
4411B6335041N52420L85641M66281O27992M82063L2566m64609p95382o68741q93207
$$ 26335041 26887461 27273102 27739383 28367375 28849438 28882004 28417395 27622013 26953272 26060065
4401B6060065o80884o19678o75341m13878j85322m54871l52113l58388m00796
$$ 26060065 25379181 24759503 24084162 23670284 23484962 23030091 22677978 22319590 21918794
4392B1918794n5096j38136j7216l5493K24692q6939J66979K24271R9633Q387J15876
$$ 21918794 21863698 21725562 21708346 21672853 21897545 21810606 21977585 22201856 22301489 22309876 22425752
4381B2425752l74933j20292R1620k79297K5647M46093m7284M01511K82254L05963
$$ 22425752 22050819 21930527 22022147 21742850 21768497 22214590 22167306 22568817 22851071 23157034
4371B3157034M41965J04180J40842K47092L60282N30504P9538K89394j66358j29888
$$ 23157034 23598999 23703179 23844021 24091113 24451395 24981899 25061437 25350831 25184473 25054585
4361B5054585Q2711K0238R219K77041J98182O6650L49553K86602K75974J4553
$$ 25054585 25137296 25157534 25166753 25443794 25641976 25708626 26058179 26344781 26620755 26635308
4351B6635308L26047K21704L03869N43112L32659L47247P71852M19148O18920
$$ 26635308 26961355 27183059 27486928 28030040 28362699 28709946 29481798 29900946 30519866
4342C0519866M44406J189715R51006J012925Q55753R47303J068248J564916J623679
$$ 30519866 30964272 32153987 33104993 34117918 34973671 35920974 36989222 38554138 40177817
4333D0177817J575248J631207J811993K093647K148212J325789P32809J062564
$$ 40177817 41753065 43384272 45196265 47289912 49438124 50763913 51496722 52559286
4325E2559286R87448M85397P14730J201166M59586m32392J53987M95760P28694
$$ 52559286 53546734 54032131 54746861 55948027 56407613 55975221 56129208 56624968 57353662
4316E7353662P83231O85584P38298P58283J056587J862799K192498L055103L455847
$$ 57353662 58136893 58822477 59560775 60319058 61375645 63238444 65430942 68486045 71941892
4307G1941892M386269M759210N276235N703554O927726Q711361J0457002J3344795
$$ 71941892 76328161 81087371 86363606 92067160 98994886 107706247 118163249 131508044
4299A31508044J6673343K1100641K7678379L2308758L3540901L9823549L9728889
$$ 131508044 148181387 169282028 196960407 229269165 262810066 302633615 342362504
4292C42362504J6111091j8639342l4923585l9616063l9579460l4650738k7682103
$$ 342362504 358473595 339834253 304910668 265294605 225715145 191064407 163382304
4285A63382304k0931792j6457447j2832982j0462460q738806p238477n895903
$$ 163382304 142450512 125993065 113160083 102697623 93958817 86720340 80824437
4278H0824437n478366n249137m312028l943263l529524k995790l113451k780357
$$ 80824437 75346071 70096934 65784906 61841643 58312119 55316329 52202878 49422521
4270D9422521k816231k272721k279899k113158j810878j529990j365176j508746
$$ 49422521 46606290 44333569 42053670 39940512 38129634 36599644 35234468 33725722
4262C3725722j320957j039393j201964r38770j143749r69813p63368j279542p21905
$$ 33725722 32404765 31365372 30163408 29224638 28080889 27111076 26347708 25068166 24346261
4253B4346261n33927n44227p88152o67371r06406o63999l75225n82515j107067
$$ 24346261 23812334 23268107 22479955 21812584 20906178 20242179 19866954 19284439 18177372
4244A8177372m32005k07393m37797j02382m45063o90167m07754l69830l82834
$$ 18177372 17745367 17537974 17100177 16997795 16552732 15862565 15454811 15084981 14702147
4235A4702147j30575N1928m90182m05099l05751k64113k89561m21246j37721k94050
$$ 14702147 14571572 14623500 14133318 13728219 13422468 13158355 12868794 12447548 12309827 12015777
4225A2015777J16580p664M1400j52166j72981l8917l8963k25142r2590k96453
$$ 12015777 12132357 12124693 12166093 12013927 11840946 11802029 11763066 11537924 11445334 11148881
4215A1148881k52502o1572J26684o4950k03814m0433j24311k18182K0684J70481
$$ 11148881 10896379 10834807 10961491 10896541 10692727 10652294 10527983 10309801 10330485 10500966
4205A0500966J25388k60233j66919j63832j56446n4600l16175j90160k3286j75036
$$ 10500966 10626354 10366121 10199202 10035370 9878924 9824324 9508149 9317989 9294703 9119667
4195I119667r272R5813L6177j91134l3618r0869k36303K74076Q9953k9897N4893
$$ 9119667 9110395 9206208 9242385 9051251 9017633 8926764 8690461 8964537 9054490 9024593 9079486
4184I079486j27961R7232R0739j27285o9420P4930k25886k38649L6977l39413
$$ 9079486 8951525 9048757 9139496 9012211 8942791 9017721 8791835 8553186 8590163 8250750
4174H250750q9184K26383p0262Q5899o5946j60565n7761j45019K04076L36718
$$ 8250750 8161566 8387949 8317687 8403586 8337640 8177075 8119314 7974295 8178371 8515089
4164H515089q7804q7048L89508K47079r5513P0857K74923m38423j41895K543P2796
$$ 8515089 8427285 8340237 8729745 8976824 8881311 8952168 9227091 8788668 8646773 8649316 8722112
4153H722112k79362j51422l00421k16931l38368k00731n0900n0898q531j64502
$$ 8722112 8442750 8291328 7990907 7773976 7435608 7234877 7183977 7133079 7124548 6960046
4143F960046m489k00194p8043K45515J30527j22869p5465K18442R7515l28863
$$ 6960046 6955557 6755363 6677320 6922835 7053362 6930493 6855028 7073470 7170985 6842122
4133F842122L5717n3875n6302L20839L2662r0852J5568j5395P6682m3477l775
$$ 6842122 6877839 6823964 6767662 7088501 7121163 7030311 7045879 7030484 7107166 7063689 7059914
4122G059914L43977J1029k84260j91124J75209j42581j73068r3974l321k13380
$$ 7059914 7403891 7414920 7130660 6939536 7114745 6972164 6799096 6705122 6701801 6488421
4112F488421k8146J74073k44957j71741j74046K16406n4868j40157Q4953K69032
$$ 6488421 6460275 6634348 6389391 6217650 6043604 6260010 6205142 6064985 6149938 6418970
4102F418970n6266j49649m2311k37385k12255J30995r7344L3063j47234M3400
$$ 6418970 6362704 6213055 6170744 5933359 5721104 5852099 5754755 5787818 5640584 5683984
4092E683984R653l53516j24135l42450l95093M9085L95716j9690n8882M0911o2694
$$ 5683984 5693637 5340121 5215986 4873536 4478443 4527528 4923244 4903554 4844672 4885583 4822889
4081D822889K08474k05250k66365K01248J60489n7730j48633j10427Q2192q753
$$ 4822889 5031363 4826113 4559748 4760996 4921485 4863755 4715122 4604695 4686887 4678134
4071D678134J12959K2119j33483R9811J48496r2745j93660j5867N953k16259K29033
$$ 4678134 4791093 4813212 4679729 4779540 4928036 4835291 4641631 4625764 4631717 4415458 4644491
4060D644491O2646J22895j29424j15725J582p4905j11902r7052J58391J97714
$$ 4644491 4707137 4830032 4700608 4584883 4586465 4511560 4399658 4302606 4460997 4658711
4050D658711J70373l76973k49663O9038R9761k19299j21988J40526L29734R7966
$$ 4658711 4829084 4452111 4202448 4271486 4371247 4151948 4029960 4170486 4500220 4598186
4040D598186R1108O8231o4424P7877J72037j3335j6369N323r000o7022o788K85973
$$ 4598186 4689294 4757525 4693101 4770978 4943015 4929680 4913311 4918634 4909634 4842612 4835824 5121797
4028E121797l27422k04034J48786k8439K68832K56091j47277K7926k21598N9997
$$ 5121797 4794375 4590341 4739127 4710688 4979520 5235611 5088334 5116260 4894662 4954659
4018D954659q4569Q9399K90583K27919J8623K16162K27323P7786J99676K40734
$$ 4954659 4870090 4959489 5250072 5477991 5496614 5712776 5940099 6017885 6217561 6458295
4008F458295n5028J00068L74021Q9611Q7787j45908K15940k07507r4711j53661
$$ 6458295 6403267 6503335 6877356 6966967 7054754 6908846 7124786 6917279 6822568 6668907
3998F668907j0268l94034k03616J47255j18700j43772l0370r009j90763J59722
$$ 6668907 6658639 6264605 6060989 6208244 6089544 5945772 5915402 5906393 5715630 5875352
3988E875352K18288J38598j99219O5439J36796J53675J16747J6203O1854q5893
$$ 5875352 6093640 6232238 6033019 6098458 6235254 6388929 6505676 6521879 6583733 6497840
3978F497840K10953J93069K07115j50495J86151J27369L70907K4959J87308J18614
$$ 6497840 6708793 6901862 7108977 6958482 7144633 7272002 7642909 7667868 7855176 7973790
3968G973790K3744k7828R7311K51638J67648p7004j9586J17995N7587k0683r930
$$ 7973790 7997534 7969706 8067017 8318655 8486303 8409299 8389713 8507708 8565295 8544612 8534682
3957H534682j30982O7122o6087k37393K05041J69791N8497J43647P0040L18945
$$ 8534682 8403700 8470822 8404735 8167342 8372383 8542174 8600671 8744318 8814358 9133303
3947I133303K15527J29129O3327K36783M45629J2111J90488L09202J14319k3087
$$ 9133303 9348830 9477959 9541286 9778069 10223698 10235809 10426297 10735499 10849818 10826731
3937A0826731k44856n27009Q5178j60821m1571j67020l21697l84932l44732k86334
$$ 10826731 10581875 10054866 10140044 9979223 9937652 9770632 9448935 9064003 8719271 8432937
3927H432937k95780j75500n3062k08559K6496P6687O5958K01350j14786k43620
$$ 8432937 8137157 7961657 7908595 7700036 7726532 7803219 7869177 8070527 7955741 7712121
3917G712121K43487q8871k32476O7678r6323j7039j54856j7323n8259k40981M1297
$$ 7712121 7955608 7866737 7634261 7701939 7605616 7588577 7433721 7416398 7358139 7117158 7158455
3906G158455k74546r8450k6248k81059J8559N1118j27502k57920l20349J09148
$$ 7158455 6883909 6785459 6759211 6478152 6496711 6547829 6420327 6162407 5842058 5951206
3896E951206o6602j21027k4279k90943o6854j42121j86307j6799k77471K63125
$$ 5951206 5884604 5763577 5739298 5448355 5381501 5239380 5053073 5036274 4758803 5021928
3886E021928N2908m19068L5331K2093j07864J69973J84755O9919j42834M5452
$$ 5021928 5074836 4655768 4691099 4713192 4605328 4775301 4960056 5029975 4887141 4932593
3876D932593Q812j46881j44515r1213J28242j37304L12325k86445l17300R4678
$$ 4932593 4941405 4794524 4650009 4558796 4687038 4549734 4862059 4575614 4258314 4352992
3866D352992J1442J3504k03854R3472J53942J09822N3507k99867J0947Q3699l9452
$$ 4352992 4364434 4377938 4174084 4267556 4421498 4531320 4584827 4284960 4295907 4379606 4340154
3855D340154J06126j59562p5128l1606J23887k9891q8974R2097J68139P6526N9473
$$ 4340154 4446280 4286718 4211590 4179984 4303871 4273980 4185006 4277103 4445242 4521768 4581241
3844D581241k91957J55758N6202K69190q4069j74259j6247q5161k7730j49418
$$ 4581241 4289284 4445042 4501244 4770434 4686365 4512106 4495859 4410698 4382968 4233550
3834D233550j91203m4345R8869J34366J12928j15955k2457K26107q7504j47730
$$ 4233550 4042347 3998002 4096871 4231237 4344165 4228210 4205753 4431860 4344356 4196626
3824D196626n3363J35910j00252j10208K54222n14635N5469K71864k19332k37645
$$ 4196626 4143263 4279173 4178921 4068713 4322935 3808300 3863769 4135633 3916301 3678656
3814C678656l8784O3605L68762l14380O2174k42202o7442O4642m1601K68541K74422
$$ 3678656 3639872 3703477 4072239 3757859 3820033 3577831 3510389 3575031 3533430 3801971 4076393
3803D076393k00265J94373j36355R3194j35854M6938J57663l33642o7758k33659
$$ 4076393 3876128 4070501 3934146 4027340 3891486 3938424 4096087 3762445 3694687 3461028
3793C461028j4890N4726N1088l326K67453L10323k08911l1242k4217p3423J54422
$$ 3461028 3446138 3500864 3551952 3548626 3816079 4126402 3917491 3886249 3862032 3788609 3943031
3782C943031J05847j28752l53231j30205Q3244R5684Q9199j25957J71570J92332
$$ 3943031 4048878 3920126 3566895 3436690 3519934 3615618 3704817 3578860 3750430 3942762
3772C942762k9602l8973j17353l2760J74685l9171n7405M32030j89270j48876
$$ 3942762 3913160 3874187 3756834 3724074 3898759 3859588 3802183 4234213 4044943 3896067
3762C896067l64974O6015K43666p4592O9793J1994k37388L5936J03769L690l0199
$$ 3896067 3531093 3597108 3840774 3766182 3835975 3847969 3610581 3646517 3750286 3753976 3723777
3751C723777q3655M4546J20968k04590L30571P1195n2153J47239j08906N4515
$$ 3723777 3640122 3684668 3805636 3601046 3931617 4002812 3950659 4097898 3988992 4043507
3741D043507j25350j50244k06164j05937K79601R8658j37496K10146l5520l25157
$$ 4043507 3918157 3767913 3561749 3455812 3735413 3834071 3696575 3906721 3871201 3546044
3731C546044J42432k3907J25303K17498j27040j31284K3007k45894n1561p1596
$$ 3546044 3688476 3664569 3789872 4007370 3880330 3749046 3772053 3526159 3474598 3403002
3721C403002R1478K27298r9373N2790j04925m5737J89799J80976k39236o3766
$$ 3403002 3494480 3721778 3622405 3675195 3570270 3524533 3714332 3895308 3656072 3592306
3711C592306N15469r7452j91758K44655J30960l23591L7253q9155q2974n3586
$$ 3592306 4107775 4010323 3818565 4063220 4194180 3870589 3907842 3818687 3735713 3682127
3701C682127k1585P2863j18646K82473k2895J73297P6069q4245J11203j49864
$$ 3682127 3660542 3733405 3614759 3897232 3874337 4047634 4123703 4039458 4150661 4000797
3691D000797j68199K5537j13825L02792Q8835J24758k75993O8379M8309j09875
$$ 4000797 3832598 3858135 3744310 4047102 4135937 4260695 3984702 4053081 4101390 3991515
3681C991515m2893j63976j61460Q4733j1058J10075L65451j12593Q9253k93445
$$ 3991515 3948622 3784646 3623186 3707919 3696861 3806936 4172387 4059794 4149047 3855602
3671C855602M3694l4010j60625k4468P7312K56936k6305j86314k2753l7909K8170
$$ 3855602 3899296 3865286 3704661 3680193 3757505 4014441 3988136 3801822 3779069 3741160 3769330
3660C769330J77049P0568J6816J88156j7828j34723J19171J29981L0579k54730
$$ 3769330 3946379 4016947 4033763 4221919 4204091 4069368 4188539 4318520 4349099 4094369
3650D094369r4789K01480q875k30766k50209K24372J15065q6898N4169J53955
$$ 4094369 3999580 4201060 4192185 3961419 3711210 3935582 4050647 3963749 4017918 4171873
3640D171873J87458j5931p8049k49763J92369M7880m6535j58253J649p4889K58193
$$ 4171873 4359331 4343400 4265351 4015588 4207957 4255837 4209302 4051049 4052698 3977809 4236002
3629D236002Q5985J14242q762l54600L39262K36428J04615o1300P5815J51157
$$ 4236002 4321987 4436229 4427467 4072867 4412129 4648557 4753172 4691872 4767687 4918844
3619D918844p3173j32335J52700L1732p828j16938Q5449J56805k3275L6958j30994
$$ 4918844 4845671 4713336 4866036 4897768 4889940 4773002 4858451 5015256 4991981 5028939 4897945
3608D897945L46061M1205m5325J27337j29516K02319J01257k43150n8795M00406
$$ 4897945 5244006 5285211 5239886 5367223 5237707 5440026 5541283 5298133 5239338 5639744
3598E639744j87798J51878K95868Q7389k87955O0029L769j50465L2837K1503K45541
$$ 5639744 5451946 5603824 5899692 5987081 5699126 5759155 5762924 5612459 5645296 5666799 5912340
3587E912340J63497K49774J99967j40752L7110J68068j25505J92769j00553O1011
$$ 5912340 6075837 6325611 6525578 6384826 6421936 6590004 6464499 6657268 6556715 6617726
3577F617726J46197K42069N5819j18349j05967J99723J52929p1369J66818p1534
$$ 6617726 6763923 7005992 7061811 6943462 6837495 7037218 7190147 7118778 7285596 7214062
3567G214062j07439L96170J90458K51110j20299j92255K72002j0482R9317O9976
$$ 7214062 7106623 7502793 7693251 7944361 7824062 7631807 7903809 7893327 7992644 8062620
3557H062620K133L6088J25952Q6821J89777L79273K59790K074l5909k4347L35212
$$ 8062620 8064753 8100841 8226793 8313614 8503391 8882664 9142454 9144528 9108619 9084272 9419484
3546I419484L30085J86474n0298j29932J88369J37681N3702L82136K24810J24240
$$ 9419484 9749569 9936043 9885745 9755813 9944182 10081863 10135565 10517701 10742511 10866751
3536A0866751j98755K71225N91381J64848J43226L93913J17441j26570K4484j04812
$$ 10866751 10667996 10939221 11530602 11695450 11838676 12232589 12350030 12223460 12247944 12143132
3526A2143132J05530M09452K99839N1675J33016L63419J72448K97545K94899K82506
$$ 12143132 12248662 12658114 12957953 13009628 13142644 13506063 13678511 13976056 14270955 14553461
3516A4553461L49004L03070M08582K8029J17709L32754N82808K68078M60416L54778
$$ 14553461 14902465 15205535 15614117 15642146 15759855 16092609 16675417 16943495 17403911 17758689
3506A7758689L96956M82493K93208K52025M02260N56002K47452k5165J30893J97480
$$ 17758689 18155645 18638138 18931346 19183371 19585631 20141633 20389085 20363920 20494813 20692293
3496B0692293K56534M34715L44126q962J12753J67569K95118N05632M86880P31560
$$ 20692293 20948827 21383542 21727668 21718706 21831459 21999028 22294146 22799778 23286658 24018218
3486B4018218N36625R3369P15844J151168J036276Q61124R00431Q93935J369526
$$ 24018218 24554843 24648212 25364056 26515224 27551500 28412624 29313055 30206990 31576516
3477C1576516R84513J308668J664149J246696J160199Q76117Q74768P52361L05169
$$ 31576516 32561029 33869697 35533846 36780542 37940741 38816858 39691626 40443987 40749156
3468D0749156L97241K43775m03584q44782j092629j136610j079099j023322j228148
$$ 40749156 41146397 41390172 40986588 40141806 39049177 37912567 36833468 35810146 34581998
3459C4581998j420327r74460q63943j185181o46641q56825q74354n24299n23444
$$ 34581998 33161671 32187211 31323268 30138087 29491446 28634621 27760267 27235968 26712524
3450B6712524p67341m69126n87811n84046m62885j7165j06839l06894O2577n62795
$$ 26712524 25945183 25476057 24888246 24304200 23841315 23824150 23717311 23410417 23472994 22910199
3440B2910199p43195n01638o47851k58037m98567o48145m34049k00588m52666
$$ 22910199 22167004 21665366 21017515 20759478 20260911 19612766 19178717 18978129 18525463
3431A8525463O6696k34912o71536n59285l35785k64562l27990k55054k32926N2024
$$ 18525463 18592159 18357247 17685711 17126426 16790641 16526079 16198089 15943035 15710109 15762133
3421A5762133m2117k23444j38450m40687k75367J15718J30083O4625J12502l7755
$$ 15762133 15720016 15496572 15358122 14917435 14642068 14757786 14887869 14952494 15064996 15027241
3411A5027241Q8586p2104j7705k62697q20889l36669m51700k26313l70605m69167
$$ 15027241 15115827 15043723 15026018 14763321 13942432 13605763 13154063 12927750 12557145 12087978
3401A2087978j76066k78921l21001l18299j20558J17855j47162j05752l15912
$$ 12087978 11911912 11632991 11311990 10993691 10873133 10990988 10843826 10738074 10422162
3392A0422162O6301j7919l07600k04502o0575K52196k21691k77338j4815K36945
$$ 10422162 10488463 10470544 10162944 9958442 9897867 10150063 9928372 9651034 9636219 9873164
3382I873164r024k15164K48074L72055k48898l75726M093j36433m66793j99454
$$ 9873164 9864140 9648976 9897050 10269105 10020207 9644481 9648574 9512141 9045348 8845894
3372H845894J07268l42942j10755J58769j20955l61869l23609o5378n8546j63306
$$ 8845894 8953162 8610220 8499465 8658234 8537279 8175410 7851801 7786423 7727877 7564571
3362G564571k15188M6078N6496j02196k2198j00571n164n0745n5662k40471J03306
$$ 7564571 7349383 7395461 7451957 7349761 7327563 7226992 7221828 7171083 7115421 6874950 6978256
3351F978256k5856J7876k3514k68805j32571Q1371l2042j43952L870j41072m20464
$$ 6978256 6952400 6970276 6946762 6677957 6545386 6626757 6594715 6450763 6454633 6313561 5893097
3340E893097j81910J82575J83607J84998M3352k7717n3816k57544Q144R9593m4043
$$ 5893097 5711187 5893762 6077369 6262367 6305719 6278002 6224186 5966642 5974786 6074379 6030336
3329F030336J08318k94142n3572L3898k1302J1216q8334J51286L5117l46994k34536
$$ 6030336 6138654 5844512 5790940 5824838 5803536 5814752 5726418 5877704 5912821 5565827 5331291
3318E331291L0248o831n3167j57798L04866J25252J0606j15562p0135l4834l36960
$$ 5331291 5361539 5354708 5301541 5143743 5448609 5573861 5584467 5468905 5398770 5363936 5026976
3307E026976R5909J71873J40258M2250k95658N5388j4220m11922J51215L32906
$$ 5026976 5122885 5294758 5435016 5477266 5181608 5236996 5222776 4810854 4962069 5294975
3297E294975p056m6801j69304p9072q1117r5266k90748n6261M7002J51891J11514
$$ 5294975 5287919 5241118 5071814 4992742 4911625 4816359 4525611 4469350 4516352 4668243 4779757
3286D779757r5728J86592k1953j09819m1519J26813l74322j67094L00014P135
$$ 4779757 4684029 4870621 4848668 4738849 4697330 4824143 4449821 4282727 4582741 4589876
3276D589876J69992k7987j35520J43274k06813J3977O0726k18103m6735Q3432
$$ 4589876 4759868 4731881 4596361 4739635 4532822 4546799 4607525 4389422 4342687 4426119
3266D426119K92827J41830j96637J66147L0158k34685k29491j23024o9863m6603
$$ 4426119 4718946 4860776 4664139 4830286 4860444 4625759 4396268 4273244 4203381 4156778
3256D156778n537K95519q4161j64799k14339K33624J35173k3943k436j17531L861
$$ 4156778 4151241 4446760 4362599 4197800 3983461 4217085 4352258 4328315 4325879 4208348 4212209
3245D212209j09856K02105l6634K08664j41040p1896M4252n0531J62985r7446
$$ 4212209 4102353 4304458 4267824 4476488 4335448 4263552 4307804 4257273 4420258 4322812
3235D322812J9553o3745R6724L09653j2887N8096k8859j11405P0569j18902J90616
$$ 4322812 4342365 4278620 4375344 4684997 4672110 4730206 4701347 4589942 4660511 4541609 4732225
3224D732225M3448l6811n7520j8953j29412k06226L00970n6223j12148K23376
$$ 4732225 4775673 4738862 4681342 4662389 4532977 4326751 4627721 4571498 4459350 4682726
3214D682726K01260K88206j4720K45711j15410k40873J00702Q1054J41780j13685
$$ 4682726 4883986 5172192 5157472 5403183 5287773 5046900 5147602 5228656 5370436 5256751
3204E256751J30663J08385k23282R9908P9039O3963M1217O5883J07381Q9748M9227
$$ 5256751 5387414 5495799 5272517 5372425 5451464 5515427 5556644 5622527 5729908 5819656 5868883
3193E868883l5893m0441R8328q998o0268L63325Q8454L2899L084K64524K85834
$$ 5868883 5832990 5792549 5890877 5881879 5821611 6184936 6273390 6306289 6309373 6573897 6859731
3182F859731J74149q7613m7227P0489O7432Q6795L88757J18008l9593J72387L36048
$$ 6859731 7033880 6946267 6899040 6969529 7036961 7123756 7512513 7630521 7590928 7763315 8099363
3171H099363M60064K77120q7291N54284K11941o7250O902M3267O2954L86736K31484
$$ 8099363 8559427 8836547 8749256 9303540 9515481 9448231 9455133 9498400 9561354 9948090 10179574
3160A0179574K08715M5330J46501N0570K33382M98203J2652K04446o3042J48367
$$ 10179574 10388289 10433619 10580120 10630690 10864072 11362275 11374927 11579373 11516331 11664698
3150A1664698K46954J55433L01809J47780L946K14854J67978L57357P2933J31155
$$ 11664698 11911652 12067085 12368894 12516674 12520620 12735474 12903452 13260809 13333742 13464897
3140A3464897J41941J35072O15582M41369K81140J64730N83263N08123O60795
$$ 13464897 13606838 13741910 14357492 14798861 15080001 15244731 15827994 16336117 16996912
3131A6996912O96667J92439M49112L52814K35024K79806l0946l91818l94942n23141
$$ 16996912 17693579 17886018 18335130 18687944 18922968 19202774 19171828 18780010 18385068 17861927
3121A7861927l15754l06213n79701k84306M3170k44445j43468q1386J92740j0597
$$ 17861927 17546173 17239960 16660259 16375953 16419123 16174678 16031210 15949824 16142564 16131967
3111A6131967J42243P413M38883L87688K40633J28988J39311K46624K34350K62808
$$ 16131967 16274210 16281623 16720506 17108194 17348827 17477815 17617126 17863750 18098100 18360908
3101A8360908m8481l01663r9648J05479j43760n59409m60277m34367l86154o63647
$$ 18360908 18312427 18010764 17911116 18016595 17872835 17313426 16853149 16418782 16032628 15368981
3091A5368981o55872j57889Q0790l93674n32092n2028k88836m26092j66857q2136
$$ 15368981 14713109 14555220 14636010 14242336 13710244 13658216 13369380 12943288 12776431 12694295
3081A2694295o5869l875j34254L5701k10009l40946N6169r7148j73717l54973
$$ 12694295 12628426 12624551 12490297 12525998 12315989 11975043 12031212 11934064 11760347 11405374
3071A1405374k87946l08478n45313l95298l99786l03220n45203l33757n46120
$$ 11405374 11117428 10808950 10263637 9868339 9468553 9165333 8620130 8286373 7740253
3062G740253l09612o2120m7514l66858M1394j37147l8500k45984l89928J34298
$$ 7740253 7430641 7368521 7321007 6954149 6995543 6858396 6819896 6573912 6183984 6318282
3052F318282j81645j86337k45014j92389k11859j68087J2122k90869k16774O1262
$$ 6318282 6136637 5950300 5705286 5512897 5301038 5132951 5145073 4854204 4637430 4698692
3042D698692L0703l31810j31122j56990k0841j32917j21354r9941j96937k4877
$$ 4698692 4729395 4397585 4266463 4109473 4088632 3955715 3834361 3734420 3537483 3512606
3032C512606N296J66341j79418k23214j13938L1874L5094l37620j11470O5466
$$ 3512606 3517902 3684243 3504825 3281611 3167673 3199547 3234641 2897021 2785551 2851017
3022B851017n7765P6809P7927j04544m2460j86518k41537p2588m6239j84167J29774
$$ 2851017 2793252 2870061 2947988 2843444 2800984 2614466 2372929 2300341 2254102 2069935 2199709
3011B199709K22320J41528k34134r6146j00970l10047p8372K23388K4874j65881
$$ 2199709 2422029 2563557 2329423 2233277 2132307 1822260 1743888 1967276 1992150 1826269
3001A826269K33116l17725j72287K76978J77415j96692l42210j22926n0816J09825
$$ 1826269 2059385 1741660 1569373 1846351 2023766 1827074 1484864 1361938 1311122 1420947
2991A420947K44079J25333j36082J56221j84671l25743P2316J28392n5291k55717
$$ 1420947 1665026 1790359 1654277 1810498 1625827 1300084 1372400 1500792 1445501 1189784
2981A189784P3853j53605K37576J23317j60360J5640m2050k95455o1113n7084
$$ 1189784 1263637 1110032 1347608 1470925 1310565 1326205 1284155 988700 927587 870503
2971H70503K29071J58028j78758n885n0033j76873l7246r1967J24673J3963N4485
$$ 870503 1099574 1257602 1078844 1072959 1022926 846053 808807 716840 841513 855476 909961
2960I09961k27409q7201R6771n1998K52709L08786k29069j5739j21963P255k05493
$$ 909961 682552 595351 692122 640124 892833 1201619 972550 956811 834848 842103 636610
2949F36610j47391P2637J71779j5571J60730q220l15464J04971J0098j97734k8614
$$ 636610 489219 561856 733635 718064 878794 870574 555110 660081 670179 472445 443831
2938D43831L02672L3399j33160j6553p1226r8995Q4625J11729j52550p9798J24329
$$ 443831 746503 779902 646742 630189 558963 459968 544593 656322 503772 423974 548303
2927E48303O5322M5917o6571L9689l9678j50093k57954M62961M5546k93418j54084
$$ 548303 613625 659542 592971 632660 592982 442889 184935 647896 693442 400024 245940
2916B45940m6786J11951N1980k11128L50646K595k38598k73614K91630O5457k81985
$$ 245940 199154 311105 363085 151957 502603 505198 266600 -7014 284616 350073 68088
2905F8088l2751m6257J83135j69971o0856K31199K5231l5868K7131j57307M1384
$$ 68088 35337 -10920 172215 2244 -58612 172587 197818 161950 189081 31774 73158
2894G3158J76388N8197q2907j86534K18137k4428j64759j09468Q6702J7152K59097
$$ 73158 249546 307743 224836 38302 256439 232011 67252 -42216 44486 61638 320735
2883C20735o5676l40894j32015J60991L28237J38331j9850k65928J47022J56148
$$ 320735 255059 -85835 -217850 -56859 271378 409709 389859 123931 270953 427101
2873D27101j7556r5152j89392j18534N2690J45860R5109K53888j42709m54951
$$ 427101 409545 314393 125001 6467 59157 205017 300126 554014 411305 -43646
2863d3646k01553K37263K69982R7335J23136j35563l6296m11615K5990j0658J46956
$$ -43646 -245199 -7936 262046 359381 482517 346954 310658 -100957 -74967 -85625 61331
2852F1331J76300q1170j28477K09936K16559m8038l02824o7770O2550k97080K35626
$$ 61331 237631 156461 27984 237920 454479 406441 103617 35847 98397 -198683 36943
2841C6943P1690M9834R2872k98843q5098J38513J88721J23033j18400O8303K3245
$$ 36943 108633 158467 251339 -47504 -132602 5911 194632 317665 199265 267568 290813
2830B90813J05395m08343K9309N8191k9178Q6068L08234M588j11904p875j12591
$$ 290813 396208 -12135 17174 75365 46187 132255 440489 445077 333173 325298 212707
2819B12707j99049P9700L4714m134K11373l48280Q1247N3236q0311j95173J82450
$$ 212707 13658 93358 128072 123938 335311 -12969 68278 121514 41203 -153970 28480
2808B8480j17883n7740j21186K98036k3910k29627k62860J43866L22135n1978
$$ 28480 -89403 -147143 -268329 29707 5797 -223830 -486690 -342824 -20689 -72667
2798g2667J39436J0351j25552j07856j9273o5976J79098N8846n1326K63842L9221
$$ -72667 66769 77120 -48432 -156288 -175561 -241537 -62439 -3593 -54919 208923 248144
2787B48144k79377J87098q802j58622P3939N9033P2611j47711P7952r9882j08265
$$ 248144 -31233 155865 147063 -11559 62380 121413 194024 46313 124265 24383 -83882
2776h3882M3448l31876K66615J08706n9008p3914M4881J75362k23379J35264j35076
$$ -83882 -40434 -372310 -105695 3011 -55997 -129911 -85030 90332 -133047 2217 -132859
2765a32859j755n9546j02527r1216k378K60208J56967j63160k99814j2869K03972
$$ -132859 -134614 -194160 -296687 -387903 -390281 -130073 26894 -136266 -436080 -448949 -244977
2754b44977m9089j04768q773J83536L9921P9331P9149K53908j58757l467o0049
$$ -244977 -294066 -398834 -407607 -224071 -184150 -104819 -25670 228238 69481 66014 5965
2743E965n25201J25069L17601m3176k53664J76105j04337n2835J62306J64261
$$ 5965 -519236 -394167 -76566 -119742 -373406 -197301 -301638 -354473 -192167 -27906
2733b7906K06196n9160j94746j6972O7708j8755j75448L02851k28838q0440k0711
$$ -27906 178290 119130 -75616 -92588 -24880 -43635 -219083 83768 -145070 -225510 -246221
2722b46221M3152j5208j86055k81571L40110K75460O435j78998r712J70924j38331
$$ -246221 -203069 -218277 -404332 -685903 -345793 -70333 -63898 -242896 -252608 -81684 -220015
2711b20015l14123K11777K3099k3622L63938P0328k26730q1183q3070p0015J52305
$$ -220015 -534138 -322361 -299262 -322884 41054 111382 -115348 -196531 -279601 -349616 -197311
2700a97311K3278P4327J00389j06498j14690K4169q5749K12421R4512j42513n1606
$$ -197311 -174033 -99706 683 -105815 -220505 -196336 -282085 -69664 24848 -117665 -169271
2689a69271K18665j19807J32937j81229O4131L5112o5950J46845m625m31566k8435
$$ -169271 49394 -70413 62524 -118705 -54574 -19462 -85412 61433 56808 -374758 -403193
2678d03193n8853l8216M27401n7654m9606K40665J3342k75898j16406K1661L31414
$$ -403193 -462046 -500262 -72861 -130515 -180121 60544 73886 -202012 -318418 -296757 34657
2667C4657M01185j92416l48862l2995k85943l323K1596L1287n2370J04106L2530
$$ 34657 435842 243426 -105436 -138431 -424374 -427697 -406101 -374814 -427184 -323078 -290548
2656b90548q7603J60354j45277K24073r5830j99588J10400p7209q8791j33990
$$ -290548 -378151 -217797 -363074 -139001 -234831 -434419 -324019 -401228 -490019 -624009
2646f24009J77166j07933J75852K18513P0250n3224q3169M3400p0718j09086J36944
$$ -624009 -446843 -554776 -378924 -160411 -90161 -143385 -226554 -183154 -253872 -362958 -226014
2635b26014N8285P1599J02688l79739l6618j26709L33392K37380l7121l74946
$$ -226014 -167729 -96130 6558 -373181 -409799 -536508 -203116 34264 -2857 -377803
2625c77803r6050n7210O47J64755m5886q328M1527j21231n5764J00474m3936J27088
$$ -377803 -473853 -531063 -530416 -365661 -411547 -419875 -378348 -499579 -555343 -454869 -498805 -371717
2613c71717J53200n0668j03313J8016L2854R9279k40888J31432P9383J34736j4882
$$ -371717 -218517 -269185 -372498 -354482 -321628 -222349 -463237 -331805 -252422 -117686 -132568
2602a32568k39410j68598J52635o4790K7278K07454J54556l39609L5460K17426
$$ -132568 -371978 -540576 -387941 -452731 -425453 -217999 -63443 -403052 -367592 -150166
2592a50166k20013L65370K71351k10956p7207l21040n3363J97461J41005K61978
$$ -150166 -370179 -4809 266542 55586 -21621 -342661 -396024 -198563 -57558 204420
2582B04420j69694N9132o3918k08925j48948k6132Q535l3391p2006J49152k66110
$$ 204420 34726 93858 29940 -178985 -327933 -354065 -345530 -378921 -450927 -301775 -567885
2571e67885J02231J09190j39267j17379L24151J81575j70488O0924p905k42292
$$ -567885 -465654 -356464 -495731 -613110 -288959 -107384 -277872 -216948 -224853 -467145
2561d67145j61024L44444j32100l9318N3124k24975J97962J30335o5299j8434
$$ -467145 -628169 -283725 -415825 -455143 -402019 -626994 -429032 -298697 -363996 -382430
2551c82430k5582P9739J61217J19214j5992j46305n3899Q9568Q7562q2684j33969
$$ -382430 -408012 -328273 -167056 -47842 -63834 -210139 -264038 -174470 -86908 -169592 -303561
2540c03561j17227K09774l3317N1217r3927k93990O8760J78574r3860q2489J47063
$$ -303561 -420788 -211014 -244331 -193114 -287041 -581031 -512271 -333697 -427557 -510046 -362983
2529c62983K43269k6976R4090J58013P6505n942m7568k86325j18964J92156J31843
$$ -362983 -119714 -146690 -52600 105413 181918 175976 128408 -157917 -276881 -84725 47118
2518D7118l32323j78035J99983Q729j62596J07616R1474P7109K31317m6698k28602
$$ 47118 -285205 -463240 -263257 -254528 -417124 -309508 -218034 -140925 90392 43694 -184908
2507a84908o2672J70870k55652J6256L4851J3424L7315P392K0254J1091M9409
$$ -184908 -247580 -76710 -332362 -316106 -281255 -267831 -230516 -223124 -202870 -191779 -142370
2496a42370J00143j6854N0614l29073J09977p7036J00580O013J9968J34445J7841
$$ -142370 -42227 -59081 -8467 -337540 -227563 -304599 -204019 -198006 -178038 -43593 -25752
2485b5752K4244J7100j20864Q2697k87920J79870J08587k13137J33652j00029
$$ -25752 -1508 15592 -105272 -22575 -310495 -130625 -22038 -235175 -101523 -201552
2475b01552J03424J80311k05679J5314o5242M8431O2195J77102J21000j84227
$$ -201552 -98128 82183 -123496 -108182 -173424 -124993 -62798 114304 235304 51077
2465E1077n6737J14751j84969k5998R5544K05670l4126k59971J4466j66760l6633
$$ 51077 -5660 109091 -75878 -101876 -6332 199338 165212 -94759 -80293 -247053 -283686
2454b83686Q5684J02711j16836K19770Q1224j39959L6078j4501n8327j68006K9241
$$ -283686 -198002 -95291 -212127 7643 88867 -51092 -15014 -29515 -87842 -255848 -226607
2443b26607K16504j07169P6704j64747M25588j10680j79283K8186P6565J80046
$$ -226607 -10103 -117272 -40568 -205315 220273 109593 -69690 -41504 35061 215107
2433B15107K7933J39389j48487P5184n5548k13344K72808Q7569Q8147m02310J53383
$$ 215107 243040 382429 233942 309126 253578 40234 313042 400611 488758 86448 239831
2422B39831K57141J40672J13089J18466k33158k23316j13372J23542K61811m86342
$$ 239831 496972 637644 750733 869199 636041 412725 299353 422895 684706 198364
2412A98364J24333J27950M8889K53824l9900j93994K08535M34835L8693R2255
$$ 198364 322697 450647 499536 753360 713460 519466 728001 1162836 1201529 1293784
2402A293784o8741k1793J83052j96281J458l2021J11747O1528O4781R9601j02649
$$ 1293784 1225043 1203250 1386302 1190021 1191479 1159458 1271205 1332733 1397514 1497115 1394466
2391A394466R0159J67385j8753P0665j37746j18200J64726j5983N9399K34112
$$ 1394466 1484625 1652010 1633257 1703922 1566176 1447976 1612702 1596719 1656118 1890230
2381A890230j54690k03189L20384R3101O5087K42695n7395q7139K38391K01556
$$ 1890230 1735540 1532351 1852735 1945836 2010923 2253618 2196223 2109084 2347475 2549031
2371B549031K22529J41657K10133L7475J13733M01514K23046K02410O0126l99018
$$ 2549031 2771560 2913217 3123350 3160825 3274558 3676072 3899118 4101528 4161654 3762636
2361C762636J52756K31977K4773K27623j2330n7782J83322L74096j41903N3410
$$ 3762636 3915392 4147369 4172142 4399765 4387435 4329653 4512975 4887071 4745168 4798578
2351D798578K6549J6349L58593K91582K31371L26644N84071P33957L72961M55601
$$ 4798578 4825127 4841476 5200069 5491651 5723022 6049666 6633737 7367694 7740655 8196256
2341H196256N38738O79667M16162O85772R57906J555299J809725J891164K706499
$$ 8196256 8734994 9414661 9830823 10516595 11474501 13029800 14839525 16730689 19437188
2332A9437188L351710L750774M106218M024493J796872j255002l283698m331870
$$ 19437188 22788898 26539672 30645890 34670383 36467255 35212253 31928555 27596685
2324B7596685m505031l818199l066484k076455j586491j262030j114390p00399
$$ 27596685 23091654 19273455 16206971 14130516 12544025 11281995 10167605 9467206
2316I467206p77844q54186n06999k66858k71747l58488p33006n09078l83369k42150
$$ 9467206 8689362 7835176 7328177 7061319 6789572 6431084 5698078 5189000 4805631 4563481
2306D563481o09107m43329j20733l66076K06505k88636k50754j02477r2106k27099
$$ 4563481 3954374 3511045 3390312 3024236 3230741 2942105 2691351 2588874 2496768 2269669
2296B269669k11273P1507k5199j74020j41113Q2309r1975l69568k7593N6961r4517
$$ 2269669 2058396 2129903 2104704 1930684 1789571 1871880 1779905 1410337 1382744 1439705 1345188
2285A345188k05410j27845K5096j41967L9826J28813p5038j57855L5138j14110
$$ 1345188 1139778 1011933 1037029 895062 934888 1063701 988663 830808 865946 751836
2275G51836k09695J32615j16107k2264K11625j45523l24579R9290j22333p7315
$$ 751836 542141 674756 558649 536385 748010 602487 277908 377198 254865 177550
2265A77550J24229L25533k58794j58768K00132J78989j04586k64261Q021K23451
$$ 177550 301779 627312 368518 209750 409882 588871 484285 220024 228045 451496
2255D51496j78954l7218j00012r8349j7856R6288J14423R3515J08741j89687m17826
$$ 451496 272542 235324 135312 36963 19107 115395 229818 323333 432074 242387 -175439
2244a75439R6435M46202j19137j47363Q1688j15511k54049q2577O4252J56203
$$ -175439 -79004 367198 248061 100698 182386 66875 -187174 -269751 -205499 -49296
2234d9296J03972N201l7655q2385l76803N3802K27229R0862j34308J64809M8885
$$ -49296 54676 59877 22222 -60163 -436966 -383164 -155935 -65073 -199381 -34572 14313
2223A4313J98570k32717k67759k16765K83434N9884q243k5242O8528R388j49372
$$ 14313 212883 -19834 -287593 -504358 -220924 -161040 -169283 -194525 -125997 -116609 -265981
2212b65981j89167K35795J48842o0976O4701l56869J12571J35302J10370j83960
$$ -265981 -455148 -219353 -70511 -131487 -66786 -423655 -311084 -175782 -65412 -249372
2202b49372j32191J83410q5793K07814J52855q6788p3400J8533j97507J9018J02081
$$ -249372 -381563 -198153 -283946 -76132 76723 -10065 -83465 -64932 -262439 -243421 -141340
2191a41340j45030r8077M6488k08871j46676J77502J56852Q7508o1982M8974l7254
$$ -141340 -286370 -384447 -337959 -546830 -693506 -516004 -359152 -271644 -333626 -284652 -321906
2180c21906j12349m7762n5755J21533k9628L2962O7610N4241r7841J35295J69318
$$ -321906 -434255 -482017 -537772 -416239 -445867 -412905 -345295 -291054 -388895 -253600 -84282
2169h4282l73516K70690m4737j46594J20372K17537l30850L2047J09731L093j65552
$$ -84282 -457798 -187108 -231845 -378439 -258067 -40530 -371380 -339333 -229602 -226509 -392061
2158c92061q7845J35211O9386o288O084J87560k57933k30118j66205l2305K11020
$$ -392061 -479906 -344695 -275309 -281597 -275513 -87953 -345886 -576004 -742209 -774514 -563494
2147e63494J35544L48432m4227k51275l0821o9278L19254N7132p8315q2403l4617
$$ -563494 -427950 -79518 -123745 -375020 -405841 -475119 -155865 -98733 -177048 -259451 -294068
2136b94068j17895j1769L62460L0385j65124l9399k03908O287p7208j7317J23139
$$ -294068 -411963 -423732 -61272 -30887 -196011 -235410 -439318 -433031 -510239 -527556 -404417
2125d04417r450k7400M2844l0175j22260J95034K56060l49558K3285m3279l8261
$$ -404417 -413867 -441267 -398423 -428598 -550858 -355824 -99764 -449322 -426037 -469316 -507577
2114e07577J93394Q2231P9331j94272J24338j43265K3836l5470m3345j80193J73652
$$ -507577 -314183 -231952 -152621 -346893 -222555 -365820 -341984 -377454 -420799 -600992 -427340
2103d27340Q8625j70918L4712J27050j34797Q1447L470J74189R618p9139R2479
$$ -427340 -338715 -509633 -474921 -347871 -482668 -401221 -397751 -223562 -213944 -293083 -200604
2092b00604q2869j06036j63503k76512J5325l6023L19618K00989k27595R4300
$$ -200604 -283473 -389509 -553012 -829524 -814199 -850222 -530604 -329615 -557210 -462910
2082d62910m3697L9558j834m3468K64421L3625k04998k62523J81379j35632p7638
$$ -462910 -506607 -467049 -468883 -512351 -247930 -214305 -419303 -681826 -500447 -636079 -713717
2071g13717M46931k54394K16242j32123J53988K23303j43112O5791p4695k49715
$$ -713717 -266786 -521180 -304938 -437061 -283073 -59770 -202882 -137091 -211786 -461501
2061d61501N7354q2646j16745J65425Q251J81372n1707j62343n3888J97208O7820
$$ -461501 -404147 -486793 -603538 -438113 -429862 -248490 -300197 -462540 -516428 -319220 -251400
2050b51400j84748n7426J99890L7816k52480R021L01771n939k55405Q0368K5126
$$ -251400 -436148 -493574 -293684 -255868 -508348 -499327 -197556 -203495 -458900 -378532 -353406
2039c53406M0571j5502k15280O078J39962j06150k716l99632K13980L34678n4705
$$ -353406 -312835 -328337 -543617 -537539 -397577 -503727 -506443 -906075 -692095 -357417 -412122
2028d12122l91884L66922O845r029j00489p1908p5852J04377o0381J1208L15960
$$ -412122 -804006 -437084 -430239 -439268 -539757 -611665 -687517 -583140 -643521 -632313 -316353
2017c16353m6517l00249j96744K59050R2165p7588k03706J74845j09149l29J16638
$$ -316353 -362870 -663119 -859863 -600813 -508648 -586236 -789942 -615097 -724246 -724575 -607937
2006f07937q5465L7578j03151L55160r3883j4438J41825j51198J43483j45070
$$ -607937 -693402 -655824 -758975 -403815 -497698 -512136 -370311 -521509 -378026 -523096
1996e23096J95935l89839l5077J66868L16575K061k85254K96347l17644j22314
$$ -523096 -327161 -717000 -752077 -585209 -268634 -266573 -551827 -255480 -573124 -695438
1986f95438L8072l74046K63388J96977q2706j34582R2238M4907J19458j92860
$$ -695438 -657366 -1031412 -768024 -571047 -653753 -788335 -696097 -651190 -531732 -724592
1976g24592L36208j00199j39245K70281l1070k07661J96173J23530j53764k9564
$$ -724592 -388384 -488583 -627828 -357547 -388617 -596278 -400105 -276575 -430339 -459903
1966d59903J72806J85320j07822j27835j68595K26096q0519l91309K68016R2915
$$ -459903 -287097 -101777 -209599 -337434 -506029 -279933 -360452 -751761 -483745 -390830
1956c90830k58892J43953N0662J15952J32940j19121K18951l9650j37388k35339
$$ -390830 -649722 -505769 -455107 -339155 -206215 -325336 -106385 -146035 -283423 -518762
1946e18762j55996J38713j29429J14912J64545q2062j44378J17987p7393Q2699
$$ -518762 -674758 -536045 -665474 -550562 -386017 -468079 -612457 -494470 -571863 -489164
1936d89164K07750r9202J1863m6831J8133O0331m7173L4626k2476p3852J7317
$$ -489164 -281414 -380616 -368753 -415584 -397451 -337120 -384293 -349667 -372143 -445995 -428678
1925d28678o9868l7463Q868j18166o8403J83314J89083j90861O213p2378P5162
$$ -428678 -498546 -536009 -527141 -645307 -713710 -530396 -341313 -532174 -525961 -598339 -523177
1914e23177L9366m5688K45065R6293k58157l2829J03828l56266k41277K57181
$$ -523177 -483811 -529499 -284434 -188141 -446298 -479127 -375299 -731565 -972842 -715661
1904g15661K30572Q4976j71655M2431q966P1726K11214L3815j86650L321J81827
$$ -715661 -485089 -400113 -571768 -529337 -538303 -466577 -255363 -221548 -408198 -404877 -223050
1893b23050m45432J45630P4216L3492j57054l71563j34500J84022M75518j30402
$$ -223050 -668482 -522852 -448636 -415144 -572198 -943761 -1078261 -894239 -418721 -549123
1883e49123j10096m7865o0897J67399j37436M7709K11058L2268j45110j38360
$$ -549123 -659219 -707084 -767981 -600582 -738018 -690309 -479251 -446983 -592093 -730453
1873g30453O7360J12614j13411k58840J97079J29103R049K1475J67272k6505J8625
$$ -730453 -663093 -550479 -663890 -922730 -725651 -596548 -587499 -566024 -398752 -425257 -406632
1862d06632j61015k1148J68098P6134k51310K846K51755R0787k79845J2104k94436
$$ -406632 -567647 -588795 -420697 -344563 -595873 -593027 -341272 -250485 -530330 -518226 -812662
1851h12662P6408J18878Q5088K78386P6570m37844q2373J97730K7297k41168j02283
$$ -812662 -736254 -617376 -532288 -253902 -177332 -615176 -697549 -499819 -472522 -713690 -815973
1840h15973J70483m8755n2992K13097R8525k61315J63599j2077K58628M1655j99100
$$ -815973 -645490 -694245 -747237 -534140 -435615 -696930 -533331 -545408 -286780 -245125 -444225
1829d44225m1933M2839p7112R6260j58330Q7143j45356k1409j63376N9579J79917
$$ -444225 -486158 -443319 -520431 -424171 -582501 -495358 -640714 -662123 -825499 -765920 -586003
1818e86003l25275n7557L42661k92760K73730j37316j6087K32677N8904M8611
$$ -586003 -911278 -968835 -626174 -918934 -645204 -782520 -798607 -565930 -507026 -458415
1808d58415r9688P6875j2999k15094o4989R0205K5812L96612j39696j70723K68682
$$ -458415 -558103 -481228 -494227 -709321 -774310 -684105 -658293 -261681 -401377 -572100 -303418
1797c03418k33825k36915N8227m5651K65156j61552m1888K09944K328j10964o0287
$$ -303418 -537243 -774158 -715931 -761582 -496426 -657978 -699866 -489922 -487594 -598558 -658845
1786f58845K0464j9394L4440o5173M3922k7497J0936J65099J57906k64159q5372
$$ -658845 -638381 -657775 -623335 -688508 -644586 -672083 -661147 -496048 -338142 -602301 -687673
1775f87673M1514j07729L38937j75839J40185n8848r2644k2928L7236J25061R4072
$$ -687673 -646159 -753888 -414951 -590790 -450605 -509453 -602097 -625025 -587789 -462728 -368656
1764c68656j11700q9910j769M20405J11842k49309m18163j22219K5430L13610
$$ -368656 -480356 -570266 -572035 -151630 -39788 -289097 -707260 -829479 -804049 -490439
1754d90439k7108l19102J14839q9671j40928q0375J74092J72183L70100K74238
$$ -490439 -517547 -836649 -721810 -811481 -952409 -1032784 -858692 -686509 -316409 -42171
$$ [...]
##END NTUPLES=NMR SPECTRUM
##END=
