##TITLE=1H_DE-80H_X3
 200.13MHz, d2o
 8 sc
 
 19ns.26.2.2025
##JCAMPDX= 6.0         $$ Bruker NMR JCAMP-DX V2.0
##DATA TYPE= NMR SPECTRUM
##DATA CLASS= NTUPLES
##ORIGIN= UXNMR, Bruker Analytische Messtechnik GmbH
##OWNER= pz
$$ XWIN-NMR		Version 3.5
$$ Thu Sep 18 15:10:05 2025 Russian Standard Time (UT+4h)  Yarkov@DPX200
##.OBSERVE FREQUENCY= 200.1313
##.OBSERVE NUCLEUS= ^1H
##.ACQUISITION MODE= SIMULTANEOUS
##.ACQUISITION SCHEME= undefined
##.AVERAGES= 8
##.DIGITISER RES= 18
##SPECTROMETER/DATA SYSTEM= spect
##.PULSE SEQUENCE= zg30
##.SOLVENT NAME= CDCl3
##.SHIFT REFERENCE= (INTERNAL, CDCl3, 0, 15.4836)
##AUDIT TRAIL= $$ (NUMBER, WHEN, WHO, WHERE, WHAT)
$$ ##TITLE= Audit trail, XWIN-NMR		Version 3.5
$$ ##JCAMPDX= 5.01
$$ ##ORIGIN= Bruker BioSpin GmbH
$$ ##OWNER= Yarkov
$$ C:/Bruker/XWIN-NMR/data/yarkov2/nmr/H-C/1/pdata/1/auditp.txt
$$ ##AUDIT TRAIL=  $$ (NUMBER, WHEN, WHO, WHERE, WHAT)
(   1,<2025-09-18 15:09:20.68 +0400>,<Yarkov>,<DPX200>,
      <created by zg, POWCHK disabled, PULCHK disabled
       configuration hash MD5:
       00 E9 B6 7A A2 85 ED C7 34 08 36 98 17 FE 4E 26
       data hash MD5: 16K
       AE 1B 93 57 6E 73 57 E6 AD 8E D5 72 9F 83 25 18>)
(   2,<2025-09-18 15:09:30.57 +0400>,<Yarkov>,<DPX200>,
      <Start of raw data processing
       efp BC_mod = 2 LB = 0.25 FT_mod = 6 PKNL = 1 PHC0 = -1348.02 PHC1 = -1.209074 SI = 16K 
       data hash MD5: 16K
       0C 87 9A 2B 07 EB 69 EA 41 46 E8 87 62 A7 60 C4>)
$$ ##END=
$$ 
$$ hash MD5
$$ 0F F9 88 CB 34 E3 CF 40 DB F3 61 C6 18 0D 22 B6
##$RELAX= 
##$RELAX= 
##$RELAX= 
##$RELAX= 
##$RELAX= 
##$RELAX= 
$$ Bruker specific parameters
$$ --------------------------
##$DU= <C:/Bruker/XWIN-NMR>
##$EXPNO= 1
##$NAME= <H-C>
##$PROCNO= 1
##$TYPE= <nmr>
##$USER= <yarkov2>
##$AMP= (0..31)
100 100 100 100 100 100 100 100 100 100 100 100 100 100 100 100 100 100 
100 100 100 100 100 100 100 100 100 100 100 100 100 100 
##$AQSEQ= 0
##$AQ_mod= 1
##$AUNM= <au_zg>
##$AUTOPOS= <>
##$BF1= 200.13
##$BF2= 200.13
##$BF3= 200.13
##$BF4= 200.13
##$BF5= 200.13
##$BF6= 200.13
##$BF7= 200.13
##$BF8= 200.13
##$BYTORDA= 1
##$CFDGTYP= 0
##$CFRGTYP= 5
##$CHEMSTR= <none>
##$CNST= (0..31)
1 1 145 1 1 1 1 1 1 1 1 1 1 1 1 1 1 1 1 1 1 1 1 1 1 1 1 1 1 1 1 1 
##$CPDPRG= <>
##$CPDPRG1= <>
##$CPDPRG2= <>
##$CPDPRG3= <>
##$CPDPRG4= <mlev>
##$CPDPRG5= <mlev>
##$CPDPRG6= <mlev>
##$CPDPRG7= <mlev>
##$CPDPRG8= <mlev>
##$CPDPRGB= <>
##$CPDPRGT= <>
##$D= (0..31)
0 0.7 0 0 0 0 0 0 0 0 0 0.03 0 0 0 0 0 0 0 0 0 0 0 0 0 0 0 0 0 0 0 0 
##$DATE= 1758193760
##$DBL= (0..7)
120 120 120 120 120 120 120 120 
##$DBP= (0..7)
150 150 150 150 150 150 150 150 
##$DBP07= 0
##$DBPNAM0= <>
##$DBPNAM1= <>
##$DBPNAM2= <>
##$DBPNAM3= <>
##$DBPNAM4= <>
##$DBPNAM5= <>
##$DBPNAM6= <>
##$DBPNAM7= <>
##$DBPOAL= (0..7)
0.5 0.5 0.5 0.5 0.5 0.5 0.5 0.5 
##$DBPOFFS= (0..7)
0 0 0 0 0 0 0 0 
##$DE= 6
##$DECBNUC= <off>
##$DECIM= 32
##$DECNUC= <off>
##$DECSTAT= 4
##$DIGMOD= 1
##$DIGTYP= 9
##$DL= (0..7)
0 120 120 120 120 120 120 120 
##$DP= (0..7)
$$ [...]
##$SUBNAM2= <"">
##$SUBNAM3= <"">
##$SUBNAM4= <"">
##$SUBNAM5= <"">
##$SUBNAM6= <"">
##$SUBNAM7= <"">
##$SUBNAM8= <"">
##$SUBNAM9= <"">
##$SW= 18.0517328524113
##$SWIBOX= (0..15)
0 0 2 0 0 0 0 0 0 0 0 0 0 0 0 0 
##$SW_h= 3612.71676300578
##$TD= 16384
##$TD0= 1
##$TE= 0
##$TE2= 300
##$TE3= 300
##$TEG= 300
##$TL= (0..7)
0 120 120 120 120 120 120 120 
##$TP= (0..7)
150 150 150 150 150 150 150 150 
##$TP07= 0
##$TPNAME0= <>
##$TPNAME1= <>
##$TPNAME2= <>
##$TPNAME3= <>
##$TPNAME4= <>
##$TPNAME5= <>
##$TPNAME6= <>
##$TPNAME7= <>
##$TPOAL= (0..7)
0.5 0.5 0.5 0.5 0.5 0.5 0.5 0.5 
##$TPOFFS= (0..7)
0 0 0 0 0 0 0 0 
##$TUNHIN= 0
##$TUNHOUT= 0
##$TUNXOUT= 0
##$USERA1= <user>
##$USERA2= <user>
##$USERA3= <user>
##$USERA4= <user>
##$USERA5= <user>
##$V9= 5
##$VALIST= <valist>
##$VCLIST= <CCCCCCCCCCCCCCC>
##$VD= 0
##$VDLIST= <DDDDDDDDDDDDDDD>
##$VPLIST= <PPPPPPPPPPPPPPP>
##$VTLIST= <TTTTTTTTTTTTTTT>
##$WBST= 1024
##$WBSW= 4
##$XGAIN= (0..3)
0 0 0 0 
##$XL= 0
##$YL= 0
##$YMAX_a= 34544
##$YMIN_a= -27640
##$ZGOPTNS= <>
##$ZL1= 120
##$ZL2= 120
##$ZL3= 120
##$ZL4= 120
##$ABSF1= 0
##$ABSF2= 0
##$ABSG= 0
##$ABSL= 0
##$ALPHA= 0
##$AQORDER= 0
##$ASSFAC= 0
##$ASSFACI= 0
##$ASSFACX= 0
##$ASSWID= 0
##$AUNMP= <proc_1d>
##$AZFE= 0.1
##$AZFW= 0.1
##$BCFW= 0
##$BC_mod= 2
##$BYTORDP= 0
##$COROFFS= 0
##$CY= -3
##$DATMOD= 1
##$DC= 0
##$DFILT= <>
##$DTYPP= 0
##$F1P= 0
##$F2P= 0
##$FCOR= 1
##$FTSIZE= 16384
##$FT_mod= 6
##$GAMMA= 0
##$GB= 0
##$INTBC= 1
##$INTSCL= 3.241238e-09
##$ISEN= 128
##$LB= 0.25
##$LEV0= 0
##$LPBIN= 0
##$MAXI= 10000
##$MC2= 0
##$MEAN= 0
##$ME_mod= 0
##$MI= 1.114404
##$NCOEF= 0
##$NC_proc= -9
##$NLEV= 6
##$NOISF1= 3.799351
##$NOISF2= 2.8
##$NSP= 0
##$NTH_PI= 0
##$NZP= 0
##$OFFSET= 15.48356
##$PC= 1
##$PHC0= -1348.02
##$PHC1= -1.209074
##$PH_mod= 1
##$PKNL= yes
##$PPARMOD= 0
##$PSCAL= 0
##$PSIGN= 0
##$REVERSE= no
##$SF= 200.130007634219
##$SI= 16384
##$SIGF1= 3
##$SIGF2= 2
##$SINO= 0.751879
##$SIOLD= 32768
##$SREGLST= <19F.Aceton>
##$SSB= 0
##$STSI= 16384
##$STSR= 0
##$SW_p= 3612.71676300578
##$SYMM= 0
##$S_DEV= 0
##$TDeff= 16384
##$TDoff= 0
##$TI= <>
##$TILT= no
##$TM1= 0
##$TM2= 0
##$TOPLEV= 0
##$USERP1= <user>
##$USERP2= <user>
##$USERP3= <user>
##$USERP4= <user>
##$USERP5= <user>
##$WDW= 1
##$XDIM= 16384
##$YMAX_p= 270456998
##$YMIN_p= -2097003
$$ End of Bruker specific parameters
$$ ---------------------------------
##NTUPLES= NMR SPECTRUM
##VAR_NAME=  FREQUENCY,     SPECTRUM/REAL,   SPECTRUM/IMAG
##SYMBOL=    X,             R,               I
##VAR_TYPE=  INDEPENDENT,   DEPENDENT,       DEPENDENT
##VAR_FORM=  AFFN,          ASDF,            ASDF
##VAR_DIM=   16384,         16384,           16384
##UNITS=     HZ,            ARBITRARY UNITS, ARBITRARY UNITS
##FACTOR=    0.220516191357247, 1,           1
##FIRST=     3098.72490264588, 0,            0
##LAST=      -513.991860359901, 0,           0
##MIN=       -513.991860359901, -2097003,    0
##MAX=       3098.72490264588, 270456998,    0
$$ Real data points
##PAGE= N=1
##DATA TABLE= (X++(R..R)), XYDATA
$$ [...]
7647D00664K6565j59223L6102M1099P8007N7867J00867k72292K26104R4130p9769
$$ 400664 427229 268006 304108 345207 423214 481081 581948 309656 535760 629890 550121
7636E50121K71418M4498k4011k83880M2722m8909J6558l64413J00654K04920l37775
$$ 550121 821539 866037 842026 558146 600868 551959 568517 204104 304758 509678 171903
7625A71903j7585k4005K45153J18662p4243J70717o4039J76625K9466j64206r9747
$$ 171903 154318 130313 375466 494128 419885 590602 526563 703188 732654 568448 468701
7614D68701O9471J49976j55380J09930j59785l59564M08L75330N8543J14696K9915
$$ 468701 538172 688148 532768 642698 482913 123349 123757 499087 557630 672326 702241
7603G02241q042K1034J9651L6406J62151l00937r1496O5469K55867k5676j04655
$$ 702241 694199 715233 734884 771290 933441 632504 541008 606477 862344 836668 732013
7592G32013j14128N3937J90617N2149k78078K2334K56276j1586j81468J51201
$$ 732013 617885 671822 862439 914588 636510 658844 915120 903534 722066 873267
7582H73267r3732l13827o6278O7810L41997K1027n2043K71347j95970j38405J06897
$$ 873267 779535 465708 399430 467240 809237 830264 778221 1049568 853598 715193 822090
7571H22090l6303p382R2868j09881o4956R5469j57349o4525J85381j79516J3295
$$ 822090 785787 778405 871273 761392 696436 791905 634556 570031 755412 575896 589191
7560E89191M3689j46506j46526J99536J77872p9358n3712J08178J44726q8341
$$ 589191 632880 486374 339848 539384 717256 637898 584186 692364 837090 748749
7550G48749k45602k58144M50324Q9808l09844n7796L52574l45917r5685n9693
$$ 748749 503147 245003 695327 785135 475291 417495 770069 424152 328467 268774
7540B68774M04026K73900p7371j083k9178l83326J83113M7956j41618Q4862k48781
$$ 268774 672800 946700 869329 868246 839068 455742 638855 686811 545193 630055 381274
7529C81274k3928L3572M2295k18773p0668L22687k1560k27730M9893J70115j0102
$$ 381274 357346 390918 433213 214440 143772 466459 444899 217169 267062 437177 427075
7518D27075p435K52266J10975j94620l09020J64429K83779o6611j26886o8991
$$ 427075 419640 671906 782881 588261 279241 443670 727449 660838 533952 464961
7508D64961k31420J83758l765J00875J56880J96787k14806m48949O1663J2550
$$ 464961 233541 417299 413534 514409 671289 868076 653270 204321 265984 278534
7498B78534L20633J18276l79143J96560J07227j40843N772r3791n4026K39774
$$ 278534 599167 717443 338300 534860 642087 501244 507016 413225 359199 598973
7488E98973j81996j99695J23454J47768J46800r5952m4404L144K82322k08735
$$ 598973 416977 217282 340736 488504 635304 539352 494948 498092 780414 571679
7478E71679j88132M0494n4157J83082J568j53567P6031K66626j75472j30460j66411
$$ 571679 383547 424041 369884 552966 554534 400967 476998 743624 568152 437692 271281
7467B71281K97058J22337k07005L1845k3820l7512Q4854L4948K59984j46148l07482
$$ 271281 568339 690676 483671 515516 491696 454184 539038 573986 833970 687822 380340
7456C80340K39497K5108R2595l41922q6538j47667K32769L02242m3027J31338
$$ 380340 619837 644945 737540 395618 309080 161413 394182 696424 653397 784735
7446G84735r5373P2608k16442N3894j74466l8842L07366n3848k46299J6513Q2341
$$ 784735 689362 761970 545528 599422 424956 386114 693480 639632 393333 409846 492187
7435D92187j27726K02401j94185J44490J5670L2305Q3727j48256l0233k56781
$$ 492187 364461 566862 372677 517167 532837 565142 648869 500613 470380 213599
7425B13599r4851J18947J2112L25682r3473L5905n4181j33650J08625K02189M947
$$ 213599 118748 237695 249807 575489 482016 517921 463740 330090 438715 640904 645851
7414F45851j78370j30708j23109K91442l6652L0035o0646K31248J04630n1468
$$ 645851 467481 336773 213664 505106 468454 498489 437843 669091 773721 722253
7404G22253K3839J62609j70331p4482j53783J54541K77449k29009J12560j70572
$$ 722253 746092 908701 738370 663888 510105 664646 942095 713086 825646 655074
7394F55074j76759J28189J46210k6208k72539j28117K67394K43659k06076k58857
$$ 655074 478315 606504 752714 726506 453967 325850 593244 836903 630827 371970
7384C71970L64461p0142k92091q7196J09943K93942J78388k54959j5669L70629
$$ 371970 736431 666289 374198 287002 396945 690887 869275 614316 598647 969276
7374I69276k55435K28940j83532n06149L29730P7262l34529k53014Q4819K67978
$$ 969276 713841 942781 759249 253100 582830 660092 325563 72549 157368 425346
7364D25346J59140K79090j06006l8015n16436j9889N37504J9850j43169j7160
$$ 425346 584486 863576 757570 719555 203119 183230 720734 740584 597415 580255
7354E80255K8410j81049J14361n8503L1450K00561K0657j30116K70692R8943l04802
$$ 580255 608665 427616 541977 483474 514924 715485 736142 606026 876718 975661 670859
7343F70859k71020M7448m6594J41413J76367n9289N6479R5921k30235K2909M0417
$$ 670859 399839 447287 400693 542106 718473 659184 715663 811584 581349 604258 644675
7332F44675K37428k0385j67429k7675j01739k7378O8801K07116k27514k4372L9993
$$ 644675 882103 861718 694289 666614 564875 537497 606298 813414 585900 561528 601521
7321F01521R709N5926r4860k55427k14505J79714J33485L41840j68628k91521
$$ 601521 611230 667156 572296 316869 102364 282078 415563 757403 588775 297254
7311B97254J50506K29149p652j05043P1011l9852K10243n8127j38124R0761O8554
$$ 297254 447760 676909 669257 564214 635225 595373 805616 747489 609365 700126 768680
7300G68680j15788k04597q3109j856K75713N7760O0828q6834j32700K2693P7238
$$ 768680 652892 448295 365186 363330 639043 696803 757631 670797 538097 560790 638028
7289F38028J17800j37028K07978J1079k00115k36575K06254R8966P5025j57921
$$ 638028 755828 618800 826778 837857 637742 401167 607421 706387 781412 623491
7279F23491j85509K97443J0206J4886q8518m8206l11340J0506J95752Q5396J01233
$$ 623491 437982 735425 745631 760517 671999 623793 312453 322959 518711 604107 705340
7268G05340q3962J16170k03300n8729Q790O5908J36279J49815k01799J02755j3399
$$ 705340 621378 737548 534248 475519 484309 550217 686496 836311 634512 737267 723868
7257G23868O3493K80912k97640l7390j76512k79654L3708N08357K59371k82309
$$ 723868 787361 1068273 770633 733243 556731 277077 310785 819142 1078513 796204
7247G96204o7304M2909J82322k1660j38857n3466P5236j77457J71795J99495K2897
$$ 796204 728900 771809 954131 932471 793614 740148 815384 637927 809722 1009217 1032114
7236A032114l3019K2003p2405Q2552k13493p3573N5127j29257o1490q5085M7455
$$ 1032114 999095 1021098 948693 1031245 817752 744179 799306 670049 608559 523474 570929
7225E70929J05692o5165k84284J70111K26911j12902r4011K10781O060N0120p615
$$ 570929 676621 611456 327172 497283 724194 611292 517281 728062 734122 784242 776627
7214G76627l41008J15463J12712j32485l0271L8921L28204J22286k84922j36704
$$ 776627 435619 551082 663794 531309 501038 539959 868163 990449 705527 568823
7204E68823O926l563J87514m3064j19595j6373J0450J35031k0353l17422j6126
$$ 568823 575749 572186 759700 716636 597041 580668 591118 726149 705796 388374 372248
7193C72248L79768N3689j64462J87869J24810o3690J44592K7074m92645O8126
$$ 372248 752016 805705 641243 829112 953922 890232 1034824 1061898 569253 637379
7183F37379L75068k22093k87094J95834J83230P5716k91014L0511K1915K8210
$$ 637379 1012447 790354 503260 699094 882324 958040 667026 697537 719452 747662
7173G47662P2563J17427O067l2001R7350j06646J3064O3671j34394k14701j5121
$$ 747662 820225 937652 943719 911718 1009068 902422 915486 979157 844763 630062 614941
7162F14941J23674j03950n2134K09002J96219j5875j02656L502J29489n7534K16501
$$ 614941 738615 634665 582531 791533 987752 971877 869221 872723 1002212 944678 1161179
7151A161179n3707j96987K09503q1850j12202K87052o2781k5640L8725J04121
$$ 1161179 1107472 910485 1119988 1038138 925936 1212988 1150207 1124567 1163292 1267413
7141A267413k0463R9137O1659J50733L1332j15603j25457J44875J37362j01165
$$ 1267413 1246950 1346087 1407746 1558479 1589811 1474208 1348751 1493626 1630988 1529823
7131A529823o238J50769o3510k6117K19994k6269J21370K58705k87733k29566
$$ 1529823 1523585 1674354 1610844 1584727 1804721 1778452 1899822 2158527 1870794 1641228
7121A641228L71317n9562O4132J89915P7332j24676J76152o9793q8878K02480
$$ 1641228 2012545 1952983 2017115 2207030 2284362 2159686 2335838 2266045 2177167 2379647
7111B379647L7986k04537Q1758M0782j8844p1333m506j04858k98663J80521l1497
$$ 2379647 2417633 2213096 2294854 2335636 2316792 2245459 2240953 2136095 1837432 2017953 1986456
7100A986456J37021j40187l21966j26531j88942r6068J4849l4525o2299L86816
$$ 1986456 2123477 1983290 1661324 1534793 1345851 1249783 1264632 1230107 1167808 1554624
7090A554624j68216k17658R747j1225k55716J282j79794J77003K72552J08326
$$ 1554624 1386408 1168750 1178497 1167272 911556 912838 733044 910047 1182599 1290925
7080A290925k98162p7665P632N1070p7941N3O8516O533K0292N3414k0721j75058
$$ 1290925 992763 915098 922730 973800 895859 895912 964428 970961 991253 1044667 1023946 848888
7068H48888r8180R2831j2742K0221R5563j36245K08080L6085j20740J3157l67807
$$ 848888 750708 843539 830797 851018 946581 810336 1018416 1054501 933761 946918 579111
7057E79111J35685J51900j5626P3988P426p9378j06606o4846K58134K12681j291
$$ 579111 714796 866696 851070 925058 932484 853106 746500 681654 939788 1152469 1151178
7046A151178q7602j99519K17214O3686r8828n0462J06760l7137k47546P9359K86009
$$ 1151178 1063576 864057 1081271 1144957 1046129 995667 1102427 1065290 817744 897103 1183112
7035A183112k3348o5773N3078M6827j35960R5928P8598j09256o0019K8446k61074
$$ 1183112 1159764 1093991 1147069 1193896 1057936 1153864 1232462 1123206 1063187 1091633 830559
7024H30559J90473J27897p6358l2212M3567p6658j4389j59928r982L6891J48204
$$ 830559 1021032 1148929 1072571 1040359 1083926 1007268 992879 832951 822969 859860 1008064
7013A008064J0436k96295O4270J32019J09069J00041r5791M3939k58454j45272
$$ 1008064 1018500 722205 786475 918494 1027563 1127604 1031813 1075752 817298 672026
7003F72026K74795J69700m0984j25013r106J1807k32997J40786m4652q5221j00342
$$ 672026 946821 1116521 1075537 950524 941418 953225 720228 861014 816362 731141 630799
6992F30799J08994J32233j91912J17750M9896j70576l7198L1391L65959l1736
$$ 630799 739793 872026 680114 797864 847760 677184 639986 671377 1037336 1005600
6982A005600p1737l42202K4894K03604j114K1611j87338R515O0943q7562K6045
$$ 1005600 933863 591661 616555 820159 819045 840656 653318 662833 723776 636214 662259
6971F62259o1413P1050P6426m1181J03300j37048R6686j51554J04347O0731k29191
$$ 662259 600846 671896 748322 707141 810441 673393 770079 618525 722872 783603 554412
6960E54412k90190J50994K97021J0065k05514k6175n5235J32207o0141P0329j16295
$$ 554412 264222 415216 712237 722302 516788 490613 435378 567585 507444 577773 461478
6949D61478l39158J75094K12905o2578J63976q0748j96773K00188P4742N5431
$$ 461478 122320 297414 510319 447741 611717 530969 334196 534384 609126 664557
6939F64557j4960P8820l10354j88539J66912K20122K15110j10575L1513J85530
$$ 664557 649597 728417 418063 229524 396436 616558 831668 721093 752606 938136
6929I38136q4075j37288J98792m0156l48717J73168O335l5798L56407j4535l6680
$$ 938136 854061 716773 915565 875409 526692 699860 706195 670397 1026804 1012269 975589
6918I75589k27899J620k46213K58844J89006j10155l6335o3099j11604j45263
$$ 975589 747690 749310 503097 761941 950947 840792 804457 741358 629754 484491
6908D84491J38116N8632l0211P7438k4227K43101R3272K1918O5594j70254k9535
$$ 484491 622607 681239 651028 728466 704239 947340 1040612 1062530 1128124 957870 928335
6897I28335p2614R0366q7909j43501K9730j60439o8427J1816K30387Q9172L51525
$$ 928335 855721 946087 858178 714677 744407 583968 515541 527357 757744 846916 1198441
6886A198441j98233l43753j28603O7658O6064k6698M4691K4137J95172M2655l2711
$$ 1198441 1000208 656455 527852 595510 661574 634876 679567 703704 898876 941531 908820
6875I08820j11509l6739l7417K97939J7090j21621m2825j03216k14011K86237
$$ 908820 797311 760572 723155 1021094 1038184 916563 873738 770522 556511 842748
6865H42748J08689J34820k16683j39379k02471q3907k2130L08234j41325p1271
$$ 842748 951437 1086257 869574 730195 527724 443817 421687 729921 588596 517325
6855E17325L67467j33909J10446k6358J25369k0500l6127l133k59225l4661L00809
$$ 517325 884792 750883 861329 834971 960340 939840 903713 900580 641355 606694 907503
6844I07503J81070j55052Q7650p1433j08667N0784L2267k11149R7849K58103m6652
$$ 907503 1088573 933521 1021171 949738 841071 891855 924122 712973 810822 1068925 1022273
6833A022273j34304J78791n6221J462q5200k0521J54054N580J24160k27704o5125
$$ 1022273 887969 1066760 1010539 1012001 926801 906280 1060334 1065914 1190074 962370 897245
6822H97245J24254j36822k71555J06599J51985k17266k25171K16290L37892l0979
$$ 897245 1021499 884677 613122 719721 871706 654440 429269 645559 983451 952472
6812I52472J43034n4791p1017o5325k47834j74759K58241N68675l05675j21233
$$ 952472 1095506 1040715 969698 904373 656539 481780 740021 1308696 1003021 881788
6802H81788J77811Q5295K3451o6310K71643J87337j97808j02808j30984J67169
$$ 881788 1059599 1144894 1168345 1102035 1373678 1561015 1363207 1260399 1129415 1296584
6792A296584j67502j13774L30481k04750p1779K09419k68196K5513j05908J50392
$$ 1296584 1129082 1015308 1345789 1141039 1069260 1278679 1010483 1035996 930088 1080480
6782A080480L17451J08895l32625j30305j18187j49496J87648R2019o7334j22644
$$ 1080480 1397931 1506826 1174201 1043896 925709 776213 963861 1055880 988546 865902
6772H65902J41985K9009M903p6730J54274Q0140j77574n0024P6968L5516p7428
$$ 865902 1007887 1036896 1041799 965069 1119343 1199483 1021909 971885 1048853 1084369 1006941
6761A006941K90107r6559j21771q2933J96100K26053j63316N4536j41270L5109
$$ 1006941 1297048 1200489 1078718 995785 1191885 1417938 1254622 1309158 1167888 1202997
6751A202997L18016L2546l73875J34999M6246k19386j75897J05837L9074R1885
$$ 1202997 1521013 1553559 1179684 1314683 1360929 1141543 965646 1071483 1110557 1202442
6741A202442k49694k9084P9282P0032Q853o8550M1323l27037J03545J53931L2574
$$ 1202442 952748 923664 1002946 1072978 1081831 1013281 1054604 727567 831112 985043 1017617
6730A017617k7898J72429k32429j02163j68339m5056R7829J50868L20024N3853
$$ 1017617 989719 1162148 929719 827556 659217 614161 711990 862858 1182882 1236735
6720A236735j2649j85570J08018O8950j60256N0605P4146k43953k17781Q6788
$$ 1236735 1224086 1038516 1146534 1215484 1055228 1105833 1179979 936026 718245 805033
6710H05033K55987K99207K1801k74588J06923k299L356p1240j97398O3854j41327
$$ 805033 1061020 1360227 1382028 1107440 1214363 1212064 1215420 1144180 946782 1010636 869309
6699H69309N7961P9125M8237j32486L72444l2312j64613K74281J5572K68785j04938
$$ 869309 927270 1006395 1054632 922146 1294590 1262278 1097665 1371946 1387518 1656303 1551365
6688A551365o7107j61706K55438K00919j24408J07941j28993K65191l4717o05862
$$ 1551365 1484258 1322552 1577990 1778909 1654501 1762442 1633449 1898640 1863923 1258061
6678A258061j299J4146K82997O8365k13264j39173R5747N2077N284K67865k10246
$$ 1258061 1256762 1270908 1553905 1622270 1409006 1269833 1365580 1417657 1422941 1690806 1480560
6667A480560k88524J96916N6880K8299r9348J7209J4316j25827L16776p4902P0054
$$ 1480560 1192036 1388952 1445832 1474131 1374783 1391992 1406308 1280481 1597257 1522355 1592409
6656A592409o5734j25832P0834J10739J92900k12971j25506k313q777j48854J63747
$$ 1592409 1526675 1400843 1471677 1582416 1775316 1562345 1436839 1434526 1425749 1276895 1440642
6645A440642j6820n7341r5429J5248J40654j39804j02500l3607N0653k8062J84896
$$ 1440642 1423822 1366481 1271052 1286300 1426954 1287150 1184650 1151043 1201696 1173634 1358530
6634A358530J38879M7230k93677J31391L02846k49355O391K15367j1318j45615
$$ 1358530 1497409 1544639 1250962 1382353 1685199 1435844 1442235 1657602 1646284 1500669
6624A500669j37917N5371J83776K41869J206j06177J8596j02034j10359k41489
$$ 1500669 1362752 1418123 1601899 1843768 1844974 1738797 1757393 1655359 1545000 1303511
6614A303511K54750K00790L5046K10104m5141o0858l35359J06952K15444j70535
$$ 1303511 1558261 1759051 1794097 2004201 1959060 1898202 1562843 1669795 1885239 1714704
6604A714704M3531o6421J82722K94484J9324j66843R2332K11107N651j44977J16584
$$ 1714704 1758235 1691814 1874536 2169020 2188344 2021501 2113833 2324940 2330591 2185614 2302198
6593B302198R5666m8605j49061J15623l6609K89305L93034P1431r6611k63211
$$ 2302198 2397864 2349259 2200198 2315821 2279212 2568517 2961551 3032982 2936371 2673160
6583B673160M0610K34291J59324j27405J2964p1279J64794N8083J09515K43050
$$ 2673160 2713770 2948061 3107385 2979980 2992944 2921665 3086459 3144542 3254057 3497107
6573C497107J15782j12478M20018K07503L00002M58157M80225L04220M37631N69224
$$ 3497107 3612889 3500411 3920429 4127932 4427934 4886091 5366316 5670536 6108167 6677391
6563F677391L31728J56627J76818L8628l54794k30236o69088l84179n4078l53623
$$ 6677391 7009119 7165746 7342564 7381192 7026398 6796162 6127074 5742895 5688817 5335194
6553E335194j57065n0475r3720l77639l53795m5788j40916q8533l9550J8918j6003
$$ 5335194 5178129 5127654 5033934 4656295 4302500 4256712 4115796 4027263 3987713 4006631 3990628
6542C990628l28210k6701j15349m8488j4266n3711j66039n9296o6443k79980j46630
$$ 3990628 3662418 3635717 3520368 3471880 3457614 3403903 3237864 3178568 3112125 2832145 2685515
6531B685515J90898K45757J1680j4948J33742n06931k74320m7359K13728J06157
$$ 2685515 2876413 3122170 3133850 3118902 3252644 2745713 2471393 2424034 2637762 2743919
6521B743919J63918j97705j61136J05759m9724J20919k43083M8122j49625J14136
$$ 2743919 2907837 2710132 2548996 2654755 2605031 2725950 2482867 2530989 2381364 2495500
6511B495500n6705J16773o4371O9394K7138j67937R159J6815j66911k01971L0993
$$ 2495500 2438795 2555568 2491197 2560591 2587729 2419792 2428951 2445766 2278855 2076884 2107877
6500B107877M3131K54537K24682k38448o7818L38689k58485j34613L48963j03300
$$ 2107877 2151008 2405545 2630227 2391779 2323961 2662650 2404165 2269552 2618515 2515215
6490B515215k22018l381K31895o5643j51681J07031J30704k99413j17293Q4114
$$ 2515215 2293197 2289816 2521711 2456068 2304387 2411418 2542122 2242709 2125416 2209530
6480B209530j18284k12281K83909N0047L37018m5804Q0269J11429o4728J71052
$$ 2209530 2091246 1878965 2162874 2212921 2549939 2504135 2584404 2695833 2631105 2802157
6470B802157o173j05475L515j8454J01583j57189Q5915J53459l1720R2090O202
$$ 2802157 2795984 2690509 2694024 2675570 2777153 2619964 2705879 2859338 2827618 2919708 2925910
6459B925910k3737O9253J51583J10007j40039j95011J41114L32366P7136L1939
$$ 2925910 2902173 2971426 3123009 3233016 3092977 2897966 3039080 3371446 3448582 3480521
6449C480521K7041k31432j13956m5158J70883J06407L5971j47462K101j05424
$$ 3480521 3507562 3276130 3162174 3117016 3287899 3394306 3430277 3282815 3284916 3179492
6439C179492J94030k1087j94807N38648K75808J15529j34547k59726R2145J03883
$$ 3179492 3373522 3352435 3157628 3696276 3972084 4087613 3953066 3693340 3785485 3889368
6429C889368q1760K31702Q6662k30163l5170K33652o98p9687N8876Q66R2920j48961
$$ 3889368 3807608 4039310 4125972 3895809 3860639 4094291 4093593 4013906 4072782 4073648 4166568 4017607
6417D017607K12007J13581O633Q228K33332J43334J56591O851L85821J19695J38636
$$ 4017607 4229614 4343195 4349828 4358056 4591388 4734722 4891313 4898164 5283985 5403680 5542316
6406E542316M4690O3581j2901M84883J07967M2365L04313K09542J4008L39425
$$ 5542316 5587006 5650587 5637686 6122569 6230536 6272901 6577214 6786756 6800764 7140189
6396G140189R0062K35979L39390L412M59735O64648M51243M12567N37412L86385
$$ 7140189 7230251 7466230 7805620 7809032 8268767 8933415 9384658 9797225 10334637 10721022
6386A0721022N59037O23366P07491Q03209J100454J118750J194320R99168J122339
$$ 10721022 11280059 11903425 12610916 13414125 14514579 15633329 16827649 17826817 18949156
6377A8949156R41296R25101M87949L83910L42878Q17002J134894J336134J209179
$$ 18949156 19890452 20815553 21303502 21687412 22030290 22847292 23982186 25318320 26527499
6368B6527499J672999J369325Q27306N61495M42440O98602M92926N74643R87966
$$ 26527499 28200498 29569823 30397129 30958624 31401064 32099666 32592592 33167235 34155201
6359C4155201J029015O92445P95640Q13914O89719Q55804J545476J921004K718088
$$ 34155201 35184216 35876661 36672301 37486215 38175934 39031738 40577214 42498218 45216306
6350D5216306L410175M121296M358289M965512N225907L996873K483600N25736
$$ 45216306 48626481 52747777 57106066 62071578 67297485 71294358 73777958 74303694
6342G4303694j483921l076135l417054k937628k336784j492086p66776O4466K70756
$$ 74303694 72819773 69743638 66326584 63388956 61052172 59560086 58793310 58857776 59128532
6333E9128532J008985K014508K857901L325484M076925M493317M460692L099906
$$ 59128532 60137517 62152025 65009926 68335410 72412335 76905652 81366344 84466250
6325H4466250J961641R34687k84817j548225l246437m118281m335088m314331
$$ 84466250 86427891 87362578 87077761 85529536 82283099 78164818 73829730 69515399
6317F9515399l551617k660159k704514j856847j598751j001913l53207j09385
$$ 69515399 65963782 63303623 60599109 58742262 57143511 56141598 55788391 55679006
6309E5679006J2738Q08200J271478K124411K784373L543285M257595M496110M323375
$$ 55679006 55691744 56499944 57771422 59895833 62680206 66223491 70481086 74977196 79300571
6300G9300571L874187K821762R53624l61023j471629k537979l411746l963739
$$ 79300571 83174758 85996520 86950144 86589121 85117492 82579513 79167767 75204028
6292G5204028l427041l060784k447616j912538j538303o05886N624P04737J421748
$$ 75204028 71776987 68716203 66268587 64356049 62817746 62211860 62217484 62922221 64343969
6283F4343969K210851K349925K396696L013594J755763j08038j661197l523740
$$ 64343969 66554820 68904745 71301441 74315035 76070798 75962760 74301563 70777823
6275G0777823m001812m119303l500843l040265k769425k308389j837667j451820
$$ 70777823 66776011 62656708 59155865 56115600 53346175 51037786 49200119 47748299
6267D7748299j324058j326323p77721q19809j361064j406476j293890j029033
$$ 47748299 46424241 45097918 44320197 43500388 42139324 40732848 39438958 38409925
6259C8409925r03952o90769n39552j003311q54026j172439j142604j095034j145378
$$ 38409925 37505973 36815204 36275652 35272341 34418315 33245876 32103272 31008238 29862860
6250B9862860r26242q35218n63123k09580o71528j085417p61190j246820r80668
$$ 29862860 28936618 28101400 27538277 27328697 26657169 25571752 24810562 23563742 22583074
6241B2583074j238038j237301q74017r41672j075824p44093q30596o16791m90667
$$ 22583074 21345036 20107735 19233718 18292046 17216222 16472129 15641533 15024742 14534075
6232A4534075n76309o70936m19398p11812m81403j31778l54978n26425k26988
$$ 14534075 13957766 13286830 12867432 12155620 11674217 11542439 11187461 10661036 10434048
6223A0434048k44773l34274l34765J81901j32117m55525l40676j37478k78211
$$ 10434048 10189275 9855001 9520236 9702137 9570020 9114495 8773819 8636341 8358130
6214H358130p0637J41508J48573j08265m33164J41914m04516k17827J94024J09014
$$ 8358130 8287493 8429001 8577574 8469309 8036145 8178059 7773543 7555716 7749740 7858754
6204G858754N6165k53236J19609r3720Q5092R239k08009K0278k64789k59716l9364
$$ 7858754 7914919 7661683 7781292 7687572 7772664 7781903 7573894 7594172 7329383 7069667 7030303
6193G030303M98843m76121k8445O6630l6405j15311j89366L0757M6420j99225
$$ 7030303 7529146 7053025 7024580 7091210 7054805 6939494 6750128 6780885 6827305 6628080
6183F628080j54486P0552R9300j80441j78141j12585n3478n9648J64057j22011
$$ 6628080 6473594 6544146 6643446 6463005 6284864 6172279 6118801 6059153 6223210 6101199
6173F101199p5604N7178k32901k1180J54432k41737m1475J47971J40921n5015
$$ 6101199 6025595 6082773 5849872 5828692 5983124 5741387 5699912 5847883 5988804 5933789
6163E933789r6609P4567k38676R4597Q1568K5720m09407k25249j89869K7459j83833
$$ 5933789 5837180 5911747 5673071 5767668 5849236 5874956 5465549 5240300 5050431 5077890 4894057
6152D894057l13734l4311M9712k2991k47245J08279l64595k33134q6981O077k84336
$$ 4894057 4580323 4546012 4595724 4572733 4325488 4433767 4069172 3836038 3749057 3755134 3470798
6141C470798J27861j15728L748j05837k227k19077n2063J37196K0418j36068K66945
$$ 3470798 3598659 3482931 3486679 3380842 3378615 3159538 3107475 3244671 3265089 3129021 3395966
6130C395966r0499j72950j99610r6034j02969l7635k32700r5190R4925J11307
$$ 3395966 3305467 3132517 2932907 2836873 2733904 2696269 2463569 2368379 2463304 2574611
6120B574611N2720k0372L04594m8759k05648l09496L41099j5279j92502q4757
$$ 2574611 2627331 2606959 2911553 2862794 2657146 2347650 2688749 2673470 2480968 2396211
6110B396211j4306o6762K8983J168j1535n2469J02946M670j31654j31743L15732
$$ 2396211 2381905 2315143 2344126 2345294 2333759 2281290 2384236 2388906 2257252 2125509 2441241
6099B441241k03252o357r9019L44103P4192q2147l96696P2259K05184M4262J6892
$$ 2441241 2237989 2231632 2132613 2476716 2550908 2468761 2072065 2144324 2349508 2393770 2410662
6088B410662k7427K9856q2793j37645J52495j68816j18036L5980L91734l34191
$$ 2410662 2383235 2413091 2330298 2192653 2345148 2176332 2058296 2094276 2486010 2151819
6078B151819j91347K35994J81098N1311L2457j65058N3198p7369j96865J82491
$$ 2151819 1960472 2196466 2377564 2428875 2461332 2296274 2349472 2272103 2075238 2257729
6068B257729K3941j40047j3471J89371N9342p719j02354j71046N7223R5880k09569
$$ 2257729 2281670 2141623 2128152 2317523 2376865 2369146 2266792 2095746 2152969 2248849 2039280
6057B039280m055j7482n5702m7390K11371J26059J94541q5435j29742K62163K16766
$$ 2039280 2035225 2017743 1962041 1914651 2126022 2252081 2446622 2361187 2231445 2493608 2710374
6046B710374l91130k15461M528K0105o7079J2610J4570J21706L00526n8643k28836
$$ 2710374 2319244 2103783 2108311 2128416 2061337 2073947 2088517 2210223 2510749 2452106 2223270
6035B223270q3176p108K91500J20074J14491K5017j78330j40516p0277j05356
$$ 2223270 2140094 2132986 2424486 2544560 2659051 2684068 2505738 2365222 2294945 2189589
6025B189589J27108P7610J20955l22064p2451P103J85658L4433K3050o4602j15455
$$ 2189589 2316697 2394307 2515262 2193198 2120747 2127850 2313508 2347941 2370991 2306389 2190934
6014B190934n102J80238K7401k8830N5372m2111l4167K7072o1725j998Q6753P0254
$$ 2190934 2185832 2366070 2393471 2364641 2420013 2377902 2343735 2370807 2309082 2307084 2393837 2464091
6002B464091J74690J69865J41008J8046J62110K49543O6944j69524n9308L44812
$$ 2464091 2638781 2808646 2949654 2967700 3129810 3379353 3446297 3276773 3217465 3562277
5992C562277k63533k36355L27002J57233N1679J10459K39286J78341j35338J88001
$$ 3562277 3298744 3062389 3389391 3546624 3598303 3708762 3948048 4126389 3991051 4179052
5982D179052J28937J71146N59296K1177M93816M74293L57862M82874J53937j16921
$$ 4179052 4307989 4479135 5038431 5059608 5553424 6027717 6385579 6868453 7022390 6905469
5972F905469K3662l20694k51650k72070l47776j90423k87091k12087p6586M1746
$$ 6905469 6929131 6608437 6356787 6084717 5736941 5546518 5259427 5047340 4970754 5012500
5962E012500l96918m29542k83992N9081L5486O8952k84866k64658j39208m2837
$$ 5012500 4615582 4186040 3902048 3961129 3996615 4065567 3780701 3516043 3376835 3333998
5952C333998k58054R6564K10639j95614m08984k99249M8321L9206Q3879J20147
$$ 3333998 3075944 3172508 3383147 3187533 2778549 2479300 2527621 2566827 2650706 2770853
5942B770853R7055k90996J21979j48965J06678R308j07818k2606j05975J9388
$$ 2770853 2867908 2576912 2698891 2549926 2656604 2665912 2558094 2535488 2429513 2448901
5932B448901M7059K2904O948L5767J10727p2465k01852k67562K18545o0818j16620
$$ 2448901 2495960 2518864 2525812 2561579 2672306 2599841 2397989 2130427 2348972 2288154 2171534
5921B171534J93288J11897j48914l4185L24807K91833j92164k5443P1903j54176
$$ 2171534 2364822 2476719 2327805 2293620 2618427 2910260 2718096 2692653 2764556 2610380
5911B610380j1228P4789j49073R1579J63957k92975M9489J03858n2497K40416
$$ 2610380 2599152 2673941 2524868 2616447 2780404 2487429 2536918 2640776 2588279 2828695
5901B828695J52015K08881k9849j47689k50696j62010R3379Q119j67376K52992
$$ 2828695 2980710 3189591 3159742 3012053 2761357 2599347 2692726 2700845 2533469 2786461
5891B786461K53121n08114q6105K28058M44230l30602N6858p1944m7993j92085
$$ 2786461 3039582 2531468 2445363 2673421 3117651 2787049 2843907 2771963 2723970 2531885
5881B531885k48075N1477k47822J0661R5237J74279j27045m9440K20184J41367
$$ 2531885 2283810 2335287 2087465 2098126 2193363 2367642 2240597 2191157 2411341 2552708
5871B552708J92668r5086j1982j25076J34027l8262j78552j27849M7207q9306
$$ 2552708 2745376 2650290 2638308 2513232 2647259 2608997 2430445 2302596 2349803 2260497
5861B260497o8147l7894K8270P8423l7117n7696O6987J78964R8017P4353j26134
$$ 2260497 2192350 2154456 2182726 2261149 2224032 2166336 2233323 2412287 2510304 2584657 2458523
5850B458523Q2964o3903J45391J83111k14395l08286L56245K94290r157N9058
$$ 2458523 2541487 2477584 2622975 2806086 2591691 2283405 2639650 2933940 2924783 2983841
5840B983841K6892K6096J49398j03493j74467J42839K52070k42484J11231M5772
$$ 2983841 3010733 3036829 3186227 3082734 2908267 3051106 3303176 3060692 3171923 3217695
5830C217695J2878P8063l316O5565j32313k76862O7543J21929p5505k06235j13333
$$ 3217695 3230573 3308636 3305320 3370885 3238572 2961710 3029253 3151182 3075677 2869442 2756109
5819B756109P8207O0982J66532O802j44878j18156j05621K1532n984K41777j68078
$$ 2756109 2834316 2895298 3061830 3068632 2923754 2805598 2699977 2721509 2715525 2957302 2789224
5808B789224r319r4759J02886J4735Q3716L399J08574J34808k02884J4076k3388
$$ 2789224 2779905 2685146 2788032 2802767 2886483 2889882 2998456 3133264 2930380 2944456 2921068
5797B921068J14703j45967n0520L0753J04351q7555j37297j07371M707j8286P0913
$$ 2921068 3035771 2889804 2839284 2870037 2974388 2886833 2749536 2642165 2646872 2628586 2699499
5786B699499k1784j71270Q9224J73054P4690P4341k02403k26968p6854J56761
$$ 2699499 2677715 2506445 2595669 2768723 2843413 2917754 2715351 2488383 2411529 2568290
5776B568290R7060N9685m6849k78259j22549K79099j3318j087k7207p791J0854
$$ 2568290 2665350 2725035 2678186 2399927 2277378 2556477 2543159 2542072 2514865 2507074 2517928
5765B517928J42245K27651J20343k56850j12157K06227O7547m40735q2284P6991
$$ 2517928 2660173 2887824 3008167 2751317 2639160 2845387 2912934 2472199 2389915 2466906
5755B466906J50000R1122J00234j02859J94595J36286l9796n8009M4462J25956
$$ 2466906 2616906 2708028 2808262 2705403 2899998 3036284 2996488 2938479 2982941 3108897
5745C108897j51108r4011o6621J55109m6248M1059q3955J23849J83657j22150
$$ 3108897 2957789 2863778 2797157 2952266 2906018 2947077 2863122 2986971 3170628 3048478
5735C048478J42014R2296J64327J5516j32396L28793k93600k22061P1533J53482
$$ 3048478 3190492 3282788 3447115 3462631 3330235 3659028 3365428 3143367 3214900 3368382
5725C368382Q3829j86660l6648M6519K455p886j58433l6119J52195J6361K57431
$$ 3368382 3452211 3265551 3228903 3275422 3277877 3269991 3111558 3075439 3227634 3243995 3501426
5714C501426K69901k6521L4918M6704k3030R1258P1887K6598J38706J56262K33637
$$ 3501426 3771327 3744806 3779724 3826428 3803398 3894656 3966543 3993141 4131847 4288109 4521746
5703D521746K21774K20403N1137O5252J2216j73535k09869J14952j57045L3406
$$ 4521746 4743520 4963923 5015060 5080312 5092528 4918993 4709124 4824076 4667031 4700437
5693D700437K51796O3969j33385K7339j46628L2013K6367K2028J32043K67608
$$ 4700437 4952233 5016202 4882817 4910156 4763528 4795541 4821908 4843936 4975979 5243587
5683E243587J96871n6884K5682o3126J71612N5867K35381r453K34591m5451M7985
$$ 5243587 5440458 5383574 5409256 5346130 5517742 5573609 5808990 5799537 6034128 5988677 6036662
5672F036662L22267K19197L13067N0533k3010K999N9585J84187k24281J71289
$$ 6036662 6358929 6578126 6891193 6941726 6918716 6921715 6981300 7165487 6941206 7112495
5662G112495K5616M9851K13204J60596o8569k62198J51637P7844o4541P3478Q0207
$$ 7112495 7138111 7187962 7401166 7561762 7493193 7230995 7382632 7460476 7395935 7469413 7549620
5651G549620J77879L38275J41850K15882L46214P8777J81106L49958L968K6651
$$ 7549620 7727499 8065774 8207624 8423506 8769720 8848497 9029603 9379561 9383529 9410180
5641I410180M61181M97695K24781M97476L94496M07896N93472M70020M75830P68955
$$ 9410180 9871361 10369056 10593837 11091313 11485809 11893705 12487177 12957197 13433027 14201982
5631A4201982N80909O26892R19531Q42777Q39562J009745Q40510J095688J346559
$$ 14201982 14782891 15409783 16329314 17172091 18011653 19021398 19861908 20957596 22304155
5622B2304155J383184J174251J810611J671383J814392K093956K359071K723332
$$ 22304155 23687339 24861590 26672201 28343584 30157976 32251932 34611003 37334335
5614C7334335K689124L276255M077241M084374M778772N499157N874458O142701
$$ 37334335 40023459 43299714 47376955 51461329 56240101 61739258 67613716 73756417
5606G3756417P038486P026314P091706O706145O271615N631754M110300K788042
$$ 73756417 80794903 87821217 94912923 101619068 107890683 113522437 117632737 120420779
5598A20420779N23000j141573k908393l498584m072598m947607m873020n231021
$$ 120420779 120943779 119802206 116893813 113395229 109322631 104375024 99502004 94270983
5590I4270983n926061n899032n933647n706846n353772m880518m350250m323483
$$ 94270983 88344922 82445890 76512243 70805397 65451625 60571107 56220857 51897374
5582E1897374l874990l214440l211421k937118k481509k056916k310908k120704
$$ 51897374 48022384 44807944 41596523 38659405 36177896 34120980 31810072 29689368
5574B9689368j894425j637816j539965j169905j169685j298222p54334o82393
$$ 29689368 27794943 26157127 24617162 23447257 22277572 20979350 20225016 19542623
5566A9542623q87066p61087n74116o36354q35905k50228p02555o98235n07569
$$ 19542623 18655557 17894470 17320354 16684000 15848095 15597867 14895312 14197077 13689508
5557A3689508k47221m37391j65422l81963q11503k93114k25705j59838l37552
$$ 13689508 13442287 13004896 12839474 12457511 11646008 11352894 11127189 10967351 10629799
5548A0629799m30256k67159K4061k90765m91192j65444k92169k28121r7570k55761
$$ 10629799 10199543 9932384 9956445 9665680 9174488 9009044 8716875 8488754 8391184 8135423
5538H135423l67900l81602j76609k35369M1739l23381q0789j91462o2710n3070
$$ 8135423 7767523 7385921 7209312 6973943 7015682 6692301 6611512 6420050 6357340 6304270
5528F304270j90019k34853j23565J62223k77675k22606m4l8694J80679j51578
$$ 6304270 6114251 5879398 5755833 5918056 5640381 5417775 5417731 5379037 5559716 5408138
5518E408138m23271j51568M69140p9509m3084m7720j97003J11106j60321l06322
$$ 5408138 4984867 4833299 5302439 5222930 5179846 5132126 4935123 5046229 4885908 4579586
5508D579586r7885q3795k1724K00917j2972k2121j51664L0465O397q5694j06065
$$ 4579586 4481701 4397906 4376182 4577099 4564127 4542006 4390342 4420807 4427204 4341510 4235445
5497D235445o413M717n0218k83917J93556o5936M9331R9173k4963j02182j75670
$$ 4235445 4229032 4233749 4183531 3899614 4093170 4027234 4076565 4175738 4150775 4048593 3872923
5486C872923k4623j2360K36159k24917n9027o1008k93309K51621L19581j35157
$$ 3872923 3848300 3835940 4072099 3847182 3788155 3727147 3433838 3685459 4005040 3869883
5476C869883P0211L35851q9837J23052J86921J8249M0823J80549N0993L59999
$$ 3869883 3940094 4275945 4186108 4309160 4496081 4514330 4555153 4735702 4786695 5146694
5466E146694K94606L28236K34188L48554M49360j64228l32486m58130m45450k57529
$$ 5146694 5441300 5769536 6003724 6352278 6801638 6637410 6304924 5846794 5401344 5143815
5456E143815l17705k13412j73304j46243K1958J29032j90983J48931m9111n08755
$$ 5143815 4826110 4612698 4439394 4293151 4315109 4444141 4253158 4402089 4352978 3844223
5446C844223k76608l34355j07770O8385o4341n5253J87277k49298l163Q6702O0140
$$ 3844223 3567615 3233260 3125490 3193875 3129534 3074281 3261558 3012260 3009097 3095799 3155939
5435C155939K3453J21838r4378j13587l48143Q6791L6335M3145R1597K10778J52223
$$ 3155939 3179392 3301230 3206852 3093265 2745122 2831913 2868248 2911393 3002990 3213768 3365991
5424C365991L3590j24554l36697m5967J08930L4900Q7286l81862o4831L22479
$$ 3365991 3399581 3275027 2938330 2892363 3001293 3036193 3123479 2741617 2676786 2999265
5414B999265j93862j67507q8268K08442Q3119L0436j31505j34894p3361K72313
$$ 2999265 2805403 2637896 2549628 2758070 2841189 2871625 2740120 2605226 2531865 2804178
5404B804178R6288j01323j3683k40172Q7171k05968J02832o650l2293j43535J12721
$$ 2804178 2900466 2799143 2785460 2545288 2632459 2426491 2529323 2522673 2490380 2346845 2459566
5393B459566K36106Q3094j39344j63312M29n5264L7646j69462k70302K45952K7659
$$ 2459566 2695672 2778766 2639422 2476110 2476539 2421275 2458921 2289459 2019157 2265109 2292768
5382B292768j21508J84072l08174l3273j42897P9647J10038R9218N3223j62347
$$ 2292768 2171260 2355332 2047158 2013885 1870988 1950635 2060673 2159891 2213114 2050767
5372B050767l32804L8939o8241N9093L83532O9349j55247j01382K56148k09667
$$ 2050767 1717963 1756902 1688661 1747754 2131286 2200635 2045388 1944006 2200154 1990487
5362A990487N2221K68833k18431L9447q9089r0423J80424R6354M1659r1518n5057
$$ 1990487 2042708 2311541 2093110 2132557 2043468 1953045 2133469 2229823 2271482 2179964 2124907
5351B124907Q4096P6619l5672Q0330o690j64627J18854K42555j29744k99952r6103
$$ 2124907 2209003 2285622 2249950 2330280 2323590 2158963 2277817 2520372 2390628 2090676 1994573
5340A994573m1105Q8570J49515j98245K7901j67916J31662J96206M996K15546
$$ 1994573 1953468 2042038 2191553 1993308 2021209 1853293 1984955 2181161 2186157 2401703
5330B401703k40163o7849k66396Q2568j57891J08270J01427q0862l8540K15429
$$ 2401703 2161540 2093691 1827295 1909863 1751972 1860242 1961669 1880807 1842267 2057696
5320B057696R8446J7270k09739J32072J94882k17474n9580j54994o9462L39727
$$ 2057696 2156142 2173412 1963673 2095745 2290627 2073153 2013573 1858579 1789117 2128844
5310B128844l14272J96609K38728p2107r1743k511R3497J15886J14176j56763
$$ 2128844 1814572 2011181 2249909 2177802 2086059 2083548 2177045 2292931 2407107 2250344
5300B250344J34801R0895K15059j77433j8999J88997L20454m977n0278R1919j92811
$$ 2250344 2385145 2476040 2691099 2513666 2494667 2683664 3004118 2999141 2948863 3040782 2847971
5289B847971k35252O1683J23392J40321m43997N8042J09728n1073L4952K2791
$$ 2847971 2612719 2674402 2797794 2938115 2494118 2552160 2661888 2610815 2645767 2668558
5279B668558k1565n3675p5659j10966J68137J33257J20606M1396j55147j44074
$$ 2668558 2646993 2593318 2517659 2406693 2574830 2708087 2828693 2870089 2714942 2570868
5269B570868J546j5692n7653J39511l6591k72536J81900j39571q1795K00172M1360
$$ 2570868 2572414 2556722 2499069 2638580 2601989 2329453 2511353 2371782 2289987 2490159 2531519
5258B531519k5415Q5969o3827O2758L05548J63267J28775l07306J64620J79016
$$ 2531519 2506104 2592073 2528246 2591004 2896552 3059819 3188594 2881288 3045908 3224924
5248C224924j56831L20625l8609l95272N846l6079O1503K58134j3075k41857P243
$$ 3224924 3068093 3388718 3350109 2954837 2960683 2924604 2986107 3244241 3231166 2989309 2996552
5237B996552J26784R2425o9640k37364m2798K16819q0045m146J16468K40037J27798
$$ 2996552 3123336 3215761 3146121 2908757 2865959 3082778 3002733 2998587 3115055 3355092 3482890
5226C482890j64989J84652R4750L3530P318n5049L82774K21648k38916o7359p6783
$$ 3482890 3317901 3502553 3597303 3630833 3638151 3583102 3965876 4187524 3948608 3881249 3804466
5215C804466o9240K25746J86219l26973q9161L02349m5543k83649k89249o2017
$$ 3804466 3735226 3960972 4147191 3820218 3731057 4033406 3987863 3704214 3414965 3352948
5205C352948K7553J69083J01645r0326j33347P0756k6495J49244J78874J13416
$$ 3352948 3380501 3549584 3651229 3560903 3427556 3498312 3471817 3621061 3799935 3913351
5195C913351P5911k58228K19918j06700L02570R296n77329K73177j35764J9519
$$ 3913351 3989262 3731034 3950952 3844252 4146822 4156118 3578789 3851966 3716202 3735721
5185C735721N9971J95812K80267R6210q2727l28871p3359j34258K99526K94617
$$ 3735721 3795692 3991504 4271771 4367981 4285254 3956383 3883024 3748766 4048292 4342909
5175D342909J53920K30854n8853j2112J84357P0124j50168K93233m7416j38556
$$ 4342909 4496829 4727683 4668830 4656718 4841075 4911199 4761031 5054264 5006848 4868292
5165D868292J27358j81179k8877P7885K01926K48132j73733p9366K24333P1101
$$ 4868292 4995650 4814471 4785594 4863479 5065405 5313537 5139804 5060438 5284771 5355872
5155E355872n9954k2515K48933L67376K21866K52537L50199L10753J05585J40707
$$ 5355872 5295918 5273403 5522336 5889712 6111578 6364115 6714314 7025067 7130652 7271359
5145G271359M73755m9978J6336o7653m6533l31099P2856k48404l28227q0892j43311
$$ 7271359 7745114 7695136 7711472 7643819 7597286 7266187 7339043 7090639 6762412 6681520 6538209
5134F538209J27163k63161J00997j22600l7665J15854N51937P4125k34767P3925
$$ 6538209 6665372 6402211 6503208 6380608 6342943 6458797 7010734 7084859 6850092 6924017
5124F924017J0397J05373M78929K25508m77741j02879Q4133J23462M7203k68030
$$ 6924017 6934414 7039787 7518716 7744224 7266483 7163604 7247737 7371199 7418402 7150372
5114G150372k13035o1713N1001k42997k39110o921L01408K96513J0961n543l8467
$$ 7150372 6937337 6875624 6926625 6683628 6444518 6437597 6739005 7035518 7046479 7040936 7002469
5103G002469P9251l633k37547j20158K28800q8800j55170J72286M0697J88167
$$ 7002469 7081720 7078087 6840540 6720382 6949182 6860382 6705212 6877498 6918195 7106362
5093G106362j29826k3379P4643M24Q6303n0650K2554k73476p885J55490p3106
$$ 7106362 6976536 6953157 7027800 7028224 7114527 7063877 7086431 6812955 6805070 6960560 6887454
5082F887454O8329L21445m8169q9641P9486L03560k63972M7805p059k9481k37100
$$ 6887454 6955783 7277228 7229059 7139418 7218904 7522464 7258492 7306297 7299238 7269757 7032657
5071G032657J1142j20398j59951K50270q6315j39147Q7181l19369Q5771L63360
$$ 7032657 7043799 6923401 6763450 7013720 6927405 6788258 6875439 6556070 6641841 7005201
5061G005201j20867J11757k79754k72076O4653L02691j76235j32917K06486K6674
$$ 7005201 6884334 6996091 6716337 6444261 6508914 6811605 6635370 6502453 6708939 6735613
5051F735613l6733q7421K9429K23814K13783M2694q1600r8843J00298L84923p9932
$$ 6735613 6698880 6611459 6640888 6864702 7078485 7121179 7039579 6940736 7041034 7425957 7346025
5040G346025k19071L64973K91796K76493N20032O524k05567O456K28330N5667
$$ 7346025 7126954 7491927 7783723 8060216 8580248 8586772 8381205 8387661 8615991 8671658
5030H671658j09274j38382j28473J28015K47728r6620L915p7328K42286K80467
$$ 8671658 8562384 8424002 8295529 8423544 8671272 8574652 8578567 8501239 8743525 9023992
5020I023992o3151L8375J35467J56586p5578l1810J71977K12164J85961L18471
$$ 9023992 8960841 8999216 9134683 9291269 9215691 9183881 9355858 9568022 9753983 10072454
5010A0072454J48897l2531J02723K75159K55261K05364r4970j13604J78740K54244
$$ 10072454 10221351 10188820 10291543 10566702 10821963 11027327 10932357 10818753 10997493 11251737
5000A1251737O61156K00433K95970L16018J76210J39666K21702L51094K54290
$$ 11251737 11912893 12113326 12409296 12725314 12901524 13041190 13262892 13613986 13868276
4991A3868276K52255L86269M00465N28533K31125K59894L63569K74896M03980
$$ 13868276 14120531 14506800 14907265 15435798 15666923 15926817 16290386 16565282 16969262
4982A6969262P11328L71205L47315M31510N56379P15140Q05710L44552L09031
$$ 16969262 17680590 18051795 18399110 18830620 19386999 20102139 20907849 21252401 21561432
4973B1561432J107332O45891L46754P49333M44712O01141P24082O12510R89286
$$ 21561432 22668764 23314655 23661409 24410742 24855454 25456595 26180677 26793187 27782473
4964B7782473P13863R09515J120410J212731J143497J367804J558574J531650
$$ 27782473 28496336 29405851 30526261 31738992 32882489 34250293 35808867 37340517
4956C7340517J752282K076571K361365K290729K436072K898774L108877L492733
$$ 37340517 39092799 41169370 43530735 45821464 48257536 51156310 54265187 57757920
4948E7757920L398316L538060L414613L821164M137282L816839M364135N129294
$$ 57757920 61156236 64694296 68108909 71930073 76067355 79884194 84248329 89377623
4940H9377623N451574N974766O689413O850528P112873P668412Q323848Q578877
$$ 89377623 94829197 100803963 107493376 114343904 121456777 129125189 137449037 146027914
4932A46027914R107674R322648R722065R104939Q028341O134298L586375J366721
$$ 146027914 155135588 164458236 174180301 183285240 191313581 197447879 201034254 202400975
4924B02400975j566020l992204n390252o261641o769229o723304o861437o359004
$$ 202400975 200834955 196842751 191452499 185190858 178421629 171698325 164836888 158477884
4916A58477884o243259o686707p852323q421710q917181q387589p955658p058349
$$ 158477884 152234625 145547918 137695595 129273885 120356704 111969115 104013457 96955108
4908I6955108o485137n799208n394811n085715m190431l711490l704837l383559
$$ 96955108 90469971 84670763 79275952 74190237 69999806 66288316 62583479 59199920
4900E9199920l066819k727860k141286k202709j896317j317913j655190j074905
$$ 59199920 56133101 53405241 51263955 49061246 47164929 45847016 44191826 43116921
4892D3116921j493616j462033j248694j317056j352276j393254j043093r23754
$$ 43116921 41623305 40161272 38912578 37595522 36243246 34849992 33806899 32883145
4884C2883145q43975j162121p01504j008772o33192m61196k78756q30389n18220
$$ 32883145 32039170 30877049 30175545 29166773 28533581 28072385 27793629 26963240 26445020
4875B6445020p34613o15647l77096n18433m73411l87687k72014n87536p10339
$$ 26445020 25710407 25094760 24717664 24199231 23725820 23338133 23066119 22478583 21768244
4866B1768244q8917p26333n45731k66702n41742n59235l46308m62272n03043k0997
$$ 21768244 21679327 20952994 20407263 20140561 19598819 19039584 18693276 18231004 17727961 17706964
4856A7706964n41269n99000m76549j31665l48954j84227n3692m33668k15134r0598
$$ 17706964 17165695 16566695 16090146 15958481 15609527 15425300 15371608 14937940 14722806 14632208
4846A4632208l10038l96221J51328l60129k93910k37952l93411k84543j78238
$$ 14632208 14322170 13925949 14077277 13717148 13423238 13185286 12791875 12507332 12329094
4837A2329094J54849k46752k2157j09207r4079j04991K7381l38647j66002j95927
$$ 12329094 12483943 12237191 12215034 12105827 12011748 11906757 11934138 11595491 11429489 11233562
4827A1233562L8007j53470k3662n3531J05945J73625j61612j13060j62543k08251
$$ 11233562 11271569 11118099 11094437 11040906 11146851 11320476 11158864 11045804 10883261 10675010
4817A0675010l3474L29026P4409N8917l9429l5579M8115j01693j51147J52824
$$ 10675010 10641536 10970562 11044971 11103888 11064459 11028880 11076995 10975302 10824155 10976979
4807A0976979K6936J13480N659K78369K82568J54091M2995j54044K99324J24363
$$ 10976979 11003915 11117395 11123054 11401423 11683991 11838082 11881077 11727033 12026357 12150720
4797A2150720J78993J54330K27773J51776M05518J34006N05982L39052j8475L62211
$$ 12150720 12329713 12484043 12711816 12863592 13269110 13403116 13909098 14248150 14229675 14591886
4787A4591886N6227J19138k89914j16344L0063m03782o6251J61436k37458N4831
$$ 14591886 14648113 14767251 14477337 14360993 14391056 13987274 13921023 14082459 13845001 13899832
4777A3899832k66711L79998K52469j68069l04833M74200K24814J35375K33844
$$ 13899832 13633121 14013119 14265588 14097519 13792686 14266886 14491700 14627075 14860919
4768A4860919J63627J40904J70501R9216K49020M48415L45670L32814M84560M62389
$$ 14860919 15024546 15165450 15335951 15435167 15684187 16132602 16478272 16811086 17295646 17758035
4758A7758035M95476L58826O00964M33062N43882J034504R23853J062516O71876
$$ 17758035 18253511 18612337 19213301 19646363 20190245 21224749 22148602 23211118 23882994
4749B3882994R40713R85296J226653J511126J487782J731655K213563K557840
$$ 23882994 24823707 25809003 27035656 28546782 30034564 31766219 33979782 36537622
4741C6537622J874167J146295J358494J526998J903209K544669K958979L325794
$$ 36537622 38411789 39558084 40916578 42443576 44346785 46891454 49850433 53176227
4733E3176227M356788M692603N564232O249553P374336R184370J1734919J4797249
$$ 53176227 57533015 62225618 67789850 74039403 81413739 90598109 102333028 117130277
4725A17130277J9619079K3024346K4193906K6143823K9035166K3056564Q253837
$$ 117130277 136749356 159773702 183967608 210111431 239146597 262203161 270456998
4718B70456998j5478154l0657427k8614650k3077589j6443201j1857644j0690396
$$ 270456998 254978844 224321417 195706767 172629178 156185977 144328333 133637937
4711A33637937j1000628j0023522q361440p566541o703033n769626n558920n777149
$$ 133637937 122637309 112613787 104252347 96685806 89982773 84213147 78654227 72877078
4703G2877078n655115m528214l735606k805475k951731k514698k131883j983794
$$ 72877078 67221963 62693749 58958143 56152668 53200937 50686239 48554356 46570562
4695D6570562j783922j313175j146860p61610o40814l09063j59356K8356K03357
$$ 46570562 44786640 43473465 42326605 41564995 40924181 40615118 40455762 40484118 40687475
4686D0687475P27052J89086k25187K61072K80892R6870K85743O51260P30428R66804
$$ 40687475 41414527 41603613 41378426 41639498 41920390 42017260 42303003 42954263 43684691 44651495
4676D4651495J433501J036886J624244K114851J663332J706564J609712J610279
$$ 44651495 46084996 47121882 48746126 50860977 52524309 54230873 55840585 57450864
4668E7450864J885364K197400K703274L254034M069722M448641M916300N791153
$$ 57450864 59336228 61533628 64236902 67490936 71560658 76009299 80925599 86716752
4660H6716752O906052Q446725J0091514J2540963J5445537J8160826J9629124
$$ 86716752 93622804 102069529 112161043 124702006 140147543 158308369 177937493
4653A77937493K0416725K0475686J7033860R057859k770548j4475187j9724143
$$ 177937493 198354218 218829904 235863764 244921623 242151075 227675888 207951745
4646B07951745j9559269j6729225j3193597j0934064j0078837r483428q263209
$$ 207951745 188392476 171663251 158469654 147535590 137456753 127973325 119710116
4639A19710116p391219o638997o101095n749650n551991n728429n664306n080285
$$ 119710116 112318897 105679900 99578805 93829155 88277164 82548735 76884429 71804144
4631G1804144m768315m195211l353890l140459k680640k981909k539029k340943
$$ 71804144 67035829 62840618 59486728 56346269 53665629 50683720 48144691 45803748
4623D5803748k243108k040471j540921j471416j690131j423428j317507j323316
$$ 45803748 43560640 41520169 39979248 38507832 36817701 35394273 34076766 32753450
4615C2753450j218008j313032j089129p60920o25714j160494j108857o43544n53075
$$ 32753450 31535442 30222410 29133281 28372361 27746647 26586153 25477296 24833752 24280677
4606B4280677m71229m29483n56358l55408n23849n98669n31604q02777k98969
$$ 24280677 23809448 23379965 22823607 22468199 21944350 21345681 20814077 20011300 19712331
4597A9712331k06416m63815l13782j30366l04204n58262k74833m03712n43333
$$ 19712331 19505915 19042100 18728318 18597952 18293748 17735486 17460653 17056941 16513608
4588A6513608l16802m13870l00220o52413k48278m15749l60j94973l30793J17597
$$ 16513608 16196806 15782936 15482716 14830303 14582025 14166276 14165916 13970943 13640150 13757747
4578A3757747r7937j24042J87476j58436L42707L33752R1103L25948p4705k64580
$$ 13757747 13659810 13535768 13723244 13564808 13907515 14241267 14332370 14658318 14583613 14319033
4568A4319033m78470k14611n89049o45418O4074k17337m69312m4825j25219J21886
$$ 14319033 13840563 13625952 13036903 12391485 12455559 12238222 11768910 11724085 11598866 11720752
4558A1720752k38072l57746J92918m13184k04504l6323m5277q9533O3262K02132
$$ 11720752 11482680 11124934 11317852 10904668 10700164 10663841 10618564 10529031 10592293 10794425
4548A0794425R2371j05686k45219M52663L03769M72485K37499J16393J99727L09026
$$ 10794425 10886796 10781110 10535891 10988554 11292323 11764808 12002307 12118700 12318427 12627453
4538A2627453L50866M47584K00580K08140N26420P20651P64055O88116M07558
$$ 12627453 12978319 13425903 13626483 13834623 14361043 15081694 15845749 16533865 16941423
4529A6941423M55384L19831K58158j26338o50181o27710n25383n40138l72459
$$ 16941423 17396807 17716638 17974796 17848458 17198277 16570567 16045184 15505046 15132587
4520A5132587l81271N4581Q0682N01171L00915L11993M30922J93742l3876m52388
$$ 15132587 14751316 14805897 14886579 15387750 15688665 16000658 16431580 16625322 16591446 16139058
4510A6139058j202072j185323q32255q29345o11161o52418m06957q82406n13133
$$ 16139058 14936986 13751663 12919408 12090063 11478902 10826484 10419527 9537121 9023988
4501I023988n38986k89945m97320k39192L145j14235n81613n0200n09065l5528
$$ 9023988 8485002 8195057 7697737 7458545 7461690 7347455 6765842 6715642 6206577 6171049
4491F171049j02500k29627k93874L5045J25991j59971j10611M2182j17290k88500
$$ 6171049 6068549 5838922 5545048 5580093 5706084 5546113 5435502 5477684 5360394 5071894
4481E071894J12013Q1885m8005J7921k24526j31433K36305l17725Q8760K27287
$$ 5071894 5183907 5265792 5217787 5235708 5011182 4879749 5116054 4798329 4887089 5114376
4471E114376r9730k15932r2669k49910M39795j20690j30503K41627O9033n42553
$$ 5114376 5014646 4798714 4706045 4456135 4895930 4775240 4644737 4886364 4955397 4412844
4461D412844l38277L8053M8100Q0265Q9249l6278m16704j06428j97189J52887
$$ 4412844 4074567 4112620 4160720 4240985 4330234 4293956 3877252 3770824 3573635 3726522
4451C726522J60222O494k25231J708j33879k176j41064m4877j13479L3584R6155
$$ 3726522 3886744 3893238 3668007 3669715 3535836 3533660 3392596 3347719 3234240 3267824 3363979
4440C363979j74345n7335J71476K71707l04964l28974L42429L21752o8431m1995
$$ 3363979 3189634 3132299 3303775 3575482 3270518 2941544 3283973 3605725 3537294 3495299
4430C495299j47063L02038J35534J66236o4507J67838j16661k7044M39208n4188
$$ 3495299 3348236 3650274 3785808 3952044 3887537 4055375 3938714 3911670 4350878 4296690
4420D296690j39318l8962l23291R8821l11787l4545J25227l59887O4619J25071
$$ 4296690 4157372 4118410 3795119 3893940 3582153 3547608 3672835 3312948 3377567 3502638
4410C502638M0016n7342j24914J28479J5900j552L21937J69812r8792L0924j69837
$$ 3502638 3542654 3485312 3360398 3488877 3504777 3503225 3825162 3994974 3896182 3927106 3757269
4399C757269j91471j69785Q7409k64159l08864M7961O278Q5491k67663k5094k2112
$$ 3757269 3565798 3396013 3483422 3219263 2910399 2958360 2964638 3050129 2782466 2757372 2735260
4388B735260L6243j49814l3300J02043m7160k16963j99077K68688o4800q9776
$$ 2735260 2771503 2621689 2588389 2690432 2643272 2426309 2227232 2495920 2431120 2341344
4378B341344l1134j32006j26443J40241J47980j36232J26571m6611q8742N8746
$$ 2341344 2310210 2178204 2051761 2192002 2339982 2203750 2330321 2283710 2194968 2253714
4368B253714k13618q9912J5835j54343J82991J88398Q9843n2979j67740J01237
$$ 2253714 2040096 1950184 1966019 1811676 1994667 2183065 2272908 2219929 2052189 2153426
4358B153426L01407P0122j15937m0032J01035O9109O3097J66658K3096K62359
$$ 2153426 2454833 2524955 2409018 2368986 2470021 2539130 2602227 2768885 2791981 3054340
4348C054340l8450j55472L24164K39638l16764Q7617L7276q8754p8026k374m68030
$$ 3054340 3015890 2860418 3184582 3424220 3107456 3195073 3232349 3143595 3065569 3063195 2595165
4337B595165j76050n3279n7221L4076m3241N431L8951J7097m84625j17481P1275
$$ 2595165 2419115 2365836 2308615 2342691 2299450 2304881 2343832 2360929 1876304 1758823 1830098
4326A830098J28585m4189Q9825k8148k41768j62599J19724K52234K34327J02739
$$ 1830098 1958683 1914494 2004319 1976171 1734403 1571804 1691528 1943762 2178089 2280828
4316B280828j64022k60081j5370q7608J01966j25811k6143J56975J77741M2222
$$ 2280828 2116806 1856725 1841355 1753747 1855713 1729902 1703759 1860734 2038475 2080697
4306B080697R574j44389n1691K83670K01729l5855k38592l30931J06364j66823
$$ 2080697 2090271 1945882 1894191 2177861 2379590 2343735 2105143 1774212 1880576 1713753
4296A713753j06543k60331J46467N01377J52653k07245J11416J03631q5967l87044
$$ 1713753 1607210 1346879 1493346 1994723 2147376 1940131 2051547 2155178 2069211 1682167
4286A682167J13687R9708j04038l5654K8339k6523q9316k6889J98871J17444j24365
$$ 1682167 1795854 1895562 1791524 1755870 1784209 1757686 1668370 1641481 1840352 1957796 1833431
4275A833431J17200N1096j33398j13118J73214M7833o9555j54849K38570k05017
$$ 1833431 1950631 2001727 1868329 1755211 1928425 1976258 1906703 1751854 1990424 1785407
4265A785407j01770m5086L31465Q4961p253Q9303Q893q4230j06688L11736J04570
$$ 1785407 1683637 1638551 1970016 2054977 2047724 2137027 2145920 2061690 1955002 2266738 2371308
4254B371308q5706j04895q4005P5533J24191O0008R4899J6957j07410j52696J02194
$$ 2371308 2285602 2180707 2096702 2172235 2296426 2356434 2451333 2468290 2360880 2208184 2310378
4243B310378K58939q4343K21430j82619J78985Q3808k15358q993N8541K15583
$$ 2310378 2569317 2484974 2706404 2523785 2702770 2786578 2571220 2562227 2620768 2836351
4233B836351K9381j22290N3674K6143j56062K34517K41901j15627o2223J5619
$$ 2836351 2865732 2743442 2797116 2823259 2667197 2901714 3143615 3027988 2965765 2981384
4223B981384Q9910n5517N8161L01660J54908J9465j94569p99R0741J72584k87095
$$ 2981384 3071294 3015777 3073938 3375598 3530506 3549971 3355402 3354603 3445344 3617928 3330833
4212C330833M8143K66036k22952m006P4914L54331J74507L0715J13275j92330
$$ 3330833 3378976 3645012 3422060 3418054 3492968 3847299 4021806 4052521 4165796 3973466
4202C973466j90464Q5330J68588M64258M0827k47113J53996J00271J01428O2069
$$ 3973466 3783002 3868332 4036920 4501178 4542005 4294892 4448888 4549159 4650587 4712656
4192D712656K18112J75750J67119L63400L5272k03348R7095K58781J03064J31289
$$ 4712656 4930768 5106518 5273637 5637037 5672309 5468961 5566056 5824837 5927901 6059190
4182F059190K23533L0525j63502K28693M29437J73015J6265K20312L28726K81728
$$ 6059190 6282723 6313248 6149746 6378439 6807876 6980891 6997156 7217468 7546194 7827922
4172G827922P638L00243K19621M40437Q3748K94878M42097J73699J33760R9144
$$ 7827922 7835560 8135803 8355424 8795861 8879609 9174487 9616584 9790283 9924043 10023187
4162A0023187L21904K04133L13978K03661L37241M03766N56310M50589M97267
$$ 10023187 10345091 10549224 10863202 11066863 11404104 11807870 12364180 12814769 13312036
4153A3312036J92998K55631L87714N31834M71473P13482M59229K92234L44945
$$ 13312036 13505034 13760665 14148379 14680213 15151686 15865168 16324397 16616631 16961576
4144A6961576K11092O22366L14380P20419N10990M63888K35630L66545N27523
$$ 16961576 17172668 17795034 18109414 18829833 19340823 19804711 20040341 20406886 20934409
4135B0934409J16680K25370L31378K39969J3725L09534J55751L80338N8092j28688
$$ 20934409 21051089 21276459 21607837 21847806 21861531 22171065 22326816 22707154 22765246 22636558
4125B2636558L5340l13499j43685r6453j84616k73738l26335p68858k33168j34216
$$ 22636558 22671898 22358399 22214714 22118261 21933645 21659907 21333572 20564714 20331546 20197330
4115B0197330k33301l56822n93449n35293n42843l09630m79843o17240m61483
$$ 20197330 19964029 19607207 19013758 18478465 17935622 17625992 17146149 16528909 16067426
4106A6067426l41063p66243m00893n20109l88018o8783l28094q06782k96949l72967
$$ 16067426 15726363 14960120 14559227 14039118 13651100 13582317 13254223 12447441 12150492 11777525
4096A1777525k38775j38002l22102l06740k58739l10916n33015l05550J7207l11272
$$ 11777525 11538750 11400748 11078646 10771906 10513167 10202251 9669236 9363686 9380893 9069621
4086I069621m51670p0522j55958k95395k13790k62933k63220j42934r2193r1188
$$ 9069621 8617951 8547429 8391471 8096076 7882286 7619353 7356133 7213199 7121006 7029818
4076G029818j60157l29182l72778Q167j39419l27092j20755k02559o9006m1397
$$ 7029818 6869661 6540479 6167701 6175868 6036449 5709357 5588602 5386043 5317037 5275640
4066E275640k73443J41067J39583k35803l27673k39366L4820l41257p8080J10492
$$ 5275640 5002197 5143264 5282847 5047044 4719371 4480005 4514825 4173568 4095488 4205980
4056D205980j42519k8035j43581k78952J14459j58443k42730q419R4260r9434
$$ 4205980 4063461 4035426 3891845 3612893 3727352 3568909 3326179 3317760 3412020 3312586
4046C312586j49876P9297j00502k02120q7114J36230J11685j29841M0443p4416
$$ 3312586 3162710 3242007 3141505 2939385 2852271 2988501 3100186 2970345 3010788 2936372
4036B936372k02793n5422k0922q9610l27170j50749J82927j97108m7974J38531
$$ 2936372 2733579 2678157 2657235 2567625 2240455 2089706 2272633 2075525 2027551 2166082
4026B166082N8259j17418j93946j48595J53283J62827j19050j6468M8319o8931
$$ 2166082 2224341 2106923 1912977 1764382 1917665 2080492 1961442 1944974 1993293 1924362
4016A924362m4552j00392K1330K47678l40407N6470r6580M9952p7944N9345j02679
$$ 1924362 1879810 1779418 1800748 2048426 1708019 1764489 1667909 1717861 1639917 1699262 1596583
4005A596583k01746n1478J96328K3018q1580k22946L0696J62975j11597j40339
$$ 1596583 1394837 1343359 1539687 1562705 1481125 1258179 1288875 1451850 1340253 1199914
3995A199914j541K75069N2664N8076l66992P6975K89130j19819k47801K47352
$$ 1199914 1198373 1473442 1526106 1584182 1217190 1294165 1583295 1463476 1215675 1463027
3985A463027J44013k07985j60881J62555j36901l46186L2051N496p1914j99959
$$ 1463027 1607040 1399055 1238174 1400729 1263828 917642 949693 955189 883275 683316
3975F83316R4917L031J89333j71466J10467M1505k5140k0569O308n1411K3973
$$ 683316 778233 781264 970597 799131 909598 951103 925963 905394 911702 860291 884264
3964H84264K6352J7104J23957k3796o0855L97916k6058k37006M8603N5808K42480
$$ 884264 910616 927720 1051677 1027881 967026 1364942 1338884 1101878 1150481 1206289 1448769
3953A448769l35159l51476J83748j56717K00895J64259j00617j43330J86509n5143
$$ 1448769 1113610 762134 945882 789165 990060 1154319 1053702 910372 1096881 1041738
3943A041738j15632q1207j63975J93365Q576n34379J92645K5447J28778J8758
$$ 1041738 926106 844899 680924 874289 882865 348486 541131 566578 695356 714114
3933G14114k62262K00328K73553p0391J9323K99888j14558j4126j13776J71298
$$ 714114 451852 652180 925733 855342 874665 1174553 1059995 1045869 932093 1103391
3923A103391K58884k60606l91373L9363J31140J3385l86059K21876L19778j69050
$$ 1103391 1362275 1101669 710296 749659 880799 894184 508125 730001 1049779 880729
3913H80729k68488J20256n4915Q2801m723L2233k52508p8263J25801J46833j81326
$$ 880729 612241 732497 677582 760383 755660 787893 535385 457122 582923 729756 548430
3902E48430J16147J6712k10599J113K73373o7551J02140m6122j51435J06536K97295
$$ 548430 664577 681289 470690 471803 745176 677625 779765 733643 582208 688744 986039
3891I86039p721l29626n4693K56657r0191m2293R7322J46199N7823j30589k83696
$$ 986039 978318 648692 593999 850656 760465 718172 815494 961693 1019516 888927 605231
3880F05231L841j61276o7555J37948K8494J1911k14353K27151J70728j14901j65391
$$ 605231 609072 447796 380241 518189 546683 558594 344241 571392 742120 627219 461828
3869D61828j0840J77884n3599K36711j012j98510q7830K78767j15152J39051J14188
$$ 461828 450988 628872 575273 811984 810972 612462 524632 803399 688247 827298 941486
3858I41486k43628p2048m974K357L2251Q4739m6781m39401l62275J10798J87878
$$ 941486 697858 625810 620836 623193 655444 740183 693402 254001 -108274 2524 190402
3847A90402L48301l1186l30062J785L42310J7534O2946J55493J62452j48168o0640
$$ 190402 538703 507517 177455 179240 521550 539084 602030 757523 919975 771807 711167
3836G11167m1225K7138k66225N329O2328M6843j18690L1348J01325J06361k33214
$$ 711167 669942 697080 430855 436184 498512 545355 426665 458013 559338 665699 432485
3825D32485R0517J89017R5615j27259l05847K35837m2927J50214M9194m8851l29119
$$ 432485 523002 712019 807634 680375 374528 610365 567438 717652 766846 717995 388876
3814C88876k56724J68357J2534j1655M1896P2538p1909K73857o02930j62728L09376
$$ 388876 132152 300509 313043 301388 343284 415822 343913 617770 14840 -147888 161488
3803A61488L12934n9220k46687Q9946J37404N5941J20310j21118J3800j27392
$$ 161488 474422 415202 168515 258461 395865 451806 572116 450998 464798 337406
3793C37406n9624K83418J09533l56424k0685K58645J17296l1593k28740l7162
$$ 337406 277782 561200 670733 314309 293624 552269 669565 637972 409232 372070
3783C72070K42475k91118J09673K86429k80646j0253k9578O1377J0080J0813K2938
$$ 372070 614545 323427 433100 719529 438883 428630 399052 460429 470509 481322 504260
3772E04260n4020j78005k6622J96590q5626N0192K67209j46694k03536m8436J80918
$$ 504260 450240 272235 245613 442203 356577 406769 673978 527284 323748 275312 456230
3761D56230J7042k08693l2791J84817O4132Q2630K28380n4716k21735O9050j36422
$$ 456230 473272 264579 231788 416605 480737 563367 791747 737031 515296 584346 447924
3750D47924L2117J89844k56230L1298Q4101k87218k2741k3202J30854J09781p5150
$$ 447924 480041 669885 413655 444953 529054 241836 219095 195893 326747 436528 361378
3739C61378j17246O7122P8934j3781m1274J17904O8267j08557j64463j58300K79831
$$ 361378 244132 311254 390188 376407 335133 453037 521304 412747 248284 89984 369815
3728C69815L4265k14830l2736J18278J12348l18085M34808L34681k61325O3730
$$ 369815 404080 189250 156514 274792 387140 69055 503863 838544 577219 640949
3718F40949m8180j95460r8o8994m9155O6447p9694j56698N6902J14818J41768
$$ 640949 592769 397309 397211 328217 279062 345509 265815 109117 166019 280837 422605
3707D22605k5558j49451r8742L6626k77552K14471L17060k22482Q4281N2655m0333
$$ 422605 397047 247596 148854 185480 -92072 122399 439459 216977 301258 353913 313580
3696C13580J586q939n0195j55361P3389j23369N6703K39472J47313j22973O5299
$$ 313580 315166 306227 256032 100671 174060 50691 107394 346866 494179 371206 436505
3685D36505l9327q5207k17923j8040J97802J56314j54831O6855j8911j88448L38069
$$ 436505 397178 311971 94048 76008 273810 430124 275293 342148 323237 134789 472858
3674D72858j60215l6616k06199j07422m6060Q4647N9726J20990K24762K0234q834
$$ 472858 312643 276027 69828 -37594 -83654 993 60719 181709 406471 426705 417871
3663D17871p3896j95224l7983R9428J65819J73992k7487J17411o8752j52758l06711
$$ 417871 343975 148751 110768 210196 376015 550007 522520 639931 571179 418421 111710
3652A11710J83735L19411r2683l44744J7646J28572Q6481r1823K01880J97012
$$ 111710 295445 614856 522173 177429 195075 323647 410128 318305 520185 717197
3642G17197n6271l15513k83933J19646l6533n580R7760k9915m3094l2093j75255
$$ 717197 660926 345413 61480 181126 144593 139013 236773 206858 163764 131671 -43584
3631d3584K42300K43157p369j63795J7405j96528J56497J01039J73625q629j23626
$$ -43584 198716 441873 434504 270709 288114 91586 248083 349122 522747 514118 390492
3620C90492j06436m8615J30314J53569j93895P7636p2804j70054K0670K006o2184
$$ 390492 284056 235441 365755 519324 325429 403065 330261 160207 180877 182883 120699
3609A20699J1894K39182J02091k44329j37080K97543J36293j62858K22036K24303
$$ 120699 132593 371775 473866 229537 92457 390000 526293 363435 585471 809774
3599H09774l04830j50899l9293O2165k6887j29281N7257J39283K04483j53400
$$ 809774 504944 354045 314752 376917 350030 220749 278006 417289 621772 468372
3589D68372p349N3651J8657K19408j83694l0820p0241K13444L2669k6200l6784
$$ 468372 461023 514674 533331 752739 569045 538225 467984 681428 714097 687897 651113
3578F51113J00549K27136p266R7852J35242j66095j84799J86020q6471k8527n7950
$$ 651113 751662 978798 971532 1069384 1204626 1038531 853732 1039752 953281 924754 866804
3567H66804J5944J29449L8803k0881m3663j48349J41303j34305J44253j39044
$$ 866804 882748 1012197 1051000 1030119 986456 838107 979410 845105 989358 850314
3557H50314j02701J68330K0481p1282J14838J12302J79067m0125J23428o934k42742
$$ 850314 747613 915943 936424 865142 979980 1092282 1271349 1231224 1354652 1347718 1104976
3546A104976Q3440K18650K28276o8199m0184n9823j62377j32932L23346o5437
$$ 1104976 1188416 1407066 1635342 1567143 1526959 1467136 1304759 1171827 1495173 1429736
3536A429736K33053R8532q2618o2231l9933m6792L02621N3930k03362J18479P6242
$$ 1429736 1662789 1761321 1678703 1616472 1576539 1529747 1832368 1886298 1682936 1801415 1877657
3525A877657K1618O6651K00536L33973j80917l5341L19931J10202j18314M2663
$$ 1877657 1899275 1965926 2166462 2500435 2319518 2284177 2604108 2714310 2595996 2638659
3515B638659K979J57127J50659k1141J27014K32299l17L47890P6667r0996K92871
$$ 2638659 2641638 2798765 2949424 2928283 3055297 3287596 3287279 3635169 3711836 3620840 3913711
3504C913711K58658L7059J25156L30925L19223p0388J11174M3875j51610L05748
$$ 3913711 4172369 4209428 4334584 4665509 4984732 4914344 5025518 5069393 4917783 5223531
3494E223531L50274K64319K49862K65762P3913K89659O53363L01347L31541O27022
$$ 5223531 5573805 5838124 6087986 6353748 6427661 6717320 7370683 7672030 8003571 8630593
3484H630593K55676L49548K18521L96623L30042J64523j4969O966J99617O4251
$$ 8630593 8886269 9235817 9454338 9850961 10181003 10345526 10330557 10337523 10537140 10601391
3474A0601391m07277j70703k84896l39701l46657k12938l28978p9819j94678n89568
$$ 10601391 10194114 10023411 9738515 9398814 9052157 8839219 8510241 8430422 8235744 7646176
3464G646176o43021j92863j36791l81286k94725k58144l26893P130k27552j69211
$$ 7646176 7003155 6810292 6673501 6292215 5997490 5739346 5412453 5419583 5192031 5022820
3454E022820L69730m91111m45880j40598j23155K32653P9510J31519J34728n400
$$ 5022820 5392550 4901439 4455559 4314961 4191806 4424459 4503969 4635488 4770216 4764816
3444D764816L18912K2278o5048l63052p41071l88888J08198j31789k61247L3752
$$ 4764816 5083728 5106006 5040958 4677906 3936835 3547947 3656145 3524356 3263109 3296861
3434C296861j29858l27399j8950k79883k14887l2557l5195J38562o2167j29545
$$ 3296861 3167003 2839604 2820654 2540771 2325884 2293327 2258132 2396694 2334527 2204982
3424B204982n1439q2900J20524j55653Q0049k9720L8437j38808J6038K68697m5769
$$ 2204982 2153543 2070643 2191167 2035514 2115563 2085843 2124280 1985472 2001510 2270207 2224438
3413B224438Q6972J41284J12326l2997k84541l12462r6743R9105j80063j77780
$$ 2224438 2311410 2452694 2565020 2532023 2247482 1935020 1838277 1937382 1757319 1579539
3403A579539l48078n7J99978j13311K45114k03608k72664j70315n6074J9241k11201
$$ 1579539 1231461 1231404 1431382 1318071 1563185 1359577 1086913 916598 860524 879765 668564
3392F68564N5370K15525J32408k31784n0680R5677P7457k3843j18160l01698J2255
$$ 668564 723934 939459 1071867 840083 789403 885080 962537 938694 820534 518836 531091
3381E31091j09954j59376J62659Q9181O4700j55768R0816R1889L1202p2696Q0355
$$ 531091 421137 261761 424420 513601 578301 422533 513349 605238 636440 563744 644099
3370F44099n5528k20721k9111j65927m7349M25018J68167j517m04588j23724K50981
$$ 644099 588571 367850 338739 172812 125463 550481 718648 717131 312543 188819 439800
3359D39800n9098j84543P9355L3244K2640K29825Q1186l11428J49745Q9911l52921
$$ 439800 380702 196159 275514 308758 331398 561223 642409 330981 480726 570637 217716
3348B17716r1857J96373j70926Q7635J72015J54852j65283m892K2979k06359J28238
$$ 217716 125859 322232 151306 238941 410956 565808 400525 395633 418612 212253 340491
3337C40491k25856K13841K57355j25102o802N1546J88868r2370r4481q0152j13811
$$ 340491 114635 328476 585831 460729 453927 505473 694341 601971 507490 427338 313527
3326C13527J35393j82685J16961o1294m7013q676l09152M14442L4015J2752k7253
$$ 313527 448920 266235 383196 321902 274889 266213 -42939 371503 405518 418270 391017
3315C91017R8569O6865J627k5173N6063L27731k63321k97332R0015q395n7783
$$ 391017 489586 556451 558078 532905 588968 916699 653378 356046 446061 437666 379883
3304C79883J03710j7963j87351K36539J05423l0228P4385K6486k79020j6038r1787
$$ 379883 483593 465630 278279 514818 620241 590013 664398 690884 411864 395826 304039
3293C04039j96525K29444K40516J21638k67694Q150J77766l04362k06317J66723
$$ 304039 107514 336958 577474 699112 431418 439568 617334 312972 106655 273378
3283B73378r0190P6876J01261J63969l64791j57881P832M1081o4114O3266J72111
$$ 273378 183188 260064 361325 525294 160503 2622 10454 51535 -12579 50687 222798
3272B22798K01801k29636K15400q1746j38042K1168j4575K41385Q9682k85608
$$ 222798 424599 194963 410363 328617 190575 211743 197168 438553 528235 242627
3262B42627J09765J28145j57965J49080j37833K642q9003M0945K50409r0437j22550
$$ 242627 352392 480537 322572 471652 333819 336461 247458 288403 538812 448375 325825
3251C25825J08464J75306j66124j17361j309n3559r1956j05086j15600J91477
$$ 325825 434289 609595 443471 326110 324801 271242 179286 74200 -41400 150077
3241A50077p963j19560J18242k2959j72665J22573K26389j67696r6899k76537
$$ 150077 142114 22554 140796 117837 -54828 67745 294134 126438 29539 -246998
3231b46998K73279K10844j77334j17789K72037J50702j06928k6525L6519M1489
$$ -246998 26281 237125 59791 -57998 214039 364741 257813 231288 267807 309296
3221C09296O3540j97285J06750J02333L4796J63150o6333k03262k4258q2274L39780
$$ 309296 372836 175551 282301 384634 419430 582580 516247 312985 288727 206453 546233
3210E46233j11054k41954J37749Q9898K46494k76235J84742K0264L2044J66585
$$ 546233 435179 193225 330974 420872 667366 391131 575873 596137 628181 794766
3200G94766j32497K5604J55752p7087Q7755k72534P7607r9133q3892J53145K49327
$$ 794766 662269 687873 843625 766538 854293 581759 659366 560233 476341 629486 878813
3189H78813J93149j85018m79j76904O7537J7222N9414J99607R7522j2956N4243
$$ 878813 1071962 886944 886465 709561 777098 794320 853734 1053341 1150863 1137907 1192150
3178A192150J37894l23290K5848M78883J12000j07303L11079J5527r1098L77587
$$ 1192150 1330044 1006754 1032602 1511485 1623485 1516182 1827261 1842788 1751690 2129277
3168B129277K40199j46142n3212M04967M66267k19268K2352M90610p4178O5868
$$ 2129277 2369476 2223334 2170122 2575089 3041356 2822088 2844440 3335050 3260872 3326740
3158C326740l93346O5226J33198o9858R9839M98841M1209m20272r1266K44717
$$ 3326740 2933394 2998620 3131818 3061960 3161799 3660640 3701849 3281577 3190311 3435028
3148C435028o8650K49510J49751Q8967o335N1077L71653m5022j34100K48877J59453
$$ 3435028 3366378 3615888 3765639 3854606 3848271 3899348 4271001 4225979 4091879 4340756 4500209
3137D500209L97701L03898J62535L69033M44042K08037m367j39070o03125k05032
$$ 4500209 4897910 5201808 5364343 5733376 6177418 6385455 6381088 6242018 5638893 5433861
3127E433861k11463n23715j46285l52984j93355q4322M3622k42920k12168K34622
$$ 5433861 5222398 4698683 4552398 4199414 4006059 3921737 3965359 3722439 3510271 3744893
3117C744893J30816l28128k09370k77138j33557L24385j05130j02982j52000M04507
$$ 3744893 3875709 3547581 3338211 3061073 2927516 3251901 3146771 3043789 2891789 3296296
3107C296296M2528M6788K7427p7427k07749l04616N4136J5429J909M4953j04705
$$ 3296296 3338824 3385612 3413039 3335612 3127863 2823247 2877383 2892812 2894721 2939674 2834969
3096B834969k67115R085k14842j76286M274m89986j62694j60017L08959L8927
$$ 2834969 2567854 2576939 2362097 2185811 2190085 1700099 1537405 1377388 1686347 1725274
3086A725274O8355m5359m1246l2115p7959m1688r5955k24132J9815n1842j43198
$$ 1725274 1793629 1748270 1707024 1674909 1596950 1555262 1459307 1235175 1254990 1203148 1059950
3075A059950J63168j14899n23942L4777K26046N9924J04461k43688O1406O1690
$$ 1059950 1223118 1108219 584277 619054 845100 905024 1009485 765797 827203 888893
3065H88893l99843K62240R6902j51708J51921p5053m92359J1401J16574j14472
$$ 888893 489050 751290 848192 696484 848405 773352 280993 292394 408968 294496
3055B94496K10233J37159p5386k7506N7942Q7406k31823l7462K18071j01869j7381
$$ 294496 504729 641888 566502 538996 596938 684344 452521 415059 633130 531261 513880
3044E13880r1236j1332j25505K35710j2853j59425K23286j56182j19291J60344
$$ 513880 422644 411312 285807 521517 508664 349239 572525 416343 297052 457396
3034D57396j24905j72509j21653J34482J90269j10867j16056L7884J84194j52816
$$ 457396 332491 159982 38329 172811 363080 252213 136157 174041 358235 205419
3024B05419n8570N8190k05723K64786k91942j11727K21523J238j18513L33381
$$ 205419 146849 205039 -684 264102 -27840 -139567 81956 83194 -35319 298062
3014B98062q3581L9777j15613J82081j92326P2950j70687j36568K75912k1919
$$ 298062 214481 254258 138645 320726 128400 201350 30663 -105905 170007 148088
3004A48088k48042l7737R1786P8419l1107N4826M28902j28602k97892j93650K42446
$$ 148088 -99954 -137691 -45905 32514 1407 56233 485135 356533 58641 -135009 107437
2993A07437n697R5659N9690M0516O9089k76394j63546K37588J1209k00546j22084
$$ 107437 101740 197399 257089 297605 366694 90300 -73246 164342 175551 -24995 -147079
2982a47079Q3282J00711j52335l674J27921j67688K29899l9722L39561k8185k40992
$$ -147079 -63797 36914 -115421 -119095 8826 -158862 71037 31315 370876 342691 101699
2971A01699m0429l257L7021j49143J3282K39054k37455J81914J0326o8552r1767
$$ 101699 61270 58013 95034 -54109 -40827 198227 -39228 142686 153012 84460 -7307
2960g307l08262J31370m3322p4915M0428R7391M4955N5403p7390q1889M4774m4595
$$ -7307 -315569 -184199 -227521 -302436 -262008 -164617 -119662 -64259 -141649 -223538 -178764 -223359
2948b23359Q6896L8192l532j5929j14971R0068J75305L00599k43787j51321J38316
$$ -223359 -136463 -98271 -101803 -117732 -232703 -142635 32670 333269 89482 -61839 76477
2937G6477k23750R4018j0092J3885m9473N1381K67099K810n6612k71653K44903
$$ 76477 -147273 -53255 -63347 -49462 -98935 -47554 219545 222355 165743 -105910 138993
2926A38993L2284n6114N0931M3307m1924k11100n1564Q242J67458N365j26001
$$ 138993 171277 115163 166094 209401 167477 -43623 -95187 -86945 80513 85878 -40123
2915d0123K61035r6471K8483O8183N2801j6273m10615p2989K9836r2168j26659
$$ -40123 220912 124441 152924 221107 273908 257635 -152980 -225969 -196133 -288301 -414960
2904d14960P2471J56014k8252Q9694O221O2362L04289p1881P460N5382j33420
$$ -414960 -342489 -186475 -214727 -125033 -118812 -56450 247839 175958 183418 238800 105380
2893A05380o3589O3700o5087L8813o8528K56988r4337K876Q7238l41369p9505
$$ 105380 41791 105491 40404 79217 10689 267677 173340 176216 263454 -77915 -157420
2882a57420R2039J86289j033M6611l957j21592k080k297N391K26272j12537k3020
$$ -157420 -65381 120908 119875 166486 162529 40937 38857 36560 41951 268223 155686 132666
2870A32666J27519q4956Q3525j0630l44616N015J17839k6713k84289J90934M8809
$$ 132666 260185 175229 258754 248124 -96492 -91477 26362 -351 -284640 -93706 -44897
2859d4897q7994J6093q4162M4993k530j26591J87460J37437L8192j30636k80326
$$ -44897 -132891 -116798 -200960 -155967 -158497 -285088 -97628 39809 78001 -52635 -332961
2848c32961K28097P1016P1351k15530p0769j90345N7749q1535K38803J66874O7752
$$ -332961 -104864 -33848 37503 -178027 -248796 -439141 -381392 -462927 -224124 -57250 10502
2837A0502P1504K7091M039k11904j2270J8275R948K9568N3517r5290J19400K07356
$$ 10502 82006 109097 113136 -98768 -111038 -92763 -82815 -53247 270 -95020 24380 231736
2825B31736K68008k03085o858j21697r6641m6734j53787j26772j62993N1751K46409
$$ 231736 499744 296659 289801 168104 71463 24729 -129058 -255830 -418823 -367072 -120663
2814a20663n9930J47984q9151p4993j5669j12428K36547J72316j86722L10438
$$ -120663 -180593 -32609 -121760 -196753 -212422 -324850 -88303 84013 -102709 207729
2804B07729j83019q5879J50308N4818r9681o2365q0662j760q9733J8468K77076
$$ 207729 24710 -61169 89139 143957 44276 -18089 -98751 -100511 -190244 -171776 105300
2793A05300Q7549j68738k88223l1208J22598K23257j21985K7750l38380P0487
$$ 105300 192849 24111 -264112 -295320 -172722 50535 -71450 -43700 -382080 -311593
2783c11593K48934J38321J815J06064k91163K49479N1414j47059o1102j13511
$$ -311593 -62659 75662 77477 183541 -107622 141857 193271 46212 -14890 -128401
2773a28401K24445j6107k77572n8461r0331n8549K16824L20144J38273j57212
$$ -128401 96044 79937 -197635 -256096 -346427 -404976 -188152 131992 270265 113053
2763A13053l96620j63762K46516K5527J04256q2573j29018R1254j23484J33044
$$ 113053 -283567 -447329 -200813 -175286 -71030 -153603 -282621 -191367 -314851 -181807
2753a81807Q4374J57150j49123m5020K20242J8226o5863O6386Q1293L8867l03456
$$ -181807 -97433 59717 -89406 -134426 85816 104042 38179 104565 185858 224725 -78731
2742g8731k21396j01719J06724J65886J4460L77147k7306j35780l97439O842Q1373
$$ -78731 -300127 -401846 -295122 -129236 -114776 262371 235065 99285 -298154 -291312 -209939
2731b09939j16391R7614m9130O6962L1242P0631Q4421l0660k44226J2150J29753
$$ -209939 -326330 -228716 -277846 -210884 -179642 -109011 -24590 -55250 -299476 -287326 -157573
2720a57573J72267l4524j1537j4628O2937j96584j2638P3926n0236Q7888j16812
$$ -157573 14694 -19830 -31367 -45995 16942 -179642 -192280 -118354 -168590 -80702 -197514
2709a97514O9817J37392R5241j74254r3980p3694J97854J40866M9468k04557R0170
$$ -197514 -127697 9695 104936 -69318 -163298 -236992 -39138 101728 151196 -53361 36809
2698C6809L68410j09697k01066k21376q7222P798R1183L76030j01868k35659l6380
$$ 36809 405219 295522 94456 -126920 -214142 -206344 -115161 260869 159001 -76658 -113038
2687a13038J28907J59298L1834j5949O3311J26396o8155j90989M5414j75900J14721
$$ -113038 15869 175167 207001 191052 254363 380759 312604 121615 167029 -8871 105850
2676A05850k89175l46645J62754M57655L28516j99714j5517q2243j84300Q1968
$$ 105850 -183325 -529970 -367216 90439 418955 219241 203724 121481 -62819 19149
2666A9149j61044J49544q3515k19J23416o2877k3694k806j33137j04727J32476
$$ 19149 -141895 7649 -75866 -76085 47331 -15546 -39240 -42046 -175183 -279910 -147434
2655a47434J19353K30944J96252j38165k83098J56657k59910l0280K28879k1007
$$ -147434 -28081 202863 399115 260950 -22148 134509 -125401 -155681 73198 52191
2645E2191j22072j1053j02377j12729L64393O2729K4776o5574j1714k06248J07665
$$ 52191 -69881 -80934 -183311 -296040 68353 131082 155858 90284 78570 -127678 -20013
2634b0013n1881N8186K24921L5722o768R207R9634k91488p2743J28952l361j59314
$$ -20013 -71894 -13708 211213 246935 240167 249374 349008 57520 -15223 113729 110368 -48946
2622d8946L8485j20808j20110P9536J58751j21775N7615K78542k15524j24142
$$ -48946 -10461 -131269 -251379 -171843 -13092 -134867 -77252 201290 -14234 -138376
2612a38376L79735P2506J22304k80387k1344J4551R8599K4331M236k00089N0714
$$ -138376 241359 313865 436169 155782 134438 148989 247588 271919 276155 76066 126780
2601A26780l4458J2669J23728M5900J55928k87046j20295J6951j20354j2677r2862
$$ 126780 92322 104991 228719 274619 430547 143501 23206 40157 -80197 -92874 -185736
2590a85736K78700K19556m31670J41052J83657J4381j16170j70290K54383J59456
$$ -185736 92964 312520 -119150 21902 205559 219940 103770 -66520 187863 347319
2580C47319k70978J05007J25719J1628l76563J54549J89657j14943j38425k4269
$$ 347319 76341 181348 307067 318695 -57868 96681 286338 171395 32970 8701
2570H701K45498l43479o4913J13400K5726K5226J37812P6800J86862j64647r4709
$$ 8701 254199 -89280 -154193 -40793 -15067 10159 147971 224771 411633 246986 152277
2559A52277k0251L4793j69599N6776N9574j45392J73744p4125L35705Q7150k67549
$$ 152277 132026 166819 -2780 53996 113570 -31822 141922 67797 403502 490652 223103
2548B23103l86018J27968n749j26958J01562p5184j28411K33535k9944k89349
$$ 223103 -162915 -34947 -40696 -167654 -66092 -141276 -269687 -36152 -66096 -355445
2538c55445R6379J45822j5187M7218q5356K36293m8727o2575L46355K18801l25622
$$ -355445 -259066 -113244 -128431 -81213 -166569 69724 20997 -41578 304777 523578 197956
2527A97956j26923J5131J2271O1063Q8558K60916l70956r4069P1266K4890j4757
$$ 197956 71033 86164 98435 159498 248056 508972 138016 43947 115213 140103 125346
2516A25346j1891m1023N7067j02865J26071j17469j40948K42704N1203k00944
$$ 125346 113455 72432 129499 26634 152705 35236 -105712 136992 188195 -12749
2506a2749R3212r8993j2735J76058J81053k48881k33930J11578J08765R2092J95936
$$ -12749 80463 -18530 -31265 144793 325846 76965 -156965 -45387 63378 155470 351406
2495C51406l42612j76359K94492J50093R7552R3231j68902n75K7724j10590R7494
$$ 351406 8794 -167565 126927 277020 374572 467803 298901 298326 326050 215460 312954
2484C12954k41582J64036q7837J36498K61008J5659j61126j04957j05671k0049
$$ 312954 71372 235408 147571 284069 545077 560736 399610 294653 188982 168933
2474A68933J67772n8539J29898j01378J26710j34217J2096L33379j41484k21818
$$ 168933 336705 278166 408064 306686 433396 299179 311275 644654 503170 281352
2464B81352r0288J71271j39562k03533O1593J14902l6552P3460m5284R9915j53360
$$ 281352 191064 362335 222773 19240 80833 195735 159183 232643 187359 287274 133914
2453A33914k011R2920o2521J68278P3280N0732k5958R4104R414k88185j03850
$$ 133914 131903 224823 162302 330580 403860 454592 428634 522738 532152 243967 140117
2442A40117J85489J62615J09808l23303P0780M9313j03764L871P7472J53165j13682
$$ 140117 325606 488221 598029 274726 345506 394819 291055 294926 372398 525563 411881
2431D11881j03842J49579J3940J63932j33528j34218L2075J45542K33208k74477
$$ 411881 308039 457618 471558 635490 501962 367744 399819 545361 778569 504092
2421E04092J44064l3336M4805j42759J26639r7928j84331o6419P1577O4480L8249
$$ 504092 648156 614820 659625 516866 643505 545577 361246 294827 366404 430884 469133
2410D69133k51791J35849O5001L62187j09536q5641L36823q0312j81770K88354
$$ 469133 217342 353191 418192 780379 670843 585202 922025 841713 659943 948297
2400I48297l2986j59275j05585J02497p940O1154K7769j23622R4892K73742K77149
$$ 948297 915311 756036 650451 752948 745008 806162 833931 710309 805201 1078943 1356092
2389A356092k07966J15581r146N5258j7848j71390j6324o1880P7194j0797q2614
$$ 1356092 1148126 1263707 1254561 1309819 1291971 1120581 1104257 1042377 1119571 1108774 1026160
2378A026160L35357K02460k30014o6596K96816M7266O938j51130J33230J39468
$$ 1026160 1361517 1563977 1333963 1267367 1564183 1611449 1618387 1467257 1600487 1739955
2368A739955L17968k3918J37878J51595L04326k9570L33016M14811M0530J18538
$$ 1739955 2057923 2034005 2171883 2323478 2627804 2598234 2931250 3346061 3386591 3505129
2358C505129L57191K08975p3873L92391K14165N70469N49102o9109O25117M81951
$$ 3505129 3862320 4071295 3997422 4389813 4603978 5174447 5723549 5654440 6279557 6761508
2348F761508M46408L71418P90730P38659L82495N58801J184634J223251J090894
$$ 6761508 7207916 7579334 8370064 9108723 9491218 10050019 11234653 12457904 13548798
2339A3548798J505165J976542K780681L458476M315730L926101M603826N182977
$$ 13548798 15053963 17030505 19811186 23269662 27585392 31511493 36115319 41298296
2331D1298296L487128N33609m715402n975557m792059l467282k586569k019279
$$ 41298296 44785424 45319033 40603631 34628074 29836015 26368733 23782164 21762885
2323B1762885j750855j877310j709654j381148j077591r32151j029153p53011
$$ 21762885 20012030 18134720 16425066 15043918 13966327 13034176 12005023 11252012
2315A1252012r40008j022695p01046q59913p23905n73990k23353n52413m75882
$$ 11252012 10312004 9289309 8588263 7728350 7004445 6430455 6207102 5654689 5178807
2306E178807m21232n43010k65624J6638m79060l31621m0939j25098n295Q6068
$$ 5178807 4757575 4214565 3948941 3965579 3486519 3154898 3113959 2988861 2983566 3069634
2296C069634k79976j04809r2776j51431k15837l06937n7555O6170j47493j3542
$$ 3069634 2789658 2684849 2592073 2440642 2224805 1917868 1860313 1926483 1778990 1765448
2286A765448k02289R1562J5570J82617j47033k09332p9300k84908J11073p7939
$$ 1765448 1563159 1654721 1670291 1852908 1705875 1496543 1417243 1132335 1243408 1165469
2276A165469m3296K23624q6897p634L0741j99009k86707J90178j19672j03590
$$ 1165469 1122173 1345797 1258900 1251266 1282007 1082998 796291 986469 866797 763207
2266G63207j2104l9090J05551j363j21814N9513j17727j56495l4377M983J0242
$$ 763207 751103 712013 817564 816201 694387 753900 636173 479678 445301 450284 460526
2255D60526J00237L62K6695M7675j43184J08020L7105l08505J207K70576j20603
$$ 460526 560763 561125 587820 635495 492311 600331 637436 328931 330138 600714 480111
2244D80111N9071Q8155j41094Q728J15706m2936j24316k10694j84987K04601O1127
$$ 480111 539182 627337 486243 494971 610677 567741 443425 232731 47744 252345 313472
2233C13472j09453p4212n1843J31005L0819k5330k60335P7389j6546L7878K76861
$$ 313472 204019 129807 77964 208969 239788 214458 -45877 31512 14966 52844 329705
2222C29705j06144j94182j9414J06124P4917R3304J12271k47132J81319o2641
$$ 329705 223561 29379 9965 116089 191006 284310 396581 149449 330768 268127
2212B68127k03070J07462J13977J86410l63302N2038o2763j10448j7379J43554
$$ 268127 65057 172519 286496 472906 109604 161642 98879 -11569 -28948 114606
2202A14606K38793K03697n417m16010k10645O8066K19285R6352k89468j1651J48466
$$ 114606 353399 557096 551679 135669 -74976 -6910 212375 308727 19259 7608 156074
2191A56074J39556l03721m03197K70765L51366j04095j93421K3157L8484L4645
$$ 156074 295630 -8091 -411288 -140523 210843 106748 -86673 -63516 -25032 9613
2181I613j25949K14142j43803n3051k2961J16857p320M6855K23587k46532O2827
$$ 9613 -116336 97806 -45997 -99048 -122009 -5152 -12472 34383 257970 11438 74265
2170G4265m9783K8834l8247j98208J35669j3K22753j40288n1104p5470j20615
$$ 74265 24482 53316 15069 -183139 -47470 -47483 175270 34982 -16122 -91592 -212207
2159b12207k0191J96866J34454J08788j65850N3940O5708J96795k5336l47290
$$ -212207 -232398 -35532 98922 207710 41860 95800 161508 358303 332967 -14323
2149a4323Q2258J0458q3208K06137j98941k91644L23973K11403k11550r5215K79862
$$ -14323 67935 78393 -4815 201322 2381 -289263 34710 246113 34563 -60652 219210
2138B19210r0766n6903o2207r8283n9291Q7608k9918k34102Q6707J40253l7638
$$ 219210 128444 71541 9334 -88949 -148240 -60632 -90550 -324652 -237945 -97692 -135330
2127a35330o386p3453J86809Q9209Q3450l7654j19936j37249P3265m5438P9095
$$ -135330 -141716 -215169 -28360 60849 144299 106645 -13291 -150540 -77275 -122713 -43618
2116d3618j917J56207j41257p2559L18649j67827r5202p4445J22699K08766m29
$$ -43618 -45535 110672 -30585 -103144 215505 47678 -47524 -121969 730 209496 209067
2105B09067j13946l18543J07403l0684r3780K26059k7808N0345O6701j8492l63427
$$ 209067 95121 -223422 -116019 -146703 -240483 -14424 -42232 8113 74814 56322 -307105
2094c07105r8075R5374L66985O7843n4862k06424J80983j93594J3695k4494m900
$$ -307105 -405180 -309806 57179 125022 70160 -136264 44719 -148875 -135180 -159674 -164574
2083a64574o5719K17035j49070n3505J91793k81858J17043k49737r8821L41481
$$ -164574 -230293 -13258 -162328 -215833 -24040 -305898 -188855 -438592 -537413 -195932
2073a95932K39515j28120Q1869M9146L1744j74508j24701p0748J29705K25997
$$ -195932 43583 -84537 -2668 46478 78222 -96286 -220987 -291735 -162030 63967
2063F3967J0078r7869Q6825J28215q1747k53057P0084K7848P828k10841K6858
$$ 63967 74045 -23824 63001 191216 109469 -143588 -73504 -45656 -37828 -248669 -221811
2052b21811n9297P6389K11903r1651P1198o2859N9067N0405j97053J29191o2780
$$ -221811 -281108 -204719 7184 -84467 -13269 -76128 -17061 33344 -163709 -34518 -97298
2041i7298m9576J55423j88545J8240K11355J1784R1230j49156K10965j3739o5189
$$ -97298 -146874 8549 -179996 -161756 49599 61383 152613 3457 214422 200683 135494
2030A35494j92026j26419K11320k04302q1086K43386J37711k0378k87238N5637
$$ 135494 -56532 -182951 28369 -175933 -257019 -13633 124078 103700 -183538 -127901
2020a27901m0017j15301J47515P8950R2399k6715q1261n8703K3857k5652J23137
$$ -127901 -167918 -283219 -135704 -56754 35645 8930 -72331 -131034 -107177 -132829 -9692
2009i692Q5751j60989n4036R6531O2500j96613J02863j69276K62769l0595l7206
$$ -9692 76059 -84930 -138966 -42435 20065 -176548 -73685 -242961 19808 -10787 -47993
1998d7993J51366q1113o1241j59414R3355N5803J11474P1868l420j64165J62598
$$ -47993 103373 22260 -38981 -198395 -105040 -49237 62237 134105 130685 -33480 129118
1987A29118m01177L0533J29455P2780p9021j17564J58170J2719Q2510j99749j65442
$$ 129118 -272059 -241526 -112071 -39291 -118312 -235876 -77706 -64987 17523 -182226 -347668
1976c47668M6464J10235O2571J00874O1391M4073k47685k01545K09004P7362O0119
$$ -347668 -301204 -190969 -128398 -27524 33867 77940 -169745 -371290 -162286 -84924 -24805
1965b4805k92665K75098l5641k51104L37458J23842m07116j19788K42884Q419
$$ -24805 -317470 -42372 -78013 -329117 8341 132183 -274933 -394721 -151837 -143418
1955a43418K76526L42602k43010j37348j35229q3762j48216O8342L87544m4694
$$ -143418 133108 475710 232700 95352 -39877 -123639 -271855 -203513 184031 139337
1945A39337J25619l789k05188j3098l36291j41434J08647J91999J65239m7693
$$ 139337 264956 261167 55979 42881 -293410 -434844 -326197 -134198 31041 -16652
1935a6652j25480l5314K13151J30099R906k87045P056m1244j07491j37259j24392
$$ -16652 -142132 -177446 35705 165804 175710 -111335 -104279 -145523 -253014 -390273 -514665
1924e14665N1598j95512M50997J71871j66880k03778l5224j03497K13762L13555
$$ -514665 -463067 -658579 -207582 -35711 -202591 -406369 -441593 -545090 -331328 -17773
1914a7773o6148k65081K43549J31753Q6521P5594j33918p2904j52791k1659k289
$$ -17773 -83921 -349002 -105453 26300 112821 188415 54497 -18407 -171198 -192857 -195146
1903a95146J26886l3493J81984p9779j90200L6193M1479r2074L4288r7078J49696
$$ -195146 -68260 -101753 80231 452 -189748 -153555 -112076 -204150 -169862 -266940 -117244
1892a17244J37067p3028O8538R1080l7729m1978L6893k12714n0654O4566J35004
$$ -117244 19823 -53205 15333 106413 68684 26706 63599 -149115 -199769 -135203 -199
1881a99j45058m3826J21415J35357l1819q9887R0068L9673m4976j34576O3962
$$ -199 -145257 -189083 -67668 67689 35870 -54017 36051 75724 30748 -103828 -39866
1870c9866j54341K04377n1342o8892M6284N2061o6981q9424N5272J26859n6420
$$ -39866 -194207 10170 -41172 -110064 -63780 -11719 -78700 -168124 -112852 14007 -42413
1859d2413K2395j17629r6697M2816L29210l00787m1915K17540l92800K05386Q0848
$$ -42413 -20018 -137647 -234344 -191528 137682 -163105 -205020 12520 -380280 -174894 -94046
1848i4046k7360K34186j02062J93028o0564k96953k40168m1054J25289j60934
$$ -94046 -121406 112780 10718 203746 143182 -153771 -393939 -434993 -309704 -470638
1838d70638L26782O5468Q7535o0986k9025L0953P7627k54864k7247P8813j03868
$$ -470638 -143856 -78388 9147 -51839 -80864 -49911 27716 -227148 -254395 -175582 -279450
1827b79450K93181j6523j56442o0059j41736j20937J28343J09773N25q9748p4319
$$ -279450 13731 -2792 -159234 -219293 -361029 -481966 -353623 -243850 -243325 -333073 -407392
1816d07392K02535J46120k33183r009l174K07000m6941L9877K06354j4878l53822
$$ -407392 -204857 -58737 -291920 -300929 -304103 -97103 -144044 -104167 102187 87309 -266513
1805b66513j23884k09172l0622O5865K81088J63354o5340L5015M7857j38708K1990
$$ -266513 -390397 -599569 -630191 -564326 -283238 -119884 -185224 -150209 -102352 -241060 -219070
1794b19070j70691l31038K56782J81169Q0954J16830K3709r2560J54794n6816
$$ -219070 -389761 -720799 -464017 -282848 -201894 -85064 -61355 -153915 879 -55937
1784e5937k33468p076K12318j55394J52875l2599J16833j14496j38136N653j97350
$$ -55937 -289405 -296481 -84163 -239557 -86682 -119281 -2448 -116944 -255080 -249427 -446777
1773d46777J38138M38834k50946J96332K5624k05498J42242O156J38593k75155
$$ -446777 -308639 130195 -120751 75581 101205 -104293 37949 44105 182698 -92457
1763i2457R9104R5922k62820J44818j13071J25353J39009j7501j47256O1451K05021
$$ -92457 6647 102569 -160251 -15433 -128504 -3151 135858 118357 -28899 32552 237573
1752B37573k13271J65842j65123K10169K26865l37158j02230R5289p9581r4326
$$ 237573 24302 190144 25021 235190 462055 124897 22667 117956 38375 -55951
1742e5951J95172M9027k19753k78665J72001O5245j98842k0838P1311j79975L46927
$$ -55951 139221 188248 -31505 -310170 -138169 -72924 -271766 -292604 -221293 -401268 -54341
1731e4341j06493j91490L81583K9446N2206j61741k052J48951j79816o455R1089
$$ -54341 -160834 -352324 29259 58705 110911 -50830 -52882 96069 -83747 -90202 887
1720H87n3233j63714K9025o4310N3999r3913j77748K87006J23796k6122j71839
$$ 887 -52346 -216060 -187035 -251345 -197346 -291259 -469007 -182001 -58205 -84327 -256166
1709b56166J28447J45381j06383k6959J12768J370l14382j8610J01274j68600
$$ -256166 -127719 17662 -88721 -115680 -2912 -1542 -315924 -334534 -233260 -401860
1699d01860M21136K19226l26321l31333m2204l7614J02983L80252K11660m13002
$$ -401860 19276 238502 -87819 -419152 -461356 -498970 -395987 -15735 195925 -217077
$$ [...]
##END NTUPLES=NMR SPECTRUM
##END=
