##TITLE=1H_DE-80H_X3
 200.13MHz, d2o
 8 sc
 
 19ns.26.2.2025
##JCAMPDX= 6.0         $$ Bruker NMR JCAMP-DX V2.0
##DATA TYPE= NMR SPECTRUM
##DATA CLASS= NTUPLES
##ORIGIN= UXNMR, Bruker Analytische Messtechnik GmbH
##OWNER= pz
$$ XWIN-NMR		Version 3.5
$$ Wed Sep 17 14:50:52 2025 Russian Standard Time (UT+4h)  Yarkov@DPX200
##.OBSERVE FREQUENCY= 200.1313
##.OBSERVE NUCLEUS= ^1H
##.ACQUISITION MODE= SIMULTANEOUS
##.ACQUISITION SCHEME= undefined
##.AVERAGES= 8
##.DIGITISER RES= 18
##SPECTROMETER/DATA SYSTEM= spect
##.PULSE SEQUENCE= zg30
##.SOLVENT NAME= CDCl3
##.SHIFT REFERENCE= (INTERNAL, CDCl3, 0, 15.4836)
##AUDIT TRAIL= $$ (NUMBER, WHEN, WHO, WHERE, WHAT)
$$ ##TITLE= Audit trail, XWIN-NMR		Version 3.5
$$ ##JCAMPDX= 5.01
$$ ##ORIGIN= Bruker BioSpin GmbH
$$ ##OWNER= Yarkov
$$ C:/Bruker/XWIN-NMR/data/yarkov2/nmr/H-C/1/pdata/1/auditp.txt
$$ ##AUDIT TRAIL=  $$ (NUMBER, WHEN, WHO, WHERE, WHAT)
(   1,<2025-09-17 14:50:03.25 +0400>,<Yarkov>,<DPX200>,
      <created by zg, POWCHK disabled, PULCHK disabled
       configuration hash MD5:
       00 E9 B6 7A A2 85 ED C7 34 08 36 98 17 FE 4E 26
       data hash MD5: 16K
       3E A6 6D 84 E7 B1 25 D8 61 DB 2C BF BE 23 E3 CA>)
(   2,<2025-09-17 14:50:10.12 +0400>,<Yarkov>,<DPX200>,
      <Start of raw data processing
       efp BC_mod = 2 LB = 0.25 FT_mod = 6 PKNL = 1 PHC0 = -1351.135 PHC1 = 5.790926 SI = 16K 
       data hash MD5: 16K
       47 FA 1E 78 3E 0E DE 66 50 3A E6 61 F5 E6 2F 53>)
(   3,<2025-09-17 14:50:17.46 +0400>,<Yarkov>,<DPX200>,
      <abs ABSG = 5 
       data hash MD5: 16K
       48 CA BC 0B 0E D3 80 2F A3 2C AD 26 25 2D F9 BE>)
$$ ##END=
$$ 
$$ hash MD5
$$ 95 3B 07 73 63 2A 52 08 50 D2 37 32 B0 BC 5D F3
##$RELAX= 
##$RELAX= 
##$RELAX= 
##$RELAX= 
##$RELAX= 
##$RELAX= 
$$ Bruker specific parameters
$$ --------------------------
##$DU= <C:/Bruker/XWIN-NMR>
##$EXPNO= 1
##$NAME= <H-C>
##$PROCNO= 1
##$TYPE= <nmr>
##$USER= <yarkov2>
##$AMP= (0..31)
100 100 100 100 100 100 100 100 100 100 100 100 100 100 100 100 100 100 
100 100 100 100 100 100 100 100 100 100 100 100 100 100 
##$AQSEQ= 0
##$AQ_mod= 1
##$AUNM= <au_zg>
##$AUTOPOS= <>
##$BF1= 200.13
##$BF2= 200.13
##$BF3= 200.13
##$BF4= 200.13
##$BF5= 200.13
##$BF6= 200.13
##$BF7= 200.13
##$BF8= 200.13
##$BYTORDA= 1
##$CFDGTYP= 0
##$CFRGTYP= 5
##$CHEMSTR= <none>
##$CNST= (0..31)
1 1 145 1 1 1 1 1 1 1 1 1 1 1 1 1 1 1 1 1 1 1 1 1 1 1 1 1 1 1 1 1 
##$CPDPRG= <>
##$CPDPRG1= <>
##$CPDPRG2= <>
##$CPDPRG3= <>
##$CPDPRG4= <mlev>
##$CPDPRG5= <mlev>
##$CPDPRG6= <mlev>
##$CPDPRG7= <mlev>
##$CPDPRG8= <mlev>
##$CPDPRGB= <>
##$CPDPRGT= <>
##$D= (0..31)
0 0.7 0 0 0 0 0 0 0 0 0 0.03 0 0 0 0 0 0 0 0 0 0 0 0 0 0 0 0 0 0 0 0 
##$DATE= 1758106202
##$DBL= (0..7)
120 120 120 120 120 120 120 120 
##$DBP= (0..7)
150 150 150 150 150 150 150 150 
##$DBP07= 0
##$DBPNAM0= <>
##$DBPNAM1= <>
##$DBPNAM2= <>
##$DBPNAM3= <>
##$DBPNAM4= <>
##$DBPNAM5= <>
##$DBPNAM6= <>
##$DBPNAM7= <>
##$DBPOAL= (0..7)
0.5 0.5 0.5 0.5 0.5 0.5 0.5 0.5 
##$DBPOFFS= (0..7)
0 0 0 0 0 0 0 0 
##$DE= 6
$$ [...]
##$SUBNAM3= <"">
##$SUBNAM4= <"">
##$SUBNAM5= <"">
##$SUBNAM6= <"">
##$SUBNAM7= <"">
##$SUBNAM8= <"">
##$SUBNAM9= <"">
##$SW= 18.0517328524113
##$SWIBOX= (0..15)
0 0 2 0 0 0 0 0 0 0 0 0 0 0 0 0 
##$SW_h= 3612.71676300578
##$TD= 16384
##$TD0= 1
##$TE= 0
##$TE2= 300
##$TE3= 300
##$TEG= 300
##$TL= (0..7)
0 120 120 120 120 120 120 120 
##$TP= (0..7)
150 150 150 150 150 150 150 150 
##$TP07= 0
##$TPNAME0= <>
##$TPNAME1= <>
##$TPNAME2= <>
##$TPNAME3= <>
##$TPNAME4= <>
##$TPNAME5= <>
##$TPNAME6= <>
##$TPNAME7= <>
##$TPOAL= (0..7)
0.5 0.5 0.5 0.5 0.5 0.5 0.5 0.5 
##$TPOFFS= (0..7)
0 0 0 0 0 0 0 0 
##$TUNHIN= 0
##$TUNHOUT= 0
##$TUNXOUT= 0
##$USERA1= <user>
##$USERA2= <user>
##$USERA3= <user>
##$USERA4= <user>
##$USERA5= <user>
##$V9= 5
##$VALIST= <valist>
##$VCLIST= <CCCCCCCCCCCCCCC>
##$VD= 0
##$VDLIST= <DDDDDDDDDDDDDDD>
##$VPLIST= <PPPPPPPPPPPPPPP>
##$VTLIST= <TTTTTTTTTTTTTTT>
##$WBST= 1024
##$WBSW= 4
##$XGAIN= (0..3)
0 0 0 0 
##$XL= 0
##$YL= 0
##$YMAX_a= 239899
##$YMIN_a= -148805
##$ZGOPTNS= <>
##$ZL1= 120
##$ZL2= 120
##$ZL3= 120
##$ZL4= 120
##$ABSF1= 15.48356
##$ABSF2= -2.56829
##$ABSG= 5
##$ABSL= 3
##$ALPHA= 0
##$AQORDER= 0
##$ASSFAC= 0
##$ASSFACI= 0
##$ASSFACX= 0
##$ASSWID= 0
##$AUNMP= <proc_1d>
##$AZFE= 0.1
##$AZFW= 0.1
##$BCFW= 0
##$BC_mod= 2
##$BYTORDP= 0
##$COROFFS= 0
##$CY= -3
##$DATMOD= 1
##$DC= 0
##$DFILT= <>
##$DTYPP= 0
##$F1P= 0
##$F2P= 0
##$FCOR= 1
##$FTSIZE= 16384
##$FT_mod= 6
##$GAMMA= 0
##$GB= 0
##$INTBC= 1
##$INTSCL= 3.241238e-09
##$ISEN= 128
##$LB= 0.25
##$LEV0= 0
##$LPBIN= 0
##$MAXI= 10000
##$MC2= 0
##$MEAN= 0
##$ME_mod= 0
##$MI= 1.114404
##$NCOEF= 0
##$NC_proc= -8
##$NLEV= 6
##$NOISF1= 3.799351
##$NOISF2= 2.8
##$NSP= 0
##$NTH_PI= 0
##$NZP= 0
##$OFFSET= 15.48356
##$PC= 1
##$PHC0= -1351.135
##$PHC1= 5.790926
##$PH_mod= 1
##$PKNL= yes
##$PPARMOD= 0
##$PSCAL= 0
##$PSIGN= 0
##$REVERSE= no
##$SF= 200.13000763422
##$SI= 16384
##$SIGF1= 3
##$SIGF2= 2
##$SINO= 0.751879
##$SIOLD= 32768
##$SREGLST= <19F.Aceton>
##$SSB= 0
##$STSI= 16384
##$STSR= 0
##$SW_p= 3612.71676300578
##$SYMM= 0
##$S_DEV= 0
##$TDeff= 16384
##$TDoff= 0
##$TI= <>
##$TILT= no
##$TM1= 0
##$TM2= 0
##$TOPLEV= 0
##$USERP1= <user>
##$USERP2= <user>
##$USERP3= <user>
##$USERP4= <user>
##$USERP5= <user>
##$WDW= 1
##$XDIM= 16384
##$YMAX_p= 278308372
##$YMIN_p= -761245
$$ End of Bruker specific parameters
$$ ---------------------------------
##NTUPLES= NMR SPECTRUM
##VAR_NAME=  FREQUENCY,     SPECTRUM/REAL,   SPECTRUM/IMAG
##SYMBOL=    X,             R,               I
##VAR_TYPE=  INDEPENDENT,   DEPENDENT,       DEPENDENT
##VAR_FORM=  AFFN,          ASDF,            ASDF
##VAR_DIM=   16384,         16384,           16384
##UNITS=     HZ,            ARBITRARY UNITS, ARBITRARY UNITS
##FACTOR=    0.220516191357247, 1,           1
##FIRST=     3098.72490264589, 0,            0
##LAST=      -513.991860359886, 0,           0
##MIN=       -513.991860359886, -761245,     0
##MAX=       3098.72490264589, 278308372,    0
$$ Real data points
##PAGE= N=1
##DATA TABLE= (X++(R..R)), XYDATA
$$ [...]
7327A07858p2855o8756L8730J63476O4481J5612J3478o7112j7004o0667K1205
$$ 107858 35003 -33753 4977 168453 232934 248546 262024 194912 177908 117241 138446
7316A38446q763p3614q4790o719M1476J23056l000o4748r2272K0962j19026L4688
$$ 138446 129683 56069 -28721 -35440 6036 129092 126092 61344 -30928 -9966 -128992 -94304
7304i4304r0433M8597J04630K4951j1829l4189n2185m0662L9079J13595l3198
$$ -94304 -184737 -136140 -31510 -6559 -18388 -52577 -104762 -145424 -106345 7250 -25948
7293b5948n9168N9062k01371N3321O7508j09704n7372n4161N6609Q2391L3813
$$ -25948 -85116 -26054 -227425 -174104 -106596 -216300 -273672 -327833 -271224 -188833 -155020
7282a55020O6822L043n3125P9052o7473j11364R495K01689j22846n9862O6177
$$ -155020 -88198 -85155 -138280 -59228 -126701 -238065 -228570 -26881 -149727 -209589 -143412
7271a43412l8254J36610j3079l893P3949p7813p1996P790O43M7230m8823M4601
$$ -143412 -181666 -45056 -58135 -62028 11921 -65892 -137888 -130098 -129455 -82225 -131048 -86447
7259h6447M4637O6594K625j02881j3992N2243r4687m0111J21964k4895O91J0179
$$ -86447 -41810 24784 27409 -75472 -89464 -37221 -131908 -172019 -50055 -74950 -74259 -64080
7247f4080j08293o1423J9624m896j04453J82324m3222k5020P0174M2869l1810
$$ -64080 -172373 -233796 -214172 -219068 -323521 -141197 -184419 -209439 -139265 -96396 -128206
7236a28206O1340m2467p0425Q2255L8580K1341J11366J5745p1579n9295j35829
$$ -128206 -66866 -109333 -179758 -97503 -58923 -37582 73784 89529 17950 -41345 -177174
7225a77174N4647L6882J31327J89689n4338j48504k370K1379q0291n816n527k3537
$$ -177174 -122527 -85645 45682 235371 181033 32529 30159 51538 -28753 -34569 -40096 -63633
7213f3633L8550L3676K7400o450J8171o8161n9401J74193P383k7717l7778K1317
$$ -63633 -25083 8593 35993 29543 47714 -20447 -79848 94345 101728 74011 36233 57550
7201E7550R1093L2165r0056O5536o1145P7804M4475n0446j28407k6097J83661
$$ 57550 148643 180808 90752 156288 95143 172947 217422 166976 38569 12472 196133
7190A96133j9912j2442k4122R8574J3512n686l7157K249N2271J93809q2370j24434
$$ 196133 176221 163779 139657 238231 251743 246057 208900 211149 263420 457229 374859 250425
7178B50425j00261J12312K2290P7078L038J49872n3834j36352j2820J07702O7899
$$ 250425 150164 262476 284766 361844 364882 514754 460920 324568 311748 419450 487349
7167D87349k20966K6912n774m1933J09865p1748J11123P310K3704N0452J88550
$$ 487349 266383 293295 287521 245588 355453 283705 394828 402138 425842 476294 664844
7156F64844n9813k614J15081O6984o1977j38233M1917P9563J29175j16275Q6047
$$ 664844 605031 602417 717498 784482 722505 584272 626189 705752 834927 718652 804699
7145H04699m768N2340j6695j614J6324P3690M7545J27542J45599J46513J9061
$$ 804699 799931 852271 835576 833962 850286 923976 971521 1099063 1244662 1391175 1410236
7134A410236o8460n7162L9007J21584J63836P3032O8154J54098J24087J61694
$$ 1410236 1341776 1284614 1323621 1445205 1609041 1682073 1750227 1904325 2028412 2190106
7124B190106R0398N9414K28280J53962P4983j1551j05949j09979J03812j49211
$$ 2190106 2280504 2339918 2568198 2722160 2797143 2785592 2679643 2569664 2673476 2524265
7114B524265j84769j732j00991m7835J2626n7062m3373j4654j88430q261M2600
$$ 2524265 2339496 2337764 2236773 2188938 2201564 2144502 2101129 2086475 1898045 1889784 1932384
7103A932384j0631J8508P549M8239m6926L2334N6930J6690J23536K06186J89389
$$ 1932384 1921753 1940261 1947810 1996049 1949123 1981457 2038387 2055077 2178613 2384799 2574188
7092B574188J04619L5873J35643K66641K76713K88973M29191N01299M61777M54599
$$ 2574188 2678807 2714680 2850323 3116964 3393677 3682650 4111841 4613140 5074917 5529516
7082E529516O76742P71424O46634N77994J11015l7998k41879m0748l08127p39020
$$ 5529516 6206258 6977682 7624316 8202310 8313325 8275327 8033448 7992700 7684573 6945553
7072F945553p90730q07380n72372m12100l76578l90452k13106k18911k05051j61750
$$ 6945553 6154823 5347443 4775071 4362971 3986393 3595941 3382835 3163924 2958873 2797123
7062B797123q8071O1532k58341R0576r413p2041J03338n3287n8263r0672J10807
$$ 2797123 2709052 2770584 2512243 2602819 2593406 2521365 2624703 2571416 2513153 2422481 2533288
7051B533288J14657M4981L9874K02565L4248j2677j5496J47036J26636J47407
$$ 2533288 2647945 2692926 2732800 2935365 2969613 2956936 2941440 3088476 3215112 3362519
7041C362519J64846M8517R5594Q5394J65170q8652m4659J069k2872j78018j19444
$$ 3362519 3527365 3575882 3671476 3756870 3922040 3833388 3788729 3789798 3766926 3588908 3469464
7030C469464j22902j73872L935j32437m0153j19803k7803p8951J36022p1037l5341
$$ 3469464 3346562 3172690 3176625 3044188 3004035 2884232 2856429 2777478 2913500 2842463 2807122
7019B807122J14570J05404J65563K93180L24279L05177K94220K92491N20476O83904
$$ 2807122 2921692 3027096 3192659 3485839 3810118 4115295 4409515 4702006 5222482 5906386
7009E906386N29054N95447N61901J28282k58836j38271k8384l48834m49633p65527
$$ 5906386 6435440 7030887 7592788 7721070 7462234 7323963 7295579 6946745 6497112 5731585
6999E731585p35300m99163o70335m46960l05614l83697o0949k26j90785j22246
$$ 5731585 4996285 4497122 3826787 3379827 3074213 2690516 2629567 2629341 2438556 2316310
6989B316310j3503j76286k18196j13472p6729j21920L031M532p5776O2263R9447
$$ 2316310 2302807 2126521 1908325 1794853 1718124 1596204 1599235 1603767 1527991 1590254 1689701
6978A689701j61721k00231j82598N7109N8744o5753R7292N8054j9927j43484R175
$$ 1689701 1527980 1327749 1145151 1202260 1261004 1195251 1292543 1350597 1330670 1187186 1196361
6967A196361K9112p2158j5117M1746Q0158Q5575J4298m1257N6336J0381J6257
$$ 1196361 1225473 1153315 1138198 1179944 1260102 1345677 1359975 1318718 1375054 1385435 1401692
6956A401692o4238R7413Q3689j3168j49157Q6909M6396m1078m9421k72092M0290
$$ 1401692 1337454 1434867 1518556 1505388 1356231 1443140 1489536 1448458 1399037 1126945 1167235
6945A167235J53872j25215o254N3804j05699J0186k7178j161n7561L5678k0422
$$ 1167235 1321107 1195892 1189638 1243442 1137743 1147929 1120751 1119590 1062029 1097707 1077285
6934A077285n601O6819n3917o8491j2268K6163j37865J15563K3817j92956K9324
$$ 1077285 1071684 1138503 1084586 1016095 1003827 1029990 892125 1007688 1031505 838549 867873
6923H67873O6197j39762j49799J79979R9520j6231J52959M1765j03852J775O8030
$$ 867873 934070 794308 644509 824488 924008 907777 1060736 1102501 998649 1000424 1068454
6912A068454Q9305O861j17844o7586P0559N6342o8442K5893Q1216r0013j9229
$$ 1068454 1157759 1164620 1046776 979190 1049749 1106091 1037649 1063542 1144758 1054745 1035516
6901A035516k0005j18634Q6021K543j16630R374J64393J38831m7108o0313j5108
$$ 1035516 1015511 896877 982898 985441 868811 878185 1042578 1181409 1134301 1073988 1058880
6890A058880J8270j30538P2189J28995j05060J56021L8275q2029M4034P5880m2899
$$ 1058880 1077150 946612 1018801 1147796 1042736 1198757 1237032 1155003 1199037 1274917 1232018
6879A232018J2150O4382N9781J826J7108Q6314j08490L6873j01881j22116J54162
$$ 1232018 1244168 1308550 1368331 1370157 1387265 1473579 1365089 1401962 1300081 1177965 1332127
6868A332127J47575J02827Q1591j0403k861R9454n9622O7737K78847R7571r9331
$$ 1332127 1479702 1582529 1664120 1653717 1650856 1750310 1690688 1758425 2037272 2134843 2035512
6857B035512O9855L0832m1865m2567P6723P0449J59106J55636J18548J63783J40972
$$ 2035512 2105367 2136199 2094334 2051767 2128490 2198939 2358045 2513681 2632229 2796012 2936984
6846B936984J15675O8595L10947L49207K27353k844k8794m7822K1344L1164j14904
$$ 2936984 3052659 3121254 3432201 3781408 4008761 4005917 3977123 3929301 3950645 3981809 3866905
6835C866905n8513l3528N4754l6726j96685O3290o4944j47781M2090N8296l902
$$ 3866905 3808392 3774864 3829618 3792892 3596207 3659497 3594553 3446772 3488862 3547158 3543256
6824C543256n1415Q1969P0516P736J4318J60881P6631R0720L3710M8034J14011
$$ 3543256 3491841 3573810 3644326 3652062 3666380 3827261 3903892 3994612 4028322 4076356 4190367
6813D190367L6627N8570J87382J6208J06983J54190O6574K30433j8985p0552L1055
$$ 4190367 4226994 4285564 4472946 4489154 4596137 4750327 4816901 5047334 5028349 4957797 4988852
6802D988852J49886J07527K38590P7828J05445J65096J22032K22742J86892J00569
$$ 4988852 5138738 5246265 5484855 5562683 5668128 5833224 5955256 6177998 6364890 6465459
6792F465459L13421K57710L58088M42045L52320M48154O08773N39419P34121P48434
$$ 6465459 6778880 7036590 7394678 7836723 8189043 8637197 9245970 9785389 10519510 11267944
6782A1267944Q54435Q10497P19075J067397J087628O55051M54483J58238J38844
$$ 11267944 12122379 12932876 13651951 14719348 15806976 16462027 16916510 17074748 17213592
6773A7213592J87241K08528j24940l57350p8295r231J45653L89794M34843M76796
$$ 17213592 17400833 17609361 17484421 17127071 17048776 17039545 17185198 17574992 18009835 18486631
6763A8486631R06670R97093R86600J272102J341952J594574J982438K233548K468628
$$ 18486631 19393301 20390394 21376994 22649096 23991048 25585622 27568060 29801608 32270236
6754C2270236L126329L717179M151337M886657N303013N101325M644218L928719
$$ 32270236 35396565 39113744 43265081 48151738 53454751 58556076 63200294 67129013
6746F7129013L133641L164214L496635L973866M292075M785936N105773N275208
$$ 67129013 70262654 73426868 76923503 80897369 85189444 89975380 95081153 100356361
6738A00356361N347604M825268L427912Q32129k300645n349381p526468q536808
$$ 100356361 105703965 110529233 113957145 114789274 112488629 107139248 99612780 91075972
6730I1075972q888835q586316q012449p235143o188048n132530m392468l473585
$$ 91075972 82187137 73600821 65588372 58353229 52165181 47032651 42640183 39166598
6722C9166598k942634k281714k027108j659583j412582j710209j987317j996150
$$ 39166598 36223964 33942250 31915142 30255559 28842977 27132768 25145451 23149301
6714B3149301j847863j700053j395350j223627j201321j048321p87479q66632
$$ 23149301 21301438 19601385 18206035 16982408 15781087 14732766 13945287 13078655
6706A3078655q77884o26599m92729l47516m57031k89672k60771l05271l54484
$$ 13078655 12200771 11574172 11081443 10733927 10276896 9987224 9726453 9421182 9066698
6697I066698k63486j34461j08662l07606l61737k78197j00700k23797k72319k22537
$$ 9066698 8803212 8668751 8560089 8252483 7890746 7612549 7511849 7288052 7015733 6793196
6687F793196k97003l41620j45372k09742j45396j04294l27153j33060j05970j12360
$$ 6793196 6496193 6154573 6009201 5799459 5654063 5549769 5222616 5089556 4983586 4871226
6677D871226r5543n4573j06507q4085r0088l6768l1402p0972j66739n3094j31103
$$ 4871226 4775683 4721110 4614603 4530518 4440430 4403662 4372260 4301288 4134549 4081455 3950352
6666C950352j26612Q1156j87155k58580j22868l8879j1852N152r749p9446p904
$$ 3950352 3823740 3904896 3717741 3459161 3336293 3297414 3285562 3290714 3280965 3201519 3193615
6655C193615j11651o9307j07807o973o2374o3269J15282m7420q5909L8539P7652
$$ 3193615 3081964 3012657 2904850 2897877 2835503 2772234 2887516 2840096 2754187 2792726 2870378
6644B870378m7414l6264J1560m5328k4526J19631K3458j20142J16121j72265R4746
$$ 2870378 2822964 2786700 2798260 2752932 2728406 2848037 2871495 2751353 2867474 2695209 2789955
6633B789955k0158o3384Q0550p2094N9764N2105j64459J39814m6230m040m8020
$$ 2789955 2769797 2706413 2786963 2714869 2774633 2826738 2662279 2802093 2755863 2751823 2703803
6622B703803j917J01540J3531o8254j1024L8934OJ91412j3521n982r0992j8151
$$ 2703803 2701886 2803426 2816957 2748703 2737679 2776613 2776619 2968031 2954510 2948528 2857536 2839385
6610B839385N1533N7334o9879j61991m6781J78747N4466J7324q9075k5662N2493
$$ 2839385 2890918 2948252 2878373 2716382 2669601 2848348 2902814 2920138 2831063 2805401 2857894
6599B857894p1235K8867j65523k61J18598L7209k488j43229k4302J54286k0955
$$ 2857894 2786659 2815526 2650003 2649742 2768340 2805549 2803061 2659832 2635530 2789816 2768861
6588B768861j20273N0579J22739k6944k3077Q6061l2920j69873o9913J10427q3134
$$ 2768861 2648588 2699167 2821906 2794962 2771885 2857946 2825026 2655153 2585240 2695667 2612533
6577B612533j1819j4779p1283k2135P2176k6515o4337M3129l1457J05041N6908
$$ 2612533 2600714 2585935 2514652 2492517 2564693 2538178 2473841 2516970 2485513 2590554 2647462
6566B647462K3384n4709n4912r0500m3716M8982n5561l7679J41320L5884P3246
$$ 2647462 2670846 2616137 2561225 2470725 2427009 2475991 2420430 2382751 2524071 2559955 2633201
6555B633201N9768j51109o6429Q8289J26368j4219K9875J04884J27830k4267j42312
$$ 2633201 2692969 2541860 2475431 2563720 2690088 2675869 2705744 2810628 2938458 2914191 2771879
6544B771879J7736J36545k7761K01624k8106k08594Q4953Q6426J1357l0345k7315
$$ 2771879 2789615 2926160 2898399 3100023 3071917 2863323 2948276 3034702 3046059 3015714 2988399
6533B988399n0856K42841J05146j8860O1443K0590M9470P0442J0702N7889R4968
$$ 2988399 2937543 3180384 3285530 3266670 3328113 3348703 3398173 3468615 3479317 3537206 3632174
6522C632174K93345J81716j05J79118L82765J97067J73146L86302L38891K06933
$$ 3632174 3925519 4107235 4107130 4286248 4669013 4866080 5039226 5425528 5764419 5971352
6512E971352R7365J87335J43870k3092j2985j75352l30889j18518l2187j96342
$$ 5971352 6068717 6256052 6399922 6376830 6363845 6188493 5857604 5739086 5706899 5510557
6502E510557k24818o4225j76486O68k0355r7961j14614k7106L4164O7939j0144
$$ 5510557 5285739 5221514 5045028 5045696 5025341 4927380 4812766 4785660 4819824 4887763 4877619
6491D877619l3358Q0641Q6652j9327n640j04110p7149n5636R033j70212J2340
$$ 4877619 4844261 4924902 5011554 4992227 4986587 4882477 4805328 4749692 4758725 4588513 4600853
6480D600853q3413q5373K3817q6503j48037p8526J0320K0192o815p1507p6877
$$ 4600853 4517440 4432067 4455884 4369381 4221344 4142818 4153138 4173330 4166515 4095008 4018131
6469D018131j6466j5839k6639K3534j14294j82085K8043J2146j06330r9229j1320
$$ 4018131 4001665 3985826 3959187 3982721 3868427 3686342 3714385 3726531 3620201 3520972 3509652
6458C509652l8774p9436L4728k9284k6421l6466J00307m84k1230o0126j9559K551
$$ 3509652 3470878 3391442 3426170 3396886 3370465 3333999 3434306 3433822 3412592 3352466 3332907 3335458
6446C335458o9800N6435j391J83878K4816j59989o9256j03045j0050p9312l4781
$$ 3335458 3265658 3322093 3320702 3504580 3529396 3369407 3300151 3197106 3187056 3107744 3072963
6435C072963L1863M8478j29224J904J22221Q3476N811o049L5576j33461M2014
$$ 3072963 3104826 3153304 3024080 3025984 3148205 3231681 3237492 3231443 3267019 3133558 3175572
6424C175572L8603m7198j8011j21591J647J08037R6382M2532P9269M4509j002
$$ 3175572 3214175 3166977 3148966 3027375 3029022 3137059 3233441 3275973 3355242 3399751 3398749
6413C398749r2768Q1771R9277j09170K3033L6779J5241J18678P2382J37691l9241
$$ 3398749 3305981 3387752 3487029 3377859 3400892 3437671 3452912 3571590 3643972 3781663 3742422
6402C742422J1502J6775J8123p5025L2087L3207O2670R2006K5240o8993J37099
$$ 3742422 3753924 3770699 3788822 3713797 3745884 3779091 3841761 3933767 3959007 3890014 4027113
6391D027113J63397Q2692J04957N5381p7015l2392m2778J4968P3275J99623J68508
$$ 4027113 4190510 4273202 4378159 4433540 4356525 4324133 4281355 4296323 4369598 4569221 4737729
6380D737729M3387O7644J7072k3164R7127O5339J45052N4767K0410N2377O2880
$$ 4737729 4781116 4848760 4865832 4842668 4939795 5005134 5150186 5204953 5225363 5277740 5340620
6369E340620R3546J46693J09716n0482J87352n0479J55418O1015J24355J10329
$$ 5340620 5434166 5580859 5690575 5640093 5827445 5776966 5932384 5993399 6117754 6228083
6359F228083J13864J52971j7318N1988J50236J37365J15646K02438J85728J41235
$$ 6228083 6341947 6494918 6477600 6529588 6679824 6817189 6932835 7135273 7321001 7462236
6349G462236J1492j7642J25192P6473L13383J82828J5768J63811J45948J73468
$$ 7462236 7473728 7456086 7581278 7657751 7971134 8153962 8169730 8333541 8479489 8652957
6339H652957J12497K01762K89357K32485J83507J48039L15311J46055J3319L01186
$$ 8652957 8765454 8967216 9256573 9489058 9672565 9820604 10135915 10281970 10295289 10596475
6329A0596475J92850K05685K59328J88843J74841M12112M49929L32297L19837
$$ 10596475 10789325 10995010 11254338 11443181 11618022 12030134 12480063 12812360 13132197
6320A3132197L67416N32275L47330N91413N75120O27291O35626P83818R29855
$$ 13132197 13499613 14031888 14379218 14970631 15545751 16173042 16808668 17592486 18522341
6311A8522341Q48015P16842R15718R85930P08899P60468N46681N04207N24313
$$ 18522341 19370356 20087198 21002916 21988846 22697745 23458213 24004894 24509101 25033414
6302B5033414M44817M41436M67244M31846N08202M61187L84258L20824K52850
$$ 25033414 25478231 25919667 26386911 26818757 27326959 27788146 28172404 28493228 28746078
6293B8746078M08083P19493O78933Q95809J034735J098266J493677J460547J490180
$$ 28746078 29154161 29873654 30552587 31448396 32483131 33581397 35075074 36535621 38025801
6284C8025801J398309J138646J338588J271776J172314J422485J441737J529848
$$ 38025801 39424110 40562756 41901344 43173120 44345434 45767919 47209656 48739504
6276D8739504J093241N93502j19929j184098j752233k056236j869250j516794
$$ 48739504 49832745 50426247 50306318 49122220 47369987 45313751 43444501 41927707
6268D1927707j313692o48982j89144n789M65312O18709Q60463J259305J237227
$$ 41927707 40614015 39965033 39775889 39770100 40235412 40854121 41714584 42973889 44211116
6259D4211116J369546J491734J490090J181651N11790M4335l13259q30677j373396
$$ 44211116 45580662 47072396 48562486 49744137 50255927 50300262 49987003 49156326 47782930
6250D7782930k113959k219137k034611j904404j896991j465625j100494j020462
$$ 47782930 45668971 43449834 41415223 39510819 37613828 36148203 35047709 34027247
6242C4027247q35322q42029n71415k06863k17312k50588p7684J83860J06254K06220
$$ 34027247 33191925 32349896 31778481 31571618 31354306 31103718 31026034 31209894 31316148 31522368
6232C1522368K72422L85701O53913O09233O88648Q87193Q61679J093067J059973
$$ 31522368 31794790 32180491 32834404 33443637 34132285 35019478 35881157 36974224 38034197
6223C8034197J009258J236354J449993J419450J317072J515405J640464J664871
$$ 38034197 39043455 40279809 41729802 43149252 44466324 45981729 47622193 49287064
6215D9287064J894040J794501J589069J287565Q26176M37994q8389l91194p46930
$$ 49287064 51181104 52975605 54564674 55852239 56678415 57116409 57028020 56636826 55889896
6206E5889896r05261j127340o50804n49178k03788k3202L30935M90561Q53771
$$ 55889896 54984635 53857295 53206491 52657313 52453525 52430323 52761258 53251819 54105590
6197E4105590J172979J311870J443424J941814K016606K103500K123601J540619
$$ 54105590 55278569 56590439 58033863 59975677 61992283 64095783 66219384 67760003
6189F7760003Q67425K79728k62301n84317q33763r91740r03489q12446n51585
$$ 67760003 68627428 68907156 68644855 68060538 67226775 66235035 65331546 64519100 63967515
6180F3967515l14695j5160J80497K91280M45149P33434J137310J604860K186203
$$ 63967515 63652820 63637660 63818157 64109437 64554586 65288020 66425330 68030190 70216393
6171G0216393K368962L008741L665496L845985M302272M639227M693435M731692
$$ 70216393 72585355 75594096 79259592 83105577 87407849 92047076 96740511 101472203
6163A01472203M822415M981513N305045N333532M956644M051871K698550N49042
$$ 101472203 106294618 111276131 116581176 121914708 126871352 130923223 133621773 134170815
6155A34170815k378295m769935o549823p565061q100839q243016p740343p232285
$$ 134170815 131792520 127022585 120472762 112907701 104806862 96563846 88823503 81591218
6147H1591218o203326n596787m979737m325318l709240l335996l164508k824700
$$ 81591218 75387892 69791105 64811368 60486050 56776810 53440814 50276306 47451606
6139D7451606k436431k330323j943566j849103j721180j397857j468402j246827
$$ 47451606 45015175 42684852 40741286 38892183 37171003 35773146 34304744 33057917
6131C3057917j323755j205433j024278j044384q91457j006698r45376n67935n40132
$$ 33057917 31734162 30528729 29504451 28460067 27568610 26561912 25616536 25048601 24508469
6122B4508469n92602o61013n80213m55855n61073m45741l48852l35047m83621
$$ 24508469 23915867 23254854 22674641 22218786 21657713 21211972 20863120 20528073 20044452
6113B0044452m47032m12173l33369k68752j71531m09516l33704k59179k13949
$$ 20044452 19597420 19185247 18851878 18583126 18411595 18002079 17668375 17409196 17195247
6104A7195247l26832l56304m06429k20807j54206k28086k20054r9730l33988l90905
$$ 17195247 16868415 16512111 16105682 15884875 15730669 15502583 15282529 15182799 14848811 14457906
6094A4457906k37285k36197j54953k69417r4243j30178k02231j12361k17047r7697
$$ 14457906 14220621 13984424 13829471 13560054 13465811 13335633 13133402 13021041 12803994 12706297
6084A2706297j04144j26011j32616j98216j17169j33615j03551j31751p5113M1506
$$ 12706297 12602153 12476142 12343526 12145310 12028141 11894526 11790975 11659224 11584111 11625617
6074A1625617j64835k70815J7708P3595k12950j87667K5955j30998l7340j90732
$$ 11625617 11460782 11189967 11207675 11281270 11068320 10880653 10906608 10775610 10738270 10547538
6064A0547538j06548p5552o3302k10206r0045o2146N3683m5676m7607p2357k7569
$$ 10547538 10440990 10365438 10302136 10091930 10001885 9939739 9993422 9947746 9900139 9827782 9800213
6053I800213O5207j12631K4675p095K2158j01231P363M9550o1340Q1800J99481
$$ 9800213 9865420 9752789 9777464 9770369 9792527 9691296 9698659 9748209 9686869 9768669 9968150
6042I968150j10685j20511n3888j0880o4323j6393L4010m3157l6424J05890M3473
$$ 9968150 9857465 9736954 9683066 9672186 9607863 9591470 9625480 9582323 9545899 9651789 9695262
6031I695262J7973J0719R6299L3310q0906R199j69327O2722O9204J5118J02639
$$ 9695262 9713235 9723954 9820253 9853563 9772657 9781856 9612529 9675251 9744455 9759573 9862212
6020I862212J04149j7159Q5993K8371K4645k4493J00981J01076N4355J47170k8864
$$ 9862212 9966361 9949202 10035195 10063566 10088211 10063718 10164699 10265775 10320130 10467300 10438436
6009A0438436J53361Q4473q4478l6297m5750Q8368P2297R7483Q2635m1541j50333
$$ 10438436 10591797 10676270 10591792 10555495 10509745 10598113 10670410 10767893 10850528 10808987 10658654
5998A0658654N8852J50879J22044K09889K6190K5538J92719m848m9503K08224
$$ 10658654 10717506 10868385 10990429 11200318 11226508 11252046 11444765 11439917 11390414 11598638
5988A1598638Q9235K36743J42296l7875K16707N7649P4140K02278K26294M8007
$$ 11598638 11687873 11924616 12066912 12029037 12245744 12303393 12377533 12579811 12806105 12854112
5978A2854112J00682J28669P5868J70876L60060Q6680J57277K03398O0325J50081
$$ 12854112 12954794 13083463 13159331 13330207 13690267 13776947 13934224 14137622 14197947 14348028
5968A4348028K92013K99828K35814L14127K01541J38334L02015L49949J88758
$$ 14348028 14640041 14939869 15175683 15489810 15691351 15829685 16131700 16481649 16670407
5959A6670407M12308M15134M82506N67928N65380P14416M68045O94733O54920
$$ 16670407 17082715 17497849 17980355 18548283 19113663 19828079 20296124 20990857 21645777
5950B1645777M83023N94876O61331Q43725Q02907P92427P02952P09197O58416
$$ 21645777 22128800 22723676 23385007 24228732 25031639 25824066 26527018 27236215 27894631
5941B7894631N04781K67008J83272m4560r363j14664j53189k16126L7030O0466
$$ 27894631 28399412 28666420 28849692 28805132 28795769 28681105 28527916 28311790 28348820 28409286
5931B8409286m4561L8563K29499L37757N77277N43554K25235M29782N35210N85362
$$ 28409286 28364725 28403288 28632787 28970544 29547821 30091375 30316610 30746392 31281602 31866964
5921C1866964O59976P14583N95890N81287O71912P12227L31243R8248M1525l65744
$$ 31866964 32526940 33241523 33837413 34418700 35090612 35802839 36134082 36232330 36273855 35908111
5911C5908111p56256r09212r19520j107650r15721p83743m20250m99209l53625
$$ 35908111 35151855 34242643 33323123 32215473 31299752 30516009 30095759 29596550 29242925
5902B9242925k45182k76986j48051j71432m6159N5348J07396O3637P7847O1875
$$ 29242925 28997743 28720757 28572706 28401274 28355115 28410463 28517859 28581496 28659343 28721218
5892B8721218l4036j04757j41387k11609m67544o33247p28185p22896p61889o41422
$$ 28721218 28687182 28582425 28441038 28229429 27761885 27128638 26400453 25677557 24915668 24274246
5882B4274246p05630p86740m97087m96483m66066k98454k01122m01114l62763
$$ 24274246 23568616 22781876 22284789 21788306 21322240 21023786 20822664 20421550 20058787
5873B0058787k26187k74999j75445j79909k40249j15445k3834M0175j60169k30833
$$ 20058787 19832600 19557601 19382156 19202247 18961998 18846553 18822719 18862894 18702725 18471892
5863A8471892n2290M1800j78880j18573L6433O1818p5501n3888m7927Q7007M0220
$$ 18471892 18419602 18461402 18282522 18163949 18200382 18262200 18186699 18132811 18084884 18171891 18212111
5852A8212111J21068O9460j07686j9162J0942j42995m7053O234J08481Q050l7785
$$ 18212111 18333179 18402639 18294953 18275791 18286733 18143738 18096685 18102919 18211400 18219450 18181665
5841A8181665k3815K12981O4446R1069L29281p9282j54409q7027K73427J13481
$$ 18181665 18157850 18370831 18435277 18526346 18855627 18776345 18621936 18534909 18808336 18921817
5831A8921817j06038P7368P7083O1938J70183p85J03160J14844M1538l6550J7876
$$ 18921817 18815779 18893147 18970230 19032168 19202351 19201566 19304726 19419570 19461108 19424558 19442434
5820A9442434J31911J43021j5388J06027R3908O4164K0643K21568J49145p6001
$$ 19442434 19574345 19717366 19701978 19808005 19901913 19966077 19986720 20208288 20357433 20281432
5810B0281432K33432R2906q043J5985P7547J32396J82912Q6841J08540J10472
$$ 20281432 20514864 20607770 20599727 20615712 20693259 20825655 21008567 21095408 21203948 21314420
5800B1314420J54111R6887R6998J35599J19509K5385R8560K5270J77489M5723
$$ 21314420 21468531 21565418 21662416 21798015 21917524 21942909 22041469 22066739 22244228 22289951
5790B2289951O4112J13680R3291J85828J82113K6343J46911J89397J83934J22788
$$ 22289951 22354063 22467743 22561034 22746862 22928975 22955318 23102229 23291626 23475560 23598348
5780B3598348K09106J55910J481K63574O1119J66352Q0752K77753J45135J41602
$$ 23598348 23807454 23963364 23964845 24228419 24289538 24455890 24536642 24814395 24959530 25101132
5770B5101132J4427N4111J79360J17052L55285K26310J60256J34011K23377L47925
$$ 25101132 25115559 25169670 25349030 25466082 25821367 26047677 26207933 26341944 26565321 26913246
5760B6913246K01786J49911L20176J21710K68892K40521L16655K40818J66209
$$ 26913246 27115032 27264943 27585119 27706829 27975721 28216242 28532897 28773715 28939924
5751B8939924L80638J55182K69800N9462J28465L3984K56307K03348o822J86753
$$ 28939924 29320562 29475744 29745544 29805006 29933471 29967455 30223762 30427110 30420288 30607041
5741C0607041L16536K49594K48925K25618J3692K08610K53832J95235J93016K68487
$$ 30607041 30923577 31173171 31422096 31647714 31661406 31870016 32123848 32319083 32512099 32780586
5731C2780586L82536L19587J27579J05722J97700L88157L05272L09890L14012
$$ 32780586 33163122 33482709 33610288 33716010 33913710 34301867 34607139 34917029 35231041
5722C5231041L90440K73734Q8607J19565j0069j72368q0581J71098J08309m2521
$$ 35231041 35621481 35895215 35983822 36103387 36093318 35920950 35840369 36011467 36119776 36077255
5712C6077255R59J33464K37574K05688K11282Q9521J21245J21765J5479J83721
$$ 36077255 36078214 36211678 36449252 36654940 36866222 36955743 37076988 37198753 37214232 37397953
5702C7397953L65629R9811R8553Q126J23917M22066J96411J99922J42162L16543
$$ 37397953 37763582 37863393 37961946 37970072 38093989 38516055 38712466 38912388 39054550 39371093
5692C9371093J92418J12494L94100J82731j4356o875J2970K16471P5771K34640
$$ 39371093 39563511 39676005 40070105 40252836 40238480 40231605 40244575 40461046 40536817 40771457
5682D0771457L33234J48495J38083K01661J44704K20176K47787L24202K74576
$$ 40771457 41104691 41253186 41391269 41592930 41737634 41957810 42205597 42529799 42804375
5673D2804375M74785K91893K15182L3098L22281K72983K03391K32777J22878L06091
$$ 42804375 43279160 43571053 43786235 43819333 44141614 44414597 44617988 44850765 44973643 45279734
5663D5279734K73940K08961K94590K30823M07892M20834P9317L82502K35906L90419
$$ 45279734 45553674 45762635 46057225 46288048 46695940 47116774 47196091 47578593 47814499 48204918
5653D8204918M38232L89987L94658M42816L90055K01139M32632N35844L97537
$$ 48204918 48643150 49033137 49427795 49870611 50260666 50461805 50894437 51430281 51827818
5644E1827818L68401L63417M77536O50863P31235P56872O11576M65064O80282
$$ 51827818 52196219 52559636 53037172 53688035 54419270 55176142 55787718 56252782 56933064
5635E6933064Q22384J010564Q81861R90429R61214Q77566O57826L64591M15625
$$ 56933064 57755448 58766012 59647873 60638302 61599516 62477082 63134908 63499499 63915124
5626F3915124L23750L62118L77868M13220P36711M94926Q41256J059025J175562
$$ 63915124 64238874 64600992 64978860 65392080 66128791 66623717 67464973 68523998 69699560
5617F9699560J198413J359706J440084J588277J691075J761583J767496J965859
$$ 69699560 70897973 72257679 73697763 75286040 76977115 78738698 80506194 82472053
5609H2472053K047774K157375K080935J763612J495585J614565J686208J675743
$$ 82472053 84519827 86677202 88758137 90521749 92017334 93631899 95318107 96993850
5601I6993850J782693J904334K353065K262302J123828L12533Q23285Q32762J068959
$$ 96993850 98776543 100680877 103033942 105296244 106420072 106732605 107555890 108388652 109457611
5592A09457611J118389J629326K328071K698711L017897L368916L997037M365952
$$ 109457611 110576000 112205326 114533397 117232108 120250005 123618921 127615958 131981910
5584A31981910M648693M918443N213818N156539N016894M948140M753724M659977
$$ 131981910 136630603 141549046 146762864 151919403 156936297 161884437 166638161 171298138
5576A71298138M581483M224840L771220L362226K825667J961647J028022l18743
$$ 171298138 175879621 180104461 183875681 187237907 190063574 192025221 193053243 192734500
5568A92734500j029158q74976r18922j829546k221370j269901p63441m49683j81033
$$ 192734500 191705342 190830366 189911444 188081898 185860528 184590627 183827186 183377503 183196470
5559A83196470O49220J071320J407057J490041J694631J745114J155697M95887
$$ 183196470 183845690 184917010 186324067 187814108 189508739 191253853 192409550 192905437
5551A92905437m46964j678342k945980l836602m228246m525284m971717n381164
$$ 192905437 192458473 190780131 187834151 183997549 179769303 175244019 170272302 164891138
5543A64891138n665596o185958o318074o182649n765569n636331n023856m436990
$$ 164891138 159225542 153039584 146721510 140538861 134773292 129136961 124113105 119676115
5535A19676115m005315l920550m101578l564905l217861l394386k944465k574601
$$ 119676115 115670800 111750250 107648672 104083767 100865906 97471520 94527055 91952454
5527I1952454k258797j976787j671478j501569j338889j092475n29746m08446
$$ 91952454 89693657 87716870 86045392 84543823 83204934 82112459 81582713 81174267
5519H1174267l85092k300J92431N22879N82170J136031J440837J596844J979286
$$ 81174267 80789175 80786875 80979306 81502185 82084355 83220386 84661223 86258067 88237353
5510H8237353K259789K621445L177871L447044L797950L818169L879902L939618
$$ 88237353 90497142 93118587 96296458 99743502 103541452 107359621 111239523 115179141
5502A15179141L971441L499304L126834K717086K003840J232010L15914j023764
$$ 115179141 119150582 122649886 125776720 128493806 130497646 131729656 132045570 131021806
5494A31021806k174819l294911m056719m359596m787501m799323m864504n032994
$$ 131021806 128846987 125552076 121495357 117135761 112348260 107548937 102684433 97651439
5486I7651439m936272m796750m539534m369909l811059l456634l434676l178893
$$ 97651439 92715167 87918417 83378883 79008974 75197915 71741281 68306605 65127712
5478F5127712k710102k426931k293703k155941j860970j872355j635256j413747
$$ 65127712 62417610 59990679 57696976 55541035 53680065 51807710 50172454 48758707
5470D8758707j302904j345373j255026r48905r95768r60999p53007n26430n40609
$$ 48758707 47455803 46110430 44855404 43906499 42910731 41949732 41196725 40670295 40129686
5461D0129686o29504n25260n83166o77530l51929m20666n61826l86806m62475
$$ 40129686 39500182 38974922 38391756 37714226 37362297 36941631 36379805 35992999 35530524
5452C5530524n88408o23458o71920o63021p50263n40023n07021p55663o52142
$$ 35530524 34942116 34318658 33646738 32983717 32233454 31693431 31186410 30430747 29778605
5443B9778605m41150n02199m53052m66220l98370l10597k82813l78507j92460
$$ 29778605 29337455 28835256 28382204 27915984 27517614 27207017 26924204 26545697 26353237
5434B6353237k31782k65471l38031j96934j82307l21400j89390o9333k24213l23929
$$ 26353237 26121455 25855984 25517953 25321019 25138712 24817312 24627922 24558589 24334376 24010447
5424B4010447k23190j45579j90161j67330k49957k35249k02795j83087M2656j16015
$$ 24010447 23787257 23641678 23451517 23284187 23034230 22798981 22596186 22413099 22455755 22339740
5414B2339740k85091J8945O0187N3724l3499K9555M7763j60187R4502M4098j19952
$$ 22339740 22054649 22073594 22133781 22187505 22154006 22183561 22231324 22071137 22165639 22209737 22089785
5403B2089785j24700j8278M807p0158j23510J42525l4292j27988k6358j08400
$$ 22089785 21965085 21946807 21951614 21881456 21757946 21900471 21866179 21738191 21711833 21603433
5393B1603433m0179J26120O4502Q9993R0700j11688j6414J41702J74469m521R7952
$$ 21603433 21563254 21689374 21753876 21843869 21934569 21822881 21806467 21948169 22122638 22118117 22216069
5382B2216069K61979O0673J65910K68477L07928N19925M97659O52370P88584P36853
$$ 22216069 22478048 22538721 22704631 22973108 23281036 23800961 24298620 24950990 25739574 26476427
5372B6476427N90626Q34619J069409J103800R58541O44307O69044P09951N37566
$$ 26476427 27067053 27901672 28971081 30074881 31033422 31677729 32346773 33056724 33594290
5363C3594290L07168M52530K86275L65030M54368L42221M75184L99116L99537
$$ 33594290 33901458 34353988 34640263 35005293 35459661 35801882 36277066 36676182 37075719
5354C7075719P40339R11640J039671J368003J809239K232576K825951L299551
$$ 37075719 37816058 38727698 39767369 41135372 42944611 45177187 48003138 51302689
5346E1302689M239515N382296N428764L702747L253509K768860M216264O166549
$$ 51302689 55542204 60924500 66353264 70056011 73309520 76078380 80294644 86461193
5338H6461193P849018Q389791R304935J1067641J4462720L247305j3723884j1121334
$$ 86461193 94310211 102700002 112004937 123072578 137535298 140782603 127058719 115937385
5330A15937385r433463j1263681j2690926j1946434r358919o863002n144825m135459
$$ 115937385 106503922 95240241 82549315 70602881 61243962 54380960 49236135 45100676
5322D5100676l296430k891402k532694k175502j887545j738670j612586j537190
$$ 45100676 41804246 38912844 36380150 34204648 32317103 30578433 28965847 27428657
5314B7428657j321812j193548j045239j036320r24276p25151p82889p87256n35613
$$ 27428657 26106845 24913297 23868058 22831738 21907462 21182311 20399422 19612166 19076553
5305A9076553p21905n30256k83473l92204l89447l92304m45531k67265k25075
$$ 19076553 18354648 17824392 17540919 17148715 16759268 16366964 15921433 15654168 15429093
5296A5429093k82615l25501k27392k44724k73949p4694k84881l15081k97387j57092
$$ 15429093 15146478 14820977 14593585 14348861 14074912 14000218 13715337 13400256 13102869 12945777
5286A2945777j95248k78085j56098j51018j41786p2307k13457j74538n2976q5713
$$ 12945777 12750529 12472444 12316346 12165328 12023542 11951235 11737778 11563240 11510264 11424551
5276A1424551O6580o8057k6660j54004k57191j34213p739k84895n1173J79754
$$ 11424551 11491131 11423074 11396414 11242410 10985219 10851006 10843267 10558372 10507199 10686953
5266A0686953p0694k03673o8187R3135l9727j77828j47943r6228N5577j129j80042
$$ 10686953 10616259 10412586 10344399 10437534 10397807 10219979 10072036 9975808 10031385 10030256 9850214
5255I850214j19149M9705k1993p9882l5260q8305k3889N355n8192k2192j3027
$$ 9850214 9731065 9780770 9758777 9678895 9643635 9555330 9531441 9536796 9478604 9456412 9443385
5244I443385k9415j35736j6878j5051R0336o4670k9443n3708m3881k0678k11542
$$ 9443385 9413970 9278234 9261356 9246305 9336641 9271971 9242528 9188820 9144939 9124261 8912719
5233H912719j13569M3493J5617N8978j17255j22712M0195K1548j46067m8336J09638
$$ 8912719 8799150 8842643 8858260 8917238 8799983 8677271 8717466 8739014 8592947 8544611 8654249
5222H654249m6325L502q3452J26163r8257p7291N9064r4011j08361N693K7301
$$ 8654249 8607924 8611426 8527974 8654137 8555880 8478589 8537653 8443642 8335281 8340974 8368275
5211H368275J02265j3274L6524J06372k911o2544O1015n9588J8925m8566l348
$$ 8368275 8470540 8457266 8493790 8600162 8597251 8534707 8595722 8536134 8555059 8506493 8503145
5200H503145q27M7676J39398Q1960J4641L2998k3915R7242J05582j4073j062o1089
$$ 8503145 8502318 8549994 8689392 8771352 8785993 8818991 8795076 8892318 8997900 8983827 8982765 8921676
5188H921676j9056J07119J78679r5581l796j24062R3087n4688P5551K3957J11800
$$ 8921676 8902620 9009739 9188418 9092837 9089041 8964979 9058066 9003378 9078929 9102886 9214686
5177I214686J33006K9777J12165P5254Q6439l5985L9317L19095J22488J30723
$$ 9214686 9347692 9377469 9489634 9564888 9651327 9615342 9654659 9973754 10096242 10226965
5167A0226965m6261j80504m3110k6502R6211o3243p2971k85356j05261Q8509N1934
$$ 10226965 10180704 10000200 9957090 9930588 10026799 9963556 9890585 9605229 9499968 9588477 9640411
5156I640411Q4482P1620p7047J3134J68076l6593j21965M188J21005l9924j48296
$$ 9640411 9724893 9796513 9719466 9732600 9900676 9864083 9742118 9746306 9867311 9827387 9679091
5145I679091m6290m4722j21661O1632n3427K5872K00812J07746J21744P6211J6141
$$ 9679091 9632801 9588079 9466418 9528050 9474623 9500495 9701307 9809053 9930797 10007008 10023149
5134A0023149K3152j6393Q2638J98716K3792M0387K09416J51368J52734J49463
$$ 10023149 10046301 10029908 10112546 10311262 10335054 10375441 10584857 10736225 10888959 11038422
5124A1038422J92341K63483J65949O4635o8082p048J38731J28750J29136J83101
$$ 11038422 11230763 11494246 11660195 11724830 11656748 11649700 11788431 11917181 12046317 12229418
5114A2229418q31P4516J7764R3135O0714P6761P3509n3331q3636L804j66523j93374
$$ 12229418 12228587 12303103 12320867 12414002 12474716 12551477 12624986 12571655 12488019 12491823 12325300 12131926
5102A2131926N4709J20281q6051j4112J74662p4475J26955K65788K5192L07730
$$ 12131926 12186635 12306916 12220865 12206753 12381415 12306940 12433895 12699683 12724875 13032605
5092A3032605J22946M8465J86475J10343k22157n5488N5812k17508M7078J97955
$$ 13032605 13155551 13204016 13390491 13500834 13278677 13223189 13279001 13061493 13108571 13306526
5082A3306526L4125j40250J7430l9332j02598j45169J5841m7644j11368L3687
$$ 13306526 13340651 13200401 13217831 13178499 13075901 12930732 12946573 12898929 12787561 12821248
5072A2821248j55850M5876J76808N3503N7613j03078l9295J39150J97604N2248
$$ 12821248 12665398 12711274 12888082 12941585 12999198 12896120 12856825 12995975 13193579 13245827
5062A3245827R110M4085R274K08878J06267m9900P7767K41683p500p4475O1505
$$ 13245827 13254937 13299022 13308296 13517174 13623441 13573541 13651308 13892991 13885491 13811016 13872521
5051A3872521n2943Q5867J2298K9830l8599K6739N5002Q157o9749P900q4809m9376
$$ 13872521 13819578 13905445 13917743 13947573 13908974 13935713 13990715 13998872 13929123 13937023 13852214 13802838
5039A3802838k5699J2066P712J4057J62162P8543R9867L9215j58265R6404P8024
$$ 13802838 13777139 13789205 13796917 13810974 13973136 14051679 14151546 14190761 14032496 14128900 14206924
5028A4206924K09232J00447l2543J40752O7231R4319J64111P9504P3382J60177
$$ 14206924 14416156 14516603 14484060 14624812 14692043 14786362 14950473 15029977 15103359 15263536
5018A5263536K46177J54003J10150J71909J16984L06222J32489J68992N6824J57826
$$ 15263536 15509713 15663716 15773866 15945775 16062759 16368981 16501470 16670462 16727286 16885112
5008A6885112J91198J86906J58535K87056P4670K01892K72610L84394L65391K02711
$$ 16885112 17076310 17263216 17421751 17708807 17783477 17985369 18257979 18642373 19007764 19210475
4998A9210475L61453J65870J96046N23238L94703K34282M20912M26548L93063
$$ 19210475 19571928 19737798 19933844 20457082 20851785 21086067 21506979 21933527 22326590
4989B2326590L95599L87696M43868L48923M23378N27088M82195M45848N3201J71148
$$ 22326590 22722189 23109885 23553753 23902676 24326054 24853142 25335337 25781185 25834386 26005534
4979B6005534K42263J73374K85486L63974M68179N35347M94856M38376N68106
$$ 26005534 26247797 26421171 26706657 27070631 27538810 28074157 28569013 29007389 29575495
4970B9575495N50156N41316N04982M94245M83985M55935M91174L82454K18599
$$ 29575495 30125651 30666967 31171949 31666194 32150179 32606114 33097288 33479742 33698341
4961C3698341J94121R6083Q5420Q6287j0911O6174m8584J16779L36460K59943
$$ 33698341 33892462 33988545 34073965 34160252 34149341 34215515 34166931 34283710 34620170 34880113
4951C4880113J74004L51749L11172L79766M39362L77576O15626N30672O05165
$$ 34880113 35054117 35405866 35717038 36096804 36536166 36913742 37529368 38060040 38665205
4942C8665205O53456O20388O32759O61771N19934M85099O40900M14817N69812
$$ 38665205 39318661 39939049 40571808 41233579 41753513 42238612 42879512 43294329 43864141
4933D3864141M70592N60129P04453M84635N66095Q98484O83200P91594Q02398
$$ 43864141 44334733 44894862 45599315 46083950 46650045 47548529 48231729 49023323 49825721
4924D9825721P88066O04701Q60306R75572Q19512P61303Q00919Q70783P54801
$$ 49825721 50613787 51218488 52078794 53054366 53873878 54635181 55436100 56306883 57061684
4915E7061684Q52730Q88038Q36784R65271J204857J164173J390264J658528J959606
$$ 57061684 57914414 58802452 59639236 60604507 61809364 62973537 64363801 66022329 67981935
4906F7981935K286150K439316K696464L310589L458099M119682M762485N191859
$$ 67981935 70268085 72707401 75403865 78714454 82172553 86292235 91054720 96246579
4898I6246579N897109O537309P404428P889570Q427212Q737999R155322Q810655
$$ 96246579 102143688 108680997 116085425 123974995 132402207 141140206 150295528 159106183
4890A59106183Q220896P310806N882019L943413J095430j939520n158050p842933
$$ 159106183 167327079 174637885 180519904 184463317 185558747 183619227 178461177 170618244
4882A70618244r628351j0240139j0114336r474869q627090p716990o367043n414534
$$ 170618244 160989893 150749754 140635418 131160549 122533459 114816469 108449426 103034892
4874A03034892m561028l832072l262739k754566k513460k131488j996769j959078
$$ 103034892 98473864 94641792 91379053 88624487 86111027 83979539 81982770 80023692
4866H0023692k357611k420008k581264k284294k049929j837285j610808j386617
$$ 80023692 77666081 75246073 72664809 70380515 68330586 66493301 64882493 63495876
4858F3495876j131847j010213q70036q09121p84667n78475k37384k64779m15574
$$ 63495876 62364029 61353816 60483780 59674659 58889992 58311517 58074133 57809354 57393780
4849E7393780j61082j30797Q4043r8844j11357K8322J65286N9072J75191K17758
$$ 57393780 57232698 57101901 57185944 57087100 56975743 57004065 57169351 57228423 57403614 57621372
4839E7621372J43100L79665M11453L46143N62223O25850L05439M83697L68566
$$ 57621372 57764472 58144137 58555590 58901733 59463956 60089806 60395245 60878942 61247508
4830F1247508K55712M31826L73333M16598M81932M62275M80351L12642K86623
$$ 61247508 61503220 61935046 62308379 62724977 63206909 63669184 64149535 64462177 64748800
4821F4748800M41890M96470O62785Q91731R18141R55137J264742J297793J368050
$$ 64748800 65190690 65687160 66349945 67241676 68159817 69114954 70379696 71677489 73045539
4812G3045539J638407J520590J784407J915207J929763K043322J943235J910440
$$ 73045539 74683946 76204536 77988943 79904150 81833913 83877235 85820470 87730910
4804H7730910J823166J981481J805785J591090J469446J257623J335912J449471
$$ 87730910 89554076 91535557 93341342 94932432 96401878 97659501 98995413 100444884
4796A00444884J487968J381439J745867J966459J967531J895276J833381J813344
$$ 100444884 101932852 103314291 105060158 107026617 108994148 110889424 112722805 114536149
4788A14536149J606270J137886R14649O99316M37596J16363M6993K10158N4456
$$ 114536149 116142419 117280305 118194954 118894270 119331866 119448229 119495222 119705380 119759836
4779A19759836J8963K04374J18502L49549L51664K66697l32625j036770j700336
$$ 119759836 119778799 119983173 120101675 120451224 120802888 121069585 120736960 119700190 117999854
4770A17999854k244462k648089k693980k380449k097739j702699j250298q66068
$$ 117999854 115755392 113107303 110413323 108032874 105935135 104232436 102982138 102116070
4762A02116070k62146K2838K74767M80347Q88860J057259R91618R52881O69897
$$ 102116070 101853924 101876762 102151529 102631876 103520736 104577995 105569613 106522494 107192391
4753A07192391L48014k22411n40912j008416j454414j904469k241794k330295
$$ 107192391 107540405 107317994 106777082 105768666 104314252 102409783 100167989 97837694
4745I7837694k189081k224832k048644j833866j392050j083628o87735n92790
$$ 97837694 95648613 93423781 91375137 89541271 88149221 87065593 86377858 85785068
4737H5785068l76431M5682J17609M56481O32276O39286R13004J116493J172401
$$ 85785068 85408637 85454319 85571928 86028409 86660685 87299971 88212975 89329468 90501869
4728I0501869J259412J356679J301541J478441J393114J286994J192940Q66198
$$ 90501869 91761281 93117960 94419501 95897942 97291056 98578050 99770990 100637188
4720A00637188P28437M02594L88789J07377n0653j65784l48482j53729J65168
$$ 100637188 101365625 101768219 102157008 102264385 102213732 102047948 101699466 101545737 101710905
4711A01710905Q895J59665M32910P08967O73755N56447N01464M74835N14825L36543
$$ 101710905 101719800 101879465 102312375 103021342 103695097 104251544 104753008 105227843 105742668 106079211
4701A06079211Q3207L25185K05764n0884l11507l90484l84814n05254m79782l60466
$$ 106079211 106162418 106487603 106693367 106642483 106330976 105940492 105555678 105050424 104570642 104210176
4691A04210176m51241l98875k47419J42921K79444M52370J024383J466302J869679
$$ 104210176 103758935 103360060 103112641 103255562 103535006 103987376 105011759 106478061 108347740
4682A08347740K334205L439445M308465N146857O558706P832566Q618569P817826
$$ 108347740 110681945 114121390 118429855 123576712 130135418 137967984 146586553 154404379
4674A54404379Q213463J0428731J2006678J3682449J6871403J1273789n404383
$$ 154404379 162617842 173046573 185053251 198735700 215607103 226880892 221476509
4667B21476509j3904663j8334946j9967399j6904326j2648094r240799o849521
$$ 221476509 207571846 189236900 169269501 152365175 139717081 130476282 123626761
4660A23626761n090600l950665k805076k075083j901409j768261j138151r67081
$$ 123626761 118536161 114585496 111780420 109705337 107803928 106035667 104897516 103930435
4652A03930435p94971p29081n03589m17175k61262l01428m97834k94629J19934
$$ 103930435 103135464 102406383 101902794 101485619 101224357 100922929 100425095 100130466 100250400
4643A00250400M25244N57023O26658P82201J178358J433945J609049J756524K077331
$$ 100250400 100675644 101232667 101859325 102641526 103819884 105253829 106862878 108619402 110696733
4634A10696733K629309L015623L433684L823005M264537M545714N185889N942703
$$ 110696733 113326042 116341665 119775349 123598354 127862891 132408605 137594494 143537197
4626A43537197O652578P601545Q662647R677024J0731761J1777561J2901555J3752781
$$ 143537197 150189775 157791320 166453967 176130991 186862752 198640313 211541868 225294649
4618B25294649J3792882J2201222J0008801P892402O065363L053053j770058o787462
$$ 225294649 239087531 251288753 261297554 269189956 275255319 278308372 276538314 269750852
4610B69750852r158369r150719p561498m789174k479537r65056n00155j217899
$$ 269750852 260592483 251441764 243880266 239091092 236611555 235646499 235146344 233928445
4602B33928445k888215m756558n376282n185122m213513k203570j95596J776255
$$ 233928445 231040230 226283672 220907390 215722268 211508755 209305185 209109589 210885844
4594B10885844M064642N831585P189312Q186680Q823560R399493R360676P385924
$$ 210885844 214950486 220782071 227971383 236158063 244981623 254381116 263741792 271127716
4586B71127716J901992n811322j3148110j7514345j8680378j7516654j4932093
$$ 271127716 273029708 267218386 254070276 236555931 217875553 200358899 185426806
4579A85426806j2551589j0276792q257964p124917o033597n107069m449038l934047
$$ 185426806 172875217 162598425 154340461 147215544 141181947 136074878 131625840 127691793
4571A27691793l398974k912998k808763k450969k245571j805052j633962j375972
$$ 127691793 124292819 121379821 118571058 116120089 113874518 112069466 110435504 109059532
4563A09059532q65398p58005k64531k4737N3117J23593N07853M74292M33511M54363
$$ 109059532 108194134 107436129 107171598 107146861 107199978 107323571 107831424 108305716 108739227 109193590
4553A09193590K85345L98750K72957K95971M2531p7622j49315k46152n31628n95712
$$ 109193590 109478935 109877685 110150642 110446613 110489144 110411522 110262207 110016055 109484427 108888715
4543A08888715o38330n35451n98278m66696k21012o5708J82571K97745M44227
$$ 108888715 108250385 107714934 107116656 106649960 106428948 106363240 106545811 106843556 107287783
4534A07287783P30902J197788J309300J813830K221103K547651K770736L153970
$$ 107287783 108018685 109216473 110525773 112339603 114560706 117108357 119879093 123033063
4526A23033063L281558K922681K947501K686520J977325J316710L64888p26594
$$ 123033063 126314621 129237302 132184803 134871323 136848648 138165358 138530246 137803652
4518A37803652j461838k367905k609374k661312k326484j987474j426439p85202
$$ 137803652 136341814 133973909 131364535 128703223 126376739 124389265 122962826 122177624
4510A22177624l50258K65724P59805J539766K127573K484156L019117L719859
$$ 122177624 121827366 122093090 122852895 124392661 126520234 129004390 132023507 135743366
4502A35743366M390429N064494N633040O593108P416802Q358593R120249R972352
$$ 135743366 140133795 145198289 150831329 157424437 164841239 173199832 182320081 192292433
4494A92292433J0937374J1110240J0967679J0822264J0043922Q709215N372834
$$ 192292433 203229807 214340047 225307726 236129990 246173912 254883127 260255961
4487B60255961m00366p281470j3359729j7227278j8441520j7342699j5268666
$$ 260255961 259855595 252574125 239214396 221987118 203545598 186202899 170934233
4480A70934233j3225894j1103943r371888q038259p043047o103683n154736m497379
$$ 170934233 157708339 146604396 137232508 129194249 122151202 116047519 110892783 106395404
4472A06395404m012312l564725k962432k448318k247235k180957j899145j668611
$$ 106395404 102383092 98818367 95855935 93407617 91160382 88979425 87080280 85411669
4464H5411669j335772j140478j009059p94523j212072k401203l445535m004891
$$ 85411669 84075897 82935419 81926360 81131837 79919765 77518562 74073027 70068136
4456G0068136m095335l722495l141117k741070k421744k181484j857093j694871
$$ 70068136 65972801 62250306 59109189 56368119 53946375 51764891 49907798 48212927
4448D8212927j743535j481144j264143j196489j175035j127405j033280r51930
$$ 48212927 46469392 44988248 43724105 42527616 41352581 40225176 39191896 38239966
4440C8239966q60383q19629r35471r02487q28501n54116n59609o27287o34820
$$ 38239966 37379583 36559954 35624483 34721996 33893495 33339379 32779770 32152483 31517663
4431C1517663m41162n69802m55229l24890m25211l21769m16682l77698l12554
$$ 31517663 31076501 30506699 30051470 29726580 29301369 28979600 28562918 28185220 27872666
4422B7872666k91799k54657j59255k51496l99833l59097k26218l95168k06178
$$ 27872666 27580867 27326210 27166955 26915459 26515626 26156529 25930311 25535143 25328965
4413B5328965l78319m47102l45999l41829k23798k47431k51075j30006k18428
$$ 25328965 24950646 24503544 24157545 23815716 23591918 23344487 23093412 22963406 22744978
4404B2744978j60777j76241k49652j79239l74388k75012j28221k31004p2980j01274
$$ 22744978 22584201 22407960 22158308 21979069 21604681 21329669 21201448 20970444 20897464 20796190
4394B0796190j40279p9793o5898J3752N5116J74537K53595M9816k8162J1662L4814
$$ 20796190 20655911 20576118 20510220 20523972 20579088 20753625 21007220 21057036 21028874 21040536 21075350
4383B1075350j32076m47818k99132k63987l52357l84026l61381q9885k78403k04970
$$ 21075350 20943274 20495456 20196324 19932337 19579980 19195954 18834573 18744688 18466285 18261315
4373A8261315j34747m1496k60363k94633j64820k92038j69109r4158n3338j16084
$$ 18261315 18126568 18085072 17824709 17530076 17365256 17073218 16904109 16809951 16756613 16640529
4363A6640529j47144o4640L1082p7316k06637j86613j58754q4881k05904j91863
$$ 16640529 16493385 16428745 16459827 16382511 16175874 15989261 15830507 15745626 15539722 15347859
4353A5347859O8147j6864j63269k97069j86954l63412j49156k50901k03368n2604
$$ 15347859 15416006 15399142 15235873 14938804 14751850 14388438 14239282 13988381 13785013 13732409
4343A3732409j85406k3869j37024k35752Q0568p602j59088j74465r4584n2871
$$ 13732409 13547003 13523134 13386110 13150358 13230926 13223324 13064236 12889771 12795187 12742316
4333A2742316m3200j19661m2181k6460j85069L7317P7209K0848j04331j88522
$$ 12742316 12699116 12579455 12537274 12510814 12325745 12363062 12440271 12461119 12356788 12168266
4323A2168266N012J29097N3743n2351J04362o9925n3758Q2520J70345N0986Q8050
$$ 12168266 12173278 12302375 12356118 12303767 12408129 12338204 12284446 12366966 12537311 12588297 12676347
4312A2676347p2803p9820O5362j49103l3833k1271j67851m4782J24065p2814L2561
$$ 12676347 12603544 12523724 12589086 12439983 12406150 12384879 12217028 12172246 12296311 12223497 12256058
4301A2256058J525j62462j7940M9898n788l6226O0921k909k0789o5691O2620O4287
$$ 12256058 12257583 12095121 12077181 12127079 12121291 12085065 12145986 12143077 12122288 12056597 12119217 12183504
4289A2183504j69069K4161k9006j0777p8234Q522K2278J8790n8567j71999o3000
$$ 12183504 12014435 12038596 12009590 11998813 11920579 11929101 11951379 11970169 11911602 11739603 11676603
4278A1676603q9399l13809j60115J2166k06971j67429L8187j8652O1323q7822
$$ 11676603 11587204 11273395 11113280 11125446 10918475 10751046 10789233 10770581 10831904 10744082
4268A0744082l6515Q045l1242j02655J6631j76053l5916K431k4008Q3050p761
$$ 10744082 10707567 10715612 10684370 10581715 10598346 10422293 10386377 10388808 10364800 10447850 10440089
4257A0440089O035o746o1474j19128j34224J8368M7413p2012k8565j9144k46741
$$ 10440089 10446124 10439378 10377904 10258776 10124552 10142920 10190333 10118321 10089756 10070612 9823871
4246I823871L9715K5916j12754k815L8124M5809K207L6661O9745j03892L8768
$$ 9823871 9863586 9889502 9776748 9773933 9812057 9857866 9860073 9896734 9966479 9862587 9901355
4235I901355R6473K9442O1370j19536j8539J197O4281k26630r8342j18017k29089
$$ 9901355 9997828 10027270 10088640 9969104 9950565 9951762 10016043 9789413 9691071 9573054 9343965
4224I343965J1949J02107L0685j0533N0860K2679n7913K8092N0693J2639j11494
$$ 9343965 9355914 9458021 9488706 9478173 9529033 9551712 9493799 9521891 9572584 9585223 9473729
4213I473729J27012k1399P7242q4529R9990J60474L0795o6924j34799l4986k5723
$$ 9473729 9600741 9579342 9656584 9572055 9672045 9832519 9863314 9796390 9661591 9626605 9600882
4202I600882l274j57663Q9398j8668m1158j0768l1459r1729r362l1006m7880l344
$$ 9600882 9597608 9439945 9529343 9510675 9469517 9458749 9427290 9335561 9326199 9295193 9247313 9243969
4190I243969l0386R015p4804O2901J66296P5911k3582o1590O1404J04320k10956
$$ 9243969 9213583 9222598 9147794 9210695 9376991 9452902 9429320 9367730 9429134 9533454 9322498
4179I322498j9936K8469r7240l5583n4679K8080p5252J53551n563j74375J19514
$$ 9322498 9302562 9331031 9233791 9198208 9143529 9171609 9096357 9249908 9244345 9069970 9189484
4168I189484M4750j4878j62024N0893o892q5355N7659l3206n7041m462l3618r9360
$$ 9189484 9234234 9219356 9057332 9108225 9101333 9015978 9073637 9040431 8983390 8978928 8945310 8845950
4156H845950j18181K5566o0880q2424l8547K1530p2709N6106j5576o0379q0188
$$ 8845950 8727769 8753335 8692455 8610031 8571484 8593014 8520305 8576411 8560835 8500456 8420268
4145H420268j2251J18065j00826K7190O9325J2629J24407J47804L1580J34019
$$ 8420268 8408017 8526082 8425256 8452446 8521771 8534400 8658807 8806611 8838191 8972210
4135H972210J48251R5337J35824Q0593L0633R6809J6716j15732j24899m6940l2785
$$ 8972210 9120461 9215798 9351622 9432215 9462848 9559657 9576373 9460641 9335742 9288802 9256017
4124I256017k49607r1349r7732l29306l1841Q3595k51227j48154P8287J38164
$$ 9256017 9006410 8915061 8817329 8488023 8456182 8539777 8288550 8140396 8218683 8356847
4114H356847K9381J36067L4351M775J32570k8805L6106q4236n7370O9633p590
$$ 8356847 8386228 8522295 8556646 8561421 8693991 8665186 8701292 8617056 8559686 8629319 8621729
4103H621729j03113O0037p271J23467M1253j01604M1284Q0861j9657K6650P1402
$$ 8621729 8518616 8578653 8571382 8694849 8736102 8634498 8675782 8756643 8736986 8763636 8835038
4092H835038m1594j17332j31902l6264Q0913M5033L1140j5804J22978J2215l0820
$$ 8835038 8793444 8676112 8544210 8507946 8588859 8633892 8665032 8649228 8772206 8784421 8753601
4081H753601K3391k8271j5283J75901J4802P5276j4482N0008k6578p2055N2118
$$ 8753601 8776992 8748721 8733438 8909339 8924141 8999417 8984935 9034943 9008365 8936310 8988428
4070H988428Q0995k01583j13823m8664P7924j01478K731J17726q2763q9466l2852
$$ 8988428 9069423 8867840 8754017 8705353 8783277 8681799 8684530 8802256 8719493 8630027 8597175
4059H597175k8012M0937k4576l3765Q409j20818J88895J23288j613M3138L1143
$$ 8597175 8569163 8610100 8585524 8551759 8560168 8439350 8628245 8751533 8749920 8793058 8824201
4048H824201J94169J52427J9590R3725L991k7240J16691J84675K45699r2759J49703
$$ 8824201 9018370 9170797 9190387 9284112 9288103 9260863 9377554 9562229 9807928 9715169 9864872
4037I864872J83299L06921J62518o3651J28496M4615J97544K1326l7593p025J11249
$$ 9864872 10048171 10355092 10517610 10453959 10582455 10627070 10824614 10845940 10808347 10801322 10912571
4026A0912571j35039Q7355m6351N5602P5573N4120R5538K19782K20666J03507
$$ 10912571 10777532 10864887 10818536 10874138 10949711 11003831 11099369 11319151 11539817 11643324
4016A1643324J55150K26255J15501J56481r055j23766j18962K48488J50327J74423
$$ 11643324 11798474 12024729 12140230 12296711 12287656 12163890 12044928 12293416 12443743 12618166
4006A2618166K36639K13437L18375K13941L68944K88772K48160J34993k72836
$$ 12618166 12854805 13068242 13386617 13600558 13969502 14258274 14506434 14641427 14368591
3997A4368591k12884n7837j49953m7540K3813J1993J20496J62065J05066j5598
$$ 14368591 14155707 14097870 13947917 13900377 13924190 13936183 14056679 14218744 14323810 14308212
3987A4308212J72401K60315P4255N0529j4054J98922J16017m7642R9175J70506
$$ 14308212 14480613 14740928 14815183 14865712 14851658 15050580 15166597 15118955 15218130 15388636
3977A5388636K78929J92656K56434K48854K89581J77808K20776M24173L52129
$$ 15388636 15667565 15860221 16116655 16365509 16655090 16832898 17053674 17477847 17829976
3968A7829976q6822Q3657K49036K07833L00372J79440K84755K68599K70102L23753
$$ 17829976 17743154 17826811 18075847 18283680 18584052 18763492 19048247 19316846 19586948 19910701
3958A9910701K73416L58483M64267L99105L91738M05390K72899N11683O37584
$$ 19910701 20184117 20542600 21006867 21405972 21797710 22203100 22475999 22987682 23625266
3949B3625266M83814O99451P15814O92322R72331P61903J028374J126037R10410
$$ 23625266 24109080 24808531 25524345 26216667 27188998 27950901 28979275 30105312 31015722
3940C1015722J084479J263157J205779J402574J457743J322302J259705J095378
$$ 31015722 32100201 33363358 34569137 35971711 37429454 38751756 40011461 41106839
3932D1106839J409611J215753J104145J205333J089103R86010O26461N60049N14392
$$ 41106839 42516450 43732203 44836348 46041681 47130784 48116794 48743255 49303304 49817696
3923D9817696K34078J70361J21773L88045K79035K21321M40206M54951N78732
$$ 49817696 50051774 50222135 50343908 50731953 51010988 51232309 51672515 52127466 52706198
3914E2706198P95659P86407J096308J148176J247034J376710J492074J417922
$$ 52706198 53501857 54288264 55384572 56532748 57779782 59156492 60648566 62066488
3906F2066488J311202J205826J248928Q66824P77120L81672n8630l16062p92904
$$ 62066488 63377690 64583516 65832444 66699268 67476388 67858060 67799430 67483368 66690464
3897F6690464j155863j282989j597124j598172j665597j793005j534216j471731
$$ 66690464 65534601 64251612 62654488 61056316 59390719 57597714 56063498 54591767
3889E4591767j393692j413816j359256j071752q02782p51996o83737o04272m01357
$$ 54591767 53198075 51784259 50425003 49353251 48550469 47798473 47114736 46510464 46109107
3880D6109107l95830m18679m08369m74404o16943q19935p05624q80065r64283
$$ 46109107 45713277 45294598 44886229 44411825 43794882 42974947 42269323 41389258 40424975
3871D0424975j078436j082853j183721j383152j353626j171560j300846j246837
$$ 40424975 39346539 38263686 37079965 35696813 34343187 33171627 31870781 30623944
3863C0623944j020112j067781j136241j080476q70117q66473q95715o45821p16646
$$ 30623944 29603832 28536051 27399810 26319334 25449217 24582744 23687029 23041208 22324562
3854B2324562o22019n04298m92865n27265n32834k83741m69741m72564l04052
$$ 22324562 21702543 21198245 20705380 20178115 19645281 19361540 18891799 18419235 18115183
3845A8115183k42072l86408l66137l16783j95834j93253k90201q1634k13799j60681
$$ 18115183 17873111 17486703 17120566 16803783 16607949 16414696 16124495 16042861 15829062 15668381
3835A5668381k10912l17042j75884o6386j54833k77281o3852j76947j80303j89577
$$ 15668381 15457469 15140427 14964543 14898157 14743324 14466043 14402191 14225244 14044941 13855364
3825A3855364n0691r9952j42368j14440r4409n6442j45253k58794j24988p4069
$$ 13855364 13804673 13704721 13562353 13447913 13353504 13297062 13151809 12893015 12768027 12693958
3815A2693958J7398j56076k14051j24518k862j09015k4067k5373L8318k9149j98240
$$ 12693958 12711356 12555280 12341229 12216711 12213849 12104834 12080767 12055394 12093712 12064563 11866323
3804A1866323j68350o8796L389j5026j54335l6361J5461k2933j37621l6209Q5754
$$ 11866323 11697973 11629177 11632566 11617540 11463205 11426844 11442305 11419372 11281751 11245542 11331296
3793A1331296J26423q4306j13998j43963M4633P381M0838r5931J29898K07401
$$ 11331296 11457719 11373413 11259415 11115452 11160085 11167466 11208304 11112373 11242271 11449672
3783A1449672j38099j17507o7040K48602j58622o6307P5862j15790Q9811J86832
$$ 11449672 11311573 11194066 11127026 11375628 11217006 11150699 11226561 11110771 11200582 11387414
3773A1387414j19247k788j61706m6179J53845J05506R578p1093m188J08723j3757
$$ 11387414 11268167 11265379 11103673 11057494 11211339 11316845 11326423 11255330 11251142 11359865 11346108
3762A1346108o8411R950j13168j3875J46174M9080m8580j4319P260O9640K9659
$$ 11346108 11277697 11287647 11174479 11160604 11306778 11355858 11307278 11292959 11300219 11369859 11399518
3751A1399518m8572O2169Q6548j0705m8912J3187J07941q5890l4434J49516L1960
$$ 11399518 11350946 11413115 11499663 11488958 11440046 11453233 11561174 11475284 11440850 11590366 11622326
3740A1622326l2863m8123l785J66134N8399r6647K9990J16258R4936N0832j35376
$$ 11622326 11589463 11541340 11537555 11703689 11762088 11665441 11695431 11811689 11906625 11957457 11822081
3729A1822081j1572L7802p1460R2612J13044o943K5847J07457j24928r878J74087
$$ 11822081 11810509 11848311 11776851 11869463 11982507 11975564 12001411 12108868 11983940 11974062 12148149
3718A2148149M7301j122O6318O9755j439q6595J15678K8631K6793J80591K4076
$$ 12148149 12195450 12194328 12260646 12330401 12328962 12242367 12358045 12386676 12413469 12594060 12618136
3707A2618136l2757l8276Q0784J23545J7718J1174P3425M0677J84845J01331k9257
$$ 12618136 12585379 12547103 12627887 12751432 12769150 12780324 12853749 12894426 13079271 13180602 13151345
3696A3151345J35763j6505N1328J21484J31165J46069J35545j48851m6263P2979
$$ 13151345 13287108 13270603 13321931 13443415 13574580 13720649 13856194 13707343 13661080 13734059
3686A3734059r1501q1351J5l9371K8426q8339j66769K11381K04904L8896L438
$$ 13734059 13642558 13561207 13561222 13521851 13550277 13461938 13295169 13506550 13711454 13750350 13753788
3675A3753788r1962J5595L0347k9728J407P8105J18877J22717q5025N8620J28150
$$ 13753788 13661826 13677421 13707768 13678040 13679447 13757552 13876429 13999146 13914121 13972741 14100891
3664A4100891l6230Q3003J76255J15125Q6576J0411J79486M2584m6407J2847o4277
$$ 14100891 14064661 14147664 14323919 14439044 14525620 14536031 14715517 14758101 14711694 14724541 14660264
3653A4660264Q8349l1657k5424j09757P8034j36438J02800J94049k34667o198
$$ 14660264 14748613 14716956 14691532 14581775 14659809 14523371 14626171 14820220 14585553 14579355
3643A4579355N7442O7564q082j2980J732P0861K1267J69172M4501O2247J09618
$$ 14579355 14636797 14704361 14696279 14683299 14685031 14755892 14777159 14946331 14990832 15053079 15162697
3632A5162697L0424J46051l1781J7009j6053R3371J87216J63994j0202J60432
$$ 15162697 15193121 15339172 15307391 15324400 15308347 15401718 15588934 15752928 15742726 15903158
3622A5903158J44448k9639J70812M0823J38786K87422J08322J09790J17966J57313
$$ 15903158 16047606 16017967 16188779 16229602 16368388 16655810 16764132 16873922 16991888 17149201
3612A7149201K34779k2043J24889K39797M7723J18869R3388K03992J26205J67554
$$ 17149201 17383980 17361937 17486826 17726623 17774346 17893215 17986603 18190595 18316800 18484354
3602A8484354R3640J20650K32865R8669J13070J84092K24225J94738K07558O75
$$ 18484354 18577994 18698644 18931509 19030178 19143248 19327340 19551565 19746303 19953861 19954536
3592A9954536K10960J54705J20996K51973K83503K02762J97527K30301J51269
$$ 19954536 20165496 20320201 20441197 20693170 20976673 21179435 21376962 21607263 21758532
3583B1758532K19809J21628L24272K26446J79188J98013M35332J47355K22722
$$ 21758532 21978341 22099969 22424241 22650687 22829875 23027888 23463220 23610575 23833297
3574B3833297K18543K16587L41295K46960K89814N10068L10675J14051L01778
$$ 23833297 24051840 24268427 24609722 24856682 25146496 25656564 25967239 26081290 26383068
3565B6383068M06206M21262L39998M48062K95810M95716M08054L62306M23835
$$ 26383068 26789274 27210536 27550534 27998596 28294406 28790122 29198176 29560482 29984317
3556B9984317L63891L33668L61208M16264J64541N35919L51215L65371L71302
$$ 29984317 30348208 30681876 31043084 31459348 31623889 32159808 32511023 32876394 33247696
3547C3247696L27647M16788N16621O06757M29349L08444N43905N11259O23648
$$ 33247696 33575343 33992131 34508752 35115509 35544858 35853302 36397207 36908466 37532114
3538C7532114N80282M68514N01430O38126N96987N29028Q29273O87498O38752
$$ 37532114 38112396 38580910 39082340 39720466 40317453 40846481 41675754 42363252 43002004
3529D3002004Q31986R44878P77914Q37392Q46638R33800R56376R20820J033423
$$ 43002004 43833990 44778868 45556782 46394174 47240812 48174612 49130988 50051808 51085231
3520E1085231J058056R26266J008846R02239J003714Q40580Q60086R90595Q49178
$$ 51085231 52143287 53069553 54078399 54980638 55984352 56824932 57685018 58675613 59524791
3511E9524791P94653R30749Q27773Q84640P78563P67599P86681R42229R03520
$$ 59524791 60319444 61250193 62077966 62962606 63741169 64508768 65295449 66237678 67141198
3502F7141198R43351J101544J205690J103329J134698J239101J363287J504979
$$ 67141198 68084549 69186093 70391783 71495112 72629810 73868911 75232198 76737177
3494G6737177J729414J706476K118286K315548K548150K902705L045683L371684
$$ 76737177 78466591 80173067 82291353 84606901 87155051 90057756 93103439 96475123
3486I6475123L620332L877114M256168M705401M938853N286665N339020N537984
$$ 96475123 100095455 103972569 108228737 112934138 117872991 123159656 128498676 134036660
3478A34036660N356634N028379M542427L588907K040038M26908j227109k742791
$$ 134036660 139393294 144421673 148964100 152553007 154593045 155019953 153792844 151050053
3470A51050053m029445m977620n210178n080445m652589m262397l921114l752607
$$ 151050053 147020608 142042988 136832810 131752365 127099776 122837379 118916265 115163658
3462A15163658l400991l133730k939130k738323k657187k424773k216731k055760
$$ 115163658 111762667 108628937 105689807 102951484 100294297 97869524 95652793 93597033
3454I3597033j916100j911621j722126j654031j574802j630271j384533j123701
$$ 93597033 91680933 89769312 88047186 86393155 84818353 83188082 81803549 80679848
3446H0679848j331843j288847j457355j285099j177958r54598j378169j310562
$$ 80679848 79348005 78059158 76601803 75316704 74138746 73184148 71805979 70495417
3438G0495417j315602j338823j213121j206098j294680j341885j222120j118046
$$ 70495417 69179815 67840992 66627871 65421773 64127093 62785208 61563088 60445042
3430F0445042j269682j143995j083016j172580j027658q20874q35324q74961p42274
$$ 60445042 59175360 58031365 56948349 55775769 54748111 53927237 53091913 52216952 51474678
3421E1474678o78665n67313n63330m72241p24657l59252k97482j60387k12721
$$ 51474678 50796013 50228700 49665370 49193129 48468472 48109220 47811738 47651351 47438630
3412D7438630j68189L7004J44365J73950K75674K43282K28014K67139N07968P61702
$$ 47438630 47270441 47307445 47451810 47625760 47901434 48144716 48372730 48639869 49147837 49909539
3402D9909539P92848R75696J176160L84217j150144j577604j922001k024949j692336
$$ 49909539 50702387 51678083 52854243 53238460 52088316 50510712 48588711 46563762 44871426
3393D4871426j326424j075788p96051o23976o26788m48694l37434l38125p1625
$$ 44871426 43545002 42469214 41673163 41049187 40422399 39973705 39636271 39298146 39226521
3384C9226521q2932j35869L4171J31870K85485O65512Q71870P32266R61345J287263
$$ 39226521 39143589 39007720 39041891 39173761 39459246 40124758 40996628 41728894 42690239 43977502
3374D3977502J004028Q93444J442781J556650J974488K495023L083559L85166
$$ 43977502 44981530 45874974 47317755 48874405 50848893 53343916 56427475 56812641
3366E6812641k459246k609835l498452l461860k940661k338938j750824j316824
$$ 56812641 54353395 51743560 48245108 44783248 41842587 39503649 37752825 36436001
3358C6436001j003060p56215p63202p00314n76091l93954m47299l71258q1628
$$ 36436001 35432941 34676726 33913524 33213210 32637119 32243165 31795866 31424608 31342980
3349C1342980j74534k01494Q45K01115K34913K65345L26843J94783K30744O53472
$$ 31342980 31168446 30966952 30967797 31168912 31403825 31669170 31996013 32190796 32421540 33075012
3339C3075012P70714P77135J021370J123715j89997j151510j323303j771932j805623
$$ 33075012 33845726 34622861 35644231 36767946 36577949 35426439 34103136 32331204 30525581
3330C0525581j503931j202661r79034n04644o08969n07407n65387m73562k19404
$$ 30525581 29021650 27818989 26839955 26335311 25726342 25218935 24653548 24179986 23960582
3321B3960582l05064k48150k75935k83795k18201k34593k74081j14918j66918
$$ 23960582 23655518 23407368 23131433 22847638 22629437 22394844 22120763 22005845 21838927
3312B1838927l54392k75773N3808j84097j83551j37556k02822r1537j94570p9983
$$ 21838927 21484535 21208762 21262570 21078473 20894922 20757366 20554544 20463007 20268437 20188454
3302B0188454k56423l10756j62033O3840j43362k10932l35590j34182o0370j26336
$$ 20188454 19932031 19621275 19459242 19523082 19379720 19168788 18833198 18699016 18638646 18512310
3292A8512310j08610r7778N9142j09466q1510j11745j40359l22754j19605Q2788
$$ 18512310 18403700 18305922 18365064 18255598 18174088 18062343 17921984 17599230 17479625 17562413
3282A7562413k5016q6846j58241p2313q1496R187j21975j53902j23384j56900
$$ 17562413 17537397 17450551 17292310 17219997 17138501 17147688 17025713 16871811 16748427 16591527
3272A6591527r3032j47534k30988n1654l817j65944m3476k25131m7724K3013n3070
$$ 16591527 16498495 16350961 16119973 16068319 16064502 15898558 15855082 15629951 15582227 15605240 15552170
3261A5552170r6499j02082L68J00670n2310J704K1578k0637l424k223j18905j69186
$$ 15552170 15455671 15353589 15353957 15454627 15402317 15404021 15425599 15404962 15401538 15399315 15280410 15111224
3249A5111224J2204K10566O1538O9868l2406j05409k5806m7602J79475J68176
$$ 15111224 15123428 15333994 15395532 15465400 15432994 15327585 15301779 15254177 15433652 15601828
3239A5601828j22018l082n4468L6386M971j3486K1642J78798J34445J17251Q0499
$$ 15601828 15479810 15476728 15422260 15458646 15463617 15450131 15471773 15650571 15785016 15902267 15982766
3228A5982766J06715M6465J67231J29398J14377J45460J05978K3753N7469J88019
$$ 15982766 16089481 16135946 16303177 16432575 16546952 16692412 16798390 16822143 16879612 17067631
3218A7067631J47539K07519K70792K82192R6022J74757J31068L72877K38933K59206
$$ 17067631 17215170 17422689 17693481 17975673 18071695 18246452 18377520 18750397 18989330 19248536
3208A9248536J17877K17905Q3111J29516K11895J41850K57912N9612J16323J96134
$$ 19248536 19366413 19584318 19667429 19796945 20008840 20150690 20408602 20468214 20584537 20780671
3198B0780671K02579K16463K20667K94095J25268K77747K10660K60166J76615
$$ 20780671 20983250 21199713 21420380 21714475 21839743 22117490 22328150 22588316 22764931
3189B2764931L02615K10952L13887K61993L91165N04714L70910K48221L35410
$$ 22764931 23067546 23278498 23592385 23854378 24245543 24750257 25121167 25369388 25704798
3180B5704798M96597M81979O01942M82924M41057M64475N72742N12499N59496
$$ 25704798 26201395 26683374 27285316 27768240 28209297 28673772 29246514 29759013 30318509
3171C0318509N51143P14492P06497N95874P51445R03821O93203O37237P17373
$$ 30318509 30869652 31584144 32290641 32886515 33637960 34541781 35234984 35872221 36589594
3162C6589594P80218O86641M78614O51282M61554M77976N49932K86629L86863
$$ 36589594 37369812 38056453 38535067 39186349 39647903 40125879 40675811 40962440 41349303
3153D1349303L68724N40831L45274N90502O61057N46459O50925R38138J078261
$$ 41349303 41718027 42258858 42604132 43194634 43855691 44402150 45053075 45991213 47069474
3144D7069474J016869J110870J098151J230943J481715J545840J744339J708804
$$ 47069474 48086343 49197213 50295364 51526307 53008022 54553862 56298201 58007005
3136E8007005J712403J772148J646950J473217J282837Q34414K22797m28644j078796
$$ 58007005 59719408 61491556 63138506 64611723 65894560 66728974 66951771 66523127 65444331
3127F5444331j486390j494210j178744j074062p85967l71209q9684R2722L21883
$$ 65444331 63957941 62463731 61284987 60210925 59424958 59053749 58964065 59056787 59378670
3118E9378670K70229N21786P20728Q45310R49693Q50694Q37652Q35594Q04816
$$ 59378670 59648899 60170685 60891413 61736723 62686416 63537110 64374762 65210356 66015172
3109F6015172P83832N92618M08918J20990p9694k89587q48185r37166j089116
$$ 66015172 66799004 67391622 67800540 67921530 67841836 67552249 66704064 65766898 64677782
3100F4677782j296132j410517j669220j644583j707322j659518j255516j113871
$$ 64677782 63381650 61971133 60301913 58657330 56950008 55290490 54034974 52921103
3092E2921103q58003n36764n30212l97073l74407l43701j47167j6432l48078l55955
$$ 52921103 52063100 51526336 50996124 50599051 50224644 49880943 49733776 49717344 49369266 49013311
3082D9013311p47013p26318p60743j040730j304278j298967j363939j652818j543319
$$ 49013311 48266298 47539980 46779237 45738507 44434229 43135262 41771323 40118505 38575186
3073C8575186j483498j496870j415582j224046j145449j050658j054489r09181
$$ 38575186 37091688 35594818 34179236 32955190 31809741 30759083 29704594 28795413
3065B8795413o80899r51819r08044n90726o66249p06592m87248m52464o44915
$$ 28795413 28114514 27162695 26254651 25663925 24997676 24291084 23803836 23351372 22706457
3056B2706457n17586n32487m44085n53766n32409m99384m58560n47982m62376
$$ 22706457 22188871 21656384 21212299 20658533 20126124 19626740 19168180 18620198 18157822
3047A8157822l75637m03837n18995l84641l13260l74069m46623l41629k79984
$$ 18157822 17782185 17378348 16859353 16474712 16161452 15787383 15340760 14999131 14719147
3038A4719147m11981k98317m33401k42006j40311k91521l93276l05572j26465
$$ 14719147 14307166 14008849 13575448 13333442 13193131 12901610 12508334 12202762 12076297
3029A2076297k04246j63105k42788r4858l13805l22352j06526R7477k52986j64189
$$ 12076297 11872051 11708946 11466158 11371300 11057495 10735143 10628617 10726094 10473108 10308919
3019A0308919j2420j80796l3018q3517k88185k18427j35016j60076k25600j49511
$$ 10308919 10296499 10115703 10082685 9999168 9710983 9492556 9357540 9197464 8971864 8822353
3009H822353j04345j43870O883j50358k44159j72598j46935j82328o1186j55263
$$ 8822353 8718008 8574138 8581021 8430663 8186504 8013906 7866971 7684643 7623457 7468194
2999G468194j36047j65354P2359n9919o5445P2221k2572r275l2073q9956p1016
$$ 7468194 7332147 7166793 7239152 7179233 7113788 7186009 7163437 7154162 7122089 7032133 6961117
2988F961117j96979k02486N1785j17251k13176j65149n7413Q1275q4822j51084
$$ 6961117 6764138 6561652 6613437 6496186 6283010 6117861 6060448 6141723 6056901 5905817
2978E905817j16379j55420j26162k733k4028k05840r7899o3349j06692P0205m7773
$$ 5905817 5789438 5634018 5507856 5505123 5481095 5275255 5177356 5114007 5007315 5077520 5029747
2967E029747j17934o0128n5266P739j70154k2554q0276q2996O678k7019p8350
$$ 5029747 4911813 4851685 4796419 4804158 4634004 4611450 4531174 4448178 4454856 4427837 4349487
2956D349487m0563k9279j50322n7843o1703P7734p3563j42890j19159M515J10828
$$ 4349487 4308924 4279645 4129323 4071480 4009777 4087511 4013948 3871058 3751899 3756414 3867242
2945C867242l6059Q975j32338q4779J41350j87728p9663m9435L0490N7028o5959
$$ 3867242 3831183 3840158 3707820 3623041 3764391 3576663 3497000 3447565 3478055 3535083 3469124
2934C469124Q9056l718P5940j28305k43477K2485L7922k2666J5643P2061q3512
$$ 3469124 3558180 3554462 3630402 3502097 3258620 3281105 3319027 3296361 3312004 3384065 3300553
2923C300553L0338j18631L1250l749p8312k4034r6990n5888O3495L7647L5970
$$ 3300553 3330891 3212260 3243510 3239761 3161449 3137415 3040425 2984537 3048032 3085679 3121649
2912C121649n9999k4392o1130p7455L032j27424Q1678P577o9747j20249R1181
$$ 3121649 3061650 3037258 2976128 2898673 2901705 2774281 2855959 2863536 2793789 2673540 2764721
2901B764721q531L9904J39804j46748o4087j45087O9147J15118j65704o8542J22985
$$ 2764721 2756190 2796094 2935898 2789150 2725063 2579976 2649123 2764241 2598537 2529995 2652980
2890B652980J36834k8418j01149p2404J02064j21850M1033l6322k640Q650l9801
$$ 2652980 2789814 2761396 2660247 2587843 2689907 2568057 2609090 2572768 2570128 2578778 2538977
2879B538977Q913o3254q2839o9187N3595L6565k2245n7448k7286n7345K2354R0831
$$ 2538977 2547890 2484636 2401797 2332610 2386205 2422770 2400525 2343077 2315791 2258446 2280800 2371631
2867B371631o4446j44508J45132R0397o9286P4896L2153L6881j37237P4484j02740
$$ 2371631 2307185 2162677 2307809 2398206 2328920 2403816 2435969 2472850 2335613 2410097 2307357
2856B307357m2956q141q4064Q7331M8895K8778m1164k3624q2578K798o7247N2834
$$ 2307357 2264401 2256260 2172196 2259527 2308422 2337200 2296036 2272412 2189834 2192632 2125385 2178219
2844B178219n7129q0653Q0406j01213j65700J64146J40354r941r2776L2918O0139
$$ 2178219 2121090 2040437 2120843 2019630 1853930 2018076 2158430 2148489 2055713 2088631 2148770
2833B148770Q1010q2311p7577j09297m4332M6614K2768J88641N0448j28726k7063
$$ 2148770 2229780 2147469 2069892 1960595 1916263 1962877 1985645 2174286 2224734 2096008 2068945
2822B068945J5863L7904l5008r9782L3761o6490M2807L0493j5005q9838o9242
$$ 2068945 2084808 2122712 2087704 1987922 2021683 1955193 1998000 2028493 2013488 1923650 1854408
2811A854408j2903R0815p1093n874p7900p2742J20023r6290M71j6436l4929P0785
$$ 1854408 1841505 1932320 1861227 1855353 1777453 1704711 1824734 1728444 1728915 1712479 1677550 1748335
2799A748335m7923L6319P3691k112o8994j24921K0989J13367m0224j65188K5285
$$ 1748335 1700412 1736731 1810422 1808310 1739316 1614395 1635384 1748751 1708527 1543339 1568624
2788A568624L7752L8137k3030m7993K0700k9759j35826q4218J61738J74617r6487
$$ 1568624 1606376 1644513 1621483 1573490 1594190 1564431 1428605 1344387 1506125 1680742 1584255
2777A584255m2112q4624j23115o269K395J78972p8649j67181L1623n8077Q9958
$$ 1584255 1542143 1457519 1334404 1328135 1330530 1509502 1430853 1263672 1295295 1237218 1327176
2766A327176m986m9918R7922J9406k55422rk5114k4874Q0464J5886J15383l4197
$$ 1327176 1322190 1272272 1370194 1389600 1134178 1134169 1109055 1084181 1164645 1180531 1295914 1261717
2754A261717p2202k6951N5350O4451J08520j56845J1381j9501K6737j94113M1450
$$ 1261717 1189515 1162564 1217914 1282365 1390885 1234040 1245421 1225920 1252657 1058544 1099994
2743A099994J00305J3644O1834k1033o5490n6265q7275M2607K3312j92635M2522
$$ 1099994 1200299 1213943 1275777 1254744 1189254 1132989 1045714 1088321 1111633 918998 961520
2732I61520k2137m2729J196J77714L1741K2540k3559j35992P5923j066l9741J65361
$$ 961520 939383 896654 897850 1075564 1107305 1129845 1106286 970294 1046217 1045151 1005410 1170771
2720A170771n7381q7675j14738O5861J22453j33893o8902L3152P5734N7448r0823
$$ 1170771 1113390 1025715 910977 976838 1099291 965398 896496 929648 1005382 1062830 972007
2709I72007O8516R727j33089J32342m88j54231l0147N2723M2898M924J0571n9344
$$ 972007 1040523 1050250 917161 1049503 1049015 894784 864637 917360 960258 965182 975753 916409
2697I16409O268k0097j04164j7386Q9015j41987l6354Q2218o7748j00680K5119
$$ 916409 922677 902580 798416 781030 870045 728058 691704 773922 706174 605494 630613
2686F30613N3670j1384N4758n3574N1123K02385K0546j82055k2558J8512M1741
$$ 630613 684283 672899 727657 674083 725206 927591 948137 766082 743524 762036 803777
2675H03777l5975r6860l7354K5157N5046m1050N2634M1061k8863k4865P1513k6671
$$ 803777 767802 670942 633588 658745 713791 672741 725375 766436 737573 712708 784221 757550
2663G57550L7787l5585o1695J1487n8853R553k2506j65679J05899J17176j98940
$$ 757550 795337 759752 698057 709544 650691 660244 637738 472059 577958 695134 496194
2652D96194Q8286k756L823J11365r4841j0202M4114M7449L6979j58444o9890M8229
$$ 496194 584480 581724 585547 696912 602071 591869 635983 683432 720411 561967 492077 540306
2640E40306M2123O4469M2703P9296k0122j38536n85j200o3925r0223j01403N4791
$$ 540306 582429 646898 689601 768897 748775 610239 609654 608454 544529 454306 352903 407694
2628D07694n4456J40808R200j21347N0870q9414P0085J22309o6456j05701O3285
$$ 407694 353238 494046 503246 381899 432769 343355 413440 535749 469293 363592 426877
2617D26877o8134L0414J9081o7946j6755K2262R319n3224k0728K0164N4900L0245
$$ 426877 358743 389157 408238 340292 323537 345799 355118 301894 281166 301330 356230 386475
2605C86475O9471N0218J10154o7541r3552n4545r6627O0914P2616M984k9398R0180
$$ 386475 455946 506164 616318 548777 455225 400680 304053 364967 437583 442567 413169 503349
2593E03349j08476K1752m4263j90078L4214N7511J5653o20j27303K7952R2137
$$ 503349 394873 416625 372362 182284 216498 274009 289662 289042 161739 189691 281828
2582B81828O2818l127J4235K5693j13759k6915J3971M0525J6720l9744n1938Q7791
$$ 281828 344646 341519 355754 381447 267688 240773 254744 295269 311989 272245 220307 308098
2570C08098m334L9869J45669L9616j05554l4861p0617k492j32237O6198O9695
$$ 308098 303764 343633 489302 528918 423364 388503 317886 315394 183157 249355 319050
2559C19050j4493M2922J23238l1859m9385M4675p7828j1701k6472O0118o6093
$$ 319050 304557 347479 470717 438858 389473 434148 356320 344619 318147 378265 312172
2548C12172m70k9065J2070p56N6600J4236m3410J0219k7227j01702N0992L2160
$$ 312172 311702 282637 294707 293951 350551 364787 321377 331596 304369 202667 253659 285819
2536B85819m1830Q4789j05255O7348N6766j00231J33731m1943j15064o8462J72810
$$ 285819 243989 328778 223523 290871 347637 247406 381137 339194 224130 155668 328478
2525C28478J9212n5896J05968J295o3187M9540q5412j4836j05182k6635o8453
$$ 328478 347690 291794 397762 399057 335870 385410 299998 285162 179980 153345 84892
2514H4892R3826J00407J0775J06061O8523m6249k07902j7180o8200L5937J10769
$$ 84892 178718 279125 289900 395961 464484 418235 210333 193153 124953 160890 271659
2503B71659O8236j8827O9764r7602o8394n4424J76882j71216k3701J43310L5554
$$ 271659 339895 321068 390832 293230 224836 170412 347294 176078 152377 295687 331241
2492C31241R0705q4363l8493k7799M9288o8938m2848J29935p2288O1058L8190
$$ 331241 421946 337583 299090 271291 320579 251641 208793 338728 266440 327498 365688
2481C65688Q695j32930m3778L2390O5042J9084J8184K6222n6224l0151j43750
$$ 365688 374383 241453 197675 230065 295107 314191 332375 358597 302373 272222 128472
2470A28472R8955L7171J10462N844m1366O2691j58319m1490q4509K7543K6639
$$ 128472 227427 264598 375060 380904 339538 402229 243910 202420 117911 145454 172093
2459A72093O1688K07032o7648j46756j78134K51272J67681o8850k7897J13390
$$ 172093 233781 440813 373165 226409 48275 299547 467228 398378 370481 483871
2449D83871m7774j22255l1460n3117J45346J5738L2106l7943N915n7714j8851
$$ 483871 436097 313842 282382 229265 374611 390349 422455 384512 390427 332713 313862
2438C13862J32369Q9803q5457Q0230J18433j67380j45880M4826N9726o7876M027
$$ 313862 446231 536034 450577 530807 649240 481860 335980 380806 440532 372656 376683
2427C76683O7258J09463k3846J66052j3746n9864p3572m3460J45866j9675J12667
$$ 376683 443941 553404 529558 695610 681864 622000 548428 504968 650834 631159 743826
2416G43826R0870p1209N5898q0381r5500j5126M2428J55813R492j89018n8495
$$ 743826 834696 763487 819385 739004 643504 628378 670806 826619 836111 647093 588598
2405E88598R4781N4998m4821p7292J00366M1142j1043l4843O7072l3654Q0803
$$ 588598 683379 738377 693556 616264 716630 757772 746729 711886 778958 745304 826107
2394H26107J03116N8904k1766m497p779R2381j0458j1787J37258r3531Q6267J0712
$$ 826107 929223 988127 966361 961864 954085 1046466 1036008 1024221 1161479 1067948 1154215 1164927
2382A164927P7356Q7205Q7552O1254l2920N8385K13808P4306N8783J7402l7045
$$ 1164927 1242283 1329488 1417040 1478294 1445374 1503759 1717567 1791873 1850656 1868058 1831013
2371A831013L1760J16116j6575K9107m368M9462r5906k4878m1571J44109J36692
$$ 1831013 1862773 1978889 1962314 1991421 1987053 2036515 1940609 1915731 1874160 2018269 2154961
2360B154961j1450Q7502M7095n2413k3751J76757R3721P2574J29061K88130K81022
$$ 2154961 2143511 2231013 2278108 2225695 2201944 2378701 2472422 2544996 2674057 2962187 3243209
2349C243209K56355K61390J81145J50723L16005K96291O02434M93368O30835R45376
$$ 3243209 3499564 3760954 3942099 4092822 4408827 4705118 5307552 5800920 6431755 7377131
2339G377131J260108J601485J847087K207516K522841K291798J135588j536490
$$ 7377131 8637239 10238724 12085811 14293327 16816168 19107966 20243554 18707064
2331A8707064l523283l069321k213182j402852j004469q86475q35889n48850k91562
$$ 18707064 15183781 12114460 9901278 8498426 7493957 6607482 5771593 5222743 4931181
2322D931181l10325l74491j99358j34780k20510k50490l26892j98020k91762q9824
$$ 4931181 4620856 4246365 4047007 3912227 3691717 3441227 3114335 2916315 2624553 2534729
2312B534729n1007k70882j60548r7017j18449J8874q6925q7146j50503p5777k4311
$$ 2534729 2483722 2212840 2052292 1955275 1836826 1855700 1768775 1681629 1531126 1455349 1431038
2301A431038o8539J1731j14635r5242P9525j787m509j58302j06953L4868N806
$$ 1431038 1362499 1374230 1259595 1164353 1243878 1242091 1237582 1079280 972327 1007195 1013001
2290A013001n9943r1569J11441k1862p6784k01146q0908J9141N8675p5619n8340
$$ 1013001 953058 861489 972930 951068 874284 673138 592230 611371 670046 594427 536087
2279E36087O8469R3j6736j87400Q7701l1564j5278Q0082n5082J37403r8972j60541
$$ 536087 604556 604649 587913 400513 488214 456650 441372 521454 466372 603775 504803 344262
2267C44262Q1263k3742P2112J893m4125k203p7220J06800j47942o6030K6598J3503
$$ 344262 425525 401783 473895 475788 431663 429460 352240 459040 311098 245068 271666 285169
2255B85169K3058l3650j36369K598q529J23762J28912k42747R361o2859j24106
$$ 285169 308227 274577 138208 140806 132277 256039 384951 142204 151565 88706 -35400
2244c5400L7074O6644K14205K2342j7481O4412J548m7706l9128k4451P75L9700
$$ -35400 1674 68318 282523 304865 287384 351796 353344 305638 266510 242059 242834 282534
2232B82534o8643L2229Q8472j3175K2557m4336j24233M6732K18225O8307j81809
$$ 282534 213891 246120 334592 321417 343974 299638 175405 222137 440362 508669 326860
2221C26860O0613m4949j39161r0235O2114P7930l5451j1402O4738m9234o8399
$$ 326860 387473 342524 203363 113128 175242 253172 217721 206319 271057 221823 153424
2210A53424O6613J08948m2912k1091K2925o5417K6105o8421Q1034O4021p8173
$$ 153424 220037 328985 286073 264982 287907 222490 248595 180174 261208 325229 247056
2199B47056m192L4837j7840j61538l3914O5754L2331k9448j8608Q1271Q2974n3368
$$ 247056 242864 277701 259861 98323 64409 130163 162494 133046 114438 195709 278683 225315
2187B25315o6314r6795k9541L7154N5660P0799j8888N1109P5015r7145j95585
$$ 225315 159001 62206 32665 69819 125479 196278 177390 228499 303514 206369 10784
2176A0784J5880p1877J8187J53533L5650l9299j9299L967l6773m4323Q797P6949
$$ 10784 26664 -45213 -27026 126507 162157 122858 103559 107526 70753 26430 35227 112176
2164A12176p0030M1698L2212M148k2779r3979M9104k9046L5697Q9477o1129p8307
$$ 112176 42146 83844 116056 120204 97425 3446 52550 23504 59201 148678 87549 9242
2152I242m7445l0157J84732N4917j43067l2650Q2953J03061o2523j1176Q3566
$$ 9242 -38203 -68360 116372 171289 28222 -4428 78525 181586 119063 107887 191453
2141A91453l6570j653M2296K9199j84165o4763m4167K2555L5868O157j3058J40130
$$ 191453 154883 153230 195526 224725 40560 -24203 -68370 -45815 -9947 -3790 -16848 123282
2129A23282Q0027k3292j46867p0108N5156J96188k7713j00239l4426q4276j1998
$$ 123282 203309 180017 33150 -36958 18198 214386 186673 86434 52008 -32268 -44266
2118d4266P2533J32837r3468n5425J14839m1548r9164k119K15895J76741k1010
$$ -44266 28267 161104 67636 12211 127050 85502 -13662 -15781 200114 376855 355845
2107C55845j46117j60291k8388k3748M1548J5711n5020j0597P979J0793N2450
$$ 355845 209728 49437 21049 -2699 38849 54560 -460 -11057 -3078 7715 60165
2096F0165L1552q1664l8998J31273L089o4956j52385k754J16220l5012p3442Q0521
$$ 60165 91717 10053 -28945 102328 105417 40461 -111924 -114678 1542 -33470 -106912 -26391
2084b6391l7648J51344N5113Q1674q2818n2099j52539J874J50236K3059l4360
$$ -26391 -64039 87305 142418 224092 141274 89175 -63364 -61490 88746 111805 77445
2073G7445n5030j5652J46920M0522j63490M7584P4034p7257k4968O4709J0890
$$ 77445 22415 6763 153683 194205 30715 78299 152333 75076 50108 114817 125707
2062A25707j04658J13409M4741J7r9937q8215k135p842P2055j19687Q2806q9833
$$ 125707 21049 134458 179199 179216 79279 -8936 -11071 -18913 53142 -66545 16261 -73572
2050g3572r3333P6180k6370L403N3891R8395R5140j81478l0008O1905r9078j20830
$$ -73572 -166905 -90725 -117095 -113692 -59801 38594 133734 -47744 -77752 -15847 -114925 -235755
2038b35755P1816M1649P2607r5081p1751J56063L5384j3753m2895O9637j0149
$$ -235755 -163939 -122290 -49683 -144764 -216515 -60452 -25068 -38821 -81716 -12079 -22228
2027b2228N0022J4799l4451J32034N3044j39636l2526O0140J71354n7566p9965
$$ -22228 27794 42593 8142 140176 193220 53584 21058 81198 252552 194986 115021
2016A15021p7211k9816j38012j8876L7610k0832J15283Q8661J7790j9663r1761
$$ 115021 37810 7994 -130018 -148894 -111284 -132116 -16833 71828 89618 69955 -21806
2005b1806L2915J08506n1592r3973Q5850K5982m2677N858l6504M8141m9212j2975
$$ -21806 11109 119615 68023 -25950 59900 85882 43205 49063 12559 60700 11488 -1487
1993a487k4406L5088M59r840m5513m4201l1519j6587q9584J49102M4526m5364
$$ -1487 -25893 9195 9654 -186 -45699 -89900 -121419 -138006 -227590 -78488 -33962 -79326
1981g9326j4697J12545j04064J32026K6893o2263L5856r9863r4278J11807l6574
$$ -79326 -94023 18522 -85542 46484 73377 11114 46970 -52893 -147171 -35364 -71938
1970g1938R2395m7199n496p634l5549n6589j1784J74367J8306o7913J29419r072
$$ -71938 20457 -26742 -32238 -39872 -75421 -132010 -143794 30573 48879 -19034 110385 101313
1958A01313L0694L6570n3569M2451p0065o5282l0733L0929n0397J20139m6127
$$ 101313 132007 168577 115008 157459 87394 22112 -8621 22308 -28089 92050 45923
1947D5923J6969j36575P1817j25031O4972R3673j08868r3278R7646L6326N2881
$$ 45923 62892 -73683 -1866 -126897 -61925 31748 -77120 -170398 -72752 -36426 16455
1936A6455l9402j4465j5881L4176k2473j6784Q4133j9617J14179p0344j32984
$$ 16455 -22947 -37412 -53293 -19117 -41590 -58374 25759 6142 120321 49977 -83007
1925h3007k0962J28308j15041n8256O4418R1349l2515r478L4173q8687Q7992P0909
$$ -83007 -103969 24339 -90702 -148958 -84540 6809 -25706 -35184 -1011 -89698 -1706 69203
1913F9203o0811M5056p2428o9755J1691L3171p6832k2730N2816N8738N8444n831
$$ 69203 8392 53448 -18980 -88735 -77044 -43873 -120705 -143435 -90619 -31881 26563 20732
1901B0732n4199L4905p1870m0947O5337M3984L7899m4244J6984l0453P816L7831
$$ 20732 -33467 1438 -70432 -111379 -46042 -2058 35841 -8403 8581 -21872 -14056 23775
1889B3775o7162j21462J22948J07835Q006j99123j24627J43329J78594k2227o2459
$$ 23775 -43387 -164849 -41901 65934 73940 -125183 -249810 -106481 72113 49886 -12573
1878a2573k1405K369k4380j08948R5959o8347L4980R4012k1626o0726N1476m6361
$$ -12573 -33978 -31609 -55989 -164937 -68978 -137325 -102345 -8333 -29959 -90685 -39209 -85570
1866h5570p0797N2029K0181K7698q2255K6229M3299L5568M3679J05229j63299
$$ -85570 -156367 -104338 -84157 -56459 -138714 -112485 -69186 -33618 10061 115290 -48009
1855d8009K4005o8042M1256L9961k4114j93927J03394J30114L9927M502L6674
$$ -48009 -24004 -92046 -50790 -10829 -34943 -228870 -125476 4638 44565 49067 85741
1844H5741r6557r8549J11231j39995J55268O75j4825l0236M5765M5285j24217
$$ 85741 -10816 -109365 1866 -138129 17139 17814 2989 -27247 18518 63803 -60414
1833f0414k6681J8968o4418P5366o5626n8401J12479K947Q8551j08858j08494
$$ -60414 -87095 -68127 -132545 -57179 -122805 -181206 -68727 -65780 22771 -86087 -194581
1822a94581J07495M0352N086o8522o7199J2625L4764Q9148k2235N6816m201k578
$$ -194581 -87086 -46734 -41648 -110170 -177369 -164744 -129980 -40832 -63067 -6251 -10452 -13030
1810a3030N2245j8493L5789l4545q3479J61341J18910q4843o1733n0318L2346
$$ -13030 39215 20722 56511 21966 -61513 99828 218738 133895 72162 21844 54190
1799E4190l7174k423o2621Q1860j84210j08401J9453J08264J61356M9846p4094
$$ 54190 17016 14593 -48028 33832 -150378 -258779 -239326 -131062 30294 80140 6046
1788F046k30274J40212M2415j29622J19505k3955q0457j4654J6096l4479m5068
$$ 6046 -224228 -84016 -41601 -171223 -51718 -75673 -156130 -170784 -154688 -189167 -234235
1777b34235K4141J45735L160R3077o8617m7778r785N4576N4751n3425L2620J18883
$$ -234235 -210094 -64359 -61199 31878 -36739 -84517 -94302 -39726 15025 -38400 -5780 113103
1765A13103j21626j42427j01015J62197K3043k9873M0262O2904n5571k6632M4500
$$ 113103 -8523 -150950 -251965 -89768 -66725 -96598 -56336 6568 -49003 -75635 -31135
1754c1135l3523k1059Q0081Q7046j03976j18732n3972K8125l1966Q4472N4877
$$ -31135 -64658 -85717 -5636 81410 -22566 -141298 -195270 -167145 -199111 -114639 -59762
1743e9762J03489L3176j74956N5264j63190n8046J49870q0226P2882p467J1920
$$ -59762 43727 76903 -98053 -42789 -205979 -264025 -114155 -194381 -121499 -128966 -117046
1732a17046q2788J04863q3008J62776m6735N4714M9303Q020O8795j52381p4493
$$ -117046 -199834 -94971 -177979 -15203 -61938 -7224 42079 50099 118894 -33487 -107980
1721a07980O0070k506M3655m1025n9091m1137L3984N9560L6221q3998J00090m0007
$$ -107980 -47910 -50416 -6761 -47786 -106877 -148014 -114030 -54470 -18249 -102247 -2157 -42164
1709d2164q8355P4917q8598P0944O0309j24688o6973J85319n9431o1654R2659
$$ -42164 -130519 -55602 -144200 -73256 -12947 -137635 -204608 -19289 -78720 -140374 -47715
1698d7715j10949N8298Q0061p9637l4264J2236J89821k806o9236M0455q3891n4024
$$ -47715 -158664 -100366 -20305 -99942 -134206 -121970 67851 65045 -4191 36264 -47627 -101651
$$ [...]
##END NTUPLES=NMR SPECTRUM
##END=
