##TITLE=1H_DE-80H_X3
 200.13MHz, d2o
 8 sc
 
 19ns.26.2.2025
##JCAMPDX= 6.0         $$ Bruker NMR JCAMP-DX V2.0
##DATA TYPE= NMR SPECTRUM
##DATA CLASS= NTUPLES
##ORIGIN= UXNMR, Bruker Analytische Messtechnik GmbH
##OWNER= pz
$$ XWIN-NMR		Version 3.5
$$ Wed Sep 17 14:43:48 2025 Russian Standard Time (UT+4h)  Yarkov@DPX200
##.OBSERVE FREQUENCY= 200.1313
##.OBSERVE NUCLEUS= ^1H
##.ACQUISITION MODE= SIMULTANEOUS
##.ACQUISITION SCHEME= undefined
##.AVERAGES= 8
##.DIGITISER RES= 18
##SPECTROMETER/DATA SYSTEM= spect
##.PULSE SEQUENCE= zg30
##.SOLVENT NAME= CDCl3
##.SHIFT REFERENCE= (INTERNAL, CDCl3, 0, 15.4836)
##AUDIT TRAIL= $$ (NUMBER, WHEN, WHO, WHERE, WHAT)
$$ ##TITLE= Audit trail, XWIN-NMR		Version 3.5
$$ ##JCAMPDX= 5.01
$$ ##ORIGIN= Bruker BioSpin GmbH
$$ ##OWNER= Yarkov
$$ C:/Bruker/XWIN-NMR/data/yarkov2/nmr/H-C/1/pdata/1/auditp.txt
$$ ##AUDIT TRAIL=  $$ (NUMBER, WHEN, WHO, WHERE, WHAT)
(   1,<2025-09-17 14:42:32.67 +0400>,<Yarkov>,<DPX200>,
      <created by zg, POWCHK disabled, PULCHK disabled
       configuration hash MD5:
       00 E9 B6 7A A2 85 ED C7 34 08 36 98 17 FE 4E 26
       data hash MD5: 16K
       78 5C 28 02 F8 A1 D5 7B 06 B1 14 88 B9 1C 0D A9>)
(   2,<2025-09-17 14:42:51.35 +0400>,<Yarkov>,<DPX200>,
      <Start of raw data processing
       efp BC_mod = 2 LB = 0.25 FT_mod = 6 PKNL = 1 PHC0 = -1352.778 PHC1 = -0.009078503 SI = 16K 
       data hash MD5: 16K
       A6 83 E6 85 88 1F 4C 71 8C 0E 81 51 FB 49 EC 51>)
(   3,<2025-09-17 14:42:55.51 +0400>,<Yarkov>,<DPX200>,
      <abs ABSG = 5 
       data hash MD5: 16K
       8B 48 EE DC 71 C5 02 77 47 17 FC C6 0D 58 01 78>)
(   4,<2025-09-17 14:43:12.53 +0400>,<Yarkov>,<DPX200>,
      <pk PHC0 = 1.642926 PHC1 = 5.800005 
       data hash MD5: 16K
       32 3B 11 9D D9 15 FF D7 AE 0C 64 7D CB 78 91 8F>)
(   5,<2025-09-17 14:43:15.54 +0400>,<Yarkov>,<DPX200>,
      <abs ABSG = 5 
       data hash MD5: 16K
       C5 FC 2B 8E 37 A3 DF 64 83 9F 45 0E F8 69 17 8E>)
$$ ##END=
$$ 
$$ hash MD5
$$ 30 8E 7F 32 FB 01 BD 5F C5 43 E0 0A FC 08 42 FC
##$RELAX= 
##$RELAX= 
##$RELAX= 
##$RELAX= 
##$RELAX= 
##$RELAX= 
$$ Bruker specific parameters
$$ --------------------------
##$DU= <C:/Bruker/XWIN-NMR>
##$EXPNO= 1
##$NAME= <H-C>
##$PROCNO= 1
##$TYPE= <nmr>
##$USER= <yarkov2>
##$AMP= (0..31)
100 100 100 100 100 100 100 100 100 100 100 100 100 100 100 100 100 100 
100 100 100 100 100 100 100 100 100 100 100 100 100 100 
##$AQSEQ= 0
##$AQ_mod= 1
##$AUNM= <au_zg>
##$AUTOPOS= <>
##$BF1= 200.13
##$BF2= 200.13
##$BF3= 200.13
##$BF4= 200.13
##$BF5= 200.13
##$BF6= 200.13
##$BF7= 200.13
##$BF8= 200.13
##$BYTORDA= 1
##$CFDGTYP= 0
##$CFRGTYP= 5
##$CHEMSTR= <none>
##$CNST= (0..31)
1 1 145 1 1 1 1 1 1 1 1 1 1 1 1 1 1 1 1 1 1 1 1 1 1 1 1 1 1 1 1 1 
##$CPDPRG= <>
##$CPDPRG1= <>
##$CPDPRG2= <>
##$CPDPRG3= <>
##$CPDPRG4= <mlev>
##$CPDPRG5= <mlev>
##$CPDPRG6= <mlev>
##$CPDPRG7= <mlev>
##$CPDPRG8= <mlev>
##$CPDPRGB= <>
##$CPDPRGT= <>
##$D= (0..31)
0 0.7 0 0 0 0 0 0 0 0 0 0.03 0 0 0 0 0 0 0 0 0 0 0 0 0 0 0 0 0 0 0 0 
$$ [...]
##$SUBNAM3= <"">
##$SUBNAM4= <"">
##$SUBNAM5= <"">
##$SUBNAM6= <"">
##$SUBNAM7= <"">
##$SUBNAM8= <"">
##$SUBNAM9= <"">
##$SW= 18.0517328524113
##$SWIBOX= (0..15)
0 0 2 0 0 0 0 0 0 0 0 0 0 0 0 0 
##$SW_h= 3612.71676300578
##$TD= 16384
##$TD0= 1
##$TE= 0
##$TE2= 300
##$TE3= 300
##$TEG= 300
##$TL= (0..7)
0 120 120 120 120 120 120 120 
##$TP= (0..7)
150 150 150 150 150 150 150 150 
##$TP07= 0
##$TPNAME0= <>
##$TPNAME1= <>
##$TPNAME2= <>
##$TPNAME3= <>
##$TPNAME4= <>
##$TPNAME5= <>
##$TPNAME6= <>
##$TPNAME7= <>
##$TPOAL= (0..7)
0.5 0.5 0.5 0.5 0.5 0.5 0.5 0.5 
##$TPOFFS= (0..7)
0 0 0 0 0 0 0 0 
##$TUNHIN= 0
##$TUNHOUT= 0
##$TUNXOUT= 0
##$USERA1= <user>
##$USERA2= <user>
##$USERA3= <user>
##$USERA4= <user>
##$USERA5= <user>
##$V9= 5
##$VALIST= <valist>
##$VCLIST= <CCCCCCCCCCCCCCC>
##$VD= 0
##$VDLIST= <DDDDDDDDDDDDDDD>
##$VPLIST= <PPPPPPPPPPPPPPP>
##$VTLIST= <TTTTTTTTTTTTTTT>
##$WBST= 1024
##$WBSW= 4
##$XGAIN= (0..3)
0 0 0 0 
##$XL= 0
##$YL= 0
##$YMAX_a= 184583
##$YMIN_a= -123585
##$ZGOPTNS= <>
##$ZL1= 120
##$ZL2= 120
##$ZL3= 120
##$ZL4= 120
##$ABSF1= 15.48356
##$ABSF2= -2.56829
##$ABSG= 5
##$ABSL= 3
##$ALPHA= 0
##$AQORDER= 0
##$ASSFAC= 0
##$ASSFACI= 0
##$ASSFACX= 0
##$ASSWID= 0
##$AUNMP= <proc_1d>
##$AZFE= 0.1
##$AZFW= 0.1
##$BCFW= 0
##$BC_mod= 2
##$BYTORDP= 0
##$COROFFS= 0
##$CY= -3
##$DATMOD= 1
##$DC= 0
##$DFILT= <>
##$DTYPP= 0
##$F1P= 0
##$F2P= 0
##$FCOR= 1
##$FTSIZE= 16384
##$FT_mod= 6
##$GAMMA= 0
##$GB= 0
##$INTBC= 1
##$INTSCL= 3.241238e-09
##$ISEN= 128
##$LB= 0.25
##$LEV0= 0
##$LPBIN= 0
##$MAXI= 10000
##$MC2= 0
##$MEAN= 0
##$ME_mod= 0
##$MI= 1.114404
##$NCOEF= 0
##$NC_proc= -8
##$NLEV= 6
##$NOISF1= 3.799351
##$NOISF2= 2.8
##$NSP= 0
##$NTH_PI= 0
##$NZP= 0
##$OFFSET= 15.48356
##$PC= 1
##$PHC0= -1351.135
##$PHC1= 5.790926
##$PH_mod= 1
##$PKNL= yes
##$PPARMOD= 0
##$PSCAL= 0
##$PSIGN= 0
##$REVERSE= no
##$SF= 200.130007634293
##$SI= 16384
##$SIGF1= 3
##$SIGF2= 2
##$SINO= 0.751879
##$SIOLD= 32768
##$SREGLST= <19F.Aceton>
##$SSB= 0
##$STSI= 16384
##$STSR= 0
##$SW_p= 3612.71676300578
##$SYMM= 0
##$S_DEV= 0
##$TDeff= 16384
##$TDoff= 0
##$TI= <>
##$TILT= no
##$TM1= 0
##$TM2= 0
##$TOPLEV= 0
##$USERP1= <user>
##$USERP2= <user>
##$USERP3= <user>
##$USERP4= <user>
##$USERP5= <user>
##$WDW= 1
##$XDIM= 16384
##$YMAX_p= 476110207
##$YMIN_p= -422965
$$ End of Bruker specific parameters
$$ ---------------------------------
##NTUPLES= NMR SPECTRUM
##VAR_NAME=  FREQUENCY,     SPECTRUM/REAL,   SPECTRUM/IMAG
##SYMBOL=    X,             R,               I
##VAR_TYPE=  INDEPENDENT,   DEPENDENT,       DEPENDENT
##VAR_FORM=  AFFN,          ASDF,            ASDF
##VAR_DIM=   16384,         16384,           16384
##UNITS=     HZ,            ARBITRARY UNITS, ARBITRARY UNITS
##FACTOR=    0.220516191357247, 1,           1
##FIRST=     3098.72490264702, 0,            0
##LAST=      -513.991860358755, 0,           0
##MIN=       -513.991860358755, -422965,     0
##MAX=       3098.72490264702, 476110207,    0
$$ Real data points
##PAGE= N=1
##DATA TABLE= (X++(R..R)), XYDATA
$$ [...]
7448A23103O677L3198O4067n7703o6848K6553M7482j8538j19269j4609m6849k06146
$$ 123103 129780 162978 227045 169342 102494 129047 176529 157991 38722 24113 -22736 -228882
7436b28882P7390K03436r9271k2685J45000l6173j06756M6278N1845R1951p1872
$$ -228882 -151492 51944 -47327 -70012 74988 38815 -67941 -21663 30182 122133 50261
7425E0261r6242K7238n730J43254M3194m6109l5800j14040q2090R9898n3396O1074
$$ 50261 -45981 -18743 -24473 118781 161975 115866 80066 -33974 -116064 -16166 -69562 -8488
7413h488N8369m4828J4555k0744J43067j31061L7793m6014k11553R3623J20630
$$ -8488 49881 5053 19608 -1136 141931 10870 48663 2649 -208904 -115281 5349
7402E349j18652J45476O6212p2603j13J28365o346r120K5908M3391j05030j25712
$$ 5349 -113303 32173 98385 25782 25669 154034 147688 138568 164476 207867 102837 -22875
7390b2875L2798j01773J31881J71123j7658q9568L3983N6730J83906l6379j15870
$$ -22875 9923 -91850 40031 211154 193496 103928 137911 194641 378547 342168 226298
7379B26298L1716R3714m0688n5009R0774n4131P6865N3866J26551k691k3606k5678
$$ 226298 258014 351728 311040 256031 346805 292674 369539 423405 549956 547265 523659 497981
7367D97981l5408j5204l6010o2592N9334M131n7645n8837o0962o9921j8229P9227
$$ 497981 462573 447369 411359 348767 408101 412232 354587 295750 234788 164867 146638 225865
7355B25865k0864l0363L0314l4715k8050j06499j4435J61357L8171j04810m3805
$$ 225865 205001 174638 204952 170237 142187 35688 21253 182610 220781 115971 72166
7344G2166R4677r6725Q8819J0037L0065j01285q6106L910L0050n302J1138M5150
$$ 72166 166843 70118 158937 168974 199039 97754 11648 15558 45608 40306 51444 96594
7332I6594J19031j31071j28285r2227M6935J62721m9544p011m172n6263K21463
$$ 96594 215625 84554 -43731 -135958 -89023 73698 24154 17143 12971 -43292 178171
7321A78171J59766j54637l1031j25607j03157R1410k9512M4277K1812O3374J4655
$$ 178171 337937 183300 152269 26662 -76495 14915 -14597 29680 51492 114866 129521
7310A29521O7752J20659j61334r9441L931K6729m4866R4716o329j837O1075R4492
$$ 129521 197273 317932 156598 57157 61088 87817 42951 137667 131338 129501 190576 285068
7298B85068l2354q1011J09523j424q0475M7465N9831P9491m4740K423J13502K9940
$$ 285068 252714 171703 281226 279802 199327 246792 306623 386114 341374 343797 457299 487239
7286D87239j0398k8655K6088M1196J7175K8474n3298J08239J20842j11511m6644
$$ 487239 476841 448186 474274 515470 532645 561119 507821 616060 736902 625391 578747
7275E78747K17387N0613L5282N0667m1910k8977N6259J97175K72300Q4115P0080
$$ 578747 796134 846747 882029 932696 890786 861809 918068 1115243 1387543 1471658 1541738
7264A541738M0314J02723J25905L947M0507J39180P0738J68225N2145R9704Q9671
$$ 1541738 1582052 1684775 1810680 1814627 1855134 1994314 2065052 2233277 2285422 2385126 2474797
7253B474797K23746M0223J60321J86903J27812J50454K61948K20976j43809J54826
$$ 2474797 2698543 2738766 2899087 3085990 3213802 3364256 3626204 3847180 3703371 3858197
7243C858197J65773M3297J05251L31415J50026j97154P1268L8027k52917q179
$$ 3858197 4023970 4067267 4172518 4503933 4653959 4456805 4528073 4566100 4313183 4305004
7233D305004m1066k3256p2645j0995j73999k51946j44685q8224j08894k4601k36331
$$ 4305004 4263938 4240682 4168037 4157042 3983043 3731097 3586412 3498188 3389294 3364693 3128362
7222C128362k43987j28134j1261o2029o7726j61157p9382j68893j63709j24704
$$ 3128362 2884375 2756241 2744980 2682951 2615225 2454068 2374686 2205793 2042084 1917380
7212A917380p8535l9642O3466k9664k02237j18764k2763J3649m4542k7012O1141
$$ 1917380 1838845 1799203 1862669 1833005 1630768 1512004 1489241 1502890 1458348 1431336 1492477
7201A492477j19801n4133J3321m8545n7989Q2838N9521K9863l1337p1701L815
$$ 1492477 1372676 1318543 1331864 1283319 1225330 1308168 1367689 1397552 1366215 1294514 1298329
7190A298329P5128K1187r3013J16881q5942n8160l6546q1250M7620J30342J32043
$$ 1298329 1373457 1394644 1301631 1418512 1332570 1274410 1237864 1156614 1204234 1334576 1466619
7179A466619k27022q2499k2935Q8488K5511j22553j306N1640Q2455o6560j7479
$$ 1466619 1239597 1157098 1134163 1222651 1248162 1125609 1124303 1175943 1258398 1191838 1174359
7168A174359r8931P8220m5041l9182q8378k6924k5951O3973m3082R579O4182J6612
$$ 1174359 1075428 1153648 1108607 1069425 981047 954123 928172 992145 949063 958642 1022824 1039436
7156A039436L8318p0588O8956O2008M7617L3930J0971p2242P7651j10662P7570
$$ 1039436 1077754 1007166 1076122 1138130 1185747 1219677 1230648 1158406 1236057 1125395 1202965
7145A202965K5373j27256l6311k0183J66979l214m298p713J90964J36602o3253
$$ 1202965 1228338 1101082 1064771 1044588 1211567 1208353 1204055 1196342 1387306 1523908 1460655
7134A460655M9520Q7781J13138J13244O2776o5735O7647J4187k9970J88737J04718
$$ 1460655 1510175 1597956 1711094 1824338 1887114 1821379 1889026 1903213 1873243 2061980 2166698
7123B166698K44070Q2823K34777J69438K07435K44085L09327J44958K91895L12573
$$ 2166698 2410768 2493591 2728368 2897806 3105241 3349326 3658653 3803611 4095506 4408079
7113D408079L56525N14300N89993O19013P83927P55852Q28539J112379J019959
$$ 4408079 4764604 5278904 5868897 6487910 7271837 8027689 8856228 9968607 10988566
7104A0988566J251767J466934J853364K200974K422145K792114L025938L074481
$$ 10988566 12240333 13707267 15560631 17761605 20183750 22975864 26001802 29076283
7096B9076283L335941L216456K686491J363740j1250m26514p13435j132499k170680
$$ 29076283 32412224 35628680 38315171 39678911 39667661 39241147 38527712 37395213 35224533
7087C5224533l181420l147071k797838k120194j758328j660056j439577j406226
$$ 35224533 32043113 28896042 26098204 23978010 22219682 20559626 19120049 17713823
7079A7713823j224292j173194r82394r19415q44659q15236p52186n17636o39458
$$ 17713823 16489531 15316337 14333943 13414528 12569869 11754633 11002447 10484811 9845353
7070I845353m12599l55864m80044n06723l85678n19551l52475l12039k08677j53317
$$ 9845353 9432754 9076890 8596846 8090123 7704445 7184894 6832419 6520380 6311703 6158386
7060F158386k10288k45848j58210n9771r2656n9945j27411j64894r2832M1948
$$ 6158386 5948098 5702250 5544040 5484269 5391613 5331668 5204257 5039363 4946531 4988479
7050D988479K1008k8494j02360L3018J72076M0712J39934J24656J55089L30770
$$ 4988479 5009487 4980993 4878633 4911651 5083727 5124439 5264373 5389029 5544118 5874888
7040E874888M43172K29396L67129O25170P09453P31783R33205J059193R38461
$$ 5874888 6318060 6547456 6914585 7539755 8249208 8980991 9914196 10973389 11911850
7031A1911850J225761J448316J723863K011140K297416K464688K877548K883012
$$ 11911850 13137611 14585927 16309790 18320930 20618346 23083034 25960582 28843594
7023B8843594K913408K710467J822272L52343m95319o10130q93123j460092k914230
$$ 28843594 31757002 34467469 36289741 36642084 36146765 35536635 34643512 33183420 30269190
7014C0269190l143745k744905k312318j917522j668240j448863j377688j249140
$$ 30269190 27125445 24380540 22068222 20150700 18482460 17033597 15655909 14406769
7006A4406769j249456j054264q06530q41092q02763q03259o28884n99421l52484
$$ 14406769 13157313 12103049 11296519 10455427 9652664 8849405 8220521 7621100 7268616
6997G268616l38768m91449l17082l53865k85383k53264k67250k96686o1611k21681
$$ 7268616 6929848 6438399 6121317 5767452 5482069 5228805 4961555 4664869 4603258 4381577
6987D381577k61884k26135l6765o600j31305k39355j84105j79568k47036J4978
$$ 4381577 4119693 3893558 3856793 3850193 3718888 3479533 3295428 3115860 2868824 2883802
6977B883802p6726j8345p1588k39401j21575k213L5685q0125j16430l22L825j15703
$$ 2883802 2807076 2788731 2717143 2477742 2356167 2353954 2389639 2309514 2193084 2192762 2196587 2080884
6965B080884n100n4924l0366m2907j32681q4923m3758j7062J25159L2516m5392
$$ 2080884 2075784 2020860 1990494 1947587 1814906 1729983 1686225 1669163 1794322 1826838 1781446
6954A781446Q845j5073J24166j29980m7951o0560o4516n3704m9235K7852k3255
$$ 1781446 1790291 1775218 1899384 1769404 1721453 1660893 1596377 1542673 1493438 1521290 1498035
6943A498035j6647J02779J17273m2200p7283q4691j27879J14317R3987n7321p331
$$ 1498035 1481388 1584167 1701440 1659240 1581957 1497266 1369387 1483704 1577691 1520370 1513039
6932A513039k32418p7716N1281r4165Q1768R3621j68775j8037L5997l2587q9543
$$ 1513039 1280621 1202905 1254186 1160021 1241789 1335410 1166635 1148598 1184595 1152008 1062465
6921A062465j32971K4306J8168p1324J09855P2814o6816n3966J25424o4791j12032
$$ 1062465 929494 953800 971968 900644 1010499 1083313 1016497 962531 1087955 1023164 911132
6910I11132P2803N0580l5668J43813j22732k3111J33301J514j3280j52054J27
$$ 911132 983935 1034515 998847 1142660 1019928 996817 1130118 1131632 1118352 966298 966425
6899I66425Q7129O0774M4032j2261N87k5025K34031p0503j03569M7835q2091J68707
$$ 966425 1053554 1114328 1158360 1146099 1146686 1121661 1355692 1285189 1181620 1229455 1147364 1316071
6887A316071j4864j42366L073l8240J9683J21041o4461j365J5081R592m089J04123
$$ 1316071 1301207 1158841 1161914 1123674 1143357 1264398 1199937 1198572 1213653 1223245 1219156 1323279
6875A323279j23506l3348L5303j34316n4053J9489j5890j04063J572l8295q5592
$$ 1323279 1199773 1166425 1201728 1067412 1013359 1032848 1016958 912895 914467 876172 790580
6864G90580k0063P0831m9259l9452L3284m0323N0896k1926k2401O8961m4773n5535
$$ 790580 770517 841348 792089 752637 785921 745598 796494 774568 752167 821128 776355 720820
6852G20820q6851L3860K4R8923R8312l7561O6291p13J15977L9860p1066J1894
$$ 720820 633969 667829 667853 766776 865088 827527 893818 893105 1009082 1048942 977876 989770
6840I89770J7392M7229Q2115l1806P0000k4308o283K7728J35180J29821k7183
$$ 989770 1007162 1054391 1136506 1104700 1174700 1150392 1144109 1171837 1307017 1436838 1409655
6829A409655O5034J80554J1536J5528J28008J35633P1074r5588l2594N4455r1403
$$ 1409655 1474689 1655243 1666779 1682307 1810315 1945948 2017022 1921434 1888840 1943295 1851892
6818A851892J33137J13889j8599Q5311J46913J33298J0930l2152M8871Q1916K20936
$$ 1851892 1985029 2098918 2080319 2165630 2312543 2445841 2456771 2424619 2473490 2555406 2776342
6807B776342L00689J51347L03716K40052J22005K60009O36840N28481K96474O87579
$$ 2776342 3077031 3228378 3532094 3772146 3894151 4154160 4791000 5319481 5615955 6303534
6797F303534O74497P43772P73005R74474J191898J375790J388248J669275K195118
$$ 6303534 6978031 7721803 8494808 9469282 10661180 12036970 13425218 15094493 17289611
6788A7289611K476247K608404K932195L228385L304936L190327K180131J054379
$$ 17289611 19765858 22374262 25306457 28534842 31839778 35030105 37210236 38264615
6780C8264615j4610n46104q12640j354911k406438l052089k976541k421498j998830
$$ 38264615 38250005 37703901 36891261 35536350 33129912 30077823 27101282 24679784 22680954
6771B2680954j649389j595545j400662j203248j061372j091224r31610p49276
$$ 22680954 21031565 19436020 18035358 16832110 15770738 14679514 13747904 12998628
6763A2998628p44223m72657m40485k66282q5920k8932Q7814K38132K28913L34042
$$ 12998628 12254405 11781748 11341263 11074981 10989061 10960129 11047943 11286075 11514988 11849030
6753A1849030N20153P11499R01295R89278J146204J462816J722813K110303K370951
$$ 11849030 12369183 13080682 13981977 14971255 16117459 17580275 19303088 21413391 23784342
6744B3784342K655666K929211K984132K880397K302649J032878j69890p37599
$$ 23784342 26440008 29369219 32353351 35233748 37536397 38569275 38399385 37661786
6736C7661786r44481j385898k219301l003415k989485k587394k332042j843244
$$ 37661786 36717305 35331407 33112106 30108691 27119206 24531812 22199770 20356526
6728B0356526j562627j400673j309099j310527j293507j056401j013315p48418
$$ 20356526 18793899 17393226 16084127 14773600 13480093 12423692 11410377 10661959
6720A0661959p15478p86649o72813n60456l35855l84792m30508l77422l21354
$$ 10661959 9946481 9159832 8487019 7926563 7590708 7205916 6775408 6397986 6076632
6711F076632j14939k18533k99196j75884L4200k93091k66657j86471r3075j18418
$$ 6076632 5961693 5743160 5443964 5268080 5302280 5009189 4742532 4556061 4462986 4344568
6701D344568k12396j16907j39438j80700k95957R701j02364j25403j40601j26784
$$ 4344568 4132172 4015265 3875827 3695127 3399170 3408871 3306507 3181104 3040503 2913719
6691B913719J04354j53678j72456l2505J10422m2960n2282N9700j82443j95013
$$ 2913719 3018073 2864395 2691939 2659434 2769856 2726896 2674614 2734314 2551871 2356858
6681B356858m4444J18503M8393j06455L747q6158j47857J1264j449N792j50338
$$ 2356858 2312414 2430917 2479310 2372855 2376602 2290444 2142587 2153851 2152402 2158194 2007856
6670B007856J40968o3860m1490p1992q7310n0081O2775J25156o7501j07133J26926
$$ 2007856 2148824 2084964 2043474 1971482 1884172 1834091 1896866 2022022 1954521 1847388 1974314
6659A974314k836q0233J57707j53570r9918L4417L3301J09631L6079N4186j06442
$$ 1974314 1971478 1891245 2048952 1895382 1795464 1829881 1863182 1972813 2008892 2063078 1956636
6648A956636n8955K1877J9300q8893m0322o0427k9178r4458r9663J56449J4890
$$ 1956636 1897681 1919558 1938858 1849965 1809643 1749216 1720038 1625580 1525917 1682366 1697256
6637A697256j23935j45845k144P6504L9391n8119N6314L489j90519l1112J68544
$$ 1697256 1573321 1427476 1425332 1501836 1541227 1483108 1539422 1542911 1352392 1321280 1489824
6626A489824J51036l2486o3783k802K660l9405O725o7550p8856Q5751K1957J15576
$$ 1489824 1640860 1608374 1544591 1541789 1544449 1505044 1511769 1444219 1365363 1451114 1473071 1588647
6614A588647J21887L9577k2330R2367j1930k1786O7764J04315P3350l5710l8611
$$ 1588647 1710534 1750111 1727781 1820148 1808218 1786432 1854196 1958511 2031861 1996151 1957540
6603A957540L9922Q5859m4227k3748J18960j31981L4727O0233k30742J31650O7736
$$ 1957540 1997462 2083321 2039094 2015346 2134306 2002325 2037052 2097285 1866543 1998193 2065929
6592B065929O0756j02093L8149J16138Q5097L1292K4677K408J04045k2417j87313
$$ 2065929 2126685 2024592 2062741 2178879 2263976 2295268 2319945 2322353 2426398 2403981 2216668
6581B216668P8342m5017K4933j486J13744L0753o0877j64454L8210J01034j26680
$$ 2216668 2295010 2249993 2274926 2273440 2387184 2417937 2357060 2192606 2230816 2331850 2205170
6570B205170k7416R4854L4673P7620J00136J09666k9057L7776J19323J56187M3002
$$ 2205170 2177754 2272608 2307281 2384901 2485037 2594703 2565646 2603422 2722745 2878932 2921934
6559B921934M2185Q4421J27199K22303J84666K72751K38907L16000L30457K81446
$$ 2921934 2964119 3048540 3175739 3398042 3582708 3855459 4094366 4410366 4740823 5022269
6549E022269L57967N41066O39120N03795N37191R17565R27895P05256R87799R98838
$$ 5022269 5380236 5921302 6560422 7064217 7601408 8518973 9446868 10152124 11139923 12138761
6539A2138761O00681M54572L86788j55191m71320o15199p50040n32870o41335
$$ 12138761 12739442 13194014 13580802 13425611 12954291 12339092 11589052 11056182 10414847
6530A0414847o29315n54235m74688m10233m89581k93224k76643k01744j73618
$$ 10414847 9785532 9231297 8756609 8346376 7856795 7563571 7286928 7085184 6911566
6521F911566l25274k02076l34268j70922k23375k24681k07282k97238k17273l00491
$$ 6911566 6586292 6384216 6049948 5879026 5655651 5430970 5223688 4926450 4709177 4408686
6511D408686k06238j87067k09273r6091o0706k09995j75971O2885k36850k28075
$$ 4408686 4202448 4015381 3806108 3710017 3649311 3439316 3263345 3326230 3089380 2861305
6501B861305O5239j01850o5562n0507k099n3100q1441j66059j27019M196q9668
$$ 2861305 2926544 2824694 2759132 2708625 2706526 2653426 2571985 2405926 2278907 2283103 2193435
6490B193435r6757m8986J20801N9005k44654J5565p147J61548J59497j20852k01237
$$ 2193435 2096678 2047692 2168493 2227498 1982844 1998409 1991262 2152810 2312307 2191455 1990218
6479A990218j01286r0813m7877J77841l8271k5765j6376K6934o6381l5648K041
$$ 1990218 1888932 1798119 1750242 1928083 1889812 1864047 1847671 1874605 1808224 1772576 1774617
6468A774617N5802l6242n9683Q826K5887p5334J79148j8472j02636r2165P985
$$ 1774617 1830419 1794177 1734494 1743320 1769207 1693873 1873021 1854549 1751913 1659748 1667733
6457A667733Q4901N3712l523j28664q0514m5624K7891N8429P8887L664j4883K5778
$$ 1667733 1752634 1806346 1802823 1674159 1593645 1548021 1575912 1634341 1713228 1716892 1702009 1727787
6445A727787J5939L921R3205J1824k085j10585M7468j14520J3831R0201J37394
$$ 1727787 1743726 1747647 1840852 1852676 1850591 1740006 1787474 1672954 1686785 1776986 1914380
6434A914380N583n4413K9796l3728M0564l6903j55003k7261J55624O6492M2761
$$ 1914380 1919963 1865550 1895346 1861618 1902182 1865279 1710276 1683015 1838639 1905131 1947892
6423A947892m6983j01070J19910J80717O513J07277M1990r8413M4727k2908L47
$$ 1947892 1900909 1799839 1919749 2100466 2106979 2214256 2256246 2157833 2202560 2179652 2179999
6412B179999R3346r6711O399O1423j60844N4189P1618J34546n1234j35056J61124
$$ 2179999 2273345 2176634 2183033 2244456 2083612 2137801 2209419 2343965 2292731 2157675 2318799
6401B318799R5575k1336L6603k2588O4942J86176p9125n7254J4140Q7130j5225
$$ 2318799 2414374 2393038 2429641 2407053 2471995 2658171 2579046 2521792 2535932 2623062 2607837
6390B607837k7638Q5967L7483J11221J82049j5570n2636r1570R3161R0200J14728
$$ 2607837 2580199 2666166 2703649 2814870 2996919 2981349 2928713 2837143 2930304 3020504 3135232
6379C135232m7109J54849J28557N8877J57871K63160J42080Q4742J45610Q4469
$$ 3135232 3088123 3242972 3371529 3430406 3588277 3851437 3993517 4078259 4223869 4308338
6369D308338J20213K47284P6922J46695J69580j3675K73313K51910J96556K03061
$$ 4308338 4428551 4675835 4752757 4899452 5069032 5055357 5328670 5580580 5777136 5980197
6359E980197K45898L90773L01431L42271M04568M32118N58892O81441Q12051P33826
$$ 5980197 6226095 6616868 6918299 7260570 7665138 8097256 8656148 9337589 10149640 10883466
6349A0883466R87678J003272J283473J052250R99535J105323J049930Q43516O95809
$$ 10883466 11871144 12874416 14157889 15210139 16209674 17314997 18364927 19208443 19904252
6340A9904252O89534P36557N79612P31647Q54617R78179Q57876P39124O02247
$$ 19904252 20593786 21330343 21909955 22641602 23496219 24474398 25332274 26071398 26673645
6331B6673645N33700M43126O51004Q46202J043475J260477J339287J419112J480856
$$ 26673645 27207345 27650471 28301475 29147677 30191152 31451629 32790916 34210028 35690884
6322C5690884J531218J558202J534436J782527K126690K566884L180352L289432
$$ 35690884 37222102 38780304 40314740 42097267 44223957 46790841 49971193 53260625
6314E3260625L414843L070651K517955J749476P16797o30056j702335k369235
$$ 53260625 56675468 59746119 62264074 64013550 64730347 64100291 62397956 60028721
6306F0028721k521985k076633j646153r84817n60107J55986O36756J044927J764057
$$ 60028721 57506736 55430103 53783950 52799133 52239026 52395012 53031768 54076695 55840752
6297E5840752J962172K586286K573113K851891K643509K249728J337569J35233
$$ 55840752 57802924 60389210 62962323 65814214 68457723 70707451 72045020 72180253
6289G2180253p46409j141415k303095l267047l509612l551282l280483l119233
$$ 72180253 71433844 70292429 67989334 64722287 61212675 57661393 54380910 51261677
6281E1261677k613535k177423j944253j685674j390544j258269j071519o65004
$$ 51261677 48648142 46470719 44526466 42840792 41450248 40191979 39120460 38455456
6273C8455456p31668l56349p05K55727N61881Q30793J356178J890830K258640
$$ 38455456 37723788 37367439 37366734 37622461 38184342 39015135 40371313 42262143 44520783
6264D4520783K455793L021511L352203L538088L407634L531636L090269K251141
$$ 44520783 46976576 49998087 53350290 56888378 60296012 63827648 66917917 69169058
6256F9169058J175671M59793l29342j192938j827520k157710k321144k231654
$$ 69169058 70344729 70804522 70475180 69282242 67454722 65297012 62975868 60744214
6248F0744214j891461j427521j112535n78439K5761N31872J076482J541318J800593
$$ 60744214 58852753 57425232 56312697 55734258 55760019 56291891 57368373 58909691 60710284
6239F0710284K078025J986416J767005J267581N50149m84212j497392k238739
$$ 60710284 62788309 64774725 66541730 67809311 68359460 67875248 66377856 64139117
6231F4139117k750254k633882k327874j995682j775385j576236j564210j386541
$$ 64139117 61388863 58754981 56427107 54431425 52656040 51079804 49515594 48129053
6223D8129053j263773j326729j327782j376005j362155j335999j063268p62836
$$ 48129053 46865280 45538551 44210769 42834764 41472609 40136610 39073342 38310506
6215C8310506p66888n75633o03434p64019p56687p56356p41522p13395p81071
$$ 38310506 37543618 36967985 36364551 35600532 34843845 34087489 33345967 32632572 31851501
6206C1851501p41045o31993o83711p56747o29724q74822j045213j058776r83103
$$ 31851501 31110456 30478463 29794752 29038005 28408281 27533459 26488246 25429470 24446367
6197B4446367p82021p92421o08797n82790p12459n92294m24366j69573k73519
$$ 24446367 23664346 22871925 22263128 21680338 20967879 20375585 19951219 19781646 19508127
6188A9508127j72629M7615N9417n9458K19355K06691J63559J55375J78167L74816
$$ 19508127 19335498 19383113 19442530 19383072 19602427 19809118 19972677 20128052 20306219 20681035
6178B0681035K10736M43298O12875N86752O97862P28450P37571O45280M35402
$$ 20681035 20891771 21335069 21947944 22534696 23232558 23961008 24698579 25343859 25779261
6169B5779261M84383K81329m8236o89247q99554q80568r97552q89151q75977q23621
$$ 25779261 26263644 26544973 26496737 25807490 24907936 24027368 23029816 22140665 21264688 20441067
6159B0441067o17120o11115m81499m48449n23370m34062o11008k66105l36030
$$ 20441067 19823947 19212832 18731333 18282884 17759514 17325452 16714444 16448339 16112309
6150A6112309l33660k34628l65912k89878k33828j83506k12630k27739m37656
$$ 16112309 15778649 15544021 15178109 14888231 14654403 14470897 14258267 14030528 13592872
6141A3592872l25130j82756l53363l83800m22439m35470l83148l42786m19303
$$ 13592872 13267742 13084986 12731623 12347823 11925384 11489914 11106766 10763980 10344677
6132A0344677m12753l70370j61746k14510k25255j75355m17154k36511j46576
$$ 10344677 9931924 9561554 9399808 9185298 8960043 8784688 8367534 8131023 7984447
6123G984447k98814k01504j69198j9985j9616j98638J9273k60082l08490j81010
$$ 7984447 7685633 7484129 7314931 7294946 7275330 7076692 7095965 6835883 6527393 6346383
6113F346383j06519o3579m0031j10074j13882n1968k06588j99874q7263o1503
$$ 6346383 6239864 6176285 6136254 6026180 5912298 5860330 5653742 5453868 5366605 5305102
6103E305102j36625j0098j52027j37002P3255n1247k04083l6265j03942O9073
$$ 5305102 5168477 5158379 5006352 4869350 4942605 4891358 4687275 4651010 4547068 4616141
6093D616141N616r4164j63955Q2194N2539j37886L3631o8431M8625j20369L056
$$ 4616141 4621757 4527593 4363638 4445832 4498371 4360485 4394116 4325685 4374310 4253941 4256997
6082D256997j5983r8445J3292j25388l1851j40602p2767J01668R093M1394p1525
$$ 4256997 4241014 4142569 4155861 4030473 3998622 3858020 3785253 3886921 3896014 3937408 3865883
6071C865883o2701k5372l9029Q1726K6832o5878p8002L9063M1305R6981m4592
$$ 3865883 3803182 3777810 3738781 3820507 3847339 3781461 3703459 3742522 3783827 3880808 3836216
6060C836216j21894j37831j1283J40717q4868P5662l5298Q1408l3935J6000j11139
$$ 3836216 3714322 3576491 3565208 3705925 3621057 3696719 3661421 3742829 3708894 3724894 3613755
6049C613755o1166P2986j22498p4287N9369l2821M1944q7410L5657P0314m6365
$$ 3613755 3552589 3625575 3503077 3428790 3488159 3455338 3497282 3409872 3445529 3515843 3469478
6038C469478K8092P3402J6928r6260j15714P0004L5604l4897J5309M5859k9436
$$ 3469478 3497570 3570972 3587900 3491640 3375926 3445930 3481534 3446637 3461946 3507805 3478369
6027C478369n7867p1017m9493J14617R8917M8726n0487K2567k6202n3969j09818
$$ 3478369 3420502 3349485 3299992 3414609 3513526 3562252 3511765 3534332 3508130 3454161 3344343
6016C344343k5765O9933J09270K16867N7943N8075J19951M8889o1572K3108J34374
$$ 3344343 3318578 3388511 3497781 3714648 3772591 3830666 3950617 3999506 3937934 3961042 4095416
6005D095416K35449K29744J65857J83180n9143p3608M5091L6687N5173J0370o7049
$$ 4095416 4330865 4560609 4726466 4909646 4850503 4776895 4821986 4858673 4913846 4924216 4857167
5994D857167j9149J7327j7810J15142J23960Q2419R4755L90Q2270L01326J66818
$$ 4857167 4838018 4855345 4837535 4952677 5076637 5159056 5253811 5254201 5336471 5637797 5804615
5983E804615O6416L11071K66822J98018J65746M28910M24033M91915K19781L04331
$$ 5804615 5871031 6182102 6448924 6646942 6812688 7241598 7665631 8157546 8377327 8681658
5973H681658N31831M94711L00194M09341M76189P95501O87996N97492P04369O31597
$$ 8681658 9213489 9708200 10008394 10417735 10893924 11689425 12377421 12974913 13679282 14310879
5963A4310879M76714N74090L13986J95402k74525m99818o08259p37147p10409
$$ 14310879 14787593 15361683 15675669 15871071 15596546 15096728 14488469 13751322 13040913
5954A3040913o84230m78316p28017n23690m91939l76608l12424l84385l58028
$$ 13040913 12356683 11878367 11150350 10626660 10134721 9758113 9445689 9061304 8703276
5945H703276k88248m03684k16805k86873l10222k23887l27698j89857j62903j26159
$$ 8703276 8415028 8011344 7794539 7507666 7197444 6973557 6645859 6456002 6293099 6166940
5935F166940j31335k41223l31728q7057r1771j05806j12918j54643q209O95j8096
$$ 6166940 6035605 5794382 5462654 5375597 5283826 5178020 5065102 4910459 4902250 4902945 4884849
5924D884849j94693m3768k6779j44414k5047j2621j89664m0042P0618j13630j17310
$$ 4884849 4690156 4646388 4619609 4475195 4450148 4437527 4247863 4207821 4278439 4164809 4047499
5913D047499o614P0339q1976o6379Q0527r1807J4052m6916J01971N4314Q99R042
$$ 4047499 4040885 4111224 4029248 3962869 4043396 3951589 3965641 3918725 4020696 4075010 4075909 4084951
5901D084951p935J63453J39177j14947Q4782M0502P8204J15341m714j266J72078
$$ 4084951 4077016 4240469 4379646 4264699 4349481 4389983 4468187 4583528 4578814 4577548 4749626
5890D749626J22107j21265J49497k106k0721k8927j43268k3496N4760K52l0011
$$ 4749626 4871733 4750468 4899965 4897859 4877138 4848211 4704943 4681447 4736207 4736459 4706448
5879D706448j08148p5627M7068q8222j9l05013k11566K5619O9362j3070M0302
$$ 4706448 4598300 4522673 4569741 4481519 4481500 4176487 3964921 3990540 4059902 4046832 4087134
5868D087134K0916j71222j54388r5016l4447R6007J22168K4079j98834q3068K733
$$ 4087134 4108050 3936828 3782440 3687424 3652977 3748984 3871152 3895231 3696397 3613329 3616062
5857C616062K9260q200o4952M3621Q5402k7834j89907R9481J04668q1596r1637
$$ 3616062 3645322 3637122 3572170 3615791 3701193 3673359 3483452 3582933 3687601 3606005 3514368
5846C514368L0287r6929K6003o7682l8416j39633J28638R1451k306K8336l2290
$$ 3514368 3544655 3447726 3473729 3406047 3367631 3227998 3356636 3448087 3445781 3474117 3441827
5835C441827N3974P4162N1588j00733L3801k670R364m9043R4462P5013J8082R4501
$$ 3441827 3495801 3569963 3621551 3520818 3554619 3551949 3561313 3512270 3606732 3681745 3699827 3794328
5823C794328k4394n578J21175m558K7537J04532J47958r0108Q1943J77102Q1375
$$ 3794328 3769934 3764356 3885531 3880973 3908510 4013042 4161000 4070892 4152835 4329937 4411312
5812D411312j65724J11367J42468r3865N3668J06705L1572q6951J07112Q3265
$$ 4411312 4245588 4356955 4499423 4405558 4459226 4565931 4597503 4510552 4617664 4700929
5802D700929N1903J34709n4669j78852L6635O7013K7941M1677p5022j12924p2325
$$ 4700929 4752832 4887541 4832872 4654020 4690655 4757668 4785609 4827286 4752264 4639340 4567015
5791D567015j9869K6420k5610N0507j43374m537J29376J68666j4710q4462J06994
$$ 4567015 4547146 4573566 4547956 4598463 4455089 4450552 4579928 4748594 4733884 4649422 4756416
5780D756416R2891J8747M8126O0813J0269J87899J19487M77J3864P4197N3207
$$ 4756416 4849307 4868054 4916180 4976993 4987262 5175161 5294648 5295125 5308989 5383186 5436393
5769E436393j01304N1758J45425K87812K12107K55461Q119l9135L08070L24752
$$ 5436393 5335089 5386847 5532272 5820084 6032191 6287652 6295771 6256636 6564706 6889458
5759F889458R1270M2491J60806Q3078k10495P0736J68555k518n2718J02351K4348
$$ 6889458 6980728 7023219 7184025 7267103 7056608 7127344 7295899 7293381 7240663 7343014 7367362
5748G367362P5629K21324R1165N7665K20502K56595K39932K07937J23345K08578
$$ 7367362 7442991 7664315 7755480 7813145 8033647 8290242 8530174 8738111 8861456 9070034
5738I070034R1460J85367L03357q1923J71092M44342M12049K69990K10305K30947
$$ 9070034 9161494 9346861 9650218 9568295 9739387 10183729 10595778 10865768 11076073 11307020
5728A1307020K74301J70126k245l22545k90888l28378k14728l70505k13269L0963
$$ 11307020 11581321 11751447 11749202 11426657 11135769 10807391 10592663 10222158 10008889 10039852
5718A0039852j13065j79317j40951j77944k07968n7432j82444N831j77117J19479
$$ 10039852 9926787 9747470 9606519 9428575 9220607 9163175 8980731 8986562 8809445 8928924
5708H928924n5113p1661J0141M6922N0609L8133J32224J25279j31109l5146K0544
$$ 8928924 8873811 8802150 8812291 8859213 8909822 8947955 9080179 9205458 9074349 9039203 9059747
5697I059747J33497j33548k70486l5813j90529j73262R28J4942q9297m6148k1029
$$ 9059747 9193244 9059696 8789210 8753397 8562868 8389606 8390534 8405476 8316179 8270031 8249002
5686H249002j26136m4780l0298j69001K4247J01989j01474N1897P03P0547M5307
$$ 8249002 8122866 8078086 8047788 7878787 7903034 8005023 7903549 7955446 7956149 8026696 8072003
5675H072003p4047P2004J24199N2380Q0695l591Q1839J87215N6957N9097j05744
$$ 8072003 7997956 8069960 8194159 8246539 8327234 8323643 8405482 8592697 8649654 8708751 8603007
5664H603007j2135K2446p8311J47986O7709J95869J81567K727J11553K48853R5808
$$ 8603007 8590872 8613318 8535007 8682993 8750702 8946571 9128138 9130865 9242418 9491271 9587079
5653I587079K41135K33682J17319K64119K65812K34619L01883K73021M49934L95336
$$ 9587079 9828214 10061896 10179215 10443334 10709146 10943765 11245648 11518669 11968603 12363939
5643A2363939M42375L62387K44714M76609M90271L59717M16169L90159L85390
$$ 12363939 12806314 13168701 13413415 13890024 14380295 14740012 15156181 15546340 15931730
5634A5931730L64044L03317K48647J91935J10062L92633M57114M84309O92373
$$ 15931730 16295774 16599091 16847738 17039673 17149735 17542368 17999482 18483791 19176164
5625A9176164N24787P48223P53256Q90646J022499J220070J294735J372118J569479
$$ 19176164 19700951 20449174 21202430 22093076 23115575 24335645 25630380 27002498 28571977
5616B8571977J773735J703408J961283K329548K510567K776328L113482L479084
$$ 28571977 30345712 32049120 34010403 36339951 38850518 41626846 44740328 48219412
5608D8219412L762896M199345M526933N029357N664419O206456O809176P734629
$$ 48219412 51982308 56181653 60708586 65737943 71402362 77608818 84417994 92152623
5600I2152623Q800728R556700J0371780J0768527J1128257J1536676J1769724
$$ 92152623 100953351 110510051 120881831 131650358 142778615 154315291 166085015
5593A66085015J1787532J1560058J1269138J0949736J0296128Q980297O724609
$$ 166085015 177872547 189432605 200701743 211651479 221947607 230927904 237652513
5586B37652513L787676L84414l080614n423601o655542p016095p255532p773066
$$ 237652513 241440189 241824603 238743989 233320388 226664846 219648751 212393219 204620153
5578B04620153q332108r138506r953400j0499557j0365886j0245327r560109q966210
$$ 204620153 196288045 187149539 177196139 166696582 156330696 146085369 136525260 127559050
5570A27559050q159942p811039p166044o608009o272827n735398n292833m895907
$$ 127559050 119399108 111588069 104422025 97814016 91541189 85805791 80512958 75617051
5562G5617051m472419m101433l573674l387821l208501k719513k581027k269485
$$ 75617051 71144632 67043199 63469525 60081704 56873203 54153690 51572663 49303178
5554D9303178k140458j862998j925565j700469j464954j433132j413103j414026
$$ 49303178 47162720 45299722 43374157 41673688 40208734 38775602 37362499 35948473
5546C5948473j209017j147633j251950j058620q73868q96074q46332p64017p90897
$$ 35948473 34739456 33591823 32339873 31281253 30407385 29511311 28664979 27900962 27110065
5537B7110065o77183n31500m41228m94926l99044l10112j80794j24456j38022
$$ 27110065 26432882 25901382 25460154 24965228 24566184 24256072 24075278 23950822 23812800
5528B3812800O679j24400o4836Q2565K18740K13137r0291K42995L36306O4039
$$ 23812800 23819479 23695079 23630243 23712808 23931548 24144685 24054394 24297389 24633695 24697734
5518B4697734J33261N6128k2675j506j5216k45655l13677k79296n21375n24787
$$ 24697734 24830995 24887123 24864448 24862942 24847726 24602071 24288394 24009098 23487723 22962936
5508B2962936l79094m88621n74090n89737o97809n48655n39581m47881l67411
$$ 22962936 22583842 22095221 21521131 20931394 20233585 19684930 19145349 18697468 18330057
5499A8330057m06114m32280n58199n32101m32251m36096n00661n64187l55670
$$ 18330057 17923943 17491663 16933464 16401363 15969112 15533016 15032355 14468168 14112498
5490A4112498k30705l45093l64399k70982m00527k24705j52409k25361k69289
$$ 14112498 13881793 13536700 13172301 12901319 12500792 12276087 12123678 11898317 11629028
5481A1629028o3263j35288k79413j32856j91299j41718k66136j52986j95050r3384
$$ 11629028 11565765 11430477 11151064 11018208 10826909 10685191 10419055 10266069 10071019 9977635
5471I977635k14566j37132j53788k67647k01008j79919j50660j24306l36990k32533
$$ 9977635 9763069 9625937 9472149 9204502 9003494 8823575 8672915 8548609 8211619 7979086
5461G979086j90049o2409l632j44603k18854k45568R883P4835k13169j28946j11480
$$ 7979086 7789037 7726628 7722996 7578393 7359539 7113971 7123854 7198689 6985520 6856574 6745094
5450F745094j18488r0664j98734j37092N4559k1981j44277l4963k37006J30746
$$ 6745094 6626606 6535942 6337208 6200116 6254675 6232694 6088417 6053454 5816448 5947194
5440E947194J7677j14102j21607P8486R152q7153j06319l2940k38967K5495J86701
$$ 5947194 5964871 5850769 5729162 5807648 5816800 5729647 5623328 5590388 5351421 5376916 5563617
5429E563617P8366j07712j4506j9320k8366J44050L3659R1389K33885l420N0845
$$ 5563617 5641983 5534271 5519765 5500445 5472079 5616129 5649788 5741177 5975062 5971642 6022487
5418F022487K7642j6794K38203n239K5603J23620j92240n4575N4731J3413r3794
$$ 6022487 6050129 6033335 6271538 6266299 6291902 6415522 6223282 6168707 6223438 6236851 6143057
5407F143057j321M0351k3036l223k39192j53002m6342j62949j13255P9591j3921
$$ 6143057 6141736 6182087 6159051 6155828 5916636 5763634 5717292 5554343 5441088 5520679 5506758
5396E506758j01073o8456k11338j33747n868J03794M4748j56370m1791K8906O7591
$$ 5506758 5405685 5337229 5125891 4992144 4986276 5090070 5134818 4978448 4936657 4965563 5033154
5385E033154L724J23852R8851O8956j14421R4843L1417j1912R2005k4411o0883
$$ 5033154 5036878 5160730 5259581 5328537 5214116 5308959 5340376 5328464 5420469 5396058 5335175
5374E335175l2371k34646r7649j37441j10761r3546K4573O3516q456p903q0418
$$ 5335175 5302804 5068158 4970509 4833068 4722307 4628761 4653334 4716850 4708394 4700491 4620073
5363D620073j05436P1646m9403p8937j49885o8973p8895n6751N4806N4428J00365
$$ 4620073 4514637 4586283 4536880 4457943 4308058 4239085 4160190 4103439 4158245 4212673 4313038
5352D313038L5516j05838k06195O1499n423j28532J8637P1697J5482n2853j62947
$$ 4313038 4348554 4242716 4036521 4098020 4092597 3964065 3982702 4054399 4069881 4017028 3854081
5341C854081P7963P313N2976k2765P8843j1708n072k8555n2667n199k1415j2599
$$ 3854081 3932044 3939357 3992333 3969568 4048411 4036703 4031631 4003076 3950409 3945210 3923795 3911196
5329C911196L6359N4447j44222l0596N4682j6194l1126r6590k5427J6094J01020
$$ 3911196 3947555 4002002 3857780 3827184 3881866 3865672 3834546 3737956 3712529 3728623 3829643
5318C829643P9840q5191o5119k3052J69951J542p300j53684O7123N5846J40200
$$ 3829643 3909483 3824292 3759173 3736121 3906072 3907614 3900314 3746630 3813753 3869599 4009799
5307D009799K3354k6202j8498j65325j07291J19766k5723j57552P1467N1402J1937
$$ 4009799 4033153 4006951 3988453 3823128 3715837 3835603 3809880 3652328 3723795 3775197 3787134
5296C787134r3807Q1792O4912o29j2211K2857L630J16486m8861J85509J00263
$$ 3787134 3693327 3775119 3840031 3839402 3827191 3850048 3853678 3970164 3921303 4106812 4207075
5285D207075j8078J27204j6826O7146l1864K76950N8441n064k0942L4640l6165
$$ 4207075 4188997 4316201 4299375 4366521 4334657 4611607 4670048 4664984 4644042 4678682 4642517
5274D642517j06127n6796j67386J46708k8391k07377j49536n9007n2032j39750
$$ 4642517 4536390 4479594 4312208 4458916 4430525 4223148 4073612 4014605 3962573 3822823
5264C822823o5186Q0436Q8097j60230m9092j02651O8579J35490J8148k24271j64837
$$ 3822823 3757637 3838073 3926170 3765940 3716848 3614197 3682776 3818266 3836414 3612143 3447306
5253C447306J22894j62641M3985J2034Q8861J32127p3320K7259Q4613o5401M9162
$$ 3447306 3570200 3407559 3451544 3463578 3552439 3684566 3611246 3638505 3723118 3657717 3706879
5242C706879n1037J12251L9805K068o8738j04590l3818n8217J3369P4800n469
$$ 3706879 3655842 3768093 3807898 3809966 3741228 3636638 3602820 3544603 3557972 3632772 3627303
5231C627303P2858Q6902M9253p6195q0202O4104J24756J01940J75436k5506l5934
$$ 3627303 3700161 3787063 3836316 3760121 3679919 3744023 3868779 3970719 4146155 4120649 4084715
5220D084715R5959M294j46211J24448M6912O0976L0793N9250K3356Q7258N6651
$$ 4084715 4180674 4184968 4038757 4163205 4210117 4271093 4301886 4361136 4384492 4471750 4528401
5209D528401j14454J55033N3719O5058K4230J1552O790P6147J27273O8929R2763
$$ 4528401 4413947 4568980 4622699 4687757 4711987 4723539 4730329 4806476 4933749 5002678 5095441
5198E095441Q6796k2041O5502R4743J68164l9001J54498L10506M7182Q8898K5982
$$ 5095441 5182237 5160196 5225698 5320441 5488605 5449604 5604102 5914608 5961790 6050688 6076670
5187F076670R7783J65508Q1145j5809j480J06875J76928R3952p8903R8873j7058
$$ 6076670 6174453 6339961 6421106 6405297 6403817 6510692 6687620 6781572 6702669 6801542 6784484
5176F784484K7319J11111J49615j5749k4460p7990j29315k807j01071J9735M4819
$$ 6784484 6811803 6922914 7072529 7056780 7032320 6954330 6825015 6822208 6721137 6740872 6785691
5165F785691Q5130o4991j20961p4283N2155J87975m0457J88293K76817P4999J67659
$$ 6785691 6870821 6805830 6684869 6610586 6662741 6850716 6810259 6998552 7275369 7350368 7518027
5154G518027K05626J49754N0521K14153J64255J89366K73443L23614L66786J04280
$$ 7518027 7723653 7873407 7923928 8138081 8302336 8491702 8765145 9088759 9455545 9559825
5144I559825O9612M53224M51778K90725L68689L45270L91357L36863L32774K19240
$$ 9559825 9629437 10082661 10534439 10825164 11193853 11539123 11930480 12267343 12600117 12819357
5134A2819357K48770J26333R7396J23691j07609k7102j3339q3588j21243L0083
$$ 12819357 13068127 13194460 13291856 13415547 13307938 13280836 13267497 13183909 13062666 13092749
5124A3092749J1829J11294J76710K01641L00645K78451M90957K26172K93753K97381
$$ 13092749 13104578 13215872 13392582 13594223 13894868 14173319 14664276 14890448 15184201 15481582
5114A5481582K03728k5476R5753J47834J67437J71930n9793N272M9993N2398j03304
$$ 15481582 15685310 15659834 15755587 15903421 16070858 16242788 16182995 16188267 16238260 16290658 16187354
5103A6187354l42658k91894k46979j77251k09261k11218k16011j70523k55335
$$ 16187354 15844696 15552802 15305823 15128572 14919311 14708093 14492082 14321559 14066224
5094A4066224r7474j6055l9040L4541N7010j19794o0814k6019K7971J51410o2693
$$ 14066224 13968750 13952695 13913655 13948196 14005206 13885412 13824598 13798579 13826550 13977960 13915267
5083A3915267Q0979L32331K82147l0289J69952R0752J75935K84434L6065L4890
$$ 13915267 13996246 14328577 14610724 14580435 14750387 14841139 15017074 15301508 15337573 15372463
5073A5372463J37250k4460j263k10586m8856J13030k90095j60960k58990q1441
$$ 15372463 15509713 15485253 15483990 15273404 15224548 15337578 15047483 14886523 14627533 14546092
5063A4546092l21026k54555j19434j89892l20943j04073j20318r7844m9777j21504
$$ 14546092 14225066 13970511 13851077 13661185 13340242 13236169 13115851 13018007 12968230 12846726
5053A2846726P5619J6880P3897j46685Q5762N7908P3171P9858K6123O4842J46200
$$ 12846726 12922345 12939225 13013122 12866437 12952199 13010107 13083278 13163136 13189259 13254101 13400301
5042A3400301K97091L95666K12783K96611K01361K37785J31097M30882M28060
$$ 13400301 13697392 14093058 14305841 14602452 14803813 15041598 15172695 15603577 16031637
5033A6031637K91358L53125L56698N61503M77642N90881O03799O56017P25092
$$ 16031637 16322995 16676120 17032818 17594321 18071963 18662844 19266643 19922660 20647752
5024B0647752Q88216R74119R57404P31727J030360J241407J184398J259279J021351
$$ 20647752 21535968 22510087 23467491 24199218 25229578 26470985 27655383 28914662 29936013
5015B9936013J131837J207505J264692J163485J114582J146776R12977J067615
$$ 29936013 31067850 32275355 33540047 34703532 35818114 36964890 37877867 38945482
5007C8945482R71037Q32909R57027P22866O97992Q52214Q99421R15844J137729
$$ 38945482 39916519 40749428 41706455 42429321 43127313 43979527 44878948 45794792 46932521
4998D6932521J364510J802665J626399J782665K021596J974846K162160K094239
$$ 46932521 48297031 50099696 51726095 53508760 55530356 57505202 59667362 61761601
4990F1761601K054588J971940J809546J574583J433008J418762J358911J102126
$$ 61761601 63816189 65788129 67597675 69172258 70605266 72024028 73382939 74485065
4982G4485065J048039Q10871J12764l56042n94073n92492n33271k92231k20890
$$ 74485065 75533104 76343975 76456739 76100697 75506624 74914132 74380861 74088630 73867740
4973G3867740j98394J26385L81528J78544J05818L55281N33738N45227P82932
$$ 73867740 73669346 73795731 74177259 74355803 74461621 74816902 75350640 75895867 76678799
4964G6678799Q67962R51504R08030Q54145N63192L93023J45386k20945m14498
$$ 76678799 77546761 78498265 79406295 80260440 80823632 81216655 81362041 81141096 80726598
4955H0726598o50361q11411j120725j397065j345187j483334j481314j789987
$$ 80726598 80076237 79264826 78144101 76747036 75401849 73918515 72437201 70647214
4947G0647214j747074j508587j486258j286145r78562o68285n69586m04529l28983
$$ 70647214 68900140 67391553 65905295 64619150 63640588 62972303 62402717 61998188 61669205
4938F1669205m798J88608M98135N65930Q13068J159487J423777J322464J917349
$$ 61669205 61664407 61853015 62351150 62917080 63730148 64889635 66313412 67635876 69553225
4929F9553225K109448K270870K821760L389357L739706M345254N038825N436392
$$ 69553225 71662673 73933543 76755303 80144660 83884366 88229620 93268445 98704837
4921I8704837O169296O681819P279845Q132301R020303R746625J0456513J1465333
$$ 98704837 104874133 111555952 118835797 126968098 135988401 145735026 156191539 167656872
4913A67656872J1994519J2837084J3337899J3464781J3384610J2723272J2022210
$$ 167656872 179651391 192488475 205826374 219291155 232675765 245399037 257421247
4906B57421247J0609070Q536523O166096L442628L52054k674951n296358p765089
$$ 257421247 268030317 276566840 282732936 286175564 286527618 283852667 278556309 270791220
4898B70791220r718635j1368077j2418479j3412394j3375294j2492043j1480730
$$ 270791220 261072585 249704508 237286029 223873635 210498341 198006298 186525568
4891A86525568j0276918q987812p907790o757477n668750m740656l545757k714401
$$ 186525568 176248650 167260838 159353048 152595571 146926821 142186165 138640408 135926007
4883A35926007j488530m50947K88263Q30819R07847M99915j42102j445909l089636
$$ 135926007 134437477 133986530 134274793 135105612 136013459 136513374 136371272 134925363 131835727
4874A31835727l880936m249060m062042m112054l911876l717267l666178l507797
$$ 131835727 127954791 123705731 119643689 115531635 111619759 107902492 104236314 100728517
4866A00728517l727477l517850l389423l157894k766303k283755j901822j689494
$$ 100728517 97001040 93483190 90093767 86935873 84169570 81885815 79983993 78294499
4858G8294499j387700j104299q24181o07038o23917o42567p45008j012661r98278
$$ 78294499 76906799 75802500 74978319 74371281 73747364 73104797 72359789 71347128 70348850
4849G0348850j206653j157576j043618r58341q78998j249412j612843j313564
$$ 70348850 69142197 67984621 66941003 65982662 65103664 63854252 62241409 60927845
4841F0927845j254419j086816r00206o40080m91502m17512j81696j18761j56040
$$ 60927845 59673426 58586610 57686404 57046324 56554822 56137310 55955614 55836853 55680813
4832E5680813j85193k8509O286J46622K04641L98188O03939P85799O37955P70779
$$ 55680813 55495620 55467111 55473397 55620019 55824660 56222848 56826787 57612586 58250541 59021320
4822E9021320R54056P69349L28618J13186l48147p49078r69266j242736j590913
$$ 59021320 59975376 60744725 61073343 61186529 60838382 60089304 59120038 57877302 56286389
4813E6286389j824872j705240j839232j972044j835771j677122j557443j531791
$$ 56286389 54461517 52756277 50917045 48945001 47109230 45432108 43874665 42342874
4805D2342874j451065j427215j124983j203540j192537j012091q28327p65620
$$ 42342874 40891809 39464594 38339611 37136071 35943534 34931443 34103116 33337496
4797C3337496p69620o72927o55477o74481o56808n54416l25747l08809m01643
$$ 33337496 32567876 31894949 31239472 30564991 29908183 29353767 29028020 28719211 28317568
4788B8317568l04504k88584m06027k30850j08314k39368N0090m1406p8292m5030
$$ 28317568 28013064 27724480 27318453 27087603 26979289 26739921 26790011 26748605 26670313 26625283
4778B6625283l05116j1798l8519j72460k59668j8601j65607K3622j45617k53739
$$ 26625283 26320167 26308369 26269850 26097390 25837722 25819121 25653514 25677136 25531519 25277780
4768B5277780j1580j14930K3368L8662L147L14045R5110K09678J89327J59431
$$ 25277780 25266200 25151270 25174638 25213300 25216447 25530492 25625602 25835280 26024607 26184038
4758B6184038R3603J13132J10979o7874k33702j87404N8154m4036j28879k66123
$$ 26184038 26277641 26390773 26501752 26433878 26200176 26012772 26070926 26026890 25898011 25631888
4748B5631888J0207O6209J16272R6536J6465R8963K20687K26572O3878J26330
$$ 25631888 25642095 25708304 25824576 25921112 25937577 26036540 26257227 26483799 26547677 26674007
4738B6674007J49069J61323J35809Q3466K1657J04180J48294K0112K15621L33588
$$ 26674007 26823076 26984399 27120208 27203674 27225331 27329511 27477805 27497917 27713538 28047126
4728B8047126M07549L80533N51169M60394O65263Q43763O64071O89580N88001
$$ 28047126 28454675 28835208 29386377 29846771 30512034 31355797 32019868 32709448 33297449
4719C3297449R05195J193333J213828J501876J781301J783817K211813K489082
$$ 33297449 34202644 35395977 36609805 38111681 39892982 41676799 43888612 46377694
4711D6377694K937177L470590M081245M834177N294250O037617O724559P752215
$$ 46377694 49314871 52785461 56866706 61700883 66995133 73032750 79757309 87509524
4703H7509524Q879603R779569J1622681J4994228J8987348K1649872K0915757
$$ 87509524 96389127 106168696 117791377 132785605 151772953 173422825 194338582
4696A94338582J9796403J7844295J5349326J0465628j139651j7620043k2657233
$$ 194338582 214134985 231979280 247328606 257794234 256654583 239034540 216377307
4689B16377307k1010155j8025206j3472267j0803351r109104q266009p443535
$$ 216377307 195367152 177341946 163869679 153066328 143957224 135691215 128247680
4682A28247680o770340o142353n482074n072416n032027m175442l364375k270770
$$ 128247680 121477340 115334987 109852913 104780497 99748470 95573028 92208653 89937883
4674H9937883j749968j180274r79241n17697j3778K48755N40769J020453J476364
$$ 89937883 88187915 87007641 86028400 85510703 85496925 85745680 86286449 87306902 88783266
4665H8783266K065435K743052L390946M120348M967628N803471O697535P815651
$$ 88783266 90848701 93591753 96982699 101103047 106070675 111874146 118571681 126387332
4657A26387332Q846118R695207J0795694J2011205J3205643J4661447J6660983
$$ 126387332 135233450 144928657 155724351 167735556 180941199 195602646 212263629
4650B12263629J9599129K3589143K7880253L1047845L3451884L5216400L3731009
$$ 212263629 231862758 255451901 283332154 314379999 347831883 383048283 416779292
4643D16779292K9435995K1482190Q412730p533647j8142568k5458875k9889297
$$ 416779292 446215287 467697477 476110207 468576560 450433992 424975117 395085820
4636C95085820k9589980k7118850k3503125k0002323j7490961j5722431j4033176
$$ 395085820 365495840 338376990 314873865 294871542 277380581 261658150 247624974
4629B47624974j2887151j1885661j0699192r153895p956704o767315n764440n262307
$$ 247624974 234737823 222852162 212152970 202999075 195042371 188275056 182510616 177248309
4621A77248309n024667n390047o439543p259016p590297p403789o862740o265825
$$ 177248309 172223642 166833595 160394052 153135036 145544739 138140950 131278210 125012385
4613A25012385n895276n529230n250042m680887m081899l905571l522174l323589
$$ 125012385 119117109 113587879 108337837 103656950 99575051 95669480 92147306 88823717
4605H8823717l020448k898141k771721k467425k545923k481024k261603k189365
$$ 88823717 85803269 82905128 80133407 77665982 75120059 72639035 70377432 68188067
4597F8188067k120077j973182j909796j486515j510670j462231j263844r30667
$$ 68188067 66067990 64094808 62185012 60698497 59187827 57725596 56461752 55531085
4589E5531085r24656r21965o24344n69428o27577p40024o09701m29740l35097
$$ 55531085 54606429 53684464 53060120 52490692 51863115 51123091 50513390 50083650 49748553
4580D9748553m37816m54334n30430m16422p05222p31079o51654p64970p15921
$$ 49748553 49310737 48856403 48325973 47909551 47204329 46473250 45821596 45056626 44340705
4571D4340705n83290m76215m38243l43336l96406l36464p8850j66650M7165J82156
$$ 44340705 43757415 43281200 42842957 42499621 42103215 41766751 41687901 41521251 41568416 41750572
4561D1750572J46624M5521L07038K29997L21150L72115M68961L03721L35468J44879
$$ 41750572 41897196 41942717 42249755 42479752 42800902 43173017 43641978 43945699 44281167 44426046
4551D4426046R880O8318j86315k16838k30580o7925J47270K49455L32583P59978
$$ 44426046 44435926 44504244 44317929 44101091 43870511 43802586 43949856 44199311 44531894 45291872
4541D5291872R53415J118926J507108J802880J477445J442303J446180J137323
$$ 45291872 46245287 47364213 48871321 50674201 52151646 53593949 55040129 56177452
4533E6177452M20550J51868j97090l52331M5124n0131j28948J2492O7788J11082
$$ 56177452 56598002 56749870 56552780 56200449 56245573 56195442 56066494 56078986 56146774 56257856
4523E6257856J87912L01881K0971J09659p1322j95698m32923r43230j258719j600196
$$ 56257856 56445768 56747649 56768620 56878279 56806957 56611259 56178336 55235106 53976387 52376191
4513E2376191j645064j645833j542613j056527p27546n47277k73647l2521J35610
$$ 52376191 50731127 49085294 47542681 46486154 45758608 45211331 44937684 44905163 45040773
4504D5040773N55713P69813Q06507J076852J268119J660109J698713J739273J795365
$$ 45040773 45596486 46366299 47172806 48249658 49517777 51177886 52876599 54615872 56411237
4495E6411237J843755J489963R86125K18942o54867k253386l531357l531452l288986
$$ 56411237 58254992 59744955 60731080 60950022 60295155 58041769 54510412 50978960 47689974
4486D7689974k678024k384702k102176j928404j625017j518326j690252j456423
$$ 47689974 45011950 42627248 40525072 38596668 36971651 35453325 33763073 32306650
4478C2306650j273686j165614j256143j146475r75885q54515q48207q23638o38877
$$ 32306650 31032964 29867350 28611207 27464732 26488847 25634332 24786125 23962487 23323610
4469B3323610o37479l75680l89029m50644l40248k05169m18064j28552l2757j4829
$$ 23323610 22686131 22310451 21921422 21470778 21130530 20925361 20507297 20378745 20345988 20331159
4459B0331159m5225m1553m06990J5174n3748j40071k44780k68932l51121l16151
$$ 20331159 20285934 20244381 19837391 19852565 19798817 19658746 19413966 19145034 18793913 18477762
4449A8477762j86827l15476k19247k45287j61733p1623K4157J84063J3458k5788
$$ 18477762 18290935 17975459 17756212 17510925 17349192 17277569 17301726 17485789 17499247 17473459
4439A7473459J47k1843M4430j02288j76148k53735K7859r7179j91388k55310k54932
$$ 17473459 17473606 17451763 17496193 17393905 17217757 16964022 16991881 16894702 16703314 16448004 16193072
4428A6193072k32659j76368j00601l1184J173R486l4960Q6183l9550J61925K28476
$$ 16193072 15960413 15784045 15683444 15652260 15653433 15662919 15627959 15714142 15674592 15836517 16064993
4417A6064993L47787L49112K54737J66364K19564l8110k42690l86742l07209n04679
$$ 16064993 16412780 16761892 17016629 17182993 17402557 17364447 17121757 16735015 16427806 15923127
4407A5923127n80382k99174l29725m06347j65048j03091q8569j82477j73938j68653
$$ 15923127 15342745 15043571 14713846 14307499 14142451 14039360 13950791 13768314 13594376 13425723
4397A3425723k72510k23583j73475k96768l62025j54458j66058k34977k81908
$$ 13425723 13153213 12929630 12756155 12459387 12097362 11942904 11776846 11541869 11259961
4388A1259961j62555L383j48341j39621j35189L1954N7115p3052j18230N3588
$$ 11259961 11097406 11100789 10952448 10812827 10677638 10709592 10766707 10693655 10575425 10629013
4378A0629013p3995j37602j39709j44816o3705j45964j63386k11690j05395k21014
$$ 10629013 10555018 10417416 10277707 10132891 10069186 9923222 9759836 9548146 9442751 9221737
4368I221737j0239j27547j66336r6131k2204r1785k8340n931k2454o6631k26277
$$ 9221737 9211498 9083951 8917615 8821484 8799280 8707495 8679155 8673224 8650770 8584139 8357862
4357H357862p2982q0374M1419j6731j74375n1259J81096J0700k31460L5963P9153
$$ 8357862 8284880 8204506 8245925 8229194 8054819 8003560 8184656 8195356 7963896 7999859 8079012
4346H079012P6839q8289J04453K22427J65687R9038R2142J04400N3374n3104q8606
$$ 8079012 8155851 8067562 8172015 8394442 8560129 8659167 8751309 8855709 8909083 8855979 8767373
4335H767373M1498j80048j52044k36292j99857j22733n130j63464j83108j5061
$$ 8767373 8808871 8628823 8476779 8240487 8040630 7917897 7912767 7749303 7566195 7551134
4325G551134j91002k25096r410j01293j41854m1364j12338O2078N5700j14222
$$ 7551134 7360132 7135036 7125626 7024333 6882479 6841115 6728777 6790855 6846555 6732333
4315F732333K9351n4559j52572j14712m0639j90645r930p2806j96205N3167j6445
$$ 6732333 6761684 6707125 6554553 6439841 6399202 6208557 6198627 6125821 5929616 5982783 5966338
4304E966338M2283j5294Q7703j22354j43983o7069K6535L3239l142k8963m7385
$$ 5966338 6008621 5993327 6081030 5958676 5814693 5747624 5774159 5807398 5804256 5775293 5727908
4293E727908m6571j14611J53747k0151O6822K2538j63459m2323q4104K0630p8946
$$ 5727908 5681337 5566726 5720473 5700322 5767144 5789682 5626223 5583900 5499796 5520426 5441480
4282E441480l4931n6214J37274l0261j38275L4789j89291R3376P0037j37515M7412
$$ 5441480 5406549 5350335 5487609 5457348 5319073 5353862 5164571 5257947 5327984 5190469 5237881
4271E237881j48184k8158L1285j38106j34823N8741j0271k9337R3727L0921j49819
$$ 5237881 5089697 5061539 5092824 4954718 4819895 4878636 4868365 4839028 4932755 4963676 4813857
4260D813857m1014K9484p299R609P7j0501M4270J1612N6170l8018R9859K5532
$$ 4813857 4772843 4802327 4795028 4804637 4804714 4794213 4838483 4850095 4906265 4868247 4968106 4993638
4248D993638j17478o7047j658r058j08852m4316p9333L0583q0668J0811L5287
$$ 4993638 4876160 4809113 4807455 4798397 4689545 4645229 4565896 4596479 4515811 4526622 4561909
4237D561909J12811m7258m3046j10280j75248J00341Q3722r7510p193K232j03277
$$ 4561909 4674720 4627462 4584416 4474136 4298888 4399229 4482951 4385441 4378248 4380480 4277203
4226D277203K4868j4257p564J0537J36209J01097p0856o7693j12525Q8945P2141
$$ 4277203 4302071 4287814 4280250 4290787 4426996 4528093 4457237 4389544 4277019 4365964 4438105
4215D438105N6713P4863k7025Q1810J58752L2772J6622J43178O9256o2652n3709
$$ 4438105 4494818 4569681 4542656 4624466 4783218 4815990 4832612 4975790 5045046 4982394 4928685
4204D928685j21007k3494J6620j07322m6538l7935o1732L8828k9490l2185R9852
$$ 4928685 4807678 4784184 4800804 4693482 4646944 4609009 4547277 4586105 4556615 4524430 4624282
4193D624282j50315M5910R7598R0674P9007j80371J09978P8417M7054j40847p8980
$$ 4624282 4473967 4519877 4617475 4708149 4787156 4606785 4716763 4795180 4842234 4701387 4622407
4182D622407J34171j03160j1707k255j321J48870J82503J10378J10501p720O8348
$$ 4622407 4756578 4653418 4641711 4639456 4638135 4787005 4969508 5079886 5190387 5182667 5251015
4171E251015R0101Q316K21365L0803o599p9346o6117J8416m5339j01101k5743
$$ 5251015 5341116 5349432 5570797 5601600 5595001 5515655 5449538 5467954 5422615 5321514 5295771
4160E295771j698Q8596J40923L358m871K09891J38431j10147K73226K73623K16162
$$ 5295771 5294073 5382669 5523592 5526950 5522079 5731970 5870401 5760254 6033480 6307103 6523265
4149F523265J67327J30138J92142p7606r447Q6278M9961L0196p2613p5596n6310
$$ 6523265 6690592 6820730 7012872 6935266 6925819 7012097 7062058 7092254 7019641 6944045 6887735
4138F887735n8491k27132J5806j64665p2460Q4529p5263p9276M9638L6055K4609
$$ 6887735 6829244 6602112 6617918 6453253 6380793 6465322 6390059 6310783 6360421 6396476 6421085
4127F421085R3484q4218J10000J66393P8761J46053n9317J44524Q1094J65716
$$ 6421085 6514569 6430351 6540351 6706744 6785505 6931558 6872241 7016765 7097859 7263575
4117G263575K21368R4283J23339K01087J85235R5879L46377J39657N062J56123
$$ 7263575 7484943 7579226 7702565 7903652 8088887 8184766 8531143 8670800 8675862 8831985
4107H831985K95636l4199R4795J59848J28568K05226J84606j72758o3819J73580
$$ 8831985 9127621 9093422 9188217 9348065 9476633 9681859 9866465 9693707 9629888 9803468
4097I803468N3747L2804j01762m9315N4325Q5414Q1508l8904J44065N4653J69285
$$ 9803468 9857215 9890019 9788257 9738942 9793267 9878681 9960189 9921285 10065350 10120003 10289288
4086A0289288J93969N7876J01806K02582P4365p525J79527K52136J3456J9070
$$ 10289288 10483257 10541133 10642939 10845521 10919886 10912361 11091888 11344024 11357480 11376550
4076A1376550K1443k3005J0578j48432n731l3062l2232j56569j7141k7253j93326
$$ 11376550 11397993 11374988 11385566 11237134 11231403 11198341 11166109 11009540 10992399 10965146 10771820
4065A0771820k08195k53243m2542L3933J6516p5318k0793p3852J13997k622l4687
$$ 10771820 10563625 10310382 10267840 10301773 10318289 10242971 10222178 10148326 10262323 10259701 10225014
4054A0225014M3448K0834o9107j3786j11786K1247L1221j11679l882j589r4490
$$ 10225014 10268462 10289296 10220189 10206403 10094617 10115864 10147085 10035406 10031524 10029935 9935445
4043I935445N400P5270j10252o967J32723J50524o8738N1907N3951m1095k48404
$$ 9935445 9940845 10016115 9905863 9898896 10031619 10182143 10113405 10165312 10219263 10178168 9929764
4032I929764j63127k25600j23507O1177Q4506J1112O6937J81873J75518J62737
$$ 9929764 9766637 9541037 9417530 9478707 9563213 9574325 9641262 9823135 9998653 10161390
4022A0161390J55261R1960J32703J10824N215O11L0161Q6804J33355N0200K39540
$$ 10161390 10316651 10408611 10541314 10652138 10657353 10657964 10688125 10774929 10908284 10958484 11198024
4011A1198024K42714L75549L68417L58301K93695L36277J82058p6604k77452n74564
$$ 11198024 11440738 11816287 12184704 12543005 12836700 13172977 13355035 13278431 13000979 12426415
4001A2426415m16869k32631k46120k90015j76633N9487j56626r086m6231Q5779
$$ 12426415 12009546 11776915 11530795 11240780 11064147 11123634 10967008 10957922 10911691 10997470
3991A0997470j34606j29614m2089j35180k23930l32284j66102N423j70230j91829
$$ 10997470 10862864 10733250 10691161 10555981 10332051 9999767 9833665 9839088 9668858 9477029
3981I477029n5023J12375O3278m3942R6481N5699l119j65163l65694m52030o6201
$$ 9477029 9422006 9534381 9597659 9553717 9650198 9705897 9702778 9537615 9171921 8719891 8653690
3970H653690n2302j31923j27315k0051k59667j4115L442L275p1759j19864j34933
$$ 8653690 8601388 8469465 8342150 8322099 8062432 8048317 8051759 8055034 7983275 7863411 7728478
3959G728478M0155O3852j18584j26078r7620J34652j2144R3435J05072o7495l4133
$$ 7728478 7768633 7832485 7713901 7587823 7490203 7624855 7612711 7706146 7811218 7743723 7709590
3948G709590N8090J0778j41995J73941j12o1949N5691J05230k5008o8735l4995
$$ 7709590 7767680 7778458 7636463 7810404 7810292 7748343 7804034 7909264 7884256 7815521 7780526
3937G780526j09246l9687P4146R9425m6487O637J01536J38889M8279O2747J0943
$$ 7780526 7671280 7631593 7705739 7805164 7758677 7765314 7866850 8005739 8054018 8116765 8127708
3926H127708J0438P148J06488J70702q492R6567J06514R9931M3877J48300J25366
$$ 8127708 8138146 8145294 8251782 8422484 8413992 8510559 8617073 8717004 8760881 8909181 9034547
3915I034547N5505j7198J00624J99078N3139N3638J07318L2909J35808p8693Q587
$$ 9034547 9090052 9072854 9173478 9372556 9425695 9479333 9586651 9619560 9755368 9676675 9685262
3904I685262M0751r280J51332k7832o6479J60750R8253K8654O8726n2069J94660
$$ 9685262 9726013 9716733 9868065 9840233 9773754 9934504 10032757 10061411 10130137 10078068 10272728
3893A0272728R7273J07266p1188j13866J2458P1819k793r8201J89156P1551j10860
$$ 10272728 10370001 10477267 10406079 10292213 10304671 10376490 10373697 10275496 10464652 10536203 10425343
3882A0425343l8139O5985J31549L5418L6206J26862o4962m1602k6609O9522P5078
$$ 10425343 10387204 10453189 10584738 10620156 10656362 10783224 10718262 10676660 10650051 10719573 10794651
3871A0794651J29006Q1675n8628j1805l4545R414K0286p3036m703J40466K749
$$ 10794651 10923657 11005332 10946704 10934899 10900354 10909768 10930054 10857018 10852315 10992781 10995530
3860A0995530n0286K3718R4965Q06K2734O8376k9168M9661R2566Q7201J85496
$$ 10995530 10945244 10968962 11063927 11064733 11087467 11155843 11126675 11176336 11268902 11356103 11541599
3849A1541599p1926m589N969R0166n926P8318N9505m2356N6163r1922j59535q0192
$$ 11541599 11469673 11465084 11471053 11561219 11555293 11633611 11693116 11650760 11706923 11615001 11455466 11375274
3837A1375274O3176l0661N5895j19175j62997j20175N1664M8080j57204j25814
$$ 11375274 11438450 11407789 11463684 11344509 11181512 11061337 11113001 11161081 11003877 10878063
3827A0878063N1946o5832o1985K1988l8662j03716n357j25937j3284n1238r6213
$$ 10878063 10930009 10864177 10802192 10824180 10785518 10681802 10676445 10550508 10537224 10485986 10389773
3816A0389773J72597J5495j16755o8418Q0865r4220L9710m16j74011l4893J68134
$$ 10389773 10562370 10577865 10461110 10392692 10473557 10379337 10419047 10418631 10244620 10209727 10377861
3805A0377861J7398j08704N3829K2404m244q6091r393J18784j13971K7391J75813
$$ 10377861 10395259 10286555 10340384 10362788 10358544 10272453 10263060 10381844 10267873 10295264 10471077
3794A0471077L0982j10876j04945L526J01037O425l6117K1947K798L2760N6812
$$ 10471077 10502059 10391183 10286238 10289764 10390801 10397226 10361109 10383056 10385854 10418614 10475426
3783A0475426l9064p7480j11690R4101j2648K7531N7677n6179N7495M4521P9854
$$ 10475426 10436362 10358882 10247192 10341293 10328645 10356176 10413853 10357674 10415169 10459690 10539544
3772A0539544P2748j6387J12123m5273P6882Q3972P9551N1990K2012n0742K00174
$$ 10539544 10612292 10595905 10708028 10662755 10739637 10823609 10903160 10955150 10977162 10926420 11126594
3761A1126594K07392j12886M8679M5148N4946Q5981r1393m3097J07851Q822J38939
$$ 11126594 11333986 11221100 11269779 11314927 11369873 11455854 11364461 11321364 11429215 11438037 11576976
3750A1576976P7610J13993N6470j47R5746R829J26227l1885o014K56862K26947
$$ 11576976 11654586 11768579 11825049 11824902 11920648 11930477 12056704 12024819 12018805 12275667 12502614
3739A2502614m213K6953R3640j13305J2276N2080r2038M4663P7402J07436J22606
$$ 12502614 12498401 12525354 12618994 12505689 12517965 12570045 12478007 12522670 12600072 12707508 12830114
3728A2830114m3260O1612j57715k1246P5282K2473Q4001M240j09783l4577R4111
$$ 12830114 12786854 12848466 12690751 12669505 12744787 12767260 12851261 12855501 12745718 12711141 12805252
3717A2805252J68567J32315o0396N7435l2854K07955R167j63271j0796j63549
$$ 12805252 12973819 13106134 13045738 13103173 13070319 13278274 13287441 13124170 13113374 12949825
3707A2949825J0970L2114J5843M0355J52367M1718m8467r2811j3618N1159J10255
$$ 12949825 12960795 12992909 13008752 13049107 13201474 13243192 13194725 13101914 13088296 13139455 13249710
3696A3249710O6465N3836o7100J36985J49172K33j21197L5937K1242j24601J920
$$ 13249710 13316175 13370011 13302911 13439896 13589068 13589301 13468104 13504041 13525283 13400682 13402602
3685A3402602P2103j11707m3754J21870J01640j21493o0673o7309q7653R1618
$$ 13402602 13474705 13362998 13319244 13441114 13542754 13421261 13360588 13293279 13205626 13297244
3675A3297244j5047j67767j44577M602R1107J3890N3244q7836N4374j103O2499
$$ 13297244 13282197 13114430 12969853 12974455 13065562 13079452 13132696 13044860 13099234 13098131 13160630
3664A3160630n7235O9762J31098q4883J01708K3995j04608q1396J92292K9866
$$ 13160630 13103395 13173157 13304255 13219372 13321080 13345075 13240467 13159071 13351363 13381229
3654A3381229N5986J54093q038n0365J28916O6134Q1257L8285j4839l2822M5108
$$ 13381229 13437215 13591308 13583270 13532905 13661821 13727955 13809212 13847497 13832658 13799836 13844944
3643A3844944l5390J8402J19916L2256k8165J45604K7940J16649J95659N0265
$$ 13844944 13809554 13827956 13947872 13980128 13951963 14097567 14125507 14242156 14437815 14488080
3633A4488080r163j00060M8991J41310J70241K29736J11690M7545K7162J68260
$$ 14488080 14478917 14378857 14427848 14569158 14739399 14969135 15080825 15128370 15155532 15323792
3623A5323792J06881j7235Q3190J71269J22257k7130J28576J14125J55328K5013
$$ 15323792 15430673 15413438 15496628 15667897 15790154 15763024 15891600 16005725 16161053 16186066
3613A6186066J61714J30732J44865J84020R1700J30732J5209J08726J32016J89887
$$ 16186066 16347780 16478512 16623377 16807397 16899097 17029829 17045038 17153764 17285780 17475667
3603A7475667O1760J33880J47761R8296J14642J76242q379J63668J74581J27505
$$ 17475667 17537427 17671307 17819068 17917364 18032006 18208248 18199869 18363537 18538118 18665623
3593A8665623J93555K45714K64731J18067M8324J85564J71597K62909J56300J74180
$$ 18665623 18859178 19104892 19369623 19487690 19536014 19721578 19893175 20156084 20312384 20486564
3583B0486564J95511J34592K12452J62171L05459K67755J33854J30062K55522
$$ 20486564 20682075 20816667 21029119 21191290 21496749 21764504 21898358 22028420 22283942
3574B2283942K34028R4411J68563K47737K01097K31186J75411L24600L52920L30912
$$ 22283942 22517970 22612381 22780944 23028681 23229778 23460964 23636375 23960975 24313895 24644807
3564B4644807K17136K81088J54676L11513L45923L43110M05179L99194L33032
$$ 24644807 24861943 25143031 25297707 25609220 25955143 26298253 26703432 27102626 27435658
3555B7435658K83152L74071L29647N02128L61684M08692M62212M81882M42212
$$ 27435658 27718810 28092881 28422528 28924656 29286340 29695032 30157244 30639126 31081338
3546C1081338O06695N34344N02741N29568N02168N22574O35892O25238Q24013
$$ 31081338 31688033 32222377 32725118 33254686 33756854 34279428 34915320 35540558 36364571
3537C6364571O78477N59510N99362Q15085P45206P83370R60865Q23798P55422
$$ 36364571 37043048 37602558 38201920 39017005 39762211 40545581 41506446 42330244 43085666
3528D3085666P50122R13380Q04211P54556Q03367Q89562P76509R92330R20983
$$ 43085666 43835788 44749168 45553379 46307935 47111302 48000864 48777373 49769703 50690686
3519E0690686R37287R75002Q02032J073833J149837J017648J100754J161145J404728
$$ 50690686 51627973 52602975 53405007 54478840 55628677 56646325 57747079 58908224 60312952
3510F0312952J691189J477599J310977J672583J815509J772083J964268K153177
$$ 60312952 62004141 63481740 64792717 66465300 68280809 70052892 72017160 74170337
3502G4170337K297833K558797K499091K743145L176591L255543L488072L812432
$$ 74170337 76468170 79026967 81526058 84269203 87445794 90701337 94189409 98001841
3494I8001841M034656M231808M501310M976096N241810N807743O193123O447630
$$ 98001841 102036497 106268305 110769615 115745711 120987521 126795264 132988387 139436017
3486A39436017O503000P128110P350369P471487P539530P473553P091392O217302
$$ 139436017 145939017 153067127 160417496 167888983 175428513 182902066 189993458 196210760
3478A96210760N239387L836153K228204M16045j479732l033547m272423n013976
$$ 196210760 201450147 205286300 207514504 207930549 206450817 203417270 199144847 194130871
3470A94130871n393490n390647n379108n153952m829878m832902m586899m556380
$$ 194130871 188737381 183346734 177967626 172813674 167983796 163150894 158563995 154007615
3462A54007615m200367m096001l973543l781488l552138l296701l056683k949284
$$ 154007615 149807248 145711247 141737704 137956216 134404078 131107377 128050694 125101410
3454A25101410k753034k421812k349037k387105k298190k230372k039799j909892
$$ 125101410 122348376 119926564 117577527 115190422 112892232 110661860 108622061 106712169
3446A06712169j922723j958148k051543j961549j735169j942366k024747j835894
$$ 106712169 104789446 102831298 100779755 98818206 97083037 95140671 93115924 91280030
3438I1280030j815628j780899j792866j770358j587311j582184j436847j517515
$$ 91280030 89464402 87683503 85890637 84120279 82532968 80950784 79513937 77996422
3430G7996422j527586j502255j282394j397331j516089j383163j429743j334615
$$ 77996422 76468836 74966581 73684187 72286856 70770767 69387604 67957861 66623246
3422F6623246j163486j074600j127946r20021j012708r26539r08201r82699r19296
$$ 66623246 65459760 64385160 63257214 62337193 61324485 60397946 59489745 58507046 57587750
3413E7587750o45937p69290q25567n97419o42354p29721n95489n58257n65806
$$ 57587750 56941813 56172523 55346956 54749537 54107183 53377462 52781973 52223716 51657910
3404E1657910m51389l43737k91153l81125k16552k84172m28706l43043l23913
$$ 51657910 51206521 50862784 50571631 50190506 49973954 49689782 49261076 48918033 48594120
3395D8594120n34871p08593o86855p34687n81986m74521l40480n96181n19288
$$ 48594120 48059249 47350656 46663801 45929114 45347128 44872607 44532127 43935946 43416658
3386D3416658n08182m25800l29195m05197m49438m42456l36495m25252l66319
$$ 43416658 42908476 42482676 42153481 41748284 41298846 40856390 40519895 40094643 39728324
3377C9728324l61765k75825l42535l31848l56277j97782k86912l48728m1568j91269
$$ 39728324 39366559 39090734 38748199 38416351 38060074 37862292 37575380 37226652 37185084 36993815
3367C6993815l31810k69567j31320j40687m56985k92714n44003m12516l78865
$$ 36993815 36662005 36392438 36261118 36120431 35663446 35370732 34826729 34414213 34035348
3358C4035348l80970k85366l12292l08773m20105k82797l17453k67196j36186
$$ 34035348 33654378 33369012 33056720 32747947 32327842 32045045 31727592 31460396 31324210
3349C1324210j83155k14998k45480k90339k51468k82963j27736j76664l39522
$$ 31324210 31141055 30926057 30680577 30390238 30138770 29855807 29728071 29551407 29211885
3340B9211885j34165j34096j15618k72745l24081j5891j02310j97887k27895p0167
$$ 29211885 29077720 28943624 28828006 28555261 28231180 28215289 28112979 27915092 27687197 27617030
3330B7617030j17057l11559j72850j16955j16215j67876o1627o5478o5951k60346
$$ 27617030 27499973 27188414 27015564 26898609 26782394 26614518 26552891 26487413 26421462 26161116
3320B6161116j21275k17661j6835J05193j88863j86352j41118j88060j30269r3349
$$ 26161116 26039841 25822180 25805345 25910538 25721675 25535323 25394205 25206145 25075876 24982527
3310B4982527j09519j36221k23454q823r8731j45330j72279j51490j64342k20911
$$ 24982527 24873008 24736787 24513333 24504510 24405779 24260449 24088170 23936680 23772338 23551427
3300B3551427k42340q1741q5959k76244j98563j51351j81170o4383l2782j13182
$$ 23551427 23309087 23227346 23141387 22865143 22666580 22515229 22334059 22269676 22236894 22123712
3290B2123712j82639q2201j06318o0047k17511j06744j34131o0302j67092k14309
$$ 22123712 21941073 21858872 21752554 21692507 21474996 21368252 21234121 21173819 21006727 20792418
3280B0792418K5556r3931j35871j72558k19206j74188k44866j64050j10375j52702
$$ 20792418 20817974 20724043 20588172 20415614 20196408 20022220 19777354 19613304 19502929 19350227
3270A9350227k75312k71180j28459k23662j02251L6678k85291j63433j12881q8918
$$ 19350227 19074915 18803735 18675276 18451614 18349363 18386041 18100750 17937317 17824436 17735518
3260A7735518J1977j02350N1461j40250j04586q1739j83544j70418N965l2306
$$ 17735518 17747495 17645145 17696606 17556356 17451770 17370031 17186487 17016069 17022034 16989728
3250A6989728q6392K3516J25515L855K4942O5529o0968j47696j18772l0404p0453
$$ 16989728 16903336 16926852 17052367 17056222 17081164 17146693 17085725 16938029 16819257 16788853 16718400
3239A6718400j0257l5477j6817Q9324o72m0908Q6754M5792M6766J41634J41485
$$ 16718400 16708143 16672666 16655849 16745173 16744501 16703593 16790347 16836139 16882905 17024539 17166024
3228A7166024k7201Q0431K32404Q7198J30495P9813n8945N9063K03882K71655
$$ 17166024 17138823 17219254 17451658 17538856 17669351 17749164 17690219 17749282 17953164 18224819
3218A8224819o77J01061J04706J73398J78216L17317K64391kL74505J53852R3666
$$ 18224819 18224142 18325203 18429909 18603307 18781523 19098840 19363231 19363229 19737734 19891586 19985252
3207A9985252K70123J04047M5699O3151J17703K59909Q7629K25452R5507K17467
$$ 19985252 20255375 20359422 20405121 20468272 20585975 20845884 20933513 21158965 21254472 21471939
3197B1471939J45752J51909J84269K04472K26265J03495M09030K64257L63428
$$ 21471939 21617691 21769600 21953869 22158341 22384606 22488101 22897131 23161388 23524816
3188B3524816L90856M40840M11980N10805L74754M14714O52147O17335N75686
$$ 23524816 23915672 24356512 24768492 25279297 25654051 26068765 26720912 27338247 27913933
3179B7913933N91444O13522N58692P72580P28824R11461Q46603Q16358R11937
$$ 27913933 28505377 29118899 29677591 30450171 31178995 32090456 32937059 33753417 34665354
3170C4665354R45565J167712R10899J005521J075338J022594R07531J035498P61793
$$ 34665354 35610919 36778631 37689530 38695051 39770389 40792983 41700514 42736012 43497805
3161D3497805P80155O94359Q66365P34886O81601P03053Q74017J127311R97233
$$ 43497805 44277960 44972319 45838684 46573570 47255171 47958224 48832241 49959552 50956785
3152E0956785J273187J178335J350980J428941J611717J732030J904503J883949
$$ 50956785 52229972 53408307 54759287 56188228 57799945 59531975 61436478 63320427
3144F3320427J961022K180049K352722K318319K768283K619174K541941K438594
$$ 63320427 65281449 67461498 69814220 72132539 74900822 77519996 80061937 82500531
3136H2500531K032436J727437J075795L93025j15842p22186j062883j132152q81068
$$ 82500531 84532967 86260404 87336199 87729224 87613382 86891196 85828313 84696161 83815093
3127H3815093p86852o84573j31223J51411L21603M68720P25512Q03371J146236
$$ 83815093 83028241 82343668 82212445 82363856 82685459 83154179 83879691 84683062 85829298
3118H5829298J294256J209347J344225J409644J408841J426629J229977J060591
$$ 85829298 87123554 88332901 89677126 91086770 92495611 93922240 95152217 96212808
3110I6212808R61485N04225J44851j82962o65914j039093j177026j488517j747090
$$ 96212808 97174293 97678518 97823369 97640407 96974493 95935400 94758374 93269857 91522767
3101I1522767j979736k122237k019805k005740j461304j480514j202864j041734
$$ 91522767 89543031 87420794 85400989 83395249 81933945 80453431 79250567 78208833
3093G8208833j018293p30001o82193m49686n30998m18815n15907n89415p49609
$$ 78208833 77190540 76460539 75778346 75328660 74797662 74378847 73862940 73273525 72523916
3084G2523916r70161j248112j239174j461551j777091j866141k089795k077112
$$ 72523916 71553755 70305643 69066469 67604918 65827827 63961686 61871891 59794779
3076E9794779j957102k138235j982549j822624j777465j739461j721426j460997
$$ 59794779 57837677 55699442 53716893 51894269 50116804 48377343 46655917 45194920
3068D5194920j364758j164709j287166j276066j103562j132417j064424q03280
$$ 45194920 43830162 42665453 41378287 40102221 38998659 37866242 36801818 35998538
3060C5998538p36955q84358r30612o71084p21355q73066o51047p70166r14255
$$ 35998538 35261583 34377225 33446613 32775529 32054174 31181108 30530061 29759895 28845640
3051B8845640p52743n88023p25302p23750p07427n69450o91032p15399m98359
$$ 28845640 28092897 27504874 26779572 26055822 25348395 24778945 24087913 23372514 22874155
3042B2874155n51517m05974n41474n14529m19722l42905o58865n39321k52195
$$ 22874155 22322638 21916664 21375190 20860661 20440939 20098034 19439169 18899848 18647653
3033A8647653l22358m52328m73132k76928k23478k77377k48544k94418o0850k17378
$$ 18647653 18325295 17872967 17399835 17122907 16899429 16622052 16373508 16079090 16018240 15800862
3023A5800862j45192k43429l33182j85952k09834k08508k76170j11900l05378
$$ 15800862 15655670 15412241 15079059 14893107 14683273 14474765 14198595 14086695 13781317
3014A3781317k25960k45158k83464j70581j32627k32880k23603k41193q4833m01214
$$ 13781317 13555357 13310199 13026735 12856154 12723527 12490647 12267044 12025851 11941018 11539804
3004A1539804k54911k33740j40131J9704j37514n9028k11251j11418K7769j90224
$$ 11539804 11284893 11051153 10911022 10930726 10793212 10734184 10522933 10411515 10439284 10249060
2994A0249060l34238n2334O2355r3593j48104j44581j52368j80599k42150m4464
$$ 10249060 9914822 9862488 9924843 9831250 9683146 9538565 9386197 9205598 8963448 8918984
2984H918984j28169k05174k20501k4742k5680j90728k44132n4621k19583m7751
$$ 8918984 8790815 8585641 8365140 8340398 8314718 8123990 7879858 7825237 7605654 7557903
2974G557903r4326k26098l6421n3087j48313k06297r8864l1934n9168q9447j23129
$$ 7557903 7463577 7237479 7201058 7147971 6999658 6793361 6694497 6662563 6603395 6513948 6390819
2963F390819l7707p6402p3224j41355o4056N9503J08323j46557o0957J8337k41732
$$ 6390819 6353112 6276710 6203486 6062131 5998075 6057578 6165901 6019344 5958387 5976724 5734992
2952E734992j23577j28021j65780n3863K7150k14410L2858r192o4992j37014R4023
$$ 5734992 5611415 5483394 5317614 5263751 5290901 5076491 5109349 5100157 5035165 4898151 4992174
2941D992174k668o5300n645p5064q5271K4497r4512o8161l5592K2806N4687K2668
$$ 4992174 4989506 4924206 4918561 4843497 4758226 4782723 4688211 4620050 4584458 4607264 4661951 4684619
2929D684619q825j63747n7614j5840o1843J1797N020j9862J733j30651o756m6771
$$ 4684619 4675794 4512047 4454433 4438593 4376750 4388547 4393567 4373705 4375438 4244787 4238031 4191260
2917D191260q2463j0116P2425M5072o6420o6843j5343j07662J7390m4513j39248
$$ 4191260 4108797 4098681 4171106 4216178 4149758 4082915 4067572 3959910 3977300 3932787 3793539
2906C793539p3818J83399l0702k4624n0328k20955J67187r020j05608M9426q4382
$$ 3793539 3719721 3903120 3872418 3847794 3797466 3576511 3743698 3734678 3629070 3678496 3594114
2895C594114K5512o1095P25M7007j3265l2850j7256L3506L9568l0322j16697p6229
$$ 3594114 3619626 3558531 3559256 3606263 3592998 3560148 3542892 3576398 3615966 3585644 3468947 3392718
2883C392718l3478k0199m7797L6085m2531Q687n7070K2261N3790K7162M2088o67
$$ 3392718 3359240 3339041 3291244 3327329 3284798 3293485 3236415 3258676 3312466 3339628 3381716 3381049
2871C381049j63715m6772j34290L4760M0843j70024n6175L9071R5336N9943j08411
$$ 3381049 3217334 3170562 3036272 3071032 3111875 2941851 2885676 2924747 3020083 3080026 2971615
2860B971615J17868o7592L1603J3300j42775J02089N0613j05949K93J48741l6305
$$ 2971615 3089483 3021891 3053494 3066794 2924019 3026108 3076721 2970772 2971065 3119806 3083501
2849C083501N758j24964n6438j6038r845j9177K3697M272n6607j3378r421j8592
$$ 3083501 3089259 2964295 2907857 2891819 2881974 2862797 2886494 2890766 2834159 2820781 2811360 2792768
2837B792768J67890p7661n1610m903j59205P149O8729N5018q5813M168m2822L3622
$$ 2792768 2960658 2882997 2831387 2826484 2667279 2674428 2743157 2798175 2712362 2716530 2673708 2707330
2825B707330N204n9526M1874o3675j30639j6930K8161L9324J64537L9158j29828
$$ 2707330 2712534 2653008 2694882 2631207 2500568 2483638 2511799 2551123 2715660 2754818 2624990
2814B624990j87062q522Q3193M0585n5014j19161j9679J07370k1629p9338J9592
$$ 2624990 2437928 2429406 2512599 2553184 2498170 2379009 2359330 2466700 2445071 2365733 2385325
2803B385325l4606K6039o2858j47585k4974n5481O1904R2610L4047j52463M9013
$$ 2385325 2350719 2376758 2313900 2166315 2141341 2085860 2147764 2240374 2274421 2121958 2170971
2792B170971O2209k10348n7348J2443N2260j01568J4395j57787N6285P421M2481
$$ 2170971 2233180 2022832 1965484 1977927 2030187 1928619 1943014 1785227 1841512 1848933 1891414
2781A891414m2259m5312L5481j16140N0351k6629P2101j0844o0982J8774m3975
$$ 1891414 1849155 1803843 1839324 1723184 1773535 1746906 1819007 1808163 1747181 1765955 1721980
2770A721980k5050J4475N024P2911j7571J13042j06036l6815M5073L7726m2590
$$ 1721980 1696930 1711405 1716429 1789340 1771769 1884811 1778775 1741960 1787033 1824759 1782169
2759A782169L001l4916l0959M2546j35933r1143M1348j4728n593J69P3783j02175
$$ 1782169 1785170 1750254 1719295 1761841 1625908 1534765 1576113 1561385 1555792 1555961 1629744 1527569
2747A527569n7493M441q2711j9270p56K5246K01R8880m722o4361j37578R2597
$$ 1527569 1470076 1474517 1391806 1372536 1371780 1397026 1397227 1496107 1491385 1427024 1289446 1382043
2735A382043n9249m0439j5319P5283O3360j10691P9863K7410j3023l7186K4582
$$ 1382043 1322794 1282355 1267036 1342319 1405679 1294988 1374851 1402261 1389238 1352052 1376634
2724A376634j42519Q948m6362k3718N9553m9918n1380l5997J64917r5597j51317
$$ 1376634 1234115 1243063 1196701 1172983 1232536 1182618 1131238 1095241 1260158 1164561 1013244
2713A013244J08055M4108j7843k5520l3471N324l1593n0579j9921n4821J2564
$$ 1013244 1121299 1165407 1147564 1122044 1088573 1093897 1062304 1011725 991804 936983 949547
2702I49547K2589J29335Q2758k3336m3571j791j30297o0131J42145R5004q7841
$$ 949547 972136 1101471 1184229 1160893 1117322 1115531 985234 925103 1067248 1162252 1074411
2691A074411n908r2904M285j7986J57552m77o7864K4039j19287J6361r4371l9624
$$ 1074411 1068503 975599 979884 961898 1119450 1118973 1051109 1075148 955861 972222 877851 838227
2679H38227L3812Q5515l0309j50726O76R8011l087M9146n0291j4876l8498m1976
$$ 838227 872039 957554 927245 776519 777195 875206 872119 921265 870974 856098 817600 775624
2667G75624N2318j07953l9266k5492n2426J13425N9585K2379J9821n6015j06078
$$ 775624 827942 719989 680723 655231 602805 716230 775815 798194 818015 762000 655922
2656F55922J20751n3463n0364l9653m0176N5530l2021P016P9947p3334j75950
$$ 655922 776673 723210 672846 633193 593017 648547 616526 623542 703489 630155 454205
2645D54205P7801J66747j5619O5158j26309R1766l4624J3410n9135J5674p3519
$$ 454205 532006 698753 683134 748292 621983 713749 679125 692535 633400 649074 575555
2634E75555K2686J1210K4389q2060o5760j10022J12158R1434j20877J8379M7328
$$ 575555 598241 609451 633840 551780 486020 375998 488156 579590 458713 477092 524420
2623E24420k2584j10524N3136Q9347r6350k513m2127j11657N6930K6321j572p923
$$ 524420 501836 391312 444448 533795 437445 434932 392805 281148 338078 364399 362827 354904
2611C54904M2963R4899k868K4648J512j54054J7904M5705N8682l2982n4567j02398
$$ 354904 397867 492766 489898 514546 516058 362004 379908 425613 484295 451313 396746 294348
2599B94348r061k6437J53596k0542J199K1494l5147L2456M7689J01819J1394j97343
$$ 294348 285287 258850 412446 391904 393103 414597 379450 411906 459595 561414 572808 375465
2587C75465n1027J15313o1854m6703J22078p6408K4414k5251j43508L6110L7003
$$ 375465 324438 439751 377897 331194 453272 376864 401278 376027 232519 268629 305632
2576C05632j64781P6492R1853O6309p5309j32475M2212K9036n3862n3190q5721
$$ 305632 140851 217343 309196 375505 300196 167721 209933 238969 185107 131917 46196
2565D6196J59506M6895p9766p2696M5191J87862L2368j23491J51453j25815j02070
$$ 46196 205702 252597 172831 100135 145326 333188 365556 242065 393518 267703 165633
2554A65633P3528L8927p6464m1414J08524O3838k5694J72532l0008m8741j16374
$$ 165633 239161 278088 201624 160210 268734 332572 306878 479410 449402 400661 284287
2543B84287q7751j4327J07489N1624j71328R3953J6347p3594m0497j6334O2121
$$ 284287 196536 182209 289698 341322 169994 263947 280294 206700 166203 149869 211990
2532B11990J976l0336K9211p8231M1842m9039P1851j095K3636o6004P432k2008
$$ 211990 213966 183630 212841 134610 176452 127413 199264 198169 221805 155801 163233 141225
2520A41225L1886n6885o7739J34722R9545J5889j7507r990n7601l5034J780J45967
$$ 141225 173111 116226 48487 183209 282754 298643 281136 271146 213545 178511 180291 326258
2508C26258k5135p9689J9456q4383K2109R710k3423j32267J05928m2802l917j06258
$$ 326258 301123 221434 240890 156507 178616 188326 164903 32636 138564 95762 91845 -14413
2496a4413Q0090K6958L5801O4592M8594n8666J3413M9572r2433n2875N4729q2008
$$ -14413 65677 92635 128436 193028 241622 182956 196369 245941 153508 100633 155362 73354
2484G3354k425k12L8327J62907j06502L5638J294O9781m0584l8458j42845j8704
$$ 73354 70929 70717 109044 271951 165449 201087 202381 272162 231578 193120 50275 31571
2472C1571K9196l455M8533O3622M0428o915o2328O5316q0582Q947q8841K6151
$$ 31571 60767 57312 105845 169467 209895 202980 140652 205968 125386 134333 45492 71643
2460G1643L9798j15490R1893L4896L8130N120j4633k9486j04312R1298K16506
$$ 71643 111441 -4049 87844 122740 160870 165990 151357 121871 17559 108857 325363
2449C25363j79106l9356J14245m221j4949J57318j7555j2882m1468K816j30114
$$ 325363 146257 106901 221146 216925 201976 359294 341739 328857 287389 290205 160091
2438A60091q3886P70n4751K1108L2277J33029l1077j9679k932n2099O507J08184
$$ 160091 76205 76975 22224 43332 75609 208638 177561 157882 154950 102851 109358 217542
2426B17542j11399r478M8042J98669M2310j76234L3240P676J0163P7147q0384
$$ 217542 106143 96665 144707 343376 385686 209452 242692 250368 260531 337678 257294
2415B57294m9724j72354j0646N0935J14738M7645q5870o356o2807J72070J77763
$$ 257294 207570 35216 24570 75505 190243 237888 152018 145662 82855 254925 432688
2404D32688r6430j9699K9935r8711J331L9864q1564p5940J28355l6219L5693j16235
$$ 432688 336258 316559 346494 247783 249114 288978 207414 131474 259829 223610 259303 143068
2392A43068J28513N1032n7971J33380N1856P833j28477m7007P1329Q0409Q9502
$$ 143068 271581 322613 264642 398022 449878 457711 329234 282227 353556 433965 523467
2381E23467m0323p751J06193R829j04537J59308J5312m4233J1469N4940Q7611
$$ 523467 483144 475393 581586 591415 486878 646186 661498 617265 628734 683674 771285
2370G71285j5057j9589J13132K8144P2413P5855R0183m4822m597K05135K36801
$$ 771285 756228 736639 849771 877915 950328 1026183 1116366 1071544 1066947 1272082 1508883
2359A508883L12280K35237J82407R0379J49745K18514M62193N13230N27878M48907
$$ 1508883 1821163 2056400 2238807 2329186 2478931 2697445 3159638 3672868 4200746 4649653
2349D649653N67593M58917N46293M39502O97726J073098J284035J567088J575618
$$ 4649653 5217246 5676163 6222456 6661958 7359684 8432782 9716817 11283905 12859523
2340A2859523J893590K073597J895953J222272M28835j173540k335715k233501
$$ 12859523 14753113 16826710 18722663 19944935 20373770 19200230 16864515 14631014
2332A4631014j785755j338659j160736j053605q01306m51406o86514m62838n41825
$$ 14631014 12845259 11506600 10345864 9292259 8490953 8039547 7353033 6890195 6348370
2323F348370n48711n20710l81488m67568j63960k27975k68919k78664l34184k26775
$$ 6348370 5799659 5278949 4897461 4429893 4265933 4037958 3769039 3490375 3156191 2929416
2313B929416k43152j52599k13390j83121k0931j3899j29160n3036m4791j71100
$$ 2929416 2686264 2533665 2320275 2137154 2116223 2102324 1973164 1920128 1875337 1704237
2303A704237j12279p3775q0799j17537q7996J2187m8946K9129j31910o2305K10
$$ 1704237 1591958 1518183 1437384 1319847 1231851 1244038 1195092 1224221 1092311 1030006 1030216
2292A030216o8931j33153n5031j4148j51283K3678N2351J43739R886j84494j8352
$$ 1030216 961285 828132 773101 758953 607670 631348 683699 827438 837324 652830 634478
2281F34478J93333R5471k82368l5735N3962L4839j31245j63059J7817Q8277K4788
$$ 634478 827811 923282 640914 605179 659141 693980 562735 399676 417493 505770 530558
2270E30558p7857J23338N1454m2387l1992l0340l4160o7336N1399j47114M343
$$ 530558 452701 576039 627493 585106 553114 522774 488614 421278 472677 325563 329906
2259C29906l6921o8139R6488m1395J15903J4906L2888j10554j22182M5076P7470
$$ 329906 292985 224846 321334 279939 395842 410748 443636 333082 210900 255976 333446
2248C33446O7166q8681j2778k2285j3841P185Q6118j3213Q149l5331J1281L6450
$$ 333446 400612 311931 299153 276868 263027 270212 356330 343117 351266 315935 327216 363666
2236C63666j2721j16917m6129k8412O5849N7309j11681q5767K0111r2823R3487
$$ 363666 350945 234028 187899 159487 225336 282645 170964 85197 105308 12485 105972
2225A05972J4252n614k4043M482N380M5409P1955J1489m7115j40976P200n4589
$$ 105972 120224 114610 90567 95049 100429 145838 217793 229282 182167 41191 48391 -6198
2213f198K008Q9627K0043J2293n4758J19194P3519q9112O7603n6116j6398P1461
$$ -6198 -4190 85437 105480 117773 63015 182209 255728 166616 234219 178103 161705 233166
2201B33166p5128j28200J9763R2377n7799K4320j58265l2586K02436K9386j71694
$$ 233166 158038 29838 49601 141978 84179 108499 -49766 -82352 120084 149470 -22224
2190b2224N1613J01365J65226O3850j66676p2351N9428m8988j21200P3969N220
$$ -22224 29389 130754 295980 359830 193154 120803 180231 131243 10043 84012 89232
2179H9232O1320R1385k1420J8259O2974r2611k8684n2912O1550J09129j09270
$$ 89232 150552 241937 220517 238776 301750 209139 180455 127543 189093 298222 188952
2168A88952j26768L7753r6309P8737J10816j525l08854o7327K10726J07979n3366
$$ 188952 62184 99937 3628 82365 193181 191656 -117198 -184525 26201 134180 80814
2157H0814j01426O0068m6872P2329J11682q5908J813l3481L617p7883R1894n0480
$$ 80814 -20612 39456 -7416 64913 176595 90687 92500 59019 62636 -15247 76647 26167
2145B6167n8410P6209p509N6486n4262n5568j43479O6739J36364k5560O3720Q6798
$$ 26167 -32243 43966 36457 92943 38681 -16887 -160366 -93627 42737 17177 80897 167695
2133A67695O1688q0321k38067J14262J4456J825J3572n5158J38444j72597n6904
$$ 167695 229383 149062 -89005 25257 39713 41538 55110 -48 138396 -34201 -91105
2122i1105j4437K6045J17867O9587j37546J6736J00769j02245l564L4570K6969
$$ -91105 -105542 -79497 38370 107957 -29589 -12853 87916 -14329 -17893 16677 43646
2111D3646j04012k7058J82333l7814O6259M3357j19289q0212K7958N8716J06079
$$ 43646 -60366 -87424 94909 57095 123354 166711 47422 -32790 -4832 53884 159963
2100A59963k6819j66956J7633N2729m9769m5606J21989l9349j1237L388q8602
$$ 159963 133144 -33812 -16179 36550 -13219 -58825 63164 23815 12578 15966 -72636
2089g2636O9530R3300k2028p083L8757L1811j05296R821L3784o5744j66697N1212
$$ -72636 -3106 90194 68166 61083 99840 131651 26355 36176 69960 4216 -162481 -111269
2077a11269J14255J0128o0063L8841J32131o1908K3851J11269o8907j79058J79569
$$ -111269 2986 13114 -46949 -8108 124023 62115 85966 197235 128328 -50730 128839
2066A28839P2786j23344N2175J08016r6972o6604r3808P4285J38143J866l7638
$$ 128839 201625 78281 130456 238472 141500 74896 -18912 55373 193516 195382 157744
2055A57744j47077R9072M0106j50700r949J0415R0579o182r9375n4084K9937O442
$$ 157744 10667 109739 149845 -855 -10804 -389 90190 84008 -15367 -69451 -39514 -33072
2043c3072M5081J48838p5086N2072k9652q7534q715k992l5680p5204o9791J02549
$$ -33072 12009 160847 85761 137833 108181 20647 11932 8940 -26740 -101944 -171735 -69186
2031f9186J5188R9818l4791l2559l2978O302O7749j5314k5397L3741j7301Q1566
$$ -69186 -53998 45820 11029 -21530 -54508 -48206 19543 4229 -21168 12573 -4728 76838
2019G6838o8629l6031j9457Q9924m0872O9301p5956o5335J01297J11467J06078
$$ 76838 8209 -27822 -47279 42645 1773 71074 -4882 -70217 31080 142547 248625
2008B48625j68467m5763P2384J1337o2456j21984k7334J33582r7085J51430j56084
$$ 248625 80158 34395 106779 118116 55660 -66324 -93658 39924 -57161 94269 -61815
1997f1815Q441j2275o2777P1215N5588j7793J18519j7390Q7018j23742q1992O0142
$$ -61815 -53374 -65649 -128426 -57211 -1623 -19416 99103 81713 168731 44989 -37003 23139
1985B3139L6948k16315j46168J44033J13042m3426J7252J30300m7562j8048o900
$$ 23139 60087 -156228 -302396 -158363 -45321 -88747 -71495 58805 11243 -6805 -13705
1974a3705n9022K4987J51220L3802J01860k3936j80734p8177J42054j46526n010
$$ -13705 -72727 -47740 103480 137282 239142 215206 34472 -43705 98349 -48177 -53187
1963e3187J03878n23j18549O1274J44841j60715n1496j6993O3936P5049q0559
$$ -53187 50691 50168 -68381 -7107 137734 -22981 -74477 -91470 -27534 47515 -33044
1952c3044Q6585n7288M4966q4256M2831N6327m5686n7785k481j17537J37957K04144
$$ -33044 53541 -3747 41219 -43037 -206 56121 10435 -47350 -49831 -167368 -29411 174733
1940A74733K0607j12123j49401L2284M2920N9250j1875K1759p538r7092L881J8810
$$ 174733 195340 83217 -66184 -33900 9020 68270 56395 78154 70616 -26476 -22595 -3785
1928c785N3297j75047N7843O3700O8008N3910j46890k5093K6814N0570k7228L8859
$$ -3785 49512 -125535 -67692 -3992 64016 117926 -28964 -54057 -27243 23327 -3901 34958
1916C4958N2931r4286M6130R8225j29906j34842K2841P4768J176M4327o495k1802
$$ 34958 87889 -6397 39733 137958 8052 -126790 -103949 -29181 -28005 16322 9827 -11975
1904a1975n839L8707o3107O3533n9063R7651R449o1977l8342q425o5099J06983
$$ -11975 -17814 20893 -42214 21319 -37744 59907 69356 7379 -30963 -39388 -104487 2496
1892B496L8847J685j44083P4080m4159p3633M4632K3792L6137L4786p0741J19483
$$ 2496 41343 43028 -101055 -26975 -71134 -144767 -100135 -76343 -40206 -5420 -76161 43322
1880D3322K8845l491l2984k8064k0871l9354K0554j07615R9762N3852k9860o8048
$$ 43322 72167 68676 35692 7628 -13243 -52597 -32043 -139658 -39896 13956 -15904 -83952
1868h3952o261N4102M8205j9233O7107J24643M7093p9386j43971O8418m4959L5115
$$ -83952 -90213 -36111 12094 -7139 59968 184611 231704 152318 8347 76765 31806 66921
1856F6921J13937k8094m5890j04950K6741L6537p698M6320j20343k9636M9896
$$ 66921 180858 152764 106874 1924 28665 65202 57504 103824 -16519 -46155 3741
1845C741L9905p3550n647N8782j59827L8676R2755P5709n8186m5097R422k294
$$ 3741 43646 -29904 -35551 23231 -136596 -97920 -5165 70544 12358 -32739 -23317 -25611
1833b5611l6772J12815l3293j06881R9870n0819o6588P1271P9362n1102r7057
$$ -25611 -62383 50432 17139 -89742 10128 -40691 -107279 -36008 43354 -7748 -104805
1822a04805L0648p9855J0491J01139R7701J04610l0432J5433L3439q1176n8651
$$ -104805 -74157 -154012 -143521 -42382 55319 159929 129497 144930 178369 97193 38542
1811C8542J25451l6238j20549K0811o0681k768j1520R43L629J92133Q102M1849
$$ 38542 163993 127755 7206 28017 -32664 -35432 -46952 -46009 -42380 149753 157855 199704
1799A99704j12779j37519n0718P1046R9707j736j30128O215L4256o2371K799J77954
$$ 199704 86925 -50594 -101312 -30266 69441 67705 -62423 -56208 -21952 -84323 -81524 96430
1787I6430N0295J2825j4848m547j67315J57200r28o9292J69789p7038k29446n7587
$$ 96430 146725 159550 144702 140155 -27160 130040 129112 59820 229609 152571 -76875 -134462
1775a34462j2146n1092J26844N0843J8127O0652k9158r3367L1350r3838k647O8153
$$ -134462 -146608 -197700 -70856 -20013 -1886 58766 29608 -63759 -32409 -126247 -128894 -60741
1763f0741J67810J8055p7674O149L8611j24450k5721j1882L6056p16L3432K3793
$$ -60741 107069 125124 47450 53599 92210 -32240 -57961 -69843 -33787 -34503 -1071 22722
1751B2722n9799J29978K8527j61022J07340m6343m623N0485l3754K2421O6237
$$ 22722 -37077 92901 121428 -39594 67746 21403 16780 67265 33511 55932 122169
1740A22169L4784q2619n804P351j233p8389m2533M5925p5204Q8986K9654o237
$$ 122169 156953 74334 68530 75881 74648 -3741 -46274 -349 -75553 13433 43087 36850
1728C6850N2703K6848J3324q6635j37200P1418Q6285r7510O8657o1362O9886j09307
$$ 36850 89553 116401 129725 43090 -94110 -22692 63593 -33917 34740 -26622 43264 -66043
1716f6043k7168J75896K686J02680j61510j20235l5952o4419M4257J37956k3289
$$ -66043 -93211 82685 85371 188051 26541 -93694 -129646 -194065 -149808 -11852 -35141
1705c5141m6737k3550m0220K243J34394J30918J06838j57341j10020L9671j22186
$$ -35141 -81878 -105428 -145648 -143405 -9011 121907 228745 71404 -38616 1055 -121131
1694a21131L0277O2012R2441M3363n8078o6040N0081m5878n3823j3354o480O7535
$$ -121131 -90854 -28842 63599 106962 48884 -17156 32925 -12953 -66776 -80130 -86610 -19075
$$ [...]
##END NTUPLES=NMR SPECTRUM
##END=
