##TITLE=1H_DE-80H_X3
 200.13MHz, d2o
 8 sc
 
 19ns.26.2.2025
##JCAMPDX= 6.0         $$ Bruker NMR JCAMP-DX V2.0
##DATA TYPE= NMR SPECTRUM
##DATA CLASS= NTUPLES
##ORIGIN= UXNMR, Bruker Analytische Messtechnik GmbH
##OWNER= pz
$$ XWIN-NMR		Version 3.5
$$ Thu Jul 10 10:30:03 2025 Russian Standard Time (UT+4h)  Yarkov@DPX200
##.OBSERVE FREQUENCY= 200.1313
##.OBSERVE NUCLEUS= ^1H
##.ACQUISITION MODE= SIMULTANEOUS
##.ACQUISITION SCHEME= undefined
##.AVERAGES= 8
##.DIGITISER RES= 18
##SPECTROMETER/DATA SYSTEM= spect
##.PULSE SEQUENCE= zg30
##.SOLVENT NAME= CDCl3
##.SHIFT REFERENCE= (INTERNAL, CDCl3, 0, 15.5276)
##AUDIT TRAIL= $$ (NUMBER, WHEN, WHO, WHERE, WHAT)
$$ ##TITLE= Audit trail, XWIN-NMR		Version 3.5
$$ ##JCAMPDX= 5.01
$$ ##ORIGIN= Bruker BioSpin GmbH
$$ ##OWNER= Yarkov
$$ C:/Bruker/XWIN-NMR/data/yarkov2/nmr/H-C/1/pdata/1/auditp.txt
$$ ##AUDIT TRAIL=  $$ (NUMBER, WHEN, WHO, WHERE, WHAT)
(   1,<2025-07-10 10:29:07.98 +0400>,<Yarkov>,<DPX200>,
      <created by zg, POWCHK disabled, PULCHK disabled
       configuration hash MD5:
       00 E9 B6 7A A2 85 ED C7 34 08 36 98 17 FE 4E 26
       data hash MD5: 16K
       83 F7 19 69 00 44 1C 97 2A 84 10 D2 BF 67 98 69>)
(   2,<2025-07-10 10:29:15.06 +0400>,<Yarkov>,<DPX200>,
      <Start of raw data processing
       efp BC_mod = 2 LB = 0.25 FT_mod = 6 PKNL = 1 PHC0 = -1356.506 PHC1 = 5.990923 SI = 16K 
       data hash MD5: 16K
       E5 9A 92 1B F8 53 74 05 FF 86 84 21 B7 79 C2 3D>)
(   3,<2025-07-10 10:29:22.68 +0400>,<Yarkov>,<DPX200>,
      <abs ABSG = 5 
       data hash MD5: 16K
       03 0E B3 1D 74 39 AF 63 CF EC 5C 1C 59 C1 14 87>)
$$ ##END=
$$ 
$$ hash MD5
$$ DE A3 56 69 8A 3A AC 28 FC 3D DD 6F 45 5C C4 36
##$RELAX= 
##$RELAX= 
##$RELAX= 
##$RELAX= 
##$RELAX= 
##$RELAX= 
$$ Bruker specific parameters
$$ --------------------------
##$DU= <C:/Bruker/XWIN-NMR>
##$EXPNO= 1
##$NAME= <H-C>
##$PROCNO= 1
##$TYPE= <nmr>
##$USER= <yarkov2>
##$AMP= (0..31)
100 100 100 100 100 100 100 100 100 100 100 100 100 100 100 100 100 100 
100 100 100 100 100 100 100 100 100 100 100 100 100 100 
##$AQSEQ= 0
##$AQ_mod= 1
##$AUNM= <au_zg>
##$AUTOPOS= <>
##$BF1= 200.13
##$BF2= 200.13
##$BF3= 200.13
##$BF4= 200.13
##$BF5= 200.13
##$BF6= 200.13
##$BF7= 200.13
##$BF8= 200.13
##$BYTORDA= 1
##$CFDGTYP= 0
##$CFRGTYP= 5
##$CHEMSTR= <none>
##$CNST= (0..31)
1 1 145 1 1 1 1 1 1 1 1 1 1 1 1 1 1 1 1 1 1 1 1 1 1 1 1 1 1 1 1 1 
##$CPDPRG= <>
##$CPDPRG1= <>
##$CPDPRG2= <>
##$CPDPRG3= <>
##$CPDPRG4= <mlev>
##$CPDPRG5= <mlev>
##$CPDPRG6= <mlev>
##$CPDPRG7= <mlev>
##$CPDPRG8= <mlev>
##$CPDPRGB= <>
##$CPDPRGT= <>
##$D= (0..31)
0 0.7 0 0 0 0 0 0 0 0 0 0.03 0 0 0 0 0 0 0 0 0 0 0 0 0 0 0 0 0 0 0 0 
##$DATE= 1752128947
##$DBL= (0..7)
120 120 120 120 120 120 120 120 
##$DBP= (0..7)
150 150 150 150 150 150 150 150 
##$DBP07= 0
##$DBPNAM0= <>
##$DBPNAM1= <>
##$DBPNAM2= <>
##$DBPNAM3= <>
##$DBPNAM4= <>
##$DBPNAM5= <>
##$DBPNAM6= <>
##$DBPNAM7= <>
##$DBPOAL= (0..7)
0.5 0.5 0.5 0.5 0.5 0.5 0.5 0.5 
##$DBPOFFS= (0..7)
0 0 0 0 0 0 0 0 
##$DE= 6
$$ [...]
##$SUBNAM3= <"">
##$SUBNAM4= <"">
##$SUBNAM5= <"">
##$SUBNAM6= <"">
##$SUBNAM7= <"">
##$SUBNAM8= <"">
##$SUBNAM9= <"">
##$SW= 18.0517328524113
##$SWIBOX= (0..15)
0 0 2 0 0 0 0 0 0 0 0 0 0 0 0 0 
##$SW_h= 3612.71676300578
##$TD= 16384
##$TD0= 1
##$TE= 0
##$TE2= 300
##$TE3= 300
##$TEG= 300
##$TL= (0..7)
0 120 120 120 120 120 120 120 
##$TP= (0..7)
150 150 150 150 150 150 150 150 
##$TP07= 0
##$TPNAME0= <>
##$TPNAME1= <>
##$TPNAME2= <>
##$TPNAME3= <>
##$TPNAME4= <>
##$TPNAME5= <>
##$TPNAME6= <>
##$TPNAME7= <>
##$TPOAL= (0..7)
0.5 0.5 0.5 0.5 0.5 0.5 0.5 0.5 
##$TPOFFS= (0..7)
0 0 0 0 0 0 0 0 
##$TUNHIN= 0
##$TUNHOUT= 0
##$TUNXOUT= 0
##$USERA1= <user>
##$USERA2= <user>
##$USERA3= <user>
##$USERA4= <user>
##$USERA5= <user>
##$V9= 5
##$VALIST= <valist>
##$VCLIST= <CCCCCCCCCCCCCCC>
##$VD= 0
##$VDLIST= <DDDDDDDDDDDDDDD>
##$VPLIST= <PPPPPPPPPPPPPPP>
##$VTLIST= <TTTTTTTTTTTTTTT>
##$WBST= 1024
##$WBSW= 4
##$XGAIN= (0..3)
0 0 0 0 
##$XL= 0
##$YL= 0
##$YMAX_a= 618720
##$YMIN_a= -607284
##$ZGOPTNS= <>
##$ZL1= 120
##$ZL2= 120
##$ZL3= 120
##$ZL4= 120
##$ABSF1= 15.52763
##$ABSF2= -2.52422
##$ABSG= 5
##$ABSL= 3
##$ALPHA= 0
##$AQORDER= 0
##$ASSFAC= 0
##$ASSFACI= 0
##$ASSFACX= 0
##$ASSWID= 0
##$AUNMP= <proc_1d>
##$AZFE= 0.1
##$AZFW= 0.1
##$BCFW= 0
##$BC_mod= 2
##$BYTORDP= 0
##$COROFFS= 0
##$CY= -3
##$DATMOD= 1
##$DC= 0
##$DFILT= <>
##$DTYPP= 0
##$F1P= 0
##$F2P= 0
##$FCOR= 1
##$FTSIZE= 16384
##$FT_mod= 6
##$GAMMA= 0
##$GB= 0
##$INTBC= 1
##$INTSCL= 3.241238e-09
##$ISEN= 128
##$LB= 0.25
##$LEV0= 0
##$LPBIN= 0
##$MAXI= 10000
##$MC2= 0
##$MEAN= 0
##$ME_mod= 0
##$MI= 1.114404
##$NCOEF= 0
##$NC_proc= -5
##$NLEV= 6
##$NOISF1= 3.799351
##$NOISF2= 2.8
##$NSP= 0
##$NTH_PI= 0
##$NZP= 0
##$OFFSET= 15.52763
##$PC= 1
##$PHC0= -1356.506
##$PHC1= 5.990923
##$PH_mod= 1
##$PKNL= yes
##$PPARMOD= 0
##$PSCAL= 0
##$PSIGN= 0
##$REVERSE= no
##$SF= 200.129998813627
##$SI= 16384
##$SIGF1= 3
##$SIGF2= 2
##$SINO= 0.751879
##$SIOLD= 32768
##$SREGLST= <19F.Aceton>
##$SSB= 0
##$STSI= 16384
##$STSR= 0
##$SW_p= 3612.71676300578
##$SYMM= 0
##$S_DEV= 0
##$TDeff= 16384
##$TDoff= 0
##$TI= <>
##$TILT= no
##$TM1= 0
##$TM2= 0
##$TOPLEV= 0
##$USERP1= <user>
##$USERP2= <user>
##$USERP3= <user>
##$USERP4= <user>
##$USERP5= <user>
##$WDW= 1
##$XDIM= 16384
##$YMAX_p= 381949230
##$YMIN_p= -194588
$$ End of Bruker specific parameters
$$ ---------------------------------
##NTUPLES= NMR SPECTRUM
##VAR_NAME=  FREQUENCY,     SPECTRUM/REAL,   SPECTRUM/IMAG
##SYMBOL=    X,             R,               I
##VAR_TYPE=  INDEPENDENT,   DEPENDENT,       DEPENDENT
##VAR_FORM=  AFFN,          ASDF,            ASDF
##VAR_DIM=   16384,         16384,           16384
##UNITS=     HZ,            ARBITRARY UNITS, ARBITRARY UNITS
##FACTOR=    0.220516191357247, 1,           1
##FIRST=     3107.54454391822, 0,            0
##LAST=      -505.172219087558, 0,           0
##MIN=       -505.172219087558, -194588,     0
##MAX=       3107.54454391822, 381949230,    0
$$ Real data points
##PAGE= N=1
##DATA TABLE= (X++(R..R)), XYDATA
$$ [...]
$$ plain form
6105 558316 613177 669870 676938 705031 767387 821525 828093 846025 858090 817810 804436 796976
6093 796976 820364 792254 805018 854757 849381 860628 876930 901024 943213 999470 1054881 1124819
6081 1124819 1222720 1310911 1428913 1514127 1561062 1635661 1646202 1682757 1698726 1693855 1682752
6070 1682752 1596350 1537246 1500340 1439605 1408401 1393170 1371212 1360186 1392436 1426097 1408829
6059 1408829 1391828 1392863 1439667 1490625 1540368 1631889 1692497 1763816 1907704 1970163 1988710
6048 1988710 1941262 1842924 1723297 1580871 1443569 1310138 1226814 1144515 1067465 1013457 984953
6037 984953 924192 885172 862475 849615 856078 821606 813875 815903 826283 801708 789734 786542
6025 786542 830556 858691 878964 920298 930704 937556 911042 850586 790784 724612 679866 620058
$$ packed form
6105E58316N4861N6693P068K8093O2356N4138O568J7932J2065m0280j3374p460
6093G96976K3388k8110J2764M9739n376J1247J6302K4094M2189N6257N5411O9938
6081A124819R7901Q8191J18002Q5214M6935P4599J0541L6555J5969m871j1103
6070A682752q6402n9104l6906o0735l1204j5231k1958j1026L2250L3661j7268
6059A408829j7001J035M6804N0958M9743R1521O0608P1319J43888O2459J8547
6048A988710m7448r8338j19627j42426j37302j33431q3324q2299p7050n4008k8504
6037I84953o0761l9020k2697j2860O463l4472p731K028J0380k4575j1974l192
6025G86542M4014K8135K0273M1334J0406O852k6514o0456n9802o6172m4746n9808
$$ plain form
6013 620058 575026 537768 501543 447093 449014 464235 448488 444516 410697 407616 419726 387958
6001 387958 372540 375028 357049 369789 332328 317958 296542 299130 275914 288604 293829 286911
5989 286911 258348 243248 253825 252809 250962 242782 249679 220854 230036 228366 254736 246283 229534
5976 229534 202745 215612 230672 240470 244684 225298 208040 194045 190768 198606 186854 202205
5964 202205 208929 244671 262540 261557 243031 216149 252090 262469 251455 259798 258480 295025 330174
5951 330174 310643 311058 311716 316780 297652 264102 269342 263299 258557 270756 265584 229232 253234
5938 253234 241625 246878 254594 251516 239574 254375 284809 259477 237436 233099 277667 318399
5926 318399 340046 329424 331189 315103 332949 348069 323717 329383 306831 274692 267820 220425
$$ packed form
6013F20058m5032l7258l6225n4450J921J5221j5747l972l3819l081J2110l1768
6001C87958j5418K488j7979J2740l7461j4370k1416K588k3216J2690N225o918
5989B86911k8563j5100J0577j016j847q180O897k8825R182j670K6370q453j6749
5976B29534k6789J2867J5060R798M214j9386j7258j3995l277P838j1752J5351
5964B02205O724L5742J7869r83j8526k6882L5941J0379j1014Q343j318L6545L5149
5951C30174j9531M15O58N064j9128l3550N240o043m742J2199n172l6352K4002
5938B53234j1609N253P716l078j1942J4801L0434k5332k2041m337M4568M0732
5926C18399K1647j0622J765j6086J7846J5120k4352N666k2552l2139o872m7395
$$ plain form
5914 220425 259979 245376 229476 201362 212484 233779 216986 229959 225712 203785 190860 180794
5902 180794 186886 205293 205725 199365 203509 238927 254564 266257 254002 239646 208193 181002 186383
5889 186383 187968 181329 155340 159792 188436 170802 165294 161262 143979 153888 134391 145462 131537
5876 131537 117232 123686 146966 149583 115675 103686 94366 127515 150661 163504 163014 144105 113883
5863 113883 123024 94344 78484 76837 64107 110053 114635 131651 146993 156295 142164 107492
5851 107492 139008 124536 130754 152942 94861 86546 108659 84133 100460 126664 124274 155962
5839 155962 169414 151367 123341 104526 85814 115768 143213 92891 128965 165200 148839 141094
5827 141094 131734 135046 91865 94628 134774 91010 74777 114262 124733 118969 141638 122672
$$ packed form
5914B20425L9554j4603j5900k8114J1122K1295j6793J2973m247k1927j2925j0066
5902A80794O092J8407M32o360M144L5418J5637J1693j2255j4356l1453k7191N381
5889A86383J585o639k5989M452K8644j7634n508m032j7283R909j9497J1071j3925
5876A31537j4305O454K3280K617l3908j1989r320L3149K3146J2843m90j8909l0222
5863A13883R141k8680j5860j647j2730M5946M582J7016J5342R302j4131l4672
5851A07492L1516j4472O218K2188n8081q315K2113k4526J6327K6204k390L1688
5839A55962J3452j8047k8026j8815j8712K9954K7445n0322L6074L6235j6361p745
5827A41094r360L312m3181K763M0146m3764j6233L9485J0471n764K2669j8966
$$ plain form
5815 122672 102904 105112 83230 109924 114992 115740 86974 74810 77615 65385 109432 131746 113620
5802 113620 92762 94371 132106 135952 136016 119539 134917 109669 130490 108489 91605 111091 117598
5789 117598 116246 92882 104265 98507 120401 117306 96500 111768 128912 106825 118522 98411
5777 98411 87769 118386 126874 102793 107524 110642 115537 117312 120254 135517 137902 116926 88211
5764 88211 70444 78526 87760 75451 69957 132382 144394 117067 143598 126155 115409 69441
5752 69441 69079 78571 94709 115210 107637 115022 107181 112266 83576 114367 121918 123054 99886 112355
5738 112355 92311 112271 124904 109576 121258 118562 125784 149791 137788 107912 80600 94219
5726 94219 125543 121296 138307 136211 123226 149317 123602 117170 90139 91407 131269 137084 139642
$$ packed form
5815A22672j9768K208k1882K6694N068P48k8766j2164K805j2230M4047K2314j8126
5802A13620k0858J609L7735L846O4j6477J5378k5248K0821k2001j6884J9486O507
5789A17598j352k3364J1383n758K1894l095k0806J5268J7144k2087J1697k0111
5777I8411j0642L0617Q488k4081M731L118M895J775K942J5263K385k0976k8715
5764H8211j7767Q082R234j2309n494O2425J2012k7327K6531j7443j0746m5968
5752F9441l62R492J6138K0501p573P385p841N085k8690L0791P551J136k3168J2469
5738A12355k0044J9960J2633j5328J1682k696P222K4007j2003k9876k7312J3619
5726I4219L1324m247J7011k096j2985K6091k5715o432k7031J268L9862N815K558
$$ plain form
5713 139642 128389 154261 156291 115197 101291 107129 93658 119850 131584 127551 119243 110669 108479
5700 108479 117983 124246 113745 121761 137260 135731 139762 159509 167078 153358 145610 123665 140508
5687 140508 143313 153518 145386 148759 178342 180546 166526 150411 149225 161042 178541 186192 195588
5674 195588 194212 185236 229648 243773 272762 283335 258096 224698 234461 248734 229770 193201
5662 193201 179916 194698 206402 197146 223748 209707 207292 220941 185058 181051 191775 206716
5650 206716 212440 240351 241318 230458 269016 311490 332438 326840 341904 368179 394493 452414
5638 452414 500653 519217 534009 509256 467573 429547 389837 326266 295407 286226 286530 302721
5626 302721 324215 302213 262722 278375 295011 293893 336307 337510 301768 337491 351180 355638
$$ packed form
5713A39642j1253K5872K030m1094j3906N838j3471K6192J1734m033q308q574k190
5700A08479R504O263j0501Q016J5499j529M031J9747P569j3720p748k1945J6843
5687A40508K805J0205q132L373K9583K204j4020j6115j186J1817J7499P651R396
5674A95588j376q976M4412J4125K8989J0573k5239l3398R763J4273j8964l6569
5662A93201j3285J4782J1704r256K6602j4041k415J3649l5883m007J0724J4941
5650B06716N724K7911R67j0860L8558M2474K0948n598J5064K6275K6314N7921
5638D52414M8239J8564J4792k4753m1683l8026l9710o3571l0859r181L04J6191
5626C02721K1494k2002l9491J5653J6636j118M2414J203l5742L5723J3689M458
$$ plain form
5614 355638 371612 377347 405236 452010 494052 534853 566425 616566 634473 625227 614339 618378
5602 618378 594666 562797 537320 540225 506194 512239 552828 562019 554135 558950 555789 553137 584841
5589 584841 585760 607005 656315 654677 679902 719231 742865 775376 795658 791837 797991 814477 840966
5576 840966 877038 912369 981618 986793 998964 1036387 1054727 1073146 1062978 1064970 1116989 1169049
5564 1169049 1178418 1223737 1247131 1253939 1295500 1332410 1348095 1356915 1353676 1382978 1364181 1311831
5552 1311831 1263380 1242865 1182387 1091491 1127804 1159331 1188939 1184417 1164628 1188568 1222048 1289321
5540 1289321 1311559 1308898 1345994 1394030 1438661 1482056 1521214 1557006 1520145 1488551 1419535 1318061
5528 1318061 1254158 1143253 1081192 1047505 996633 942563 925034 910536 887214 871809 892501
$$ packed form
5614C55638J5974N735K7889M6774M2042M0801L1572N0141J7907r246j0888M039
5602F18378k3712l1869k5477K905l4031O045M0589R191p884M815l161k652L1704
5589E84841R19K1245M9310j638K5225L9329K3634L2511K0282l821O154J6486K6489
5576H40966L6072L5331O9249N175J2171L7423J8340J8419j0168J992N2019N2060
5564A169049R369M5319K3394O808M1561L6910J5685Q820l239K9302j8797n2350
5552A311831m8451k0515o0478r0896L6313L1527K9608m522j9789K3940L3480O7273
5540A289321K2238k661L7096M8036M4631M3395L9158L5792l6861l1594o9016j01474
5528A318061o3903j10905o2061l3687n0872n4070j7529j4498k3322j5405K0692
$$ plain form
5517 892501 942738 911005 918286 973305 1008592 1037358 1086116 1169733 1205510 1304017 1332145 1330381
5505 1330381 1316362 1296199 1255258 1159381 1070344 997220 930384 862264 819243 761019 731487
5494 731487 722023 724163 734559 725458 675131 642272 634195 669352 689931 748764 807960 840928
5482 840928 843228 894011 936047 960245 1016115 1025480 1004668 932736 840594 757456 701169 656232
5470 656232 626678 598066 558473 541559 548974 580232 594663 555156 553124 579458 594940 612792
5458 612792 646253 652680 647240 677520 678257 706896 749851 776166 810757 826183 837448 826976
5446 826976 835417 830793 818023 859211 838659 801796 850687 859335 871407 857043 873335 914638
5434 914638 976250 1014872 1074674 1120551 1151344 1221284 1285654 1363843 1369121 1350994 1331328 1318086
$$ packed form
5517H92501N0237l1733P281N5019L5287K8766M8758Q3617L5777R8507K8128j764
5505A330381j4019k0163m0941r5877q9037p3124o6836o8120m3021n8224k9532
5494G31487r464K140J0396r101n0327l2859q077L5157K0579N8833N9196L2968
5482H40928K300N0783M2036K4198N5870R365k0812p1932r2142q3138n6287m4937
5470F56232k9554k8612l9593j6914P415L1258J4431l9507k032K6334J5482J7852
5458F12792L3461O427n440L0280P37K8639M2955K6315L4591J5426J1265j0472
5446H26976Q441m624j2770M1188k0552l6863M8891Q648J2072j4364J6292M1303
5434I14638O1612L8622N9802M5877L0793O9940O4370P8189N278j8127j9666j3242
$$ plain form
5422 1318086 1272656 1246818 1281080 1275847 1292321 1343081 1384200 1382849 1407219 1432932 1475295 1527291
5410 1527291 1557739 1618822 1660487 1685180 1706016 1793091 1872898 1937244 1991364 2105334 2225355
5399 2225355 2232226 2159031 2081601 1972371 1873384 1805484 1744032 1700476 1643659 1618059 1622859 1612703
5387 1612703 1601991 1603812 1660209 1713271 1727649 1754049 1783240 1858274 1875144 1831956 1752451 1679340
5375 1679340 1646804 1610067 1567666 1504932 1438711 1366608 1272571 1179161 1084041 1014687 923382
5364 923382 873806 881714 864521 845946 832070 780393 790561 814687 797738 819738 819667 840276
5352 840276 844908 815615 815068 853943 796750 733739 702101 628703 601441 579375 547531 515140
5340 515140 483749 462593 458321 392300 378212 406072 385756 390694 360017 319480 303351 331682
$$ packed form
5422A318086m5430k5838L4262n233J6474N0760M1119j351K4370K5713M2363N1996
5410A527291L0448O1083M1665K4693K0836Q7075P9807O4346N4120J13970J20021
5399B225355O871p3195p7430j09230r8987o7900o1452m3556n6817k5600M800j0156
5387A612703j0712J821N6397N3062J4378K6400K9191P5034J6870m3188p9505p3111
5375A679340l2536l6737m2401o2734o6221p2103r4037r3410r5120o9354r1305
5364I23382m9576P908j7193j8575j3876n1677J0168K4126j6949K2000p1K0609
5352H40276M632k9293n47L8875n7193o3011l1638p3398k7262k2066l1844l2391
5340E15140l1391k1156m272o6021j4088K7860k0316M938l0677m0537j6129K8331
$$ plain form
5328 331682 345077 363705 311909 300219 347962 328974 334392 338333 315310 306884 292099 291701 272041
5315 272041 263489 273576 278146 272166 272073 263729 262432 217580 202492 212470 225890 239592 230499 247389
5301 247389 233538 245500 263377 258254 226586 231055 220029 238091 252926 249255 259230 276972
5289 276972 255237 241021 223801 205497 235247 233981 241480 252165 220156 213634 215033 222230 206787
5276 206787 179915 173667 193449 240559 256402 224799 213838 230222 238104 235815 229138 211060
5264 211060 200976 205227 213678 226564 205434 211966 248645 230587 222431 251945 252572 261622 237665
5251 237665 192888 196630 216148 217715 189601 168686 194082 189444 197181 181134 162285 165663 188573
5238 188573 213496 223328 197730 219366 201043 173706 186425 198376 181532 135421 149007 151620
$$ packed form
5328C31682J3395J8628n1796j1690M7743j8988N418L941k3023q426j4785l98j9660
5315B72041q552J0087M570n980r3q344j297m4852j5088R978J3420J3702r093J6890
5301B47389j3851J1962J7877n123l1668M469j1026J8062J4835l671R975J7742
5289B76972k1735j4216j7220j8304K9750j266P499J0685l2009o522J399P197j5443
5276B06787k6872o248J9782M7110J5843l1603j0961J6384P882k289o677j8078
5264B11060j0084M251Q451J2886k1130O532L6679j8058q156K9514O27R050k3957
5251B37665m4777L742J9518J567k8114k0915K5396m638P737j6047j8849L378K2910
5238A88573K4923R832k5598K1636j8323k7337J2719J1951j6844m6111J3586K613
$$ plain form
5226 151620 203160 205838 185025 222621 214805 208869 211016 211745 223784 208215 197239 195262 216733
5213 216733 215220 212532 245703 238885 237214 255623 226216 234843 241419 202773 178539 200649 191945
5200 191945 188099 223864 189259 166126 204176 196913 207491 208046 190055 218647 225775 209710 215398
5187 215398 208855 199493 204601 207877 207186 208263 238948 245092 238666 238457 228048 228729 251296 220899
5173 220899 192130 184527 169008 224380 239948 260439 226572 212267 201117 200512 232714 222841
5161 222841 225837 240287 246563 267952 244653 225138 212447 202375 234342 243839 243446 241771 252336
5148 252336 244561 260930 258066 256285 230542 251297 250522 241004 223327 208922 221641 221466 228685
5135 228685 240988 244951 261101 290168 273123 257971 254860 261083 276121 256125 272346 281660
$$ packed form
5226A51620N1540K678k0813L7596p816n936K147P29J2039j5569j0976j977K1471
5213B16733j513k688L3171o818j671J8409k9407Q627O576l8646k4234K2110q704
5200A91945l846L5765l4605k3133L8050p263J0578N55j7991K8592P128j6065N688
5187B15398o543r362N108L276o91J077L0685O144o426k09j0409O81K2567l0397
5173B20899k8769p603j5519N5372J5568K0491l3867j4305j1150o05L2202r873
5161B22841K996J4450O276K1389k3299j9515j2691j0072L1967R497l93j675J0565
5148B52336p775J6369k864j781k5743K0755p75r518j7677j4405J2719j75P219
5135B28685J2303L963J6150K9067j7045j5152l111O223J5038j9996J6221R314
$$ plain form
5123 281660 280019 292092 294024 306434 300978 304251 307645 308529 318195 331657 314161 306357 315433 301700
5109 301700 311808 336112 334800 337856 354375 372438 372255 380399 375110 348550 343982 358325 326472
5096 326472 301473 333137 384518 400879 386437 398648 397342 409806 426547 449773 442796 454102
5084 454102 478254 481414 456188 455370 460738 476659 529872 534163 538042 546069 552595 588580 593472
5071 593472 621489 650525 642924 678281 740488 800472 825374 850452 887232 942970 1023060 1074764
5059 1074764 1137400 1196112 1282019 1365921 1485166 1616439 1744463 1836772 1952956 2156371
5049 2156371 2420261 2680386 2980516 3352072 3750712 4187312 4585838 4846460 5030949 5347281
5039 5347281 5714768 6032661 6205422 6197786 6088465 6124599 6257729 6312699 6109131 5612072
$$ packed form
5123B81660j641J2073J932J2410n456L273L394Q84R666J3462j7496p804R076j3733
5109C01700J0108K4304j312L056J6519J8063j83Q144n289k6560m568J4343l1853
5096C26472k4999L1664N1381J6361j4442J2211j306J2464J6741K3226o977J1306
5084D54102K4152L160k5226q18N368J5921N3213M291L879Q027O526L5985M892
5071E93472K8017K9036p601L5357O2207N9984K4902K5078L6780N5738Q0090N1704
5059A074764O2636N8712Q5907Q3902J19245J31273J28024R2309J16184K03415
5049B156371K63890K60125L00130L71556L98640M36600L98526K60622J84489L16332
5039E347281L67487L17893J72761p636j09321L6134J33130N4970k03568m97059
$$ plain form
5029 5612072 4863506 4240046 3825566 3533250 3362374 3272811 3161437 2987283 2774786 2477581
5019 2477581 2203692 2037117 1884020 1744269 1634916 1556467 1469316 1389275 1354806 1239804
5009 1239804 1198644 1162737 1104829 1044903 1001522 966764 926637 919165 878817 880099 844794 812108
4997 812108 808034 815010 797928 758904 713815 722151 709538 722754 707374 661264 672261 668472
4985 668472 663383 600500 602557 598767 620339 657738 645235 606241 582344 636170 628347 574252
4973 574252 577549 569477 597857 536926 480695 492019 523015 498665 487409 475188 489078 509062
4961 509062 513951 514255 508330 496335 499168 524727 486673 466525 445279 449942 462391 469709 471442
4948 471442 477798 482001 482430 470876 510133 534882 522124 488072 455463 489892 470369 483965
$$ packed form
5029E612072p48566o23460m14480k92316j70876q9563j11374j74154k12497k97205
5019B477581k73889j66575j53097j39751j09353p8449q7151q0041l4469j15002
5009A239804m1160l5907n7908n9926m3381l4758m0127p472m0348J282l5305l2686
4997H12108m074O976j7082l9024m5089Q336j2613J3216j5380m6110J0997l789
4985F68472n089o2883K057l790K1572L7399j2503l8994k3897N3826p823n4095
4973E74252L297q072K8380o0931n6231J1324L0996k4350j1256j2221J3890J9984
4961E09062M889L04n925j1995K833K5559l8054k0148k1246M663J2449P318J733
4948D71442O356M203M29j1554L9257K4749j2758l4052l2609L4429j9523J3596
$$ plain form
4936 483965 490325 525216 545406 541836 515504 511987 504184 522720 521339 540617 550592 537792 576691
4923 576691 549953 573201 560600 564427 587083 634326 588693 574059 587862 625348 644879 602738
4911 602738 587678 600897 637403 652982 638022 621224 626959 634124 641695 664309 648384 641773
4899 641773 652530 654687 676995 657518 666841 645193 665632 707980 726781 721680 764916 795813
4887 795813 746877 723494 710970 703181 698411 699430 693616 716479 728190 718014 725910 722096 673396
4874 673396 684254 713270 736717 717337 712525 770502 808286 794819 774444 790496 822041 805311
4862 805311 803744 812976 835607 824504 827186 838474 827269 814252 803056 822786 817207 835579
4850 835579 874757 899370 868751 868072 890213 910786 921365 909830 935234 983385 987729 1021768
$$ packed form
4936D83965O360L4891K0190l570k6332l517p803J8536j381J9278R975j2800L8899
4923E76691k6738K3248j2601L827K2656M7243m5633j4634J3803L7486J9531m2141
4911F02738j5060J3219L6506J5579j4960j6798N735P165P571K2614j5925o611
4899F41773J0757K157K2308j9477R323k1648K0439M2348J8801n101M3236L0897
4887G95813m8936k3383j2524p789m770J019n814K2863J1711j0176P896l814m8700
4874F73396J0858K9016K3447j9380m812N7977L7784j3467k0375J6052L1545j6730
4862H05311j567R232K2631j1103K682J1288j1205j3017j1196J9730n579J8372
4850H35579L9178K4613l0619o79K2141K0573J0579j1535K5404M8151M344L4039
$$ plain form
4838 1021768 1006211 1033385 1084350 1086952 1078520 1097517 1059899 1065417 1077158 1066050 1067717 1084605
4826 1084605 1125172 1136350 1150472 1145669 1186084 1234501 1254451 1267237 1298578 1323069 1354437 1349827
4814 1349827 1388831 1427386 1459017 1498048 1555384 1619678 1641820 1635667 1657342 1689958 1740908 1773837
4802 1773837 1804898 1809507 1838361 1922257 1982488 2007029 2071566 2132093 2180234 2220547 2249919 2293504
4790 2293504 2363691 2418656 2460822 2552397 2640496 2727709 2822371 2954430 3056531 3218771 3349413
4779 3349413 3519860 3683268 3823252 3989823 4172402 4343806 4519686 4746962 4995614 5270333
4769 5270333 5562387 5860102 6228458 6552335 6885456 7260642 7631719 8066343 8505685 9012480
4759 9012480 9516608 10038387 10620936 11273727 12020744 12867122 13889729 15067491 16383367
$$ packed form
4838A021768j5557K7174N0965K602q432J8997l7618N518J1741j1108J667J6888
4826A084605M0567J1178J4122m803M0415M8417J9950J2786L1341K4491L1368m610
4814A349827L9004L8555L1631L9031N7336O4294K2142o153K1675L2616N0950L2929
4802A773837L1061M609K8854Q3896O0231K4541O4537O0527M8141M0313K9372M3585
4790B293504P0187N4965M2166R1575Q8099Q7213R4662J32059J02101J62240J30642
4779C349413J70447J63408J39984J66571J82579J71404J75880K27276K48652K74719
4769E270333K92054K97715L68356L23877L33121L75186L71077M34624M39342N06795
4759I012480N04128N21779N82549O52791P47017Q46378J022607J177762J315876
$$ plain form
4750 16383367 17774910 19095272 20144079 20805979 21185738 21458573 21771455 22099581 22421355
4741 22421355 22672861 22939571 23272831 23771812 24362353 25057374 25810404 26587563 27406544
4732 27406544 28307520 29266244 30193870 31051014 31811267 32567981 33419106 34454674 35680431
4723 35680431 37081527 38594173 40185979 41708525 43042327 43855390 43934215 43149230 41779729
4714 41779729 40222541 38770045 37509494 36428265 35457759 34602421 33855311 33055856 32176154
4705 32176154 31143108 30020854 28937086 28017376 27213438 26562059 25994928 25506109 25059866
4696 25059866 24681270 24453175 24386956 24389442 24266303 24023456 23671341 23262106 22769776 21983260
4686 21983260 20824157 19327971 17639725 16090764 14861372 13858811 13060540 12460747
$$ packed form
4750A6383367J391543J320362J048807O61900L79759K72835L12882L28126L21774
4741B2421355K51506K66710L33260M98981N90541O95021P53030P77159Q18981
4732B7406544R00976R58724R27626Q57144P60253P56714Q51125J035568J225757
4723C5680431J401096J512646J591806J522546J333802Q13063P8825p84985j369501
4714D1779729j557188j452496j260551j081229r70506q55338p47110p99455q79702
4705C2176154j033046j122254j083768r19710q03938o51379n67131m88819m46243
4696B5059866l78596k28095o6219K486j23139k42847l52115m09235m92330p86516
4686B1983260j159103j496186j688246j548961j229392j002561p98271n99793
$$ plain form
4678 12460747 11939687 11390554 10871436 10374912 9887061 9430249 8989601 8631374 8294305
4669 8294305 7947753 7607854 7300028 6990172 6700475 6423600 6160612 5945570 5725863 5486191
4659 5486191 5282023 5106048 4933750 4720468 4521847 4348192 4248157 4151473 4048343 3915681
4649 3915681 3811398 3741107 3674418 3621681 3558583 3503991 3425385 3404131 3361397 3349946 3319112
4638 3319112 3308329 3290912 3225185 3185592 3179341 3175795 3100719 3048745 3029207 2996127 2933396 2800369
4626 2800369 2762278 2666652 2539439 2473147 2392240 2318058 2253117 2214287 2172536 2108094 2046052
4615 2046052 1996806 1938521 1936862 1954921 1911380 1900080 1884489 1841659 1824010 1815652 1797855 1788428
4603 1788428 1730736 1713154 1704889 1695203 1654706 1621775 1602739 1540047 1471555 1408579 1375983 1316312
$$ packed form
4678A2460747n21060n49133n19118m96524m87851m56812m40648l58227l37069
4669H294305l46552l39899l07826l09856k89697k76875k62988k15042k19707k39672
4659E486191k04168j75975j72298k13282j98621j73655j00035r6684j03130j32662
4649C915681j04283p0291o6689n2737o3098n4592p8606k1254m2734j1451l0834
4638C319112j0783j7417o5727l9593o251l546p5076n1974j9538l3080o2731j33027
4626B800369l8091r5626j27213o6292q0907p4182o4941l8830m1751o4442o2042
4615B046052m9246n8285j659J8059m3541j1300j5591m2830j7649q358j7797r427
4603A788428n7692j7582q265r686m0497l2931j9036o2692o8492o2976l2596n9671
$$ plain form
4591 1316312 1309774 1316305 1295651 1218008 1192603 1174473 1155676 1111739 1083999 1091888 1087320 1053989
4579 1053989 1014644 958656 994124 1012892 974471 957779 967123 950406 930312 930911 950768 936596
4567 936596 890275 864593 881272 879607 841966 870437 867222 853581 849068 828855 809682 780754
4555 780754 762400 811642 808940 793604 758903 788598 800455 769571 782228 762525 764109 776673
4543 776673 798238 793482 782315 805442 785238 747093 743820 755463 710929 737197 752789 740969
4531 740969 736196 763715 798133 759945 721739 778328 771358 772742 772523 744651 721256 725846 736629
4518 736629 743562 770493 771145 740161 711664 730986 764748 768658 722382 695322 687736 727869 722193
4505 722193 721880 689770 707442 710326 723206 735529 726091 708650 687347 692140 683142 677629 651015
$$ packed form
4591A316312o538O531k0654p7643k5405j8130j8797m3937k7740P889m568l3331
4579A053989l9345n5988L5468J8768l8421j6692R344j6717k0094N99J9857j4172
4567I36596m6321k5682J6679j665l7641K8471l215j3641m513k0213j9173k8928
4555G80754j8354M9242k702j5336l4701K9695J1857l0884J2657j9703J584J2564
4543G76673K1565m756j1167K3127k0204l8145l273J1643m4534K6268J5592j1820
4531G40969m773K7519L4418l8188l8206N6589o970J384k19k7872k3395M590J0783
4518G36629O933K6931O52l0984k8497J9322L3762L910m6276k7060p586M0133n676
4505G22193l13l2110J7672K884J2880J2323r438j7441k1303M793q998n513k6614
$$ plain form
4492 651015 649646 704551 693664 652570 639584 682311 689265 670661 655287 654371 631471 669715
4480 669715 666292 639759 641224 654271 641577 613791 591925 587444 629771 615796 645967 669320
4468 669320 612942 586511 625041 624593 592944 595180 639229 653112 631075 596424 617500 599478
4456 599478 579787 578202 571044 577920 558434 575054 581812 570300 594830 620535 634021 615102
4444 615102 619689 638773 650563 664283 699009 683399 682292 700384 674284 661000 673516 673627
4432 673627 681001 692998 680849 725362 752684 706157 714041 746666 737142 748323 756617 750925 744666
4419 744666 761126 785035 786923 762197 784783 813878 817344 842529 833594 861532 872035 855487
4407 855487 867588 887420 866753 854811 875384 896691 863718 837186 800571 818835 810498 816894
$$ packed form
4492F51015j369N4905j0887m1094j2986M2727O954j8604j5374r16k2900L8244
4480F69715l423k6533J465J3047j2694k7786k1866m481M2327j3975L0171K3353
4468F69320n6378k6431L8530m48l1649K236M4049J3883k2037l4651K1076j8022
4456E99478j9691j585p158O876j9486J6620O758j1512K4530K5705J3486j8919
4444F15102M587J9084J1790J3720L4726j5610j107J8092k6100j3284J2516J11
4432F73627P374J1997j2149M4513K7322m6527P884L2625r524J1181Q294n692o259
4419G44666J6460K3909J888k4726K2586K9095L466K5185q935K7938J0503j6548
4407H55487J2101J9832k0667j1942K0573K1307l2973k6532l6615J8264q337O396
$$ plain form
4395 816894 830885 842754 833615 769876 810723 805113 793556 825229 854962 855648 813465 814451 823480
4382 823480 835416 842537 835059 849138 861027 871550 850267 823732 841528 829542 805670 821544
4370 821544 834008 835447 790784 786787 808636 815403 807780 797525 784745 785403 807268 821421 855951
4357 855951 817852 785260 817525 846403 831644 857541 874921 898577 914057 926142 909981 911441
4345 911441 940071 944665 919357 910040 929174 916571 907659 895778 938076 927976 940530 956937
4333 956937 942370 949552 944476 893457 907298 963505 949139 955392 972461 964782 965410 970487 984243
4320 984243 980061 1021265 1035450 1061180 1059125 1056469 1051278 1082279 1092917 1150439 1147993 1165428 1220450
4307 1220450 1214610 1203538 1222582 1270955 1254639 1256115 1308085 1353969 1365317 1357796 1367416 1408885
$$ packed form
4395H16894J3991J1869r139o3739M0847n610j1557L1673K9733O86m2183R86R029
4382H23480J1936P121p478J4079J1889J0523k1283k6535J7796j1986k3872J5874
4370H21544J2464J439m4663l997K1849O767p623j0255j2780O58K1865J4153L4530
4357H55951l8099l2592L2265K8878j4759K5897J7380K3656J5480J2085j6161J460
4345I11441K8630M594k5308r317J9134j2603q912j1881M2298j0100J2554J6407
4333I56937j4567P182n076n1019J3841N6207j4366O253J7069p679O28N077J3756
4320I84243m182M1204J4185K5730k055k656n191L1001J0638N7522k446J7435N5022
4307A220450n840j1072J9044M8373j6316J476N1970M5884J1348p521R620M1469
$$ plain form
4295 1408885 1448995 1488911 1545196 1591399 1633727 1697607 1744292 1785458 1836537 1902231 1954699
4284 1954699 1984686 2055458 2181857 2316623 2403965 2515382 2623825 2750148 2924768 3096053
4274 3096053 3235775 3350779 3533986 3695362 3883286 4122158 4330192 4586670 4870409 5215377
4264 5215377 5551987 5870944 6193728 6487923 6830997 7212252 7547184 7785259 8051907 8325512
4254 8325512 8568262 8847392 9231079 9646006 10213952 10852237 11601765 12403858 13214911 14013249
4244 14013249 14759862 15401511 15869312 16131693 16321050 16444746 16583487 16869627 17323984
4235 17323984 17947081 18709566 19610902 20595043 21639015 22608496 23419461 23997758 24312022
4226 24312022 24342140 24086372 23706080 23275638 22929823 22766303 22858436 23153609 23607406 24209443
$$ packed form
4295A408885M0110L9916N6285M6203M2328O3880M6685M1166N1079O5694N2468
4284A954699K9987P0772J26399J34766Q7342J11417J08443J26323J74620J71285
4274C096053J39722J15004J83207J61376J87924K38872K08034K56478K83739L44968
4264E215377L36610L18957L22784K94195L43074L81255L34932K38075K66648K73605
4254H325512K42750K79130L83687M14927N67946O38285P49528Q02093Q11053P98338
4244A4013249P46613O41649M67801K62381J89357J23696J38741K86140M54357
4235A7323984O23097P62485R01336R84141J043972R69481Q10965N78297L14264
4226B4312022L0118k55768l80292m30442l45815j63520R2133K95173M53797O02037
$$ plain form
4216 24209443 24831424 25488207 26013737 26251045 26120095 25606957 24750639 23687188 22572253
4207 22572253 21556230 20781124 20171037 19852242 19697760 19687164 19848002 19984033 20038118 19851587
4197 19851587 19371194 18589392 17546570 16371661 15225919 14173451 13309731 12588598 12083884
4188 12083884 11752590 11482964 11264418 11087161 10903014 10611009 10198164 9621639 8961418
4179 8961418 8279323 7663222 7102677 6610206 6242426 5955775 5665670 5468382 5276518 5116959
4169 5116959 4965965 4817225 4629465 4392940 4174204 3963372 3781041 3600163 3466942 3335170
4159 3335170 3228935 3135218 3058331 2935658 2825132 2766632 2716445 2648199 2559287 2500092 2417433
4148 2417433 2345944 2305075 2247166 2168602 2119354 2103983 2081542 2065106 1985389 1983305 1931371 1917623
$$ packed form
4216B4209443O21981O56783N25530K37308j30950n13138q56318j063451j114935
4207B2572253j016023p75106o10087l18795j54482j0596J60838J36031N4085j86531
4197A9851587m80393p81802j042822j174909j145742j052468q63720p21133n04714
4188A2083884l31294k69626k18546j77257j84147k92005m12845n76525o60221
4179H961418o82095o16101n60545m92471l67780k86651k90105j97288j91864j59559
4169E116959j50994j48740j87760k36525k18736k10832j82331j80878j33221j31772
4159C335170j06235r3717p6887j22673j10526n8500n0187o8246q8912n9195q2659
4148B417433p1489m0869n7909p8564m9248j5371k2441j6436p9717k084n1934j3748
$$ plain form
4136 1917623 1908805 1907630 1869441 1833986 1802763 1809380 1784788 1743313 1761812 1753825 1778905 1775514
4124 1775514 1746454 1728999 1720842 1708240 1654541 1666865 1632338 1585031 1578476 1578964 1563604 1582548
4112 1582548 1568820 1552490 1554173 1528476 1530419 1497845 1515431 1542312 1552069 1542289 1537930 1547912 1518583
4099 1518583 1495788 1531434 1540016 1541028 1544853 1577606 1537233 1540238 1569346 1580662 1565450 1581903
4087 1581903 1588748 1600047 1656689 1663711 1634085 1625992 1681613 1741297 1746498 1793896 1841113 1857359
4075 1857359 1904502 1943739 1993560 2023808 2054127 2041887 2061663 2105911 2106489 2168161 2221733 2292535
4063 2292535 2365985 2400706 2481661 2528544 2536597 2564514 2564322 2570669 2591324 2653785 2633908 2673800
4051 2673800 2744997 2815835 2898746 2998469 3083169 3084738 3065626 3063502 3017578 2944046 2943027 2862732
$$ packed form
4136A917623q818j175l8189l5455l1223O617k4592m1475J8499p987K5080l391
4124A775514k9060j7455q157j2602n3699J2324l4527m7307o555M88j5360J8944
4112A582548j3728j6330J683k5697J943l2574J7586K6881R757r780m359R982k9329
4099A518583k2795L5646Q582J012L825L2753m0373L005K9108J1316j5212J6453
4087A581903O845J1299N6642P022k9626q093N5621N9684N201M7398M7217J6246
4075A857359M7143L9237M9821L0248L0319j2240J9776M4248N78O1672N3572P0802
4063B292535P3450L4721Q0955M6883Q053K7917j92O347K0655O2461j9877L9892
4051B673800P1197P0838Q2911R9723Q4700J569j9112k124m5924p3532j019q0295
$$ plain form
4039 2862732 2838709 2819163 2829744 2900322 2922429 2943878 2960196 2985779 2988704 2956638 2904975 2855662
4027 2855662 2777839 2722698 2690973 2675343 2677606 2641917 2633358 2657385 2666686 2675800 2654654 2615931
4015 2615931 2593056 2579589 2571720 2574743 2576650 2587255 2637783 2628412 2611876 2658153 2703637 2703584 2678519
4002 2678519 2693364 2664041 2676165 2728988 2769936 2822797 2830190 2834387 2889840 2885159 2891285 2942636
3990 2942636 2979618 3002238 3042915 3045341 3055307 3090701 3125143 3221408 3284707 3315941 3335083 3352366
3978 3352366 3360256 3390199 3439467 3455354 3468278 3511639 3566007 3620559 3626891 3659475 3694759 3719202
3966 3719202 3753279 3779913 3793807 3818296 3816235 3844601 3830898 3871576 3962858 4010315 4057974 4090963
3954 4090963 4150830 4204961 4249864 4283745 4317079 4365464 4411558 4434779 4491752 4548667 4577440
$$ packed form
4039B862732k4023j9546J0581P0578K2107K1449J6318K5583K925l2066n1663m9313
4027B855662p7823n5141l1725j5630K263l5689q559K4027R301R114k1146l8723
4015B615931k2875j3467p869L023J907J0605N0528r371j6536M6277M5484n3k5065
4002B678519J4845k9323J2124N2823M0948N2861P393M197N5453m681O126N1351
3990B942636L6982K2620M0677K426R966L5394L4442R6265O3299L1234J9142J7283
3978C352366P890K9943M9268J5887J2924M3361N4368N4552O332L2584L5284K4443
3966C719202L4077K6634J3894K4489k061K8366j3703M0678R1282M7457M7659L2989
3954D090963N9867N4131M4903L3881L3334M8385M6094K3221N6973N6915K8773
$$ plain form
3943 4577440 4558971 4547902 4591472 4577096 4565800 4613997 4668222 4736773 4805213 4906780 5028537
3932 5028537 5126840 5294197 5486358 5688491 5858858 6033540 6177689 6270786 6330259 6357629
3922 6357629 6366572 6409507 6451629 6538060 6685486 6851587 7018950 7237733 7469423 7695138
3912 7695138 7930013 8285325 8677969 9094298 9573249 10101292 10647576 11204898 11831975 12439955
3902 12439955 13061145 13714553 14469782 15390852 16464859 17720978 19131122 20591480 22035940
3893 22035940 23232897 24069474 24451114 24557687 24576141 24702129 24980401 25398827 25971517
3884 25971517 26727868 27763207 28904691 30150095 31372248 32392153 33142447 33613042 33843784
3875 33843784 33902605 34019135 34174575 34497081 35085520 35957632 37182732 38776123 40638606
$$ packed form
3943D577440j8469j1069M3570j4376j1296M8197N4225O8551O8440J01567J21757
3932E028537R8303J67357J92161K02133J70367J74682J44149R3097N9473K7370
3922F357629Q943M2935M2122Q6431J47426J66101J67363K18783K31690K25715
3912G695138K34875L55312L92644M16329M78951N28043N46284N57322O27077O07980
3902A2439955O21190O53408P55229R21070J074007J256119J410144J460358J444460
3893B2035940J196957Q36577L81640J06573J8454J25988K78272M18426N72690
3884B5971517P56351J035339J141484J245404J222153J019905P50294M70595K30742
3875C3843784N8821J16530J55440L22506N88439Q72112J225100J593391J862483
$$ plain form
3866 40638606 42660138 44740448 46680479 48077444 48544938 47706795 45738647 43048512
3858 43048512 40276188 37965117 36263672 35045744 34190313 33614822 33206413 32962655 32804711
3849 32804711 32681877 32527715 32169114 31590535 30740152 29554414 28144933 26725760 25478011
3840 25478011 24518089 23878163 23537310 23310147 23173712 23002219 22790228 22543135 22079385
3831 22079385 21253516 20073456 18705817 17278566 16022138 14987588 14200929 13525389 12957265
3822 12957265 12455581 11975379 11510090 10996525 10551021 10153301 9747540 9457811 9188294
3813 9188294 8971817 8751412 8561287 8397137 8272758 8173627 8092855 8040349 8006831 7957077
3803 7957077 7936203 7882048 7819631 7769287 7690403 7588715 7468896 7250463 7078951 6925289
$$ packed form
3866D0638606K021532K080310J940031J396965M67494q38143j968148k690135
3858D3048512k772324k311071j701445j217928q55431n75491m08409k43758j57944
3849C2804711j22834j54162l58601n78579q50383j185738j409481j419173j247749
3840B5478011r59922o39926l40853k27163j36435j71493k11991k47093m63750
3831B2079385q25869j180060j367639j427251j256428j034550p86659o75540n68124
3822A2957265n01684m80202m65289n13565m45504l97720m05761k89729k69517
3813I188294k16477k20405j90125j64150j24379r9131q0772n2506l3518m9754
3803G957077k0874n4155o2417n0344p8884j01688j19819k18433j71512j53662
$$ plain form
3793 6925289 6769170 6685393 6574851 6530369 6494241 6464240 6439641 6423903 6390662 6343254 6298701
3782 6298701 6278101 6274813 6249615 6244654 6246592 6266502 6267668 6254764 6212245 6183811 6156651 6169996
3770 6169996 6177011 6136848 6143691 6139831 6105232 6105470 6143133 6159313 6176513 6238118 6338448 6427833
3758 6427833 6500795 6558111 6656974 6740722 6797766 6897945 6998392 7114754 7275587 7433470
3748 7433470 7608500 7813944 8022172 8255143 8516962 8780296 9097583 9469827 9828007 10235701
3738 10235701 10654268 11158133 11693699 12267543 12928970 13631962 14424403 15298548 16328441
3729 16328441 17499598 18817422 20304708 21998597 23825135 25768464 27685784 29517403
3721 29517403 31137907 32469742 33452442 34072840 34352684 34257705 33939937 33489220 33008024
$$ packed form
3793F925289j56119q3777j10542m4482l6128l0001k4599j5738l3241m7408m4553
3782F298701k0600l288k5198m961J938J9910J166j2904m2519k8434k7160J3345
3770F169996P015m0163O843l860l4599K38L7663J6180J7200O1605J00330Q9385
3758F427833P2962N7316R8863Q3748N7044J00179J00447J16362J60833J57883
3748G433470J75030K05444K08228K32971K61819K63334L17287L72244L58180M07694
3738A0235701M18567N03865N35566N73844O61427P02992P92441Q74145J029893
3729A6328441J171157J317824J487286J693889J826538J943329J917320J831619
3721B9517403J620504J331835R82700O20398K79844r4979l17768m50717m81196
$$ plain form
3712 33008024 32632330 32369980 32307808 32470079 32797481 33116216 33310416 33329675 33064508 32460934
3702 32460934 31533772 30277992 28798457 27125790 25297035 23505463 21788621 20152448
3694 20152448 18663658 17334421 16206455 15264233 14462497 13740607 13087484 12526949 11993380
3685 11993380 11560371 11147110 10794340 10465878 10120681 9839906 9584779 9377880 9180981
3676 9180981 9026075 8884788 8746696 8619514 8515166 8453431 8378023 8327468 8290660 8237526
3666 8237526 8171972 8117307 8054872 8010408 7952002 7877437 7832214 7796052 7716870 7695863 7674631
3655 7674631 7633706 7645435 7637532 7661168 7638933 7638260 7678989 7702836 7716966 7739842 7759681 7824366
3643 7824366 7886931 7953943 8004674 8058012 8139505 8230672 8309339 8368278 8446466 8546540 8664431
$$ packed form
3712C3008024l75694k62350o2172J62271L27402L18735J94200J9259k65167o03574
3702C2460934r27162j255780j479535j672667j828755j791572j716842j636173
3694B0152448j488790j329237j127966r42222q01736p21890o53123n60535n33569
3685A1993380m33009m13261l52770l28462l45197k80775k55127k06899j96899
3676I180981j54906j41287j38092j27182j04348o1735p5408n0555l6808n3134
3666H237526o5554n4665o2435m4464n8406p4565m5223l6162p9182k1007k1232
3655G674631m0925J1729p903K3636k2235o73M0729K3847J4130K2876J9839O4685
3643G824366O2565O7012N0731N3338Q1493R1167P8667N8939P8188J00074J17891
$$ plain form
3632 8664431 8766950 8871470 9010124 9113578 9225942 9390701 9579657 9750267 9944911 10107614
3622 10107614 10261111 10481669 10614926 10769787 10968632 11193968 11386057 11568737 11768120
3613 11768120 12029350 12291754 12613845 12953183 13313854 13719209 14171375 14681622 15223968
3604 15223968 15787185 16376041 17032739 17829431 18651529 19539691 20536848 21683976 22979515
3595 22979515 24482604 26149427 28098002 30366458 32919326 35788784 38823970 41985958
3587 41985958 45135641 48116274 50706881 52828667 54436075 55549537 56161365 56340360
3579 56340360 56215283 55988153 55815133 55779131 55933418 56348004 56895606 57416626 57804152 57884232
3569 57884232 57520617 56638020 55226815 53318021 50949913 48327080 45489857 42584379
$$ packed form
3632H664431J02519J04520J38654J03454J12364J64759J88956J70610J94644J62703
3622A0107614J53497K20558J33257J54861J98845K25336J92089J82680J99383
3613A1768120K61230K62404L22091L39338L60671M05355M52166N10247N42346
3604A5223968N63217N88856O56698P96692Q22098Q88162R97157J147128J295539
3595B2979515J503089J666823J948575K268456K552868K869458L035186L161988
3587D1985958L149683K980633K590607K121786J607408J113462O11828J78995
3579E6340360j25077k27130j73020l6002J54287M14586N47602N21020L87526Q0080
3569E7884232l63615q82597j411205j908794k368108k622833k837223k905478
$$ plain form
3561 42584379 39789969 37162342 34832595 32810114 31072656 29615144 28415135 27403476
3553 27403476 26559238 25856382 25272908 24794607 24427045 24166097 23998973 23966466 23987634 24113229
3543 24113229 24389809 24735997 25172980 25691223 26336842 27068015 27907757 28893592 29994703
3534 29994703 31279897 32711969 34334906 36160176 38201379 40487120 43023304 45792857
3526 45792857 48699617 51689516 54780465 57787776 60658822 63361690 65885765 68281160
3518 68281160 70514387 72520627 74171560 75432624 76275755 76664196 76695363 76427747 75860766
3509 75860766 75049833 74036773 72859738 71525829 70086025 68518186 66809404 64996512
3501 64996512 63109296 61141974 59183920 57348740 55624548 53991178 52591843 51479738
$$ packed form
3561D2584379k794410k627627k329747k022481j737458j457512j200009j011659
3553B7403476q44238p02856n83474m78301l67562k60948j67124l2507K1168J25595
3543B4113229K76580L46188M36983N18243O45619P31173Q39742R85835J101111
3534B9994703J285194J432072J622937J825270K041203K285741K536184K769553
3526D5792857K906760K989899L090949L007311K871046K702868K524075K395395
3518F8281160K233227K006240J650933J261064Q43131L88441L1167k67616n66981
3509G5860766q10933j013060j177035j333909j439804j567839j708782j812892
3501F4996512j887216j967322j958054j835180j724192j633370j399335j112105
$$ plain form
3493 51479738 50641021 50094903 49888006 50035383 50553592 51346246 52243399 53165845 54125400
3484 54125400 55210630 56734872 58770016 61194959 63825927 66511600 69272631 72331894
3476 72331894 75875993 79711909 83593737 87418916 91131780 94602937 97805500 100701759
3468 100701759 103350985 105889659 108543717 111509156 114985522 119146045 124036531 129684550
3460 129684550 135882995 142375839 148749997 154592425 159494257 163225150 165756669 166712533
3452 166712533 165961156 163476977 159577197 154739005 149648409 144909444 140716123 137234135
3444 137234135 134532366 132478199 130755494 129128579 127374060 125361569 122917253 119836095
3436 119836095 116019106 111445154 106263767 100662301 94940061 89234026 83736971 78607717
$$ packed form
3493E1479738q38717n46118k06897J47377N18209P92654Q97153R22446R59555
3484E4125400J085230J524242K035144K424943K630968K685673K761031L059263
3476G2331894L544099L835916L881828L825179L712864L471157L202563K896259
3468A00701759K649226K538674K654058K965439L476366M160523M890486N648019
3460A29684550O198445O492844O374158N842428M901832L730893K531519R55864
3452A66712533p51377k484179l899780m838192n090596m738965m193321l481988
3444A37234135k701769k054167j722705j626915j754519k012491k444316l081158
3436A19836095l816989m573952n181387n601466n722240n706035n497055n129254
$$ plain form
3428 78607717 73873933 69647000 65903234 62593906 59835999 57566529 55696654 54225029
3420 54225029 53128538 52293791 51724178 51462071 51470174 51723152 52311638 53265031 54512512
3411 54512512 56162224 58277279 60789896 63731360 67096802 70699950 74467783 78141999
3403 78141999 81601978 84790086 87668005 90327161 92705180 94645362 96031627 96775923
3395 96775923 96796373 96212801 95245948 94075770 92875289 91631317 90393093 89081103 87821374
3386 87821374 86581181 85465915 84394352 83264485 81956257 80395009 78414307 76066189
3378 76066189 73422462 70414841 67150124 63706964 60155762 56668470 53322812 50174729
3370 50174729 47333583 44699143 42338170 40298675 38515368 36976176 35709068 34630040
$$ packed form
3428G8607717m733784m226933l743766l309328k757907k269470j869875j471625
3420E4225029j096491q34747n69613k62107Q103K52978N88486R53393J247481
3411E4512512J649712K115055K512617K941464L365442L603148L767833L674216
3403G8141999L459979L188108K877919K659156K378019J940182J386265P44296
3395I6775923K0450n83572r66853j170178j200481j243972j238224j311990j259729
3386H7821374j240193j115266j071563j129867j308228j561248j980702k348118
3378G6066189k643727l007621l264717l443160l551202l487292l345658l148083
3370E0174729k841146k634440k360973k039495j783307j539192j267108j079028
$$ plain form
3362 34630040 33678921 32675734 31704159 30679981 29715324 28953460 28357588 27925983 27628087
3353 27628087 27507478 27496386 27613546 27982936 28548470 29294003 30106301 30892938 31593906 32055532
3343 32055532 32177832 31952802 31311814 30493497 29744832 29176144 28905412 28897937 29055072 29243466
3333 29243466 29457435 29658585 29816492 29896946 29891292 29831345 29704128 29579362 29541401 29600901
3323 29600901 29762948 30041135 30561995 31215655 31989858 32869468 33684948 34380795 34840588
3314 34840588 35081960 35069495 35087034 35297588 35901484 36948814 38361233 40026125 41868577
3305 41868577 43818020 45815790 47925817 50103208 52349457 54587586 56814188 58934498
3297 58934498 60979784 62895683 64760965 66611599 68513731 70393097 72159720 73743450
$$ packed form
3362C4630040r51119j003187r71575j024178r64657p61864n95872m31605k97896
3353B7628087j20609j1092J17160L69390N65534P45533Q12298P86637P00968M61626
3343C2055532J22300k25030o40988q18317p48665n68688k70732p475J57135J88394
3333B9243466K13969K01150J57907Q0454n654n9947j27217j24766l7961N9500
3323B9600901J62047K78187N20860O53660P74203Q79610Q15480O95847M59793
3314C4840588K41372j2465J7539K10554O03896J047330J412419J664892J842452
3305D1868577J949443J997770K110027K177391K246249K238129K226602K120310
3297E8934498K045286J915899J865282J850634J902132J879366J766623J583730
$$ plain form
3289 73743450 75031267 76038350 76812457 77442048 77918021 78218599 78159742 77579241 76460659
3280 76460659 74798921 72715531 70322446 67638363 64594713 61266742 57698571 53910483
3272 53910483 50094231 46375083 42807961 39402862 36322144 33495241 30912076 28608643
3264 28608643 26580759 24828556 23280277 21897500 20677533 19599638 18625268 17794205
3256 17794205 16975555 16244946 15637834 15072589 14568360 14114882 13711525 13328720 13000018
3247 13000018 12704848 12410145 12224443 12018598 11848316 11753746 11591866 11525901 11434532 11317116
3237 11317116 11236590 11168800 11069531 10954049 10858307 10729264 10581960 10473479 10346498 10198130
3227 10198130 10081109 9996698 9913303 9810377 9702443 9634564 9531975 9381225 9259571 9106412
$$ packed form
3289G3743450J287817J007083P74107O29591M75973L00578n8857n80501j118582
3280G6460659j661738k083390k393085k684083l043650l327971l568171l788088
3272E3910483l816252l719148l567122l405099l080718k826903k583165k303433
3264B8608643k027884j752203j548279j382777j219967j077895r74370q31063
3256A7794205q18650p30609o07112n65245n04229m53478m03357l82805l28702
3247A3000018k95170k94703j85702k05845j70282r4570j61880o5965r1369j17416
3237A1317116q0526o7790r9269j15482r5742j29043j47304j08481j26981j48368
3227A0198130j17021q4411q3395j02926j07934o7879j02589j50750j21654j53159
$$ plain form
3217 9106412 8906584 8698411 8485898 8226149 8010603 7813318 7565117 7373179 7244449 7121713
3207 7121713 7020408 6869727 6743497 6648947 6540783 6481529 6382758 6315625 6231661 6136072 6103280
3196 6103280 6032102 5955573 5917126 5899881 5878597 5860250 5830045 5807960 5825367 5837190 5855915
3185 5855915 5869490 5858868 5887742 5877177 5867148 5855528 5838692 5817258 5825041 5828183 5859323 5870908
3173 5870908 5860408 5923379 5994506 6015374 6079297 6143396 6168953 6206865 6244117 6277464 6296728
3162 6296728 6295182 6316117 6304945 6336043 6352480 6362298 6388242 6387951 6420685 6435929 6476963 6497590
3150 6497590 6504071 6535697 6541730 6495975 6513283 6524747 6536749 6573099 6568667 6567364 6605009 6634802
3138 6634802 6661169 6735484 6787004 6827987 6904939 6983674 7061194 7118703 7187756 7261028 7374844
$$ packed form
3217I106412j99828k08173k12513k59749k15546j97285k48201j91938j28730j22736
3207G121713j01305j50681j26230r4550j08164n9254r8771o7133q3964r5589l2792
3196F103280p1178p6529l8447j7245k1284j8347l0205k2085J7407J1823J8725
3185E855915J3575j0622K8874j0565j0029j1620j6836k1434P783L142L1140J1585
3173E870908j0500O2971P1127K0868O3923O4099K5557L7912L7252L3347J9264
3162F296728j546K0935j1172L1098J6437R818K5944k91L2734J5244M1034K0627
3150F497590O481L1626O033m5755J7308J1464J2002L6350m432j303L7645K9793
3138F634802K6367P4315N1520M0983P6952P8735P7520N7509O9053P3272J13816
$$ plain form
3127 7374844 7457550 7585694 7716381 7845366 7995170 8113966 8235432 8362309 8470493 8612907
3117 8612907 8749177 8917842 9127942 9316722 9519274 9755464 10015933 10357378 10719952 11058748
3107 11058748 11419375 11779177 12149900 12503220 12904608 13287611 13667929 14106505 14568502
3098 14568502 15043388 15556185 16094897 16706604 17371878 18136990 18963483 19834846 20771944
3089 20771944 21758583 22810698 24013385 25334580 26699780 28157709 29740928 31403311
3081 31403311 33220333 35275546 37511880 40037358 42823823 45940153 49539097 53613441
3073 53613441 58227718 63365611 68910156 75027925 81874423 89446942 98039405 107590741
3065 107590741 118129504 130048716 143925246 160335048 179750956 202219056 227681651
$$ packed form
3127G374844Q2706J28144J30687J28985J49804J18796J21466J26877J08184J42414
3117H612907J36270J68665K10100J88780K02552K36190K60469L41445L62574L38796
3107A1058748L60627L59802L70723L53320M01388L83003L80318M38576M61997
3098A4568502M74886N12797N38712O11707O65274P65112Q26493Q71363R37098
3089B0771944R86639J052115J202687J321195J365200J457929J583219J662383
3081C1403311J817022K055213K236334K525478K786465L116330L598944M074344
3073E3613441M614277N137893N544545O117769O846498P572519Q592463R551336
3065A07590741J0538763J1919212J3876530J6409802J9415908K2468100K5462595
$$ plain form
3058 227681651 256504447 287574704 317553623 341939874 358076213 367967904 375916409
3051 375916409 381949230 379867219 362370397 327843814 283183403 239546218 203995476
3044 203995476 176914659 156211387 140083141 127095794 116224847 106717793 98015383
3037 98015383 89901005 82447930 75747343 69823214 64622950 59958153 55776575 51954766
3029 51954766 48467765 45293766 42512562 40050631 37830858 35874913 34071899 32395991
3021 32395991 30858229 29450975 28116164 26867346 25722535 24689843 23720247 22766360
3013 22766360 21871060 21080629 20329721 19579124 18812635 18043592 17327342 16596711 15941513
3004 15941513 15388254 14828996 14306743 13839971 13388134 12988293 12621921 12295010 11985129
$$ packed form
3058B27681651K8822796L1070257K9978919K4386251J6136339R891691P948505
3051C75916409O032821k082011j7496822l4526583m4660411m3637185l5550742
3044B03995476k7080817k0703272j6128246j2987347j0870947r507054q702410
3037I8015383q114378p453075o700587n924129n200264m664797m181578l821809
3029E1954766l487001l173999k781204k461931k219773j955945j803014j675908
3021C2395991j537762j407254j334811j248818j144811j032692r69596r53887
3013B2766360q95300p90431p50908p50597p66489p69043p16250p30631o55198
3004A5941513n53259n59258n22253m66772m51837l99841l66372l26911l09881
$$ plain form
2995 11985129 11679242 11397791 11104438 10824823 10543420 10262200 9991149 9692940 9389817
2986 9389817 9104508 8823442 8532401 8292485 8042932 7775642 7588434 7397459 7260538 7109080
2976 7109080 6940561 6812394 6717338 6549053 6415726 6281550 6160797 5999616 5854982 5742827
2966 5742827 5613802 5519200 5374319 5220818 5113648 5012208 4927584 4855586 4780904 4679460
2956 4679460 4598960 4521318 4438741 4369314 4291529 4192132 4093469 4047222 3997247 3933350 3847078
2945 3847078 3765689 3673165 3599437 3558217 3535172 3469105 3429360 3433553 3447944 3396355 3359095 3323422
2933 3323422 3273843 3219957 3183539 3125966 3088266 3074344 3014201 2932939 2879089 2810137 2770962
2922 2770962 2735839 2661810 2630440 2610648 2557343 2529330 2476716 2447508 2387770 2356583 2333210
$$ packed form
2995A1985129l05887k81451k93353k79615k81403k81220k71051k98209l03123
2986I389817k85309k81066k91041k39916k49553k67290j87208j90975j36921j51458
2976G109080j68519j28167r5056j68285j33327j34176j20753j61181j44634j12155
2966E742827j29025r4602j44881j53501j07170j01440q4624p1998p4682j01444
2956D679460q0500p7642q2577o9427p7785r9397r8663m6247m9975o3897q6272
2945C847078q1389r2524p3728m1220k3045o6067l9745M193J4391n1589l7260l5673
2933C323422m9579n3886l6418n7573l7700j3922o0143q1262n3850o8952l9175
2922B770962l5123p4029l1370j9792n3305k8013n2614k9208n9738l1187k3373
$$ plain form
2911 2333210 2281334 2209897 2177130 2143271 2063215 1994697 1935309 1846255 1812079 1779376 1758909
2900 1758909 1724611 1670830 1668588 1638162 1605406 1607240 1620710 1578438 1565195 1546403 1520665 1483157
2888 1483157 1466381 1431447 1403797 1379976 1350547 1305888 1277583 1261247 1259644 1238582 1226328 1217224
2876 1217224 1165308 1124561 1107922 1078719 1097756 1093093 1083845 1053558 1016976 1011773 990006 949441
2864 949441 946035 928533 900618 860351 825474 827456 832328 818773 824318 833947 805253 788807 772275
2851 772275 768326 745600 752865 782946 810540 789885 754300 742026 723377 779536 769349 735268
2839 735268 773309 796863 818620 839229 842519 879334 940598 926444 951340 987429 952992 936762
2827 936762 925982 910077 922204 908160 905990 913704 887729 853266 839585 847765 823754 807384
$$ packed form
2911B333210n1876p1437l2767l3859q0056o8518n9388q9054l4176l2703k0467
2900A758909l4298n3781k242l0426l2756J834J3470m2272j3243j8792k5738l7508
2888A483157j6776l4934k7650k3821k9429m4659k8305j6336j603k1062j2254r104
2876A217224n1916m0747j6639k9203J9037m663r248l0287l6582n203k1767m0565
2864I49441l406j7502k7915m0267l4877J982M872j3555N545R629k8694j6446j6532
2851G72275l949k2726P265L0081K7594k0655l5585j2274j8649N6159j0187l4081
2839G35268L8041K3554K1757K0609L290L6815O1264j4154K4896L6089l4437j6230
2827I36762j0780j5905J2127j4044k170P714k5975l4463j3681Q180k4011j6370
$$ plain form
2815 807384 787109 804522 804840 789504 828816 808506 795947 761396 745887 719408 712750 725008
2803 725008 721423 728176 731697 678702 668096 738402 740904 736435 710049 727021 744259 787627 805046
2790 805046 820440 818152 818885 826774 873583 951844 992184 1028186 1105171 1202101 1255652 1323048
2778 1323048 1419225 1541409 1653136 1803209 1968786 2101315 2217573 2316780 2389489 2449536
2768 2449536 2453460 2454845 2399868 2235684 1974349 1703831 1517656 1357548 1219052 1169681 1093395
2757 1093395 1028445 980404 912926 889108 836017 771701 747405 730458 678379 649612 590183
2746 590183 549852 520020 513340 491341 470274 452197 449812 460658 438334 416978 390354 408056
2734 408056 412135 419042 420264 414710 406520 395926 362716 341505 358344 387255 381667 365098 330045
$$ packed form
2815H07384k0275J7413L18j5336L9312k0310j2559l4551j5509k6479o658J2258
2803G25008l585O753L521n2995j0606P0306K502m469k6386J6972J7238M3368J7419
2790H05046J5394k288P33P889M6809P8261M0340L6002P6985R6930N3551O7396
2778A323048R6177J22184J11727J50073J65577J32529J16258R9207P2709O0047
2768B449536L924J385n4977j64184k61335k70518j86175j60108j38496m9371p6286
2757A093395o4950m8041o7478k3818n3091o4316k4296j6947n2079k8767n9429
2746E90183m0331k9832o680k1999k1067j8077k385J0846k2324k1356k6624J7702
2734D08056M079O907J222n554q190j0594l3210k1211J6839K8911n588j6569l5053
$$ plain form
2721 330045 313998 316030 314056 305927 300625 272212 232204 248496 250536 230005 196785 212280 226675
2708 226675 231365 213185 188765 176390 176613 177814 168164 137618 147061 167940 169724 153826 131297
2695 131297 132450 117389 121689 71451 62126 73420 83131 82295 73455 65182 52208 54168 44477 33894
2681 33894 79601 62862 71106 63473 41396 51507 55503 46149 35101 46249 14706 30158 64316
2668 64316 36342 29677 14208 29456 21408 -8608 -3353 -15210 -18515 -25489 -20708 -42995 -38223
2655 -38223 -19178 -26901 -10678 3597 -40524 -30266 -29610 -31538 -34803 -35888 -52956 -82491 -59838
2642 -59838 -64563 -99570 -65643 -75740 -95220 -52308 -78204 -84321 -90434 -90220 -88032 -78466 -76051
2629 -76051 -77685 -49405 -40325 -62450 -71456 -71179 -98025 -96467 -89809 -81386 -99155 -90157 -53190 -52122
$$ packed form
2721C30045j6047K032j974q129n302k8413m0008J6292K040k0531l3220J5495J4395
2708B26675M690j8180k4420j2375K23J201r650l0546R443K0879J784j5898k2529
2695A31297J153j5061M300n0238r325J1294R711q36q840q273j2974J960r691j0583
2681C3894M5707j6739Q244p633k2077J0111L996r354j1048J1148l1543J5452L4158
2668F4316k7974o665j5469J5248q048l0016N255j1857l305o974M781k2287M772
2655c8223J9045p723J6223J4275m4121J0258O56j928l265j085j7068k9535K2653
2642e9838m725l5007L3927j0097j9480M2912k5896o117o113K14K188R566K415
2629g6051j634K8280R080k2125r006K77k6846J558O658Q423j7769Q998L6967J068
$$ plain form
2615 -52122 -65414 -89064 -60896 -56479 -50801 -56749 -84076 -53449 -80552 -107852 -110632 -87860 -101314
2602 -101314 -97501 -65263 -48328 -43815 -44244 -55742 -64212 -65847 -59862 -52445 -81328 -83494 -57387
2589 -57387 -60669 -48261 -53248 -66024 -102019 -119376 -122379 -99204 -94661 -96634 -86126 -60133 -97436
2576 -97436 -100816 -90150 -84366 -71682 -82082 -69860 -94231 -83954 -111801 -129569 -100873 -124695
2564 -124695 -104295 -115074 -129963 -107202 -62718 -58127 -69585 -55044 -86645 -85671 -81445 -36624
2552 -36624 -40210 -84786 -93195 -95657 -132494 -157992 -132660 -85393 -92762 -88807 -122237 -124937 -93564
2539 -93564 -89249 -115461 -113856 -113996 -169769 -150478 -113940 -108238 -96757 -127115 -115502 -90434 -66201
2526 -66201 -92222 -119257 -124680 -120187 -119360 -90445 -91639 -107405 -115495 -110848 -109082 -94763 -106904
$$ packed form
2615e2122j3292k3650K8168M417N678n948k7327L0627k7103k7300k780K2772j3454
2602a01314L813L2238J6935M513m29j1498q470j635N985P417k8883k166K6107
2589e7387l282J2408m987j2776l5995j7357l003K3175M543j973J0508K5993l7303
2576i7436l380J0666N784J2684j0400J2222k4371J0277k7847j7768K8696k3822
2564a24695K0400j0779j4889K2761M4484M591j1458J4541l1601R74M226M4821
2552c6624l586m4576q409k462l6837k5498K5332M7267p369L955l3430k700L1373
2539i3564M315k6212J605j40n5773J9291L6538N702J1481l0358J1613K5068K4233
2526f6201k6021k7035n423M493Q27K8915j194j5766q090M647J766J4319j2141
$$ plain form
2513 -106904 -129423 -127941 -105880 -130846 -156201 -158500 -138694 -111274 -111250 -113460 -137975 -155873 -144367
2500 -144367 -122476 -116544 -112961 -127504 -157660 -157030 -146515 -147273 -149135 -151322 -106232 -84804 -63383
2487 -63383 -97137 -117366 -111435 -75712 -61654 -88942 -111939 -110780 -117531 -110486 -120798 -108358 -108786
2474 -108786 -133947 -112413 -111510 -139142 -116041 -125186 -122180 -99426 -125874 -110002 -118842 -112122 -120572
2461 -120572 -114491 -114606 -138590 -110201 -107186 -113906 -117315 -123901 -99663 -105997 -120054 -77910 -103963
2448 -103963 -127449 -134815 -148937 -121720 -107142 -83217 -116959 -138994 -106050 -105542 -115983 -118210
2436 -118210 -92691 -109899 -126085 -140284 -122523 -146225 -141826 -155314 -154309 -101501 -83313 -108332
2424 -108332 -98993 -94114 -132291 -122116 -139828 -131569 -119498 -123898 -122816 -139338 -146440 -110292 -76401
$$ packed form
2513a06904k2519J482K2061k4966k5355k299J9806K7420K4k210k4515j7898J1506
2500a44367K1891N932L583j4543l0156O30J0515p58j862k187M5090K1428K1421
2487f3383l3754k0229N931L5723J4058k7288k2997J159o751P045j0312J2440m28
2474a08786k5161K1534R03k7632K3101r145L006K2754k6448J5872q840O720q450
2461a20572O081j15k3984K8389L015o720l409o586K4238o334j4057M2144k6053
2448a03963k3486p366j4122K7217J4578K3925l3742k2035L2944N08j0441k227
2436a18210K5519j7208j6186j4199J7761k3702M399j3488J005N2808J8188k5019
2424a08332R339M879l8177J0175j7712Q259J2071m400J082j6522p102L6148L3891
$$ plain form
2411 -76401 -71199 -87314 -108177 -92327 -93355 -101984 -120357 -128405 -126095 -122704 -76420 -78705 -105467
2398 -105467 -100983 -69047 -44669 -49846 -82594 -82180 -88575 -73986 -78887 -66131 -79370 -63877 -63324
2385 -63324 -81793 -71113 -87182 -74660 -107114 -85656 -58919 -60554 -61727 -51443 -20099 -75587
2373 -75587 -87035 -99690 -62433 -30045 -32626 -38616 -29813 -30211 -50076 -40663 -33227 -40758 -40759 -54678
2359 -54678 -52462 -56062 -67111 -39244 -30549 -29679 -28829 -28668 1726 -26813 -39497 -9714 -19128 -17276
2345 -17276 7616 45112 44271 58590 43803 46973 60886 116916 118175 107981 122413 124415 102094
2332 102094 97211 157729 189781 203633 221459 230111 244893 271471 302573 333716 387569 389784
2320 389784 426105 442075 478005 504954 566203 640626 695378 770882 840006 954383 1088364
$$ packed form
2411g6401N202j6115k0863J5850j028q629j8373q048K310L391M6284k285k6762
2398a05467M484L1936K4378n177l2748M14o395J4589m901J2756j3239J5493N53
2385f3324j8469J0680j6069J2522l2454K1458K6737j635j173J0284L1344n5488
2373g5587j1448j2655L7257L2388k581n990Q803l98j9865R413P436p531jj3919
2359e4678K216l600j1049K7867Q695Q70Q50J61L0394k8539j2684K9783r414J852
2345a7276K4892L7496q41J4319j4787L170J3913N6030J259j0194J4432K002k2321
2332A02094m883O0518L2052J3852J7826Q652J4782K6578L1102L1143N3853K215
2320C89784L6321J5970L5930K6949O1249P4423N4752P5504O9124J14377J33981
$$ plain form
2309 1088364 1205768 1399536 1580167 1712219 1847657 1999210 2093538 2216303 2421033 2705572
2299 2705572 3055461 3532396 4223673 5077290 5961431 6943419 8137742 9286998 10000772
2290 10000772 9715165 8513192 6735954 5232808 4273145 3625935 3161806 2782416 2477509
2281 2477509 2266267 2069918 1919224 1791743 1678319 1549024 1422722 1346642 1208264 1086307
2271 1086307 977664 888663 803478 701711 660922 637952 592226 533704 500265 480332 478863
2260 478863 416132 399167 392361 330949 305441 293914 258494 233039 248300 214943 190007 184863
2248 184863 164703 154491 162427 152535 118140 62938 75715 87391 92466 83249 67130 62591 97653
2235 97653 103246 112596 90910 77411 74911 35706 1387 10470 10632 33533 29628 -191 -6509
$$ packed form
2309A088364J17404J93768J80631J32052J35438J51553R4328J22765K04730K84539
2299B705572L49889M76935O91277Q53617Q84141R81988J194323J149256P13774
2290A0000772k85607j201973j777238j503146r59663o47210m64129l79390l04907
2281B477509k11242j96349j50694j27481j13424j29295j26302p6080j38378j21957
2271A086307j08643q9001q5185j01767m0789k2970m5726n8522l3439j9933j469
2260D78863o2731j6965o806o1412k5508j1527l5420k5455J5261l3357k4936n144
2248A84863k0160j0212P936r892l4395n5202J2777J1676N075r217j6119m539L5062
2235I7653N593R350k1686j3499k500l9205l4319R083J62K2901l905k9819o318
$$ plain form
2222 -6509 -11780 -18932 -41140 -59383 -33128 -46646 -41332 -4223 -12828 -15225 -27066 -23250 -31595
2209 -31595 -10151 -27705 -25696 -10691 -5492 -29053 -45587 -66975 -65463 -69031 -61032 -88571 -72394
2196 -72394 -59715 -65747 -39209 -39980 -65183 -85916 -88130 -107251 -116079 -81616 -80901 -74607 -78096 -111637
2182 -111637 -102755 -91304 -93393 -88352 -78249 -80922 -76449 -60062 -62266 -93110 -109939 -102538 -86539
2169 -86539 -109583 -105148 -82212 -99354 -102611 -96163 -118933 -123993 -144046 -141124 -113106 -68912 -86851
2156 -86851 -84632 -106850 -121202 -120440 -124713 -127001 -60512 -22350 -42741 -52704 -59155 -93280 -120715
2143 -120715 -82809 -86402 -86559 -108024 -141216 -148300 -130059 -132232 -160281 -133975 -59770 -90083 -88755
2130 -88755 -104201 -115256 -102735 -97091 -115055 -137206 -172176 -179215 -147151 -146137 -137800 -144789 -138907
$$ packed form
2222f509n271p152k2208j8243K6255j3518N314L7109q605k397j1841L816q345
2209c1595K1444j7554K009J5005N199k3561j6534k1388J512l568P999k7539J6177
2196g2394J2679o032K6538p71k5203k0733k214j9121q828L4463P15O294l489l3541
2182a11637Q882J1451k089N041J0103k673M473J6387k204l0844j6829P401J5999
2169h6539k3044M435K2936j7142l257O448k2770n060k0053K922K8018M4194j7939
2156h6851K219k2218j4352P62m273k288O6489L8162k0391r963o451l4125k7435
2143a20715L7906l593j57k1465l3192p084J8241k173k8049K6306P4205l0313J328
2130h8755j5446j1055J2521N644j7964k2151l4970p039L2064J014Q337o989N882
$$ plain form
2117 -138907 -142203 -163337 -125972 -132981 -121726 -120091 -131126 -146554 -160179 -138690 -153785 -114918
2105 -114918 -144229 -154602 -143542 -122438 -131414 -127355 -167579 -168659 -167677 -136311 -139228 -133731 -110243
2092 -110243 -153440 -140764 -110182 -111210 -130016 -108511 -104093 -127167 -116009 -118736 -128075 -122387 -127239
2079 -127239 -120475 -124650 -104669 -96862 -133658 -174061 -178114 -162176 -153408 -110570 -127892 -122524 -99259
2066 -99259 -122709 -132061 -115926 -103099 -110815 -111781 -147906 -115275 -137703 -126331 -80996 -94787 -133593
2053 -133593 -131459 -147799 -166733 -149681 -134525 -118420 -128831 -104860 -125265 -143585 -149972 -152910
2041 -152910 -145746 -156397 -139290 -144140 -114696 -110136 -116436 -101673 -87928 -82550 -113561 -124620 -118150
2028 -118150 -145222 -115771 -77098 -90632 -120624 -139276 -110356 -122896 -107562 -81722 -118908 -136617
$$ packed form
2117a38907l296k1134L7365p009J1255J635j1035j5428j3625K1489j5095L8867
2105a14918k9311j0373J1060K1104q976M059m0224j080R82L1366k917N497K3488
2092a10243m3197J2676L0582j028j8806K1505M418k3074J1158k727r339N688m852
2079a27239O764m175J9981P807l6796m0403m053J5938Q768M2838j7322N368K3265
2066i9259k3450r352J6135J2827p716r66l6125L2631k2428J1372M5335j3791l8806
2053a33593K134j6340j8934J7052J5156J6105j0411K3971k0405j8320o387k938
2041a52910P164j0651J7107m850K9444M560o300J4763J3745N378l1011j1059O470
2028a18150k7072K9451L8673j3534k9992j8652K8920j2540J5334K5840l7186j7709
$$ plain form
2016 -136617 -131620 -111709 -146052 -158811 -140866 -108706 -90434 -137385 -123686 -119090 -100325 -76683
2004 -76683 -99362 -106368 -110526 -92633 -115689 -117347 -117702 -112459 -107786 -109469 -121063 -121451 -123479 -130267
1990 -130267 -116862 -105429 -100519 -79109 -111392 -131510 -126855 -123993 -101989 -117912 -109686 -117160 -125620
1977 -125620 -137518 -160310 -133898 -131179 -111754 -95467 -115784 -115211 -108849 -103130 -128793 -129904 -147839
1964 -147839 -140773 -103402 -92850 -85008 -83525 -84274 -103612 -123953 -134174 -119058 -109567 -130257 -151388
1951 -151388 -132034 -120641 -136874 -129495 -95254 -100654 -129767 -163130 -189803 -192652 -189126 -161085
1939 -161085 -176877 -138652 -132999 -128004 -117933 -118816 -121016 -103159 -106587 -134044 -133697 -130677 -139224 -117557
1925 -117557 -113513 -112378 -161993 -194588 -170554 -160966 -178369 -165661 -114409 -128509 -155843 -181698
$$ packed form
2016a36617M997J9911l4343j2759J7945L2160J8272m6951J3699M596J8765K3642
2004g6683k2679p006m158J7893k3056j658l55N243M673j683j1594l88k028o788
1990a30267J3405J1433M910K1410l2283k0118M655K862K2004j5923Q226p474q460
1977a25620j1898k2792K6412K719J9425J6287k0317N73O362N719k5663j111j7935
1964a47839P066L7371J0552P842J483p49j9338k0341j0221J5116R491k0690k1131
1951a51388J9354J1393j6233P379L4241n400k9113l3363k6673k849L526K8041
1939a61085j5792L8225N653M995J0071q83k200J7857l428k7457L47L020q547K1667
1925a17557M044J135m9615l2595K4034R588j7403J2708N1252j4100k7334k5855
$$ plain form
1913 -181698 -145570 -97144 -103589 -130182 -123400 -135580 -125350 -81870 -101619 -110304 -133648 -106645
1901 -106645 -77644 -107841 -126197 -99454 -112911 -109220 -91149 -96595 -87636 -70762 -106524 -110543
1889 -110543 -117834 -113308 -95109 -107091 -122443 -131511 -103259 -114852 -132712 -122561 -133763 -145007
1877 -145007 -128834 -132894 -126072 -122518 -105493 -128791 -137410 -133859 -140394 -133990 -114720 -125868 -132687
1864 -132687 -139552 -152780 -110108 -128062 -153230 -136689 -123867 -133036 -127698 -108824 -129779 -109014
1852 -109014 -100256 -90886 -115226 -128424 -111583 -107200 -146213 -159433 -145508 -134970 -126820 -143438
1840 -143438 -118020 -128289 -125521 -136876 -144423 -145855 -147416 -102128 -115415 -152092 -135255 -117225
1828 -117225 -128384 -113495 -112055 -116469 -80929 -75055 -97043 -106325 -92621 -94075 -118396 -99402 -103763
$$ packed form
1913a81698L6128M8426o445k6593O782j2180J0230M3480j9749q685k3344K7003
1901a06645K9001l0197j8356K6743j3457L691J8071n446Q959J6874l5762m019
1889a10543p291M526J8199j1982j5352r068K8252j1593j7860J0151j1202j1244
1877a45007J6173m060O822L554J7025k3298q619L551o535O404J9270j1148o819
1864a32687o865j3228M2672j7954k5168J6541J2822r169N338J8874k0955K0765
1852a09014Q758R370k4340j3198J6841M383l9013j3220J3925J0538Q150j6618
1840a43438K5418j0269K768j1355p547j432j561M5288j3287l6677J6837J8030
1828a17225j1159J4889J440m414L5540N874k1988r282J3704j454k4321J8994m361
$$ plain form
1815 -103763 -92533 -114097 -126932 -125288 -124377 -122553 -121894 -144918 -122642 -136217 -131322 -107854 -138707
1802 -138707 -148908 -125905 -157697 -151608 -134824 -112901 -82542 -88241 -122259 -160796 -141061 -108214
1790 -108214 -135655 -121746 -107772 -99149 -106199 -125241 -132294 -140989 -89370 -92675 -88110 -110895 -139418
1777 -139418 -98413 -88273 -79552 -81650 -90205 -103997 -116132 -101913 -105365 -121278 -100471 -75573
1765 -75573 -107106 -98438 -97974 -94384 -126032 -145313 -120643 -98196 -99834 -77999 -124314 -125272 -86977
1752 -86977 -91636 -98537 -97943 -104487 -119194 -132402 -151200 -147117 -124449 -98255 -106453 -125456 -130011
1739 -130011 -111330 -84882 -106061 -112355 -117096 -113366 -113026 -100450 -87357 -86443 -119219 -115516 -101308
1726 -101308 -121696 -107368 -118929 -92380 -68577 -62265 -44928 -89133 -93884 -88120 -66954 -91579
$$ packed form
1815a03763J1230k1564j2835J644R11J824O59k3024K2276j3575M895K3468l0853
1802a38707j0201K3003l1792O089J6784K1923L0359n699l4018l8537J9735L2847
1790a08214k7441J3909J3974Q623p050j9042p053q695N1619l305M565k2785k8523
1777a39418M1005J0140Q721k098q555j3792j2135J4219l452j5913K0807K4898
1765g5573l1533Q668M64L590l1648j9281K4670K2447j638K1835m6315r58L8295
1752h6977m659o901N94o544j4707j3208j8798M083K2668K6194q198j9003m555
1739a30011J8681K6448k1179o294m741L730L40J2576J3093R14l2776L703J4208
1726a01308k0388J4328j1561K6549K3803O312J7337m4205m751N764K1166k4625
$$ plain form
1714 -91579 -93926 -101318 -104649 -109550 -121923 -109001 -111607 -103477 -119446 -125145 -80431 -74018 -98048
1701 -98048 -116503 -127228 -137967 -107636 -89541 -92989 -94047 -76748 -75154 -95745 -104463 -94215 -117361
1688 -117361 -122909 -133779 -120231 -100557 -89505 -68239 -82974 -92852 -104759 -111385 -136662 -110739
1676 -110739 -71979 -70688 -86456 -92824 -76158 -55412 -99017 -90348 -75992 -101106 -95510 -104711 -79690
1663 -79690 -57034 -65362 -52171 -56223 -66618 -105966 -73649 -80737 -86544 -111850 -106370 -85842 -93924
1650 -93924 -101236 -84370 -92952 -84466 -62177 -25779 -48923 -79968 -76285 -65279 -102174 -127932 -133176
1637 -133176 -120360 -119456 -104900 -94618 -100443 -99117 -70738 -74858 -104073 -81875 -94037 -100519 -80749
1624 -80749 -87439 -81855 -101023 -117991 -116528 -90592 -48401 -99582 -90695 -102380 -112185 -98346 -93673
$$ packed form
1714i1579k347p392l331m901j2373J2922k606Q130j5969n699M4714O413k4030
1701i8048j8455j0725j0739L0331J8095l448j058J7299J594k0591q718J0248k3146
1688a17361n548j0870J3548J9674J1052K1266j4735r878j1907o626k5277K5923
1676a10739L8760J291j5768o368J6666K0746m3605Q669J4356k5114N596r201K5021
1663g9690K2656q328J3191m052j0395l9348L2317p088n807k5306N480K0528q082
1650i3924p312J6866q582Q486K2289L6398k3144l1045L683J1006l6895k5758n244
1637a33176J2816R04J4556J0282n825J326K8379m120k9215K2198j2162o482J9770
1624h0749o690N584j9168j6968J463K5936M2191n1181Q887j1685r805J3839M673
$$ plain form
1611 -93673 -92567 -84798 -66111 -65088 -59475 -31877 -40711 -52590 -70719 -44068 -62120 -72652 -38818
1598 -38818 -33575 -59582 -97587 -84143 -60625 -96296 -85666 -48108 -57170 -60100 -98453 -119029
1586 -119029 -110801 -67187 -61025 -80960 -48435 -65077 -88922 -61382 -32769 -41628 -55316 -45283
1574 -45283 -65191 -73643 -108578 -99528 -81827 -47945 -71650 -111602 -99987 -108977 -84444 -26556
1562 -26556 -39555 -75932 -34039 -16676 -35407 -51966 -52142 -57943 -66615 -64322 -79158 -100921 -75257
1549 -75257 -90212 -80946 -102994 -118489 -105630 -87210 -90051 -97895 -105357 -87503 -71271 -53834 -51040
1536 -51040 -33460 -41303 -56702 -76381 -76495 -71106 -65263 -44863 -68063 -85805 -85923 -96863 -91916
1523 -91916 -86552 -88030 -74659 -64031 -37113 -40214 -33131 -35885 -69315 -93521 -84638 -89301 -100623
$$ packed form
1611i3673J106P769J8687J023N613K7598q834j1879j8129K6651j8052j0532L3834
1598c8818N243k6007l8005J3444K3518l5671J0630L7558r062k930l8353k0576
1586a19029Q228M3614O162j9935L2525j6642k3845K7540K8613q859j3688J0033
1574d5283j9908q452l4935R050J7701L3882k3705l9952J1615q990K4533N7888
1562b6556j2999l6377M1893J7363j8731j6559j76n801q672K293j4836k1763K5664
1549g5257j4955R266k2048j5495J2859J8420k841p844p462J7854J6232J7437K794
1536e1040J7580p843j5399j9679j14N389N843K0400k3200j7742j18j0940M947
1523i1916N364j478J3371J0628K6918l101P083k754l3430k4206Q883m663j1322
$$ plain form
1510 -100623 -104124 -111883 -118422 -75894 -88704 -93804 -63919 -104889 -85653 -55188 -44151 -40338 -65159
1497 -65159 -76609 -66078 -57814 -40883 -50154 -84162 -83915 -49339 -41994 -28799 -35949 -65985 -93716
1484 -93716 -67869 -61764 -86898 -60022 -71611 -49845 -48431 -59068 -55428 -43347 -67522 -51161
1472 -51161 -65092 -82879 -42918 -17124 -54969 -86128 -47495 -58619 -55769 -69356 -72599 -37395
1460 -37395 -34879 -15198 -26724 -54364 -76352 -88751 -77954 -81562 -85329 -93951 -67147 -73308 -70864
1447 -70864 -49414 -55035 -53759 -45042 -40124 -30427 -57434 -77801 -80492 -68674 -48419 -88302 -62861
1434 -62861 -41682 -71022 -78117 -73456 -50194 -51001 -63819 -73170 -79636 -60178 -61936 -77896 -48034
1421 -48034 -28929 -38160 -27206 -38686 -54183 -34334 -18429 -81870 -72366 -67984 -80674 -35169
$$ packed form
1510a00623l501p759o539M2528j2810n100K9885m0970J9236L0465J1037L813k4821
1497f5159j1450J0531Q264J6931r271l4008K47L4576P345J3195p150l0036k7731
1484i3716K5847O105k5134K6876j1589K1766J414j0637L640J2081k4175J6361
1472e1161j3931j7787L9961K5794l7845l1159L8633j1124K850j3587l243L5204
1460c7395K516J9681j1526k7640k1988j2399J0797l608l767q622K6804o161K444
1447g0864K1450n621J276Q717M918R697k7007k0367k691J1818K0255l9883K5441
1434f2861K1179k9340p095M661K3262q07j2818r351o466J9458j758j5960K9862
1421d8034J9105r231J0954j1480j5497J9849J5905o3441R504M382j2690M5505
$$ plain form
1409 -35169 -57436 -62391 -65948 -74628 -43031 -66351 -67527 -78386 -86292 -65630 -86638 -61215 -45670
1396 -45670 -105826 -101360 -82546 -68578 -34612 -32289 -41559 -4901 -41506 -30909 -46573 -54531 -17005
1383 -17005 -30284 -51764 -54864 -47561 -28107 -12732 1024 -30369 -66533 -67680 -77485 -82091 -65688
1370 -65688 -68591 -75187 -69248 -86857 -36767 -30574 -57378 -61539 -57907 -75315 -54413 -32528 -60442
1357 -60442 -42939 -31930 -42475 -35006 -50521 -44883 -41259 -35417 -56429 -50633 -61690 -78007 -88327
1344 -88327 -60915 -56102 -57921 -78443 -71600 -61592 -10436 -19370 -81326 -81653 -51560 -47332 -77774
1331 -77774 -77358 -42562 -36262 -21232 -13494 -36904 -38021 -22315 -41269 -21905 -32926 -37863 -41767
1318 -41767 -34676 -539 -33072 -51449 -29323 -21404 -20105 -22672 -45180 -70648 -70107 -31285 -21084
$$ packed form
1409c5169k2267m955l557q680L1597k3320j176j0859p906K0662k1008K5423J5545
1396d5670o0156M466J8814J3968L3966K323r270L6658l6605J0597j5664p958L7526
1383a7005j3279k1480l100P303J9454J5375J3756l1393l6164j147r805m606J6403
1370f5688k903o596N939j7609N0090O193k6804m161L632j7408K0902K1885k7914
1357f0442J7503J1009j0545P469j5515N638L624N842k1012N796j1057j6317j0320
1344h8327K7412M813j819k0522O843J0008N1156q934o1956l27L0093M228l0442
1331g7774M16L4796O300J5030P738k3410j117J5706j8954J9364j1021m937l904
1318d1767P091L4137l2533j8377K2126P919J299k567k2508k5468N41L8822J0201
$$ plain form
1305 -21084 -4099 -12521 -8436 11436 -2197 -58332 -69227 -37426 -54703 -23401 -43000 -25936
1293 -25936 -10847 -41060 -76091 -64147 -37726 -71713 -56302 -45575 -25783 -17957 -35237 -27188
1281 -27188 -8197 -40023 -46304 -42981 -39004 -48505 -22833 -47634 -57568 -66152 -32472 -10928 17043
1268 17043 -5177 -7160 -29360 -52546 -18521 -14053 -49618 -67652 -46148 -57564 -71875 -69905
1256 -69905 -73208 -72698 -67396 -45098 -37309 -39171 -48892 -36625 -35152 -59220 -21716 -52894 -63019
1243 -63019 -39565 -28374 -27345 -40219 -76034 -74175 -38604 -33169 -40196 -48815 -13739 -32749 -40534
1230 -40534 3438 1066 -39315 -45661 -67162 -78379 -50126 -50875 -19346 -28799 -73501 -80449 824
1217 824 8280 -23403 -19353 -21692 3084 -30363 -42573 -18461 -30297 -43231 -8849 -4846 14436
$$ packed form
1305b1084J6985q422M085J9872j3633n6135j0895L1801j7277L1302j9599J7064
1293b5936J5089l0213l5031J1944K6421l3987J5411J0727J9792P826j7280Q049
1281b7188J8991l1826o281L323L977r501K5672k4801r934q584L3680K1544K7971
1268A7043k2220j983k2200k3186L4025M468l5565j8034K1504j1416j4311J970
1256f9905l303N10N302K2298P789j862r721J2267J473k4068L7504l1178j0125
1243f3019K3454J1191J029j2874l5815J859L5571N435p027q619L5076j9010p785
1230d0534M3972k372m0381o346k1501j1217K8253p49L1529r453m4702o948Q1273
1217H24P456l1683M050k339K4776l3447j2210K4112j1836j2934L4382M003J9282
$$ plain form
1204 14436 -23742 -28791 -31132 -25890 -57221 -96713 -91995 -55829 -47207 -39768 -30503 -41035 -13518
1191 -13518 -21530 -21400 -52004 -46376 -14127 -18106 -24085 -15693 -58136 -26624 -42198 -76162 -75204 -50707
1177 -50707 -66507 -37964 -38086 -35798 -28288 9390 -11634 -29107 -48869 -34188 1787 26086 46276
1164 46276 16746 -17109 -37641 4833 -31140 -58295 -33916 -62632 -63193 -40358 -34870 -46572
1152 -46572 -31635 -6305 -9224 2296 7834 -13829 -50673 -26980 -21956 -20470 -22361 -28339 -28658
1139 -28658 -26383 -33508 -21381 -33545 -30173 -22832 -42932 -60525 -21070 -33217 -19153 -22129 -17987
1126 -17987 3828 -8364 -32831 -17792 -40040 -75272 -34881 -46064 -50002 -50777 -24853 -18701 -21242
1113 -21242 -13100 -27944 -19779 -32732 -34420 -24108 -42262 3386 8120 -32063 -43374 -33069 -28040
$$ packed form
1204A4436l8178n049k341N242l1331l9492M718L6166Q622P439R265j0532K7517
1191a3518q012J30l0604N628L2249l979n979Q392m2443L1512j5574l3964R58K4497
1177e0707j5800K8543j22K288P510L7678k1024j7473j9762J4681L5975K4299K0190
1164D6276k9530l3855k0532M2474l5973k7155K4379k8716n61K2835N488j1702
1152d6572J4937K5330k919J1520N538k1663l6844K3693N024J486j891n978l19
1139b8658K275p125J2127j2164L372P341k0100j7593L9455j2147J4064k976M142
1126a7987K1815j2192k4467J5039k2248l5232M0391j1183l938p75K5924O152k541
1113b1242Q142j4844Q165j2953j688J0312j8154M5648M734m0183j1311J0305N029
$$ plain form
1100 -28040 -47183 -24194 -10368 -349 -63698 -95542 -85752 -64025 -12737 -796 10806 -28899
1088 -28899 -33678 -29561 -51572 -67314 -43230 -34531 471 -7306 -35194 -30038 -79497 -103822 -15898
1075 -15898 -17547 -35968 -43311 -40745 -63084 -95894 -72164 -50126 -42904 -30590 -8951 -6254 -25078
1062 -25078 -11103 -24533 -35373 -27988 -28369 20617 48328 29953 13089 -12840 -11636 62 -34433
1049 -34433 -23952 -35849 2245 -15028 -23755 -24127 -4865 17153 17668 9846 34474 22936 34284
1036 34284 29938 -10826 -40211 7314 21133 -280 15980 -5132 -13125 -6542 7955 426 -11975
1023 -11975 3616 35120 8900 -25233 -24169 -39546 -56075 -32536 -9676 2699 17056 15683
1011 15683 16037 -4165 -6233 -900 -5738 16734 2315 -24461 -30934 -15143 -10455 4308 -20494
$$ packed form
1100b8040j9143K2989J3826J0019o3349l1844R790K1727N1288J1941J1602l9705
1088b8899m779M117k2011j5742K4084Q699L5002p777k7888N156m9459k4325Q7924
1075a5898j649j8421p343K566k2339l2810K3730K2038P222J2314K1639K697j8824
1062b5078J3975j3430j0840P385l81M8986K7711j8375j6864k5929J204J1698l4495
1049c4433J0481j1897L8094j7273q727l72J9262K2018N15p822K4628j1538J1348
1036C4284m346m0764k9385M7525J3819k1413J6260k1112p993O583J4497p529j2401
1023a1975J5591L1504k6220l4133J064j5377j6529K3539K2860J2375J4357j373
1011A5683L54k0202k068N333m838K2472j4419k6776o473J5791M688J4763k4802
$$ plain form
998 -20494 -16514 -12349 -19927 3541 -22418 -31977 23555 21970 13169 6378 -19235 6059 -5575
985 -5575 -22596 -38521 -29152 -31973 -35695 -17169 -23539 -29748 -21501 -15854 -15865 -6444 979 805 -6509
970 -6509 -26056 -6455 12029 24413 -17456 -21795 6380 -21341 8464 -19669 -26115 -20465 -10505
957 -10505 -20297 -33183 -23743 -27658 9150 17614 3151 -18754 -52152 1894 17830 23146 1174
944 1174 -2505 29439 37862 17385 -17793 -7151 748 20321 34624 13791 16693 -8308 -23818
931 -23818 -3720 4286 -7514 -15524 12528 -12535 -28875 -7931 -18423 -29648 -12133 -1363
919 -1363 -12961 3225 -9273 -3545 -5175 8709 20160 -4337 36523 13801 1228 -5153 8815
906 8815 15074 -13262 -10093 -18052 -3589 3233 4602 14178 -4634 -5169 96 -3744 437 -27812
$$ packed form
998b0494L980M165p578K3468k5959r559N5532j585q801o791k5613K5294j1634
985e575j7021j5925R369k821l722J8526o370o209Q247N647j1R421P423j74p314
970f509j9547J9601J8484J2384m1869m339K8175k7721K9805k8133o446N650R960
957a0505r792j2886R440l915L6808Q464j4463k1905l3398N4046J5936N316k1972
944A174l679L1944Q423k0477l5178J0642P899J9573J4303k0833K902k5001j5510
931b3818K0098Q006j1800q010K8052k5063j6340K0944j0492j1225J7515J0770
919a363j1598J6186j2498N728j630J3884J1451k4497M0860k2722j2573o381J3968
906H815O259k8336L169p959J4463O822J369R576j8812n35N265l840M181k8249
$$ plain form
892 -27812 12875 22316 20321 -11119 -9893 14097 27680 33353 9322 9024 833 7644 -12416 463
878 463 -927 1748 19972 11850 -4016 -6433 -1290 23885 27505 10609 17345 4609 10771 -411
864 -411 -577 10935 6484 14002 21440 12009 7443 -3912 -13998 24645 6671 -28118 -15499 26625
850 26625 8254 16323 22968 -9704 3397 16922 5232 -4517 9362 28344 17435 6036 -11798
837 -11798 6601 18163 30356 25493 48634 44504 48324 19412 6174 -8367 -670 9206 13903
824 13903 10912 -249 -4758 3855 -28596 -24244 11740 15107 72098 44342 27022 34879 50868
811 50868 36369 6261 8853 8526 -904 10304 26622 31992 17361 34109 23567 -24121 -26535
798 -26535 11952 28210 26792 15138 -1997 17786 41256 16308 -21346 5657 3501 33231
$$ packed form
892b7812M0687R441j995l1440J226K3990J3583N673k4031k98q191O811k0060J2879
878D63j390K675J8224q122j5866k417N143K5175L620j6896O736j2736O162j1182
864d11j66J1512m451P518P438r431m566j1355j0086L8643j7974l4789J2619M2124
850B6625j8371Q069O645l2672J3101J3525j1690r749J3879J8982j0909j1399j7834
837a1798J8399J1562J2193m863K3141m130L820k8912j3238j4541P697R876M697
824A3903k991j1161m509Q613l2451M352L5984L367N6991k7756j7320P857J5989
811E0868j4499l0108K592l27r430J1208J6318N370j4631J6748j0542m7688k414
798b6535L8487J6258j418j1654j7135J9783K3470k4948l7654K7003k156K9730
$$ plain form
786 33231 54425 20746 11028 24515 26227 20193 45111 34809 32124 2812 3722 6648 49638
773 49638 32156 9740 44845 18298 24789 14987 33712 5662 -58120 -2099 42594 56205
761 56205 45015 9790 2527 -15408 -25318 22351 39308 4838 7006 18285 7466 -85 -9917
748 -9917 4086 -12215 -6302 -10147 -15339 -13991 14674 29358 -2787 7513 32575 14747 13258
735 13258 23258 13891 -8975 22296 20596 -15926 -13290 -9732 -23079 765 -18891 27390 52853
722 52853 23900 17948 17779 8861 41714 53138 25045 -683 18110 46806 50617 24141 19745
709 19745 43530 23580 29368 10642 31531 37979 24883 24122 39761 -27668 6159 16044 -20193
696 -20193 -26222 -9303 3935 7559 8751 5837 279 -8608 -36801 -20590 8066 17259 16023 17304
$$ packed form
786C3231K1194l3679r718J3487J712o034K4918j0302k685k9312R10K926M2990
773D9638j7482k2416L5105k6547O491r802J8725k8050o3782N6021M4693J3611
761E6205j1190l5225p263j7935r910M7669J6957l4470K168J1279j0819p551r832
748i917J4003j6301N913l845n192J348K8665J4684l2145J0300K5062j7828j489
735A3258J0000r367k2866L1271j700l6522K636L558j3347K3844j9656M6281K5463
722E2853k8953n952j69q918L2853J1424k8093k5728J8793K8696L811k6476m396
709A9745K3785j9950N788j8726K0889O448j3096p61J5639o7429L3827R885l6237
696b0193o029J6919J3238L624J192k914n558q887k8193J6211K8656R193j236J281
$$ plain form
682 17304 22932 21775 37650 37097 48884 25031 8838 32519 5105 25302 44098 29905 45935
669 45935 47043 23168 43384 20743 -6324 -4756 -2248 18874 16997 38729 37157 50189 29183
656 29183 -12942 23488 43293 35083 30848 14909 13722 28578 48757 54453 44801 12875 30043
643 30043 44234 15983 35545 51419 21894 46890 67078 68267 57584 32479 9996 9113 10892
630 10892 29246 60127 62817 28758 22177 54036 32507 50975 62723 39301 45155 35202 31630
617 31630 50569 18973 7463 11736 19040 -3692 1933 12873 15406 13456 5632 66707 32480
604 32480 -5303 -17966 266 32654 14906 57406 52629 46286 86296 72848 50298 31140
592 31140 41488 32596 25501 34133 27351 34034 40607 52391 49349 7751 4361 1016 2236 45764
$$ packed form
682A7304N628j157J5875n53J1787k3853j6193K3681k7414K0197J8796j4193J6030
669D5935J108k3875K0216k2641k7067J568K508K1122j877K1732j572J3032k1006
656B9183m2125L6430J9805q210m235j5939j187J4856K0179N696r652l1926J7168
643C0043J4191k8251J9562J5874k9525K4996K0188J189j0683k5105k2483q83J779
630A0892J8354L0881K690l4059o581L1859k1529J8468J1748k3422N854r953l572
617C1630J8939l1596j1510M273P304k2732N625J0940K533j950p824O1075l4227
604C2480l7783j2663J8232L2388j7748M2500m777o343M0010j3448k2550j9158
592C1140J0348q892p095Q632o782O683O573J1784l042m1598l390l345J220M3528
$$ plain form
578 45764 57192 70610 32984 57954 44720 32867 11690 50911 82783 55299 50163 39436
566 39436 26107 -3620 -26717 5675 11019 18577 56849 37343 23113 16181 18552 1911 -14759
553 -14759 -15274 16519 39850 35720 18097 17452 23813 46505 62672 53836 42453 47967 63257 63136
539 63136 24248 35685 13821 8774 33245 34637 842 16878 26864 35156 59007 52904 24289
526 24289 15549 34645 35082 16761 22997 48787 61602 10366 21486 21557 25289 36166 55018 61485
512 61485 48779 50267 24555 16031 13142 27233 17641 12726 57674 47180 40346 45545 54250 42891
498 42891 24831 10032 20267 38519 50210 66746 59744 44607 50967 75998 77808 37486 43707
485 43707 36560 11430 8113 25520 36013 44758 58772 30855 52837 53106 45106 46045 72283 52840
$$ packed form
578D5764J1428J3418l7626K4970j3234j1853k1177L9221L1872k7484n136j0727
566C9436j3329k9727k3097L2392N344P558L8272j9506j4230o932K371j6641j6670
553a4759n15L1793K3331m130j7623o45O361K2692J6167q836j1383N514J5290j21
539F3136l8888J1437k1864n047K4471J392l3795J6036R986Q292K3851o103k8615
526B4289q740J9096M37j8321O236K5790J2815n1236J1120P1L732J0877J8852O467
512F1485j2706J488k5712q524k889J4091r592m915M4948j0494o834N199Q705j1359
498D2891j8060j4799J0235J8252J1691J6536p002j5137O360K5031J810m0322O221
485D3707p147k5130l317J7407J0493Q745J4014k7917K1982K69q000R39K6238j9443
$$ plain form
471 52840 54725 54632 42142 47744 49356 51484 42266 45427 53536 78904 100525 75333 69481 64119
457 64119 74053 47128 12922 11464 75567 75530 71889 37612 23652 55383 63248 73500 75179 53276
443 53276 53297 38095 34470 33809 37335 33605 48839 13971 24934 46738 31242 46213 54278 53242
429 53242 51408 43714 74121 60303 52729 82640 57226 47883 39514 69720 52204 40661 33007
416 33007 9311 24334 48965 35622 30208 33115 47364 55523 70427 53834 30730 47373 64413
403 64413 55584 38851 68027 51422 34749 35840 46200 46360 33621 52134 64194 73351 69633
390 69633 76838 45517 42050 43077 61780 58611 37196 66597 86751 78158 48708 62943 83808
377 83808 62659 67628 85612 56142 31193 44875 35599 48084 77235 61021 47040 44863 56906
$$ packed form
471E2840J885r3j2490N602J612K128r218L161Q109K5368K1621k5192n852n362
457F4119R934k6925l4206j458O4103l7l641l4277j3960L1731P865J0252J679k1903
443E3276K1j5202l625o61L526l730J5234l4868J0963K1804j5496J4971Q065j036
429E3242j834p694L0407j3818p574K9911k5414r343q369L0206j7516j1543p654
416C3007k3696J5023K4631j3343n414K907J4249Q159J4904j6593k3104J6643J7040
403F4413q829j6733K9176j6605j6673J091J0360J60j2739J8513J2060R157l718
390F9633P205l1321l467J027J8703l169k1415K9401K0154q593k9450J4235K0865
377H3808k1149M969J7984k9470k4949J3682r276J2485K9151j6214j3981k177J2043
$$ plain form
364 56906 53165 48432 47190 36301 49890 73592 84922 86023 70593 26235 19978 31984 42148
351 42148 39028 25337 27194 46353 72182 88835 67431 56242 71727 51361 44654 61631 76294
338 76294 54055 48666 40239 57462 86792 61393 80099 86986 75498 45674 75573 61734 53972
325 53972 53556 64884 45836 54654 33960 22630 36163 63193 37194 70738 103655 97438 49535
312 49535 28022 54625 57507 78071 79115 67051 45641 47066 32265 64631 56662 47986 54235
299 54235 63035 56073 89974 93867 70655 68532 59428 72614 51276 53300 83401 37102 5824
286 5824 35660 55262 40816 59689 80599 64164 39291 54401 54397 69713 63063 83964 80031
273 80031 67291 66235 45539 20220 42032 61465 69048 48885 38978 70066 62679 57968 72744
$$ packed form
364E6906l741m733j242j0889J3589K3702J1330J101j5430m4358o257J2006J0164
351D2148l120j3691J857J9159K5829J6653k1404j1189J5485k0366o707J6977J4663
338G6294k2239n389q427J7223K9330k5399J8706O887j1488k9824K9899j3839p762
325E3972m16J1328j9048Q818k0694j1330J3533K7030k5999L3544L2917o217m7903
312D9535k1513K6603K882K0564J044j2064k1410J425j4801L2366p969q676O249
299E4235Q800o962L3901L893k3212k123r104J3186k1338K024L0101m6299l1278
286E824K9836J9602j4446J8873K0910j6435k4873J5110mJ5316o650K0901l933
273H0031j2740j056k0696k5319K1812J9433P583k0163r907L1088p387m711J4776
$$ plain form
260 72744 41769 83896 108961 81033 69362 97729 68197 42627 23983 7264 47019 86839
248 86839 62428 34584 24911 45821 84704 83630 65241 58595 79258 95866 107405 87280 70528
235 70528 56998 44868 25450 50246 62537 67796 41326 56083 59802 67738 61572 37455 52144
222 52144 59319 70241 53032 49296 53283 59385 15440 22350 72004 53929 67432 52791 76520
209 76520 59675 31129 26641 23458 46464 64436 55492 64302 38829 30128 58052 54203 61387
196 61387 55313 82385 73600 51552 46173 45006 36661 67089 64646 37752 37173 22197 60741 53638
182 53638 79807 80444 65566 77833 92895 112861 102867 88172 78999 92315 63933 77136 83632
169 83632 95233 76716 74075 77299 77418 85537 74905 82231 59775 74281 81575 100504 95424 57282
$$ packed form
260G2744l0975M2127K5065k7928j1671K8367k9532k5570j8644j6719L9755L9820
248H6839k4411k7844r673K0910L8883j074j8389o646K0663J6608J1539k0125j6752
235G0528j3530j2130j9418K4796J2291N259k6470J4757L719P936o166k4117J4689
222E2144P175J0922j7209l736L987O102m3945O910M9654j8075J3503j4641K3729
209G6520j6845k8546m488l183K3006J7972q944Q810k5473q701K7924l849P184
196F1387o074K7072q785k2048n379j167q345L0428k443k6894n79j4976L8544p103
182E3638K6169O37j4878J2267J5062J9966r994j4695r173J3316k8382J3203O496
169H3632J1601j8517k641L224J19Q119j0632P326k2456J4506P294J8929n080l8142
$$ plain form
155 57282 51453 69994 34264 32108 46414 36752 79930 68179 56667 31884 41429 62975 88879
142 88879 82317 69384 69680 58981 79354 45023 43245 68690 60563 52939 58179 81684 84913 73229
128 73229 73958 82254 99056 97279 96923 76974 58653 57380 64682 73012 80777 70889 53974 50245
114 50245 76290 64025 48833 47555 76910 66754 47422 56595 30761 39016 59056 61218 53037
101 53037 56965 37212 51385 60496 69279 79764 73628 80740 86465 66592 55219 53932 80046
88 80046 93555 79540 98013 98843 92795 100988 65852 44609 75459 63700 62494 53633 62439 83126
74 83126 81951 66342 62945 43077 39087 41641 53133 46902 53700 57367 47525 50481 60319 57078
60 57078 49504 64538 39462 62713 72039 62371 54491 69587 88603 62506 69812 68408 80035
$$ packed form
155E7282n829J8541l5730k156J4306r662M3178j1751j1512k4783R545K1546K5904
142H8879o562j2933K96j0699K0373l4331j778K5445q127p624N240K3505L229j1684
128G3229P29Q296J6802j777l56j9949j8321j273P302Q330P765r888j6915l729
114E0245K6045j2265j5192j278K9355j0156j9332R173k5834Q255K0040K162q181
101E3037L928j9753J4173R111Q783J0485o136P112N725j9873j1373j287K6114
88H0046J3509j4015J8473Q30o048Q193l5136k1243L0850j1759j206q861Q806K0687
74H3126j175j5609l397j9868l990K554J1492o231O798L667r842K956R838l241
60E7078p574J5034k5076K3251R326r668p880J5096J9016k6097P306j404J1627
$$ plain form
47 80035 104949 93362 58258 54726 45707 40969 48432 41772 48141 69908 90133 80706 59365 64137
33 64137 68796 49508 80694 91240 80907 86629 74429 81944 102628 90185 121969 85276 80260
20 80260 63687 52067 77746 75135 47081 38893 60153 61195 55238 68803 71159 89634 89990 54849
6 54849 54997 59065 56729 86826 92837 62621
0 62621
$$ packed form
47H0035K4914j1587l5104l532r019m738P463o660O369K1767K0225r427k1341M772
33F4137M659j9288L1186J0546j0333N722j2200P515K0684j2443L1784l6693n016
20H0260j6573j1620K5679k611k8054q188K1260J042n957J3565K356J8475L56l5141
6E4849J48M068k336L0097O011l0216
0F2621
$$ Imaginary data points
##PAGE= N=2
##DATA TABLE= (X++(I..I)), XYDATA
$$ plain form
16383 -1401704 -1350984 -1342696 -1334689 -1345689 -1318774 -1283016 -1267647 -1226696 -1230457 -1233087 -1185523 -1170793
16371 -1170793 -1156539 -1164070 -1146565 -1120337 -1126774 -1115047 -1095542 -1086814 -1066368 -1036362 -1009093 -999977
16359 -999977 -991231 -988340 -964619 -956533 -940503 -923081 -923540 -902048 -907142 -872870 -852670 -832475 -806132
16346 -806132 -776448 -742819 -715158 -719026 -709903 -684977 -674874 -683380 -688135 -658779 -642721 -634223
16334 -634223 -618691 -593869 -561961 -559151 -540953 -510784 -512111 -500661 -491184 -488492 -449106 -428416
16322 -428416 -421082 -395397 -384777 -370814 -339058 -331537 -328025 -333328 -326944 -286710 -270504 -273577 -281923
16309 -281923 -255072 -240024 -245417 -239398 -225460 -194729 -196372 -165494 -150658 -127686 -111161 -104053
16297 -104053 -53930 -64889 -74218 -57761 -48579 -34821 -18006 15545 5221 11113 52866 63814
$$ packed form
16383a401704N0720Q288Q007j1000K6915L5758J5369M0951l761k630M7564J4730
16371a170793J4254p531J7505K6228o437J1727J9505Q728K0446L0006K7269R116
16359i99977Q746K891K3721Q086J6030J7422m59K1492n094L4272K0200K0195K6343
16346h06132K9684L3629K7661l868R123K4926J0103q506m755K9356J6058Q498
16334f34223J5532K4822L1908K810J8198L0169j327J1450R477K692L9386K0690
16322d28416P334K5685J0620J3963L1756P521L512n303O384M0234J6206l073q346
16309b81923K6851J5048n393O019J3938L0731j643L0878J4836K2972J6525P108
16297a04053N0123j0959r329J6457R182J3758J6815L3551j0324N892M1753J0948
$$ plain form
16285 63814 75801 84904 75041 90320 129175 134514 145222 184437 192877 152841 166608 162447 190213
16272 190213 208046 220140 220241 222167 258426 271325 265189 271191 311773 327368 295483 298838 304132
16259 304132 325327 348172 365017 397598 421050 422377 409881 415725 426156 435133 447433 465220
16247 465220 466991 486344 456033 479339 496295 492645 531607 548628 537769 541848 529845 566168
16235 566168 567955 565626 596541 583301 586665 599771 611358 601747 620505 616198 617322 627849 633574
16222 633574 652969 646353 650561 687929 686130 683030 694837 690855 681474 711845 735527 747718 742552
16209 742552 736452 779390 793183 775362 768337 783934 792667 817791 809475 834262 819228 822262
16197 822262 853658 831627 820546 820681 837914 851448 851750 858253 846920 878114 897684 916172
$$ packed form
16285F3814J1987R103r863J5279L8855N339J0708L9215Q440m0036J3767m161K7766
16272A90213J7833J2094J01J926L6259J2899o136O002M0582J5595l1885L355N294
16259C04132K1195K2845J6845L2581K3452J327j2496N844J0431Q977J2300J7787
16247D65220J771J9353l0311K3306J6956l650L8962J7021j0859M079j2003L6323
16235E66168J787k329L0915j3240L364J3106J1587r611J8758m307J124J0527N725
16222F33574J9395o616M208L7368j799l100J1807l982r381L0371K3682J2191n166
16209G42552o100M2938J3793j7821p025J5597Q733K5124q316K4787j5034L034
16197H22262L1396k2031j1081J35J7233J3534L02O503j1333L1194J9570J8488
$$ plain form
16185 916172 899582 886075 898281 904566 912576 904467 915496 910051 897915 859407 899038 923129
16173 923129 896521 904073 916486 929124 932565 944858 943309 974787 987967 945307 946262 948553 969250
16160 969250 955089 965826 971406 962293 1005692 1018586 1018952 973925 978819 994134 1006531 992856
16148 992856 998065 1003272 1007695 1020227 1016536 1008378 1004168 1025117 1055718 1068201 1067176 1076441 1073031
16135 1073031 1075884 1056245 1040596 1051278 1097320 1091088 1070485 1066762 1069729 1047301 1053960 1062579
16123 1062579 1101764 1112706 1091602 1055864 1047833 1043567 1046040 1067447 1070664 1092425 1111272 1102791
16111 1102791 1109281 1114049 1106630 1114662 1116042 1108267 1100388 1099994 1124568 1121577 1121464 1111094 1112179 1140720
16097 1140720 1117494 1136906 1135434 1130580 1116697 1100226 1142921 1154701 1146659 1129571 1099654 1085780
$$ packed form
16185I16172j6590j3507J2206O285Q010q109J1029n445j2136l8508L9631K4091
16173I23129k6608P552J2413J2638L441J2293j549L1478J3180m2660R55K291K0697
16160I69250j4161J0737N580r113M3399J2894L66m5027M894J5315J2397j3675
16148I92856N209N207M423J2532l691q158m210K0949L0601J2483j025R265l410
16135A073031K853j9639j5649J0682M6042o232k0603l723K967k2428O659Q619
16123A062579L9185J0942k1104l5738q031m266K473K1407L217K1761J8847q481
16111A102791O490M768p419Q032J380p775p879l94K4574k991j13j0370J085K8541
16097A140720k3226J9412j472m854j3883j6471M2695J1780q042j7088k9917j3874
$$ plain form
16085 1085780 1087471 1088897 1111586 1123784 1144196 1139136 1119208 1111146 1137085 1160322 1148488 1164252
16073 1164252 1150782 1124546 1133547 1152272 1146455 1128154 1145444 1170487 1163754 1146686 1163510 1180257
16061 1180257 1156036 1166249 1169594 1172834 1169854 1136326 1110228 1109507 1119880 1146473 1118793 1101234
16049 1101234 1111830 1124582 1142236 1158271 1153424 1165431 1147366 1139159 1147718 1177844 1185931 1160671
16037 1160671 1194295 1181472 1165068 1149521 1163270 1163342 1163372 1137981 1136137 1162680 1160973 1154184 1150121
16024 1150121 1170961 1137015 1147851 1159529 1183690 1180904 1167898 1175873 1187624 1224184 1215421 1167183
16012 1167183 1156623 1136226 1128441 1150196 1123457 1142365 1161681 1150997 1161188 1165747 1167437 1183889
16000 1183889 1185172 1143663 1116414 1157016 1137446 1159761 1164206 1169143 1196434 1183404 1218350 1166102
$$ packed form
16085A085780J691J426K2689J2198K0412n060j9928q062K5939K3237j1834J5764
16073A164252j3470k6236R001J8725n817j8301J7290K5043o733j7068J6824J6747
16061A180257k4221J0213L345L240k980l3528k6098p21J0373K6593k7680j7559
16049A101234J0596J2752J7654J6035m847J2007j8065q207Q559L0126Q087k5260
16037A160671L3624j2823j6404j5547J3749P2L0k5391j844K6543j707o789m063
16024A150121K0840l3946J0836J1678K4161k786j3006P975J1751L6560q763m8238
16012A167183j0560k0397p785K1755k6739J8908J9316j0684J0191M559J690J6452
16000A183889J283m1509k7249M0602j9570K2315M445M937K7291j3030L4946n2248
$$ plain form
15988 1166102 1149164 1165504 1179678 1170500 1181980 1195318 1183698 1184170 1165597 1169969 1174100 1187786
15976 1187786 1190054 1160595 1164407 1183453 1155334 1196781 1233943 1195167 1145097 1162829 1179768 1184845
15964 1184845 1188773 1149475 1142057 1167044 1197664 1167166 1177210 1176348 1164135 1145960 1155581 1190289
15952 1190289 1179086 1164764 1172983 1159649 1157850 1171360 1196781 1185173 1133089 1131634 1163445 1168581
$$ packed form
15988A166102j6938J6340J4174r178J1480J3338j1620M72j8573M372M131J3686
15976A187786K268k9459L812J9046k8119M1447L7162l8776n0070J7732J6939N077
15964A184845L928l9298p418K4987L0620l0498J0044q62j2213j8175R621L4708
15952A190289j1203j4322Q219j3334j799J3510K5421j1608n2084j455L1811N136
$$ [...]
##END NTUPLES=NMR SPECTRUM
##END=
