##TITLE=1H_DE-80H_X3
 200.13MHz, d2o
 8 sc
 
 19ns.26.2.2025
##JCAMPDX= 6.0         $$ Bruker NMR JCAMP-DX V2.0
##DATA TYPE= NMR SPECTRUM
##DATA CLASS= NTUPLES
##ORIGIN= UXNMR, Bruker Analytische Messtechnik GmbH
##OWNER= pz
$$ XWIN-NMR		Version 3.5
$$ Wed Jul 16 14:40:05 2025 Russian Standard Time (UT+4h)  Yarkov@DPX200
##.OBSERVE FREQUENCY= 200.1313
##.OBSERVE NUCLEUS= ^1H
##.ACQUISITION MODE= SIMULTANEOUS
##.ACQUISITION SCHEME= undefined
##.AVERAGES= 8
##.DIGITISER RES= 18
##SPECTROMETER/DATA SYSTEM= spect
##.PULSE SEQUENCE= zg30
##.SOLVENT NAME= CDCl3
##.SHIFT REFERENCE= (INTERNAL, CDCl3, 0, 15.5155)
##AUDIT TRAIL= $$ (NUMBER, WHEN, WHO, WHERE, WHAT)
$$ ##TITLE= Audit trail, XWIN-NMR		Version 3.5
$$ ##JCAMPDX= 5.01
$$ ##ORIGIN= Bruker BioSpin GmbH
$$ ##OWNER= Yarkov
$$ C:/Bruker/XWIN-NMR/data/yarkov2/nmr/H-C/1/pdata/1/auditp.txt
$$ ##AUDIT TRAIL=  $$ (NUMBER, WHEN, WHO, WHERE, WHAT)
(   1,<2025-07-16 14:39:23.37 +0400>,<Yarkov>,<DPX200>,
      <created by zg, POWCHK disabled, PULCHK disabled
       configuration hash MD5:
       00 E9 B6 7A A2 85 ED C7 34 08 36 98 17 FE 4E 26
       data hash MD5: 16K
       CC 78 E2 6B ED AB 25 65 7E AA 48 8A 6C 2E BD FD>)
(   2,<2025-07-16 14:39:27.76 +0400>,<Yarkov>,<DPX200>,
      <Start of raw data processing
       efp BC_mod = 2 LB = 0.25 FT_mod = 6 PKNL = 1 PHC0 = -1362.974 PHC1 = 20.39091 SI = 16K 
       data hash MD5: 16K
       AA 85 B3 6C F8 10 6B 63 85 39 2D E4 88 A1 4D E5>)
(   3,<2025-07-16 14:39:32.79 +0400>,<Yarkov>,<DPX200>,
      <abs ABSG = 5 
       data hash MD5: 16K
       85 1A 8E 62 03 4B C9 0A E5 DB 2C BB A5 07 07 77>)
$$ ##END=
$$ 
$$ hash MD5
$$ B7 70 00 71 85 FF ED 0F 5C 57 F9 7E 0F 54 99 45
##$RELAX= 
##$RELAX= 
##$RELAX= 
##$RELAX= 
##$RELAX= 
##$RELAX= 
$$ Bruker specific parameters
$$ --------------------------
##$DU= <C:/Bruker/XWIN-NMR>
##$EXPNO= 1
##$NAME= <H-C>
##$PROCNO= 1
##$TYPE= <nmr>
##$USER= <yarkov2>
##$AMP= (0..31)
100 100 100 100 100 100 100 100 100 100 100 100 100 100 100 100 100 100 
100 100 100 100 100 100 100 100 100 100 100 100 100 100 
##$AQSEQ= 0
##$AQ_mod= 1
##$AUNM= <au_zg>
##$AUTOPOS= <>
##$BF1= 200.13
##$BF2= 200.13
##$BF3= 200.13
##$BF4= 200.13
##$BF5= 200.13
##$BF6= 200.13
##$BF7= 200.13
##$BF8= 200.13
##$BYTORDA= 1
##$CFDGTYP= 0
##$CFRGTYP= 5
##$CHEMSTR= <none>
##$CNST= (0..31)
1 1 145 1 1 1 1 1 1 1 1 1 1 1 1 1 1 1 1 1 1 1 1 1 1 1 1 1 1 1 1 1 
##$CPDPRG= <>
##$CPDPRG1= <>
##$CPDPRG2= <>
##$CPDPRG3= <>
##$CPDPRG4= <mlev>
##$CPDPRG5= <mlev>
##$CPDPRG6= <mlev>
##$CPDPRG7= <mlev>
##$CPDPRG8= <mlev>
##$CPDPRGB= <>
##$CPDPRGT= <>
##$D= (0..31)
0 0.7 0 0 0 0 0 0 0 0 0 0.03 0 0 0 0 0 0 0 0 0 0 0 0 0 0 0 0 0 0 0 0 
##$DATE= 1752662362
##$DBL= (0..7)
120 120 120 120 120 120 120 120 
##$DBP= (0..7)
150 150 150 150 150 150 150 150 
##$DBP07= 0
##$DBPNAM0= <>
##$DBPNAM1= <>
##$DBPNAM2= <>
##$DBPNAM3= <>
##$DBPNAM4= <>
##$DBPNAM5= <>
##$DBPNAM6= <>
##$DBPNAM7= <>
##$DBPOAL= (0..7)
0.5 0.5 0.5 0.5 0.5 0.5 0.5 0.5 
##$DBPOFFS= (0..7)
0 0 0 0 0 0 0 0 
##$DE= 6
$$ [...]
##$SUBNAM3= <"">
##$SUBNAM4= <"">
##$SUBNAM5= <"">
##$SUBNAM6= <"">
##$SUBNAM7= <"">
##$SUBNAM8= <"">
##$SUBNAM9= <"">
##$SW= 18.0517328524113
##$SWIBOX= (0..15)
0 0 2 0 0 0 0 0 0 0 0 0 0 0 0 0 
##$SW_h= 3612.71676300578
##$TD= 16384
##$TD0= 1
##$TE= 0
##$TE2= 300
##$TE3= 300
##$TEG= 300
##$TL= (0..7)
0 120 120 120 120 120 120 120 
##$TP= (0..7)
150 150 150 150 150 150 150 150 
##$TP07= 0
##$TPNAME0= <>
##$TPNAME1= <>
##$TPNAME2= <>
##$TPNAME3= <>
##$TPNAME4= <>
##$TPNAME5= <>
##$TPNAME6= <>
##$TPNAME7= <>
##$TPOAL= (0..7)
0.5 0.5 0.5 0.5 0.5 0.5 0.5 0.5 
##$TPOFFS= (0..7)
0 0 0 0 0 0 0 0 
##$TUNHIN= 0
##$TUNHOUT= 0
##$TUNXOUT= 0
##$USERA1= <user>
##$USERA2= <user>
##$USERA3= <user>
##$USERA4= <user>
##$USERA5= <user>
##$V9= 5
##$VALIST= <valist>
##$VCLIST= <CCCCCCCCCCCCCCC>
##$VD= 0
##$VDLIST= <DDDDDDDDDDDDDDD>
##$VPLIST= <PPPPPPPPPPPPPPP>
##$VTLIST= <TTTTTTTTTTTTTTT>
##$WBST= 1024
##$WBSW= 4
##$XGAIN= (0..3)
0 0 0 0 
##$XL= 0
##$YL= 0
##$YMAX_a= 285058
##$YMIN_a= -298984
##$ZGOPTNS= <>
##$ZL1= 120
##$ZL2= 120
##$ZL3= 120
##$ZL4= 120
##$ABSF1= 15.49237
##$ABSF2= -2.55948
##$ABSG= 5
##$ABSL= 3
##$ALPHA= 0
##$AQORDER= 0
##$ASSFAC= 0
##$ASSFACI= 0
##$ASSFACX= 0
##$ASSWID= 0
##$AUNMP= <proc_1d>
##$AZFE= 0.1
##$AZFW= 0.1
##$BCFW= 0
##$BC_mod= 2
##$BYTORDP= 0
##$COROFFS= 0
##$CY= -3
##$DATMOD= 1
##$DC= 0
##$DFILT= <>
##$DTYPP= 0
##$F1P= 0
##$F2P= 0
##$FCOR= 1
##$FTSIZE= 16384
##$FT_mod= 6
##$GAMMA= 0
##$GB= 0
##$INTBC= 1
##$INTSCL= 3.241238e-09
##$ISEN= 128
##$LB= 0.25
##$LEV0= 0
##$LPBIN= 0
##$MAXI= 10000
##$MC2= 0
##$MEAN= 0
##$ME_mod= 0
##$MI= 1.114404
##$NCOEF= 0
##$NC_proc= -7
##$NLEV= 6
##$NOISF1= 3.799351
##$NOISF2= 2.8
##$NSP= 0
##$NTH_PI= 0
##$NZP= 0
##$OFFSET= 15.51551
##$PC= 1
##$PHC0= -1362.974
##$PHC1= 20.39091
##$PH_mod= 1
##$PKNL= yes
##$PPARMOD= 0
##$PSCAL= 0
##$PSIGN= 0
##$REVERSE= no
##$SF= 200.130001238609
##$SI= 16384
##$SIGF1= 3
##$SIGF2= 2
##$SINO= 0.751879
##$SIOLD= 32768
##$SREGLST= <19F.Aceton>
##$SSB= 0
##$STSI= 16384
##$STSR= 0
##$SW_p= 3612.71676300578
##$SYMM= 0
##$S_DEV= 0
##$TDeff= 16384
##$TDoff= 0
##$TI= <>
##$TILT= no
##$TM1= 0
##$TM2= 0
##$TOPLEV= 0
##$USERP1= <user>
##$USERP2= <user>
##$USERP3= <user>
##$USERP4= <user>
##$USERP5= <user>
##$WDW= 1
##$XDIM= 16384
##$YMAX_p= 384249870
##$YMIN_p= -867631
$$ End of Bruker specific parameters
$$ ---------------------------------
##NTUPLES= NMR SPECTRUM
##VAR_NAME=  FREQUENCY,     SPECTRUM/REAL,   SPECTRUM/IMAG
##SYMBOL=    X,             R,               I
##VAR_TYPE=  INDEPENDENT,   DEPENDENT,       DEPENDENT
##VAR_FORM=  AFFN,          ASDF,            ASDF
##VAR_DIM=   16384,         16384,           16384
##UNITS=     HZ,            ARBITRARY UNITS, ARBITRARY UNITS
##FACTOR=    0.220516191357247, 1,           1
##FIRST=     3105.1189565479, 0,             0
##LAST=      -507.597806457884, 0,           0
##MIN=       -507.597806457884, -867631,     0
##MAX=       3105.1189565479, 384249870,     0
$$ Real data points
##PAGE= N=1
##DATA TABLE= (X++(R..R)), XYDATA
$$ [...]
9710 2794105 2693593 2618481 2686562 2735190 2822348 2622459 2575803 2633446 2671989 2689342 2724816
9699 2724816 2559240 2475514 2539645 2502873 2436205 2211109 2209038 2364915 2374094 2272725 2215073
9688 2215073 2276243 2353265 2229509 2177222 2125946 2240610 2333340 2251589 2165451 2157250 2216552
9677 2216552 2198408 2067454 2065591 2177368 2199788 2165774 2061785 2045941 1968845 1986575 2014541
9666 2014541 2079105 2063490 2098109 2082030 1919698 1874358 1943942 1960229 2089023 2010531 1911114
9655 1911114 1762504 1816533 1786604 1856070 1895626 1851050 1861956 1698692 1843790 1695515 1589018
9644 1589018 1752216 1752306 1667074 1526501 1414188 1484581 1514879 1509529 1537827 1508811 1562970 1554497
9632 1554497 1629359 1651455 1472158 1418407 1256977 1327898 1401502 1549105 1586444 1514798 1528002
9621 1528002 1520988 1391902 1308895 1254912 1337167 1432389 1410034 1245878 1316586 1388407 1376078
9610 1376078 1385818 1268798 1249760 1333405 1387007 1392927 1267198 1188222 1275603 1247117 1162830
9599 1162830 1170118 1146348 1158146 1095382 1187984 1180274 1202871 1203289 1258093 1385925 1261253 1287003
9587 1287003 1311609 1168430 1158022 1226950 1260485 1235687 1335981 1297029 1126279 1061607 1018726
9576 1018726 1001559 1078189 1040645 932354 929151 1000376 1131520 1027578 998976 998331 1033373
9565 1033373 888250 919906 933309 908698 1013429 967213 1001997 1004942 876902 836301 967741
9554 967741 979067 1005144 928512 817471 813023 942716 1029519 877150 896462 899498 894693 871392
9542 871392 881133 803731 809476 711967 654182 726153 721978 680811 749754 748299 793769 753345
9530 753345 690608 758353 692315 839807 799850 719670 745730 798252 934617 687958 644605
9519 644605 637939 656733 655742 710894 681321 667192 702239 662389 598505 652348 619144 693344
9507 693344 707325 708630 607604 635511 686781 622819 685603 686630 602865 439288 419112 555888
9495 555888 564046 555711 580343 545930 519325 460474 688633 610219 529350 505318 461617 514581
9483 514581 512573 450052 588267 606785 591506 631772 525363 432352 544265 497020 559399
9472 559399 532840 570260 480442 386327 432067 594594 582627 492592 465711 450212 465123
9461 465123 414108 454505 453200 530088 638164 514559 571831 588733 559474 476697 385407
9450 385407 349798 395723 424767 442686 520189 458758 385914 427593 485958 418271 454756 464835
9438 464835 464649 410046 403262 458112 300336 236657 407487 389967 278885 275459 432603 357005
9426 357005 291623 445930 449730 418842 285603 392393 451460 398229 504133 357279 346514
9415 346514 390151 385175 385071 426611 389594 325197 243808 316563 308580 296158 343736 463656
9403 463656 432200 480136 453650 490642 505415 486499 484750 401225 404647 473382 392774 347031
9391 347031 526521 503624 342120 372637 332138 245887 295721 205363 247860 312819 224582
9380 224582 257875 315136 246530 276753 399540 413117 233877 172952 118452 41653 89463
9369 89463 174725 138665 260624 328498 276547 75838 79046 227894 343518 168761 80877
9358 80877 94987 70345 214208 157135 139635 75716 101090 88263 109968 149057 172897 140491
9346 140491 164782 83186 85483 224307 280299 332201 203404 205593 260663 227888 334428
9335 334428 303203 202451 110492 189298 273399 148713 174108 118801 122159 89832 122409
9324 122409 159466 168283 103869 155674 146067 175094 179096 235293 57258 120087 108393 180991
9312 180991 265978 341465 378310 232148 214701 125313 43003 104602 278230 171224 189643
9301 189643 146414 201505 121780 156147 214928 258518 157793 116251 67337 246510 109781
9290 109781 42524 120734 168832 293632 224513 306936 278369 252536 230382 288845 113079
9279 113079 198655 227464 163417 175815 229978 243057 187884 269465 147222 123037 63153
9268 63153 25682 66318 129012 1428 5634 98995 119899 106148 231711 203277 35974
9257 35974 11899 37662 -23056 54231 112742 91084 -1559 15773 103913 149803 56303 -11365
9245 -11365 -11957 -43812 54348 30279 81713 123776 20065 192675 173974 119576 164055 59045
9233 59045 116937 187106 196569 69946 154766 147717 105844 61569 100111 -5232 -65048 -40930
9221 -40930 24978 -44366 15439 72970 53542 43962 53533 -36275 -92372 -12323 84279 108798
9209 108798 89776 78296 46841 134061 27921 -19004 102224 137289 20446 43234 116006
9198 116006 87718 115645 222445 247235 138402 132874 -26506 -23171 126153 187559 186308
9187 186308 203197 204066 35950 50038 140587 112451 134619 89610 28217 24394 58037 112552
9175 112552 239264 211531 85474 141577 59644 -36880 -3116 68755 94154 77486 171625
9164 171625 133709 161991 204030 175524 162629 88345 45102 142659 168819 118322 221914
9153 221914 147145 148405 100164 210311 212785 205056 154958 38639 84558 33892 26578 77776
9141 77776 45754 -3185 -6122 84631 89666 147113 90265 64372 159748 66686 105622 -31875
9129 -31875 -13477 70596 -5801 75441 42604 113877 198575 271701 261438 130133 158360 206589
9117 206589 75469 21286 66517 66349 111638 170052 147870 83467 215190 179345 107834 199092
9105 199092 175239 98462 89164 327462 290106 239599 145800 34798 47787 104431 193900
9094 193900 318477 260342 54785 111905 144762 81675 161313 82970 142091 48599 -61701
9083 -61701 304256 187138 139777 112918 148372 196289 72356 48225 53497 211296 261043
9072 261043 167001 188693 115816 176569 138453 258951 265538 206581 244446 273898 237352 124439
9060 124439 142540 164307 277831 256868 254932 227449 264084 118739 86680 215579 212385
9049 212385 167856 62869 16468 -4011 136126 270412 268250 211623 109516 133216 106502
9038 106502 99042 106152 76182 117192 151050 168968 149519 176135 153211 216470 296332 271101
9026 271101 278860 326919 272594 253200 257694 262566 396857 331507 304678 297086 358283 323019
9014 323019 322238 226179 236241 278972 364789 394345 274068 249408 233384 348218 239010
9003 239010 320560 222677 358349 367354 330916 357209 372381 338339 350418 385336 416353 393011
8991 393011 325348 351083 435222 412504 390696 533106 497403 382051 436679 421619 459424
8980 459424 576135 398137 450566 614436 701321 666523 630819 573866 644238 773127 717857
8969 717857 748000 806563 776655 820751 933422 971130 1021579 1029069 1052043 1070412 1227575
8958 1227575 1342496 1321862 1495535 1676261 1704032 1775498 1882105 1946176 2060939 2150341
8948 2150341 2446263 2514245 2558876 2855636 3164247 3371155 3656441 4045437 4383509 4779313
8938 4779313 5416194 6009925 6634151 7225510 7907056 8754109 9881155 10960158 12700475
8929 12700475 14963719 18177101 22267197 27298967 31542766 34593528 32714837 25661109
8921 25661109 19804901 15879903 13221783 11187126 9727647 8668679 7720268 7000348
8913 7000348 6574371 5950098 5351122 5054515 4763425 4303483 3886768 3487145 3354036 3130418
8903 3130418 2953425 2710541 2591915 2496073 2390527 2205334 2035370 1992503 1971038 1828245
8893 1828245 1779689 1605509 1417095 1291146 1266926 1232602 1168858 1137151 1130461 1156265 1015769
8882 1015769 1002986 999596 894603 848651 845963 797482 787611 770757 680740 561097 495173 565801
8870 565801 513139 601491 486555 563679 502220 488579 557600 536268 641240 598156 554472
8859 554472 559855 499610 466509 458492 498150 495581 442065 548093 441662 316421 284252 309066
8847 309066 246449 252388 229912 175787 186803 194036 151580 224922 270464 218220 186814 157856
8835 157856 62083 119300 192282 181314 156543 282029 277325 265230 275823 238614 171249 159965
8823 159965 64075 61509 253604 230919 175977 96910 176588 240163 229194 133005 116573 168094
8811 168094 87745 216454 246485 293333 194990 160088 216957 180880 171032 54680 116582
8800 116582 25813 82182 155087 130260 -4279 82644 199597 46477 -13985 100090 -15086
8789 -15086 -36047 181471 28466 56196 99007 98293 99882 94905 122031 200609 141536 92054
8777 92054 128161 204527 200167 118265 87891 108568 43433 169842 284502 287067 238606 265911
8765 265911 299156 379690 337868 285772 283752 377259 225108 356368 373452 282934 278210 158545
8753 158545 122702 99078 61516 42357 150835 196382 209362 121073 127091 82044 8419 -27340
8741 -27340 93206 89350 104514 4773 72760 -6722 -29340 -80245 -24422 22319 137474 159754
8729 159754 166531 103810 69115 5515 80992 149697 126680 56706 69895 87451 93804 -30902
8717 -30902 -158271 16296 22299 -43423 42753 -6919 -56112 -65812 -29195 152446 88354 102589
8705 102589 73942 21901 38097 -16102 -240961 -91404 86514 153408 144752 109434 38961
8694 38961 82234 63556 -33552 -109543 -38941 46730 91281 127975 134670 134628 80216 122142 116194
8681 116194 64215 51466 -34126 19443 67680 -53725 -117376 82726 152382 79476 -35396
8670 -35396 -127700 -18450 -44452 26170 29479 -138699 -35046 3273 18417 19621 -132757
8659 -132757 -30131 -65518 -61950 -9839 127822 4986 70573 -15947 -46827 85277 -2022
8648 -2022 17539 63691 125156 763 -147352 -111461 -62592 -40037 -21044 -142647 -77572
8637 -77572 -104698 -175883 -133168 -67990 -22650 34759 42883 103092 58923 -55620 -62884 -56576
8625 -56576 -133570 -125969 -115179 -195239 -161458 -123471 4461 28562 -45981 -104579 -59144 -86165
8613 -86165 -35346 -48398 39592 22013 -116963 -125298 -230950 -49766 41933 86530 83208 50745
8601 50745 -65053 -126140 -134256 -108072 -156383 -111789 -76025 -155330 -63813 70024 -98965
8590 -98965 -165120 -18402 -32673 -72882 72146 70336 123679 -26567 -52528 -75357 -129686
8579 -129686 -26135 -42447 -39234 -75295 41956 84974 -20896 -22940 28014 13211 48547
8568 48547 -4725 -19574 -18666 152031 76019 102845 146623 91460 -33317 -124732 15149 -38475
8556 -38475 -7532 -17259 39857 -65095 -173200 -90079 -9640 42042 71548 152967 69105 28487
8544 28487 185017 244018 17194 -7730 56094 79274 -31017 -52480 30654 29887 72819 62173
8532 62173 127837 133603 139848 118527 11969 -89359 -33422 106851 6635 -40351 102024
8521 102024 208167 43472 88456 -19023 14789 82517 24969 -34017 -103574 -136343 -45332
8510 -45332 -4099 -110544 -85904 3652 -57037 -68533 -109259 -177048 -194219 -221787 -69891
8499 -69891 74196 89836 -2921 -49154 40634 -2465 -85090 -127861 -94586 -134769 -179509 -130281
8487 -130281 -111782 -37295 -968 11374 -187886 -212820 -162569 -129855 -23398 -97286 -122269
8476 -122269 -6019 -71816 -58693 -94499 58229 154336 170624 258043 168326 17561 -32809
8465 -32809 46069 78028 126985 151790 93149 120748 24701 12646 -120615 -114434 119427 158068
8453 158068 20896 58502 126850 162169 106048 117786 229445 110369 99002 243925 156229
8442 156229 158959 175158 87105 74907 113959 187442 142058 -79017 -207828 -92649 61811
8431 61811 115084 53641 11600 -27298 -98399 -233876 -168337 -91959 -224760 -206392 -143858
8420 -143858 -95325 -78860 -157442 -170692 -86069 8535 137020 -37335 -3438 63008 -62107
8409 -62107 -86039 -54012 3003 -26573 70549 42315 -51180 -155124 -140486 -21017 50500
8398 50500 -41937 -193247 -133980 -33459 -59777 -68582 -173174 -101529 -143178 -114359 71112
8387 71112 -60522 -227911 -119475 -137 14188 -81087 -31053 -243018 -398437 -175198
8377 -175198 -163555 -249815 -207993 -176348 -180616 -43523 -19879 -201972 -273536 -256378 -149419
8366 -149419 -31691 -417 1918 -164383 -196480 43111 -85907 -96063 -190717 32211 47506
8355 47506 -144281 -224544 -297299 -125418 -54677 -103055 -44360 -37122 -103435 -154674 -126116 -231752
8343 -231752 -182184 14344 -64328 11904 44672 53665 96201 21276 -52030 -113638 -200858 -220835
8331 -220835 -214472 -152738 -96632 -72820 -106440 -59855 3179 3446 -56754 -98641 -16510 -32109
8319 -32109 -129796 32539 -109015 -53768 -32520 5215 -22260 -10912 -46432 -151998 -113177
8308 -113177 69865 115521 -34889 -57971 -48509 -88823 -73173 -60785 -57743 -83025 5971 -88952
8296 -88952 -64539 -22921 -55231 -23503 -78460 -136458 -56788 -1437 -101147 -158149 -165758 -269969
8284 -269969 -252942 -183428 -92174 -7900 46555 23040 -104161 -155108 -215096 -87175 -109084
8273 -109084 -179617 -124005 45557 -39551 -41659 -88047 -103986 -40189 -60670 -107671 -115719 -128655
8261 -128655 -55133 -112080 -133417 -20511 -60113 -14892 -61195 -50593 -59711 2543 -50053 -43998
8249 -43998 6016 -16003 38597 -90803 -43946 -87498 -84176 -148438 -180103 -211486 -138849 68970
8237 68970 36603 61513 54144 -42009 -91025 -69632 -155994 -286759 -242375 -199255 -60697 -146826
8225 -146826 -199618 -167337 -188349 -108586 10343 -94727 -166953 -231139 -179604 -6894 12144
8214 12144 15794 15128 2422 -83112 -80617 -229695 -217642 -161610 -32043 -713 105968 42438
8202 42438 -16688 -38405 -101813 -52507 -14438 -51508 -39348 -56128 20575 -211445 -867631
8191 -867631 -447544 -101306 -60322 -38072 -24122 -241104 -340301 -104283 -160897 -200357 -125957
8180 -125957 -65663 -11027 24747 -67405 -119273 -82828 -145246 -260861 -216316 -188269 -74673
8169 -74673 -120098 -93580 -179160 -87046 -113382 -175861 -8887 -6791 -146017 -73217 -105852 -71492
8157 -71492 -92104 -108768 -47661 -68831 115056 65769 32828 -2757 63590 46247 -11985 -44704
8145 -44704 64945 -56546 -64100 -80734 -146140 -130102 -210128 -186692 -164266 -286871 -163663
8134 -163663 -40988 -36291 -116934 -114527 -154473 -57340 -83248 188 81477 71659 -50607 -68555
8122 -68555 13338 -147155 -198586 -171582 -126134 -20576 23316 -82470 -67160 -104227 -179756
8111 -179756 -135030 -58442 -43802 -11884 -43128 27982 92620 -44597 -182344 -164600 -141605
8100 -141605 -61182 -3168 -77367 -159262 -188362 -286956 -126421 -97992 29193 -82091 -50913
8089 -50913 -14365 -13001 -94497 -96898 -107035 -82666 -59347 -179853 -174850 -91826 -132707 -206171
8077 -206171 -155141 -96980 -206659 -221817 -246206 -248303 -105847 28310 -54535 -215456 -136968
8066 -136968 -156558 -169251 -202426 -143612 -154270 -284891 -216424 -15815 104225 -20424 53104
8055 53104 -12448 -37087 -25326 -23788 -43208 -78351 -16409 -111456 -11193 -30526 19375 15489
8043 15489 7548 -31374 -163219 -125608 -56280 -158463 -201075 -86746 -43703 -89432 -160032
8032 -160032 -71308 -81418 -88834 -56555 -45627 151733 -48863 -92928 -156155 -138961 -25219
8021 -25219 -118671 -147639 -100764 -207263 -165275 -87226 -53313 -77267 -51067 4657 -25877 -264933
8009 -264933 -188783 -79630 -64050 -117277 -124784 -56946 -107917 -172196 -180200 -171770 -114896 -54299
7997 -54299 -170599 -274114 -144847 -80505 -31037 -76554 52014 33146 -106232 -22604 30253
7986 30253 58123 21401 -35038 5443 23543 -13752 -112052 -124871 -149968 37950 173690
7975 173690 37785 64639 -44424 -149864 -236514 -103793 -2179 53451 6850 68989 -139875
7964 -139875 -206544 -146826 -28919 30420 -25780 17614 22211 14727 67478 -7834 -14978 -44980
7952 -44980 -73322 -146242 -134666 -107906 -15260 -65697 -26423 -128568 -218112 -105036 -29604
7941 -29604 -24433 54115 59778 55278 56614 26012 52062 -26287 9439 7672 -112447 -30324 54139
7928 54139 -64463 -23893 -19158 -7020 -101604 -76614 -22915 -22018 -85244 -93146 -138556 -188243
7916 -188243 -57715 -40362 -129829 -229198 -118621 -69379 78832 104321 25683 79392 32004
7905 32004 25591 44976 -42254 -49347 90273 145314 152132 150530 78226 144892 146511 48390 148905
7892 148905 205854 246475 29966 -32598 -144411 -246528 -63403 -74275 -94938 106506 120405
7881 120405 100291 148054 96378 12362 105901 37358 27116 65413 -19748 -101059 -51316 85397
7869 85397 124527 -12835 43019 -75626 -56155 62930 -66694 -101559 -80686 13843 -11036
7858 -11036 -44636 -84944 -64382 -78911 -70103 44951 -36864 -76909 -108411 -146534 -210988 -134666
7846 -134666 73341 -30989 -68549 75477 12741 -61416 -25223 29076 -85435 -97732 -187442
7835 -187442 -121169 -108350 -71688 -88337 -161305 -220425 -116682 -1179 -93598 -35605 -28672
7824 -28672 49173 59707 -75838 -171130 13162 -27542 -107938 -32993 74128 -28152 -42730
7813 -42730 -109416 -119201 -39474 48534 -228146 -251936 -177757 -140622 -219132 -89589 -149736 -85155
7801 -85155 -212484 68607 282815 -1639 -117182 -108785 -115350 -180731 -636 -31337 28557
7790 28557 -40649 -126124 -86996 99066 56271 -135707 -74358 -587 -123817 -79671 -42971
7779 -42971 -84987 -20260 75869 12632 116772 135825 -6447 -81461 -26715 -111849 -65788
7768 -65788 6570 -145373 -187860 -188631 -104832 -167800 -151385 -37410 -69565 -101884 -146573 -165206
7756 -165206 -120612 -81228 -148223 -114910 20997 -89728 -295426 -274340 -171618 -186587 -88325
7745 -88325 -137596 -140193 -142377 -54376 114 -52539 70393 9494 -54941 -107785 -93951 -159699
7733 -159699 -70463 -145127 -198140 -104720 -158445 -122603 -67174 -162662 -201561 -189203 -53487
7722 -53487 -87556 4483 141315 68580 33090 135990 100308 -6690 -126055 -80509 -15486
7711 -15486 -59277 -125429 -168683 -225836 -202816 -96687 -95450 -74157 -62917 7333 76133 -9403
7699 -9403 8494 15067 -24870 -126123 -87336 -110305 54518 80704 -30916 -75543 -140108 -127163
7687 -127163 -174883 6225 -62322 -171477 -88143 -36841 -43271 -71853 -56612 -31243 -94838
7676 -94838 -100488 -98077 -74269 -135667 -124184 -77192 -97344 -27940 24826 38307 38835 44416 45168
7663 45168 -25707 30102 -99478 45072 47230 -34788 -35458 -91571 -49381 11623 -230058 -235791
7651 -235791 -177603 -135822 -94482 -161004 -88020 55960 -6787 -139771 -56322 -121689 -116560
7640 -116560 -81473 -50196 -9788 -113980 -197178 -52389 59958 -100982 -19569 85816 90050
7629 90050 20870 3855 -38500 -143872 -140888 -49205 -178880 -119624 -82553 -31544 -14921 -34094
7617 -34094 -116845 -103091 -93303 -136916 36460 104030 246446 -29276 -19550 3029 7872 -63106
7605 -63106 12478 22863 -185031 -164391 -67785 -27310 18229 82121 59986 -80458 39609
7594 39609 86877 158203 70445 -19748 -96536 -119248 -103737 -148142 -54219 -27364 5692 -80381
7582 -80381 -63507 650 -32323 28653 679 -75559 -85408 -196040 -166460 -112372 -6872 -37446
7570 -37446 -137315 -168336 -88286 11446 14539 10020 -50915 -33585 -120996 -103308 -89142 -95145
7558 -95145 -33856 -127532 -112157 46235 68652 4987 11727 -80511 -54777 -70297 -55289 -97351
7546 -97351 -165308 -146037 -85624 -115509 -162774 -122507 -51111 -60408 -53379 19570 51936 -5462
7534 -5462 -63046 -75307 -112914 -166677 -206975 -204698 -256050 -116374 7565 -78623 -131164 -134779
7522 -134779 -210959 -193008 -172872 -69481 -9271 -72440 -132952 -172344 -149059 -215295 -234725
7511 -234725 -248354 -289834 -172833 -131853 -53379 -14896 -95235 -206203 1551 66625 -61611
7500 -61611 -14264 -138628 -201066 -215938 -199216 -221019 -150764 70605 54583 -83573 64387
7489 64387 42833 -54100 -63877 -108233 -91863 -145277 -105512 -20466 -49591 -15654 -96572 -101138
7477 -101138 13378 -111425 -235931 -140888 -18077 8783 -14927 -45118 18960 161964 192424
7466 192424 -42701 12768 52868 103688 125957 155146 116229 -79751 -65705 -119358 -124138
7455 -124138 -85136 -32295 20100 -6664 -33800 -55758 -23509 -1805 -137262 -216190 -138145
7444 -138145 -159278 -47728 2591 -3601 26431 66783 43797 43272 62814 -93757 -100419 -108260
7432 -108260 -143270 -6877 -85775 -132429 -82622 51219 6335 -115365 -107088 -202042 -218820
7421 -218820 -142173 -134407 -174907 -78456 21728 15137 -84296 -22189 53792 29802 42609 68352
7409 68352 -60826 19328 -119939 -178105 -121726 -99419 -33906 -26258 2305 42541 -141115
7398 -141115 -89792 -114174 -182626 55648 -5855 -85880 -35240 -45117 -28194 -154363 -141808
7387 -141808 -16289 -91547 -79933 19966 -12653 -1199 139534 32324 -72078 -187718 -238488
7376 -238488 -67360 16501 37668 30327 -86321 -104832 -44565 -6811 73963 -154420 -93974
7365 -93974 -59818 -171613 30406 91568 -85686 -224639 -185887 76618 -79105 -63903 26613
7354 26613 -48351 90399 -39057 -95869 -55882 -70613 -129910 -152338 -163252 -133053 -166637
7343 -166637 -74918 -242683 -336195 -152036 -208803 -212990 -163316 -124896 -6888 -47092 -194022
7332 -194022 -125580 -92902 -61385 -1626 -53099 -16849 25038 79216 -1973 1709 25679 -15193
7320 -15193 -122111 -54524 -75109 -126490 -53642 -105676 -91022 -121297 -177050 22502 14011 39519
7308 39519 92759 115007 168288 50265 66501 -47382 -235144 -150940 -208585 -21805 -39172
7297 -39172 -50429 74570 -26356 -110525 -41257 -67362 -86665 60500 164807 116841 220138
7286 220138 35452 -99876 -137265 -148273 3424 71463 126656 -44529 -88972 -48000 110900
7275 110900 32666 31878 -11084 970 -140 18771 61659 -11302 -114112 -152267 -255898 -139928
7263 -139928 -108693 -144145 -102885 -196280 -154754 -102885 -89682 -43893 -50828 -107190 -144415 -104926
7251 -104926 -149619 -163047 -104188 -120879 -84025 -107687 -186469 -181850 -153126 -198391 -148893 -175412
7239 -175412 -170990 -6258 -36888 -89524 -9238 -83894 -115374 -109113 -70386 -65785 -88054 -54050
7227 -54050 28252 54126 21796 -20691 -89295 -17747 392 -7854 -29830 -78392 -142834 -18021
7215 -18021 -28314 -24079 -123647 -37836 -38580 -147618 -16120 13829 43427 -41595 -22405 15739
7203 15739 73777 66284 72423 -22215 -55218 -60504 -29058 39781 96216 10281 -193387 -270077
7191 -270077 -169576 -49293 -114571 -170887 -145990 -70193 -114654 -8762 -38997 -70383 -12618
7180 -12618 -59079 -131384 -75482 -94665 -81478 -48723 -41507 -184558 -258747 -193946 -52434 -16228
7168 -16228 -57102 -41981 -55969 -20395 -253175 -217358 -185392 -177350 -175998 -148143 -44734 -157507
7156 -157507 -278216 -142190 -101430 -114632 -190 18633 -21684 -51479 -24311 30868 -130054
7145 -130054 -256639 -111296 -93962 -170667 -155422 -104641 -24008 -36550 -63908 42734 -75223
7134 -75223 -52810 -108151 -61518 52490 109631 90682 68861 84474 13945 -2287 155132
7123 155132 142130 47105 116884 107512 1513 -13199 19166 49491 13708 -22949 -97583 -164331
7111 -164331 -171279 -235527 -101458 -6495 -79439 -169491 -60443 -133272 -13037 79634 86072
7100 86072 -1511 -118831 -112825 -21563 102689 -57321 -75440 25826 -114505 -79105 -69656
7089 -69656 -92149 -56347 -484 40197 11250 -95652 -136611 -121816 -58914 -128044 -134496 -148635
7077 -148635 -137119 -85086 -23443 6171 -64649 -79100 -31229 -115275 -97394 3010 -50853
7066 -50853 -41155 7605 -74212 -11801 -63870 2025 162732 141095 71911 -22123 22458 17588
7054 17588 -154565 -171702 -185969 -137286 -141652 -184448 -109308 -142507 -27579 42555 5505 14401
7042 14401 -58281 -3568 68654 102953 39884 -135168 -99003 -179811 -107776 -115904 -129020 -93530
7030 -93530 36130 90301 102480 -44413 -10027 -32843 -93462 39589 -85359 -153422 -90175
7019 -90175 37426 -13292 -4191 53954 -73328 -53571 -143390 -228256 -156541 -55899 -122110
7008 -122110 -144564 -231963 -162092 -173226 -151138 -106404 -115347 -72141 -92673 -40862 -42004 -157982
6996 -157982 -235381 -143221 -63903 -85711 3623 48305 54815 62788 -60210 -75485 17911 -22597
6984 -22597 -34422 -23424 -109271 3376 77299 6801 -100255 -71329 -62955 -44448 34456 -38392
6972 -38392 -47535 -223492 -130400 -18922 -83303 -86635 -11264 -19248 -40682 -20598 -51199 -31746
6960 -31746 47105 24483 -10942 -21602 24505 -17497 -123397 -148486 -98167 -15428 -12010 44029
6948 44029 20432 -68393 -110506 7000 -78567 -79180 -56461 75576 107986 6946 21969 122291
6936 122291 -47105 11701 47402 -33388 28086 134090 101671 109076 18222 -9383 -46677
6925 -46677 -151370 -190564 -171017 -113438 -67943 -52396 7823 32910 7368 -56531 -136766 -17640
6913 -17640 42236 136387 -17878 -95574 -49525 -115043 -125480 -118650 7277 -51571 60676
6902 60676 101258 154156 100502 32198 -27278 -72868 28868 -20314 -49868 -25063 -18772 -121498
6890 -121498 -59746 -119037 1675 42338 26735 -14145 -57061 64410 82677 39847 -7018
6879 -7018 -107753 -117066 -59775 -13229 -70170 -58970 -128400 -70271 -37015 -153292 -240032 -193499
6867 -193499 -47107 -2404 -125644 -123643 -236844 -136056 3467 -108460 -275238 -183642
6857 -183642 10340 -30900 -110083 -52424 39895 -72467 -93542 -91570 29790 -26368 -10060
6846 -10060 78560 66402 -14783 -63817 -61640 -249350 -187689 6391 118258 75244 -4789
6835 -4789 -40049 -41565 42387 94740 20029 -116054 -201285 -226530 -114263 -64343 -45039 -34356
6823 -34356 -109483 -99253 68453 87655 38522 98336 107476 121740 622 69098 53492 -42238
6811 -42238 -236 -106056 -192549 -184229 -5599 -27726 33399 -104500 -23310 80157 78796
6800 78796 57396 86859 68369 -15584 -49243 -57564 10377 113806 118462 196815 264395 267836
6788 267836 299602 336391 338927 270766 180443 152883 241402 387309 351269 292232 214408 226517
6776 226517 243025 401169 435847 501635 500490 455297 446147 304940 466026 334845 223393
6765 223393 233522 202986 292247 365332 410240 556703 619562 660775 437156 524183 570656
6754 570656 791310 936016 1019858 995772 982576 861839 952689 1014390 970831 948920 799499
6743 799499 844083 830720 797560 668375 661154 695510 556366 515068 607890 558421 612257
6732 612257 630098 681789 800285 871853 863481 821019 1079196 1207767 1309898 1381876 1312221
6721 1312221 1327533 1332382 1178970 1233609 1232256 1166050 1026845 864003 775083 831664 721688
6710 721688 621643 662770 715583 709322 655906 653722 614826 584387 561260 627411 594622 693819
6698 693819 690217 733942 861357 910758 924369 980802 999682 986076 956498 932382 886797 834210
6686 834210 570350 477930 509429 624000 371896 247372 330729 320197 263068 336788 379857
6675 379857 276367 365226 325322 220655 258526 346492 251530 276410 384074 466573 384418
6664 384418 431271 598463 409141 407915 311895 321810 267725 222732 201661 316513 199436
6653 199436 172089 68849 85402 232365 113992 42261 84046 170339 59044 192002 258694
6642 258694 245022 172056 175267 168338 127608 129164 108914 57938 78164 52526 96849 96926 148329
6629 148329 144914 64183 -37773 18611 -54837 -88493 -53859 -11162 -24447 60975 80104 4104
6617 4104 48779 112184 -13556 16629 6043 -111704 8457 -41256 -130379 -13951 12119
6606 12119 -156359 -244040 -210635 -84718 -49649 -56582 -16722 -65661 18690 -78125 -78969 -33780
6594 -33780 -8624 8706 -23631 40947 -111403 -80408 -186969 -48262 -34649 86494 158991
6583 158991 220731 122997 65159 53829 6899 -9110 15410 -14284 -27406 49228 94472 -59234
6571 -59234 -71210 43604 53778 182694 91142 10467 -21198 -89948 92742 8907 15243
6560 15243 66863 -99106 -71667 -56612 54842 -5451 -94971 -197090 -100485 -95055 -103060 -223394
6548 -223394 -184034 -75011 -12735 5754 72202 80332 -85087 -104950 -30519 53893 859
6537 859 -24876 13034 -198651 -214773 -57704 -57252 -161588 -178553 -95572 -114520 -36491 -23094
6525 -23094 -80172 -73035 -206024 -204956 -203211 -208881 -165847 -91222 -158423 -84343 -42427 2025
6513 2025 235248 187503 107904 130095 63294 89864 124576 95321 36555 55076 26331 62558
6501 62558 -14261 64599 63782 22135 79041 123636 -74046 -102241 30931 -5858 -215315 -148020
6489 -148020 -39858 -32125 77802 -8499 35242 77646 75821 -78252 -156199 -47533 18526
6478 18526 -81465 -57148 -17215 2552 -14762 -21725 -127118 -222904 -110943 -97139 -154009 -84165
6466 -84165 -40315 16080 36418 67857 -40453 -48583 3971 -27781 -97617 -17994 12789 63969
6454 63969 -9445 9316 42177 -27841 -72537 -38106 -51724 -99710 -49933 -70514 -67352 -25238
6442 -25238 -32132 -119703 -127029 -86102 -228188 -190492 -56392 70587 -42642 -44345 -75403 -66332
6430 -66332 -140512 -216368 -167931 -105239 -30161 -154905 -243874 -150634 -45060 -106357 -76096
6419 -76096 61120 48810 100121 3042 -27335 -172573 -263882 -197709 -64499 -175375 -290729
6408 -290729 -195034 -40324 -63265 -98919 -56390 -117923 -97315 -140583 -188695 -216870 -111478
6397 -111478 2078 179124 101103 -4202 -38853 23494 -48954 -19008 41421 -260149 -230188
6386 -230188 -38827 -82142 -54550 -84494 -229634 -276943 -78236 -3047 17826 66329 67485
6375 67485 -12547 66703 100740 130816 111599 173714 33561 -63098 -112448 -91921 -9222 11546
6363 11546 54513 117231 228047 224196 -37392 -38090 1838 -18661 -6124 66889 -2039 -25959
6351 -25959 -32326 -163884 -145352 -160309 -51160 55698 -11504 -134048 -33211 11525 -29305
6340 -29305 -12576 30979 139072 59436 -24226 -102264 -59822 13244 103784 114617 51425 18132
6328 18132 -93917 -79453 -152728 -170763 -9750 81671 34058 14731 -120506 -139150 -85707
6317 -85707 -207942 -195416 -17026 91589 38005 36553 -125572 -115711 -30205 -233539 -375589
6306 -375589 -304153 -149442 -36354 -47113 -21289 -17793 95901 74286 193805 199007 92031
6295 92031 68915 -2707 36676 128447 176960 84071 -34498 -62646 -77327 -152476 -198416 -180408
6283 -180408 -35963 -67184 49671 49726 6071 -41019 149886 122571 126174 102669 51442 154021
6271 154021 109060 20163 41739 43953 81536 -21505 12966 65769 140520 90930 20987 81597
6259 81597 191370 210670 60251 -39223 37894 -30823 -41571 7266 -30553 -174029 -33985
6248 -33985 71242 64715 37668 -47641 191436 154577 -24468 -58546 39322 16284 71027
6237 71027 27044 45408 -35017 24173 53831 2195 128789 160924 70469 162 97236 53496
6225 53496 37456 117523 288347 238704 168888 98983 6608 -1472 74401 93686 103017 171282
6213 171282 109447 152219 142640 204553 277673 181970 -19905 -76280 69582 185340 23855
6202 23855 1 -8671 -76073 12321 -33846 115346 141282 17560 -7447 112257 59606
6191 59606 32483 68312 72498 98083 61199 107595 -27673 9300 15181 82236 265787 318865
6179 318865 240880 253245 279449 310838 219147 314665 234960 287033 188034 162314 181206 98938
6167 98938 67610 -30082 62793 102043 40672 -992 88469 155446 87250 -18684 3009 -13557
6155 -13557 -56738 23804 -38113 -8224 92120 28547 26312 115348 10544 52998 44360 -71234
6143 -71234 52489 89573 170463 195058 151277 129132 79138 13288 82715 159719 247159 246382
6131 246382 64785 -32211 80310 121413 24985 14117 153623 267997 350536 273832 274401
6120 274401 322220 382072 304757 379092 249768 216336 369723 367730 314862 327922 362037
6109 362037 415544 488964 450213 496077 517170 483572 535627 558857 663095 710762 721976
6098 721976 930790 947237 999478 983425 1055698 1321550 1425131 1479726 1462359 1452014 1518338
6087 1518338 1400464 1331103 1337603 1315144 1375893 1449810 1568239 1527578 1546536 1681946 1736356
6076 1736356 1784390 1781620 1907328 2008376 2124042 2301916 2376400 2658751 2837100 2865512
6066 2865512 3072646 3333507 3470090 3453106 3527154 3352446 3218608 2855981 2745409 2676178
6056 2676178 2335272 2187606 1961410 1919074 1898950 1951395 1834032 1795561 1829112 1858367 1925669
6045 1925669 1970461 1990814 2049234 2267717 2408160 2607422 2800807 2960808 3135812 3217343
6035 3217343 3045626 3012666 3100923 2948587 2645736 2459322 2359733 2140080 1878779 1775228
6025 1775228 1724679 1579926 1628588 1431760 1380758 1369615 1281044 1342515 1322062 1209829 1178679
6014 1178679 1290076 1262966 1291200 1282835 1185374 1112817 1046278 1014591 957999 906923 901811 868098
6002 868098 930475 847696 808691 707648 611599 533357 495360 542035 621921 636713 587176
5991 587176 533728 407712 326743 361192 475870 516951 502212 380717 297750 215050 271287
5980 271287 262138 194466 210702 324379 300362 328523 306797 266623 386328 194489 189506
5969 189506 223408 173703 334366 294591 141396 210583 330041 296940 299920 206100 251430
5958 251430 281209 254745 181716 358456 319483 211856 146008 169288 295483 230114 339194
5947 339194 221800 283003 502111 374347 272952 169242 232820 386072 282496 201301
5937 201301 269160 286251 161343 212277 260091 320862 288396 179206 182377 398802 385034
5926 385034 294620 209058 290187 363854 353967 299574 217275 272445 354727 311704 234374 162102
5914 162102 219725 233557 165213 61559 3320 56514 227700 293947 218825 166030 100285
5903 100285 90082 44437 96874 102854 130125 127414 213998 221238 107153 181732 189544 83357
5891 83357 76971 72676 66813 -14554 58580 38333 59335 214682 182790 214326 138291 118764
5879 118764 119730 193415 238990 214787 189390 210577 292920 103247 25756 89001 -54828 87489
5867 87489 142042 134075 54915 -71047 69762 70412 -16976 105519 163158 148206 -523 44538
5855 44538 84953 56934 221548 84125 -58044 40608 156277 86703 114037 183014 224922
5844 224922 172849 189362 62138 -4050 42314 94153 96544 183664 137160 235117 236166 -44601
5832 -44601 -62546 87704 138590 105656 6026 19703 13587 49170 142638 253048 189999 59262
5820 59262 71451 62297 149186 103691 29310 123146 137175 72454 48301 -18025 -92662 -73197
5808 -73197 64856 23989 -121906 85080 102877 -2711 -77652 -7828 186726 86459 91395
5797 91395 48637 77530 -17209 -48576 94551 192887 119132 203503 128766 121938 207846 223019
5785 223019 280751 159587 204512 106967 193741 205393 129589 198767 231572 70719 -10312
5774 -10312 57425 21134 187999 233687 150587 28946 196465 134799 47547 32162 91902
5763 91902 89047 123905 139361 107650 9185 53503 253160 79785 47679 52413 190346 234925
5751 234925 171306 199133 47010 -5124 161531 241653 297719 225437 100534 206319 241994
5740 241994 238736 260853 307334 450923 522323 532030 421887 444953 488252 424625 413855 464178
5728 464178 411795 438084 517830 566394 505995 590364 550852 598809 696356 558373 487246
5717 487246 621976 581208 340738 276520 345838 475184 501645 405683 402569 434005 563026
5706 563026 534195 588851 608061 673795 669760 508617 528561 550490 556887 596917 573595 541971
5694 541971 687454 726453 738298 776097 885766 845566 730812 666328 872472 962433 958131
5683 958131 832642 927603 986641 818565 756901 719800 704469 797631 810380 617142 690007
5672 690007 785215 778798 983397 908218 892131 857332 763523 778562 858830 839232 892752 1020714
5660 1020714 916117 930670 909472 893389 922573 900890 910673 828641 793262 738075 763417
5649 763417 811228 940856 957217 801259 895462 987140 978419 1006194 1122463 1209092 969654
5638 969654 899155 792327 820491 913980 902323 1014451 936779 928496 908727 987370 1046655
5627 1046655 1148089 1051227 1034805 1045412 1043243 1021665 983579 963631 893046 785636 786835
5616 786835 748607 900608 956418 955281 1090403 1137542 1141633 974198 879451 1110844 1314004
5605 1314004 1291863 1184596 1241156 1073421 1215075 1284365 1243094 1388509 1314104 1181558
5595 1181558 1177372 1105874 1157569 1332240 1295195 1291880 1340830 1396471 1439839 1529886 1502560 1483707
5583 1483707 1494421 1681757 1683049 1627040 1606531 1580507 1649477 1668849 1701123 1593233 1352958
5572 1352958 1385665 1417556 1507760 1602168 1573065 1509381 1472608 1574974 1636493 1502913 1552090
5561 1552090 1788464 1888430 1815869 1939976 1959106 1969112 2091266 2172400 2253075 2250188 2262166
5550 2262166 2279044 2348657 2277431 2241398 2191052 2043917 1968711 1873413 1788275 1800194 1712517
5539 1712517 1697666 1712701 1592924 1646726 1680169 1637800 1851996 1995313 1981920 2031345 2097166
5528 2097166 2206988 2154973 2152497 2246611 2319374 2275170 2175365 2015861 2099141 2132333 1999541
5517 1999541 1837665 1780433 1784010 1530772 1485788 1580123 1536658 1423223 1471184 1494421 1587366
5506 1587366 1660811 1558761 1600601 1842472 1916320 1958490 2097319 1925169 1830070 1856978 1970597
5495 1970597 1982468 1912762 1912668 1853228 1778497 1730114 1659362 1492452 1397349 1327503 1338392 1208534
5483 1208534 1264841 1339528 1369473 1349109 1357883 1318681 1363327 1338842 1387949 1580288 1537423
5472 1537423 1508049 1584472 1584919 1500369 1650206 1667957 1638124 1660933 1740005 1563725 1493309
5461 1493309 1567813 1620024 1579314 1623314 1834004 1988157 2054707 2001923 2065865 2193199 2420366
5450 2420366 2454523 2473951 2477243 2818153 2982011 3125027 3410002 3382875 3452813 3491197 3504531
5439 3504531 3495653 3541515 3684554 3779800 3704467 3508334 3557491 3564024 3473893 3357850 3390201
5428 3390201 3399655 3501447 3599523 3646771 3591250 3643826 3954002 3986605 4277816 4455936 4724087
5417 4724087 5188934 5357333 5576405 5792022 5885110 5989331 5884972 5839551 5723299 5609468
5407 5609468 5441068 5289857 5207919 5016932 4731519 4458227 4310137 4153047 4007516 4076638
5397 4076638 4010759 4036406 4003991 4203118 4269344 4256451 4280026 4283355 4435357 4600681 4656799
5386 4656799 4676764 4684083 4622011 4621300 4433172 4443114 4337941 4097862 3998131 3885630 3806857
5375 3806857 3699034 3621090 3639498 3521281 3448419 3281393 3261797 3302485 3521597 3498941 3469347
5364 3469347 3476260 3536148 3523865 3520982 3522641 3409381 3470345 3522492 3577791 3735511 3886784
5353 3886784 4020468 4042997 4119626 4125548 4067839 4209240 4291859 4479622 4545342 4765219 4782027
5342 4782027 4700035 4781091 5020088 5226831 5294644 5403905 5540425 5804563 5979099 5956028
5332 5956028 6045165 6173162 6294627 6412253 6706272 7032034 7307764 7499083 7573301 7893422
5322 7893422 8204493 8582462 8815143 9126619 9529296 10134288 10681912 11115607 11659728 12132572
5312 12132572 12686719 13356552 14190067 14795370 15588706 16369653 17311563 18314224 19293175
5303 19293175 20306769 21446047 22685698 23998830 25440566 26852498 28328736 29790210
5295 29790210 31093159 32297737 33383740 34423578 35437503 36333004 37178157 37692105 38361726
5286 38361726 38805791 39594604 40245565 40972654 41742790 42427707 43279915 44121906 45212319
5277 45212319 46272279 47433116 48730845 50058427 51476039 52926147 54523667 56193600
5269 56193600 57701461 59542660 61399826 63127527 64982113 66674321 68141691 69545645
5261 69545645 70457249 70753707 70702440 70262110 69434643 68290412 66715999 64913810 63203445
5252 63203445 61398562 59689163 58140439 56752162 55258015 53778416 52340526 51165885
5244 51165885 50044201 48923458 48067122 47004510 46050531 45328658 44538665 44102655 43583738
5235 43583738 42882793 42334851 41687403 41281607 40651582 39964768 39196191 38447850 37404435
5226 37404435 36189020 34861875 33384538 31677783 30185401 28755849 27224688 25847099
5218 25847099 24659538 23450247 22289760 21255008 20266628 19310516 18488354 17629356 16752370
5209 16752370 15990024 15207657 14593370 13967788 13469186 12870075 12320113 11754363 11328093
5200 11328093 11027420 10595703 10154440 9797258 9540377 9336241 9042501 8598910 8413606
5191 8413606 8167794 7934448 7629979 7307717 7097625 6916282 6773168 6736162 6684141 6516709
5181 6516709 6362895 6078349 5878044 5899162 5828140 5587262 5262365 5161728 5056108 4869078
5171 4869078 4726475 4461306 4458007 4398515 4393296 4316954 4100764 4064887 4026286 3810336 3790982
5160 3790982 3855290 3790256 3588235 3514607 3490202 3418053 3230135 3197734 3207732 3008455 2924471
5149 2924471 2958633 3010367 3071836 3041486 2873233 2737794 2774652 2658727 2556125 2505187 2476991
5138 2476991 2422309 2312129 2364986 2387350 2349814 2121375 2037236 2124671 2159412 2094525 2118274
5127 2118274 2027183 1830713 1754218 1616985 1600893 1700963 1888228 1864070 1804345 1831830 1868613
5116 1868613 1801675 1664559 1680831 1667628 1719020 1668608 1708476 1683056 1606264 1497705 1363724
5105 1363724 1424430 1582409 1594380 1588524 1540257 1605688 1719649 1626843 1569793 1386592 1314099
5094 1314099 1417882 1464561 1333826 1216601 1115980 1079765 983329 1040921 951559 966356 956416
5083 956416 912858 1025139 1112924 1139080 1144009 1055278 941620 969989 1000764 925981 888645
5072 888645 865818 925566 946467 898366 889459 932078 935658 975256 1045235 1096714 1056698 1026830
5060 1026830 1002577 1019713 1198062 1110237 1163186 1134999 1286456 1310733 1260556 1179551 1284046
5049 1284046 1211725 994216 1030715 933368 844549 798870 924323 875005 790562 892867 823601
5038 823601 711783 716186 708936 695934 802261 827848 715500 634681 857463 901496 705731
5027 705731 683244 631590 520154 621787 750115 575735 539295 564729 571568 523100 519226
5016 519226 472400 543239 565982 488302 460387 406320 523399 473273 538148 523137 470283
5005 470283 490803 579854 574108 563918 453362 544189 677466 800087 671625 678206 703394
4994 703394 624021 436851 454910 644253 548009 627977 668130 564707 494731 444235 573270
4983 573270 629338 514514 476392 574778 637222 517407 529564 630108 620665 422789 535080
4972 535080 631326 830143 727560 736269 709882 629321 751554 707823 811596 746241 713250
4961 713250 740888 844740 871458 891082 836791 874415 896435 788809 912799 842311 963611
4950 963611 918929 935680 989680 937713 1074474 1173665 1165892 1299140 1420559 1414225 1343101
4939 1343101 1294782 1320423 1510577 1544925 1583182 1786721 1922042 1919116 1869288 1901702 1858922
4928 1858922 1891849 1980722 1971589 2050610 2053741 1924609 1931073 1927684 1758258 1721312 1733515 1766923
4916 1766923 1784413 1782095 1908291 2006708 2066863 2183335 2243898 2338510 2450664 2609557 2598770
4905 2598770 2603475 2674603 2804933 2844003 2923656 2966857 3031406 2989537 2972187 3037906 2846493
4894 2846493 2774414 2724595 2776828 2800521 2770916 2733678 2639665 2691833 2752395 2688157 2772674
4883 2772674 2730487 2727026 2763128 2810809 2928850 2993749 3010023 3024488 3004410 3097642 3039896
4872 3039896 3088278 3178207 3120072 3196958 3284374 3472910 3594539 3535892 3707656 3834985 3902294
4861 3902294 3831880 3895183 4161976 4235596 4412205 4538788 4774313 5028115 5320473 5611522
4851 5611522 5980377 6572114 7334080 8364224 9356364 10479907 11888259 13434046 14974548
4842 14974548 16500899 17093120 16768888 16125492 15236100 14322188 12818887 11042381 9531524
4833 9531524 8256768 7307681 6464476 5771557 5116931 4802586 4444622 4151049 3918909
4824 3918909 3592048 3454953 3160355 2721455 2534155 2384074 2187388 2168606 1996915 1901654
4814 1901654 1957791 1877340 1763996 1481829 1353921 1280571 1204546 1271081 1344769 1216113 1095065
4803 1095065 1070963 951862 988542 928996 781124 773149 668684 834923 866449 821027 865732
4792 865732 511581 468390 593595 572334 641532 595167 595960 498097 488496 488786 431590 397427
4780 397427 413057 391292 330377 436105 562454 641625 360952 314669 397628 472979 303910
4769 303910 165233 216556 260214 287729 223124 175617 190476 98936 207428 181238 147910
4758 147910 204825 134636 11692 -120339 89464 91761 63483 97822 162764 259097 127851
4747 127851 42858 146231 215234 255151 259337 107069 -61716 -87062 -113316 -2256 132717
4736 132717 115260 155778 149570 90672 56262 191666 154845 104115 29761 13988 44099 33532
4724 33532 73007 51443 40410 138830 158643 271832 167323 -23018 -52156 118062 182298
4713 182298 95649 -82999 -67390 22596 -65428 -50266 59400 192784 145977 -67947 29865
4702 29865 55494 122081 202835 290837 349746 260790 232251 297162 313570 220142 250115 246988
4690 246988 156817 30870 30272 125339 205264 165239 181058 175727 106622 28791 92691 78035
4678 78035 41074 110278 28943 -1129 32013 57560 61545 -15051 -2732 50764 111058 83662
4666 83662 10168 -23177 176971 195364 170584 168284 151172 116711 90116 102797 161756 17
4654 17 93372 112189 133928 112386 97673 79490 3360 -64095 172291 316483 222570 188173
4642 188173 110499 39809 122741 117014 17634 52325 2875 71547 67391 93114 150483 219991
4630 219991 168279 186539 146472 101834 103142 233372 283026 127564 185091 177053 272878 224989
4618 224989 198857 251361 208290 287084 304364 213236 148144 235070 308191 333578 472268
4607 472268 311143 207126 438198 462673 412350 348554 428383 463882 404706 340376 370780
4596 370780 404426 281221 287707 423363 413774 400871 425426 426656 474907 404058 430271 482634
4584 482634 525760 561209 438944 424492 392083 464565 485648 576587 605151 542213 659160
4573 659160 605395 589503 586916 526595 584087 484388 482185 455232 483968 578090 466573 394488
4561 394488 446690 419916 560016 625051 545283 488187 483758 489297 451561 474846 498201 588244
4549 588244 552918 531988 659911 501125 498164 563007 583598 665869 699710 495171 536243
4538 536243 566836 554845 526340 495167 517492 417914 443495 341821 353953 388888 464975
4527 464975 519079 561060 483306 553088 492184 503631 476601 371379 455986 389207 487134
4516 487134 526928 574921 544814 377720 448193 543697 529843 482825 455198 552785 612609
4505 612609 542238 381309 308333 213854 257181 317868 275336 273727 332321 327070 311856 362094
4493 362094 446900 503440 426857 359941 472018 495654 544464 521224 442019 193512 141571
4482 141571 322129 276230 428167 408579 297560 388925 430345 444836 482261 348327 311436
4471 311436 405012 626344 493718 479860 464805 534895 525683 604090 573921 424177 496893
4460 496893 539380 498234 412068 367544 411232 587388 687385 685428 764959 843286 835292 749302
4448 749302 727101 795838 824813 790026 798459 954718 1021038 957862 1008714 1018206 990835 981520
4436 981520 1153145 1294548 1256731 1375184 1424876 1408489 1572832 1573095 1471850 1434511 1398322
4425 1398322 1513802 1557782 1581279 1776749 1871357 2003722 2015206 2154877 2239070 2246271 2275354
4414 2275354 2377176 2501177 2558237 2650740 2702788 2902669 2929893 3266346 3579455 3882342
4404 3882342 3996128 4260254 4416837 4551648 4624059 4617950 4608448 4670349 4662712 4735237 4922355
4393 4922355 4988685 5031864 5317251 5547692 5752452 6191391 6409398 6592158 6972042 7477215
4383 7477215 7882056 8370245 8854914 9222700 9683788 10147072 10355133 10802107 11143659 11449945
4373 11449945 11871623 12310426 12893219 13728267 14581206 15423010 16420155 17389009 18002990
4364 18002990 18397375 19003625 19293495 19567220 19771998 19790377 19852683 20102523 20588711 20987328
4354 20987328 21648587 22474104 23127722 23746453 24162126 24238115 24023430 23558135 23012058 22420910
4344 22420910 21893734 21604161 21355626 21368719 21457731 21757998 22130864 22297452 22394208 22410177
4334 22410177 22063352 21351922 20805078 20115857 19355448 18807485 18329755 17961184 17687424
4325 17687424 17494374 17424306 17609960 17559161 17371444 17353573 17268960 17021209 16628686 16231552
4315 16231552 16050540 15938120 15640399 15432217 15436008 15401517 15511808 15688949 15756621 15866800
4305 15866800 15972734 16182806 16249899 16261848 16172964 16208766 16207362 16048728 16098805 16174364 16119983
4294 16119983 16251254 16371166 16426035 16449242 16555989 16490542 16204052 16120316 16050481 15847852
4284 15847852 15563114 15330207 15126600 14735943 14533236 14505842 14343369 14053504 13867631 13657168
4274 13657168 13332095 13011494 12683418 12245129 11866760 11507530 11154580 10808427 10508582
4265 10508582 10201491 9862549 9476506 9253363 9162548 8941846 8577812 8131744 7777476 7534744
4255 7534744 7275576 6991810 6735457 6529842 6173878 6090616 6044871 5865146 5690319 5546941
4245 5546941 5587189 5457684 5363847 5297213 5028564 4950009 4854376 4750963 4687722 4573041 4536654
4234 4536654 4565315 4546792 4507806 4414411 4480594 4511683 4387754 4449905 4387411 4458491 4456628
4223 4456628 4386895 4267721 4420911 4495609 4407548 4489947 4670836 4751499 4678914 4574499 4574467
4212 4574467 4606857 4759103 4825828 4694827 4696967 4899205 4984269 5064620 4950516 5027384 5131241
4201 5131241 5135550 5188630 5291627 5333494 5455759 5562741 5620722 5561328 5649452 5862416 5925576
4190 5925576 6089219 6090822 6189798 6478062 6675912 6786212 6979290 7291283 7518514 7683245
4180 7683245 7753749 7969943 8236065 8572349 8763970 8958911 9253127 9859683 10297665 10549974
4170 10549974 10906012 11217534 11496683 11971888 12481467 12814913 13215573 13606678 14127170
4161 14127170 14635097 15254199 15799675 16314360 17002929 17695910 18402661 19257511 20089305
4152 20089305 21179444 22185684 23286784 24537071 25937336 27248873 28898021 30658943
4144 30658943 32214163 33823359 35758723 37839561 40277134 43031249 45966646 49252543
4136 49252543 53039535 57272408 62095236 67443579 73392689 79958214 87287302 95686721
4128 95686721 105195072 116206233 129027166 143732090 161075113 181854871 206239979
4121 206239979 233507391 262777902 294003625 327296257 357723615 376329875 379235788
4114 379235788 371373093 356541341 336523342 310807657 278957605 247123491 220355622
4107 220355622 199555351 183417610 170846774 160762691 152779673 145905679 140101116
4100 140101116 134993284 130095031 125866831 122012508 118400756 115085221 112391496 110462910
4092 110462910 109170788 108488795 108460564 109074951 110401058 112198899 113925140 115104611 115498526
4083 115498526 114740505 112582341 109295469 105154574 100614468 95722214 91220980 87429470
4075 87429470 84284284 81683690 79424694 77598270 76052573 74591939 73208289 71572102
4067 71572102 69848462 68045243 66090964 64133319 61991407 59867689 57948718 56353022
4059 56353022 55034629 54137098 53288459 52516482 52056942 51709341 51266349 50442079 49337456
4050 49337456 47765797 45879717 43693532 41498652 38990552 36824220 34774726 32584626
4042 32584626 30817848 29265326 27900552 26584331 25436603 24494732 23537646 22861014 21974957
4033 21974957 21214962 20791891 20205270 19529309 19103295 18704815 18321586 18079359 17651939
4024 17651939 17335029 16855156 16604180 16373367 16093308 15906137 15502113 15140766 14868059
4015 14868059 14758962 14569618 14238157 13901348 13841803 13798257 13518933 13491152 13498671 13364142
4005 13364142 13219365 13224256 13057959 12954098 12809610 12825889 12815658 12736768 12570093 12543467
3995 12543467 12623895 12551913 12517802 12510287 12326882 12275028 12135899 12164272 12128233 12008714 12002561
3984 12002561 12097658 12081932 12140785 12251759 12225131 12306925 12460355 12647407 12649338 12717008 12923402
3973 12923402 13104479 13267799 13518813 13750742 13943247 14131317 14416265 14843301 15396396
3964 15396396 15993571 16513093 17214415 17992759 18815004 19775722 20935231 22212870 23526419
3955 23526419 25070436 26669992 28586396 30804727 33276964 35975303 38866016 41789257
3947 41789257 45186526 48384181 51547843 54386012 56911661 59248052 61125776 62402260
3939 62402260 63525014 64154044 64322724 64293319 64222583 64137542 64193414 64480282 64603066 64684162
3929 64684162 64676241 64618532 64262059 63560913 62667820 61362237 59737873 57788352 55505470
3920 55505470 53053840 50397603 47871609 45474485 43096944 40922421 38997943 37100654
3912 37100654 35665224 34626698 33686735 32852475 32157210 31603697 31193092 30962541 30665087
3903 30665087 30275514 30242989 30184550 30096490 30038643 30137629 30211325 30344397 30453602 30790892
3893 30790892 31216887 31697049 32329913 33105247 33977607 34896461 35951664 37070463 38326137
3884 38326137 39393690 40332707 41373011 42129490 42734006 43076344 43408678 43738969 43895518
3875 43895518 43836714 43773513 43675855 43493078 43265618 43049821 42765942 42439514 41983211 41209630
3865 41209630 40320846 39173941 37931847 36614576 35139923 33631298 32296638 30661818
3857 30661818 29059785 27692139 26300568 25015900 23885877 22855845 21899111 21096067
3849 21096067 20407918 19633894 18918117 18283060 17926698 17516686 16983856 16598338 16260144
3840 16260144 16092007 15793272 15602783 15462154 15151742 14933813 14942737 14895487 14765741 14906804
3830 14906804 15053977 15045133 15041007 15200227 15216042 15069175 14947371 14935183 14865836 14845652 14777994
3819 14777994 14569198 14441656 14297590 13978268 13695546 13536512 13536502 13419260 13267725 13267522 13095013
3808 13095013 12986916 13012569 12892493 12864980 12900694 12875969 13110795 13349993 13333242 13556754
3798 13556754 13674337 13882610 14147727 14406825 14805426 15152116 15605790 16104907 16485173
3789 16485173 17134999 17905424 18616237 19350435 20122232 21006574 21849426 22540155 23108137
3780 23108137 23790297 24220595 24440272 24616089 24647995 24457539 24089998 23783920 23257692 22728524
3770 22728524 22301852 22016712 21735825 21507886 21455053 21435402 21503686 21568287 21993641 22270170
3760 22270170 22684204 23097189 23677172 24086787 24596691 25035869 25446043 25938456 26468116
3751 26468116 27016773 27449415 27849565 28423478 29257468 30136590 31177472 32321043 33746116
3742 33746116 35453559 37295533 39413648 42172114 45229874 48559061 52181756 56412217
3734 56412217 61043616 65820876 70660544 75556589 80125983 84606286 88584604 91928668
3726 91928668 94602246 96716352 98118336 98727790 99079848 99006776 98716700 98405793 98181727
3717 98181727 98106793 98248094 98976942 100290256 102110038 104288026 107016141 110120467 113613359
3708 113613359 117233318 120916574 124500301 127584477 130342464 132413607 133972992 134629366
3700 134629366 134409403 133350938 131525670 128960802 125833085 122370647 118631614 114764735
3692 114764735 111010178 106935301 103070285 99192748 95464272 91910571 88199587 84643017
3684 84643017 81114179 77695439 74118508 70649103 67389400 64089704 60753296 57655481
3676 57655481 54747120 52015536 49377235 47033487 44771848 42615320 40810448 39106336
3668 39106336 37747629 36441042 35189974 34190975 33304644 32529890 32070531 31545655 31185734
3659 31185734 30881230 30605399 30613069 30684948 30820933 30823205 30993717 31198816 31245122 31218217 31182169
3648 31182169 30980193 30729888 30177775 29656168 29230922 28666368 28047732 27372048 26819253
3639 26819253 26183451 25596515 25243723 24744059 24315765 23721830 23342984 22886344 22358645
3630 22358645 21879828 21431368 20963445 20510263 20129240 19719816 19264018 18833155 18436701
3621 18436701 18137315 17844889 17467367 17273818 17062258 16816931 16690662 16710019 16811513 16864618
3611 16864618 16950453 17170676 17177122 17293722 17643398 17919010 18159821 18517845 18761716 19024495
3601 19024495 19256107 19560243 19855004 20321936 20533048 20777997 21142493 21546545 21722942
3592 21722942 22076503 22249968 22536772 22726918 22992432 23140186 23156835 23303367 23444199 23667969
3582 23667969 23796103 23929424 24002243 24160668 24431377 24729238 24950980 25143142 25525749 25920707
3572 25920707 26232436 26890596 27466595 28249364 28944465 29791518 30837822 31917574 33301268
3563 33301268 34927238 36685491 38838793 41056284 43669042 46660755 49999134 53605292
3555 53605292 57538107 62127178 67198300 72716615 78827590 84993527 91545906 98250249
3547 98250249 105032119 111698366 118145234 124528786 130497195 136000365 141282011 146065851
3539 146065851 150389015 154273764 157775318 160904000 163782009 166239079 168166716 169656569
3531 169656569 170699762 171231572 171135813 170441780 169213989 167316135 164853382 162190388 158971037
3522 158971037 155179944 151043370 146976523 142425101 137898063 133579651 129297815 125076663
3514 125076663 120836102 116870331 113307487 109941542 106892005 104245366 101849384 99766225
3506 99766225 98062280 96825582 95793599 94849793 94063174 93409535 93019321 92709966 92346675
3497 92346675 92079711 91814150 91629836 91113089 90120922 88624891 87020698 85270409 83289836
3488 83289836 81513931 79933737 78745918 78018360 77703368 77864292 78269024 78913252 79746341
3479 79746341 80825521 82403417 84097322 86007116 88043232 90305354 92838177 95600030
3471 95600030 98417232 101618706 105052527 109085374 113172599 117124967 121197634 125357969
3463 125357969 129691226 134207125 138750023 143688529 148862618 153974423 159067044 163907986
3455 163907986 168072824 171099458 172864468 173273700 172309580 169871645 166192426 161511499
3447 161511499 156322576 150950111 145526295 140179949 135056193 130096836 125225441 120590862
3439 120590862 116138961 111576544 107103936 102560803 98223441 93939527 89776053 85898767
3431 85898767 82185020 78646204 75188156 71838097 68734576 65954271 63242463 60671510
3423 60671510 58422635 56383531 54318040 52662795 51137235 49589750 48444748 47463773
3415 47463773 46490753 45686525 45056357 44315880 43662943 43124838 42464745 42108349 41720999
3406 41720999 41404006 41093210 40923812 40896488 41167733 41635363 42161482 42809772 43643446 44999396
3396 44999396 46478523 48293464 50231388 52561604 55349000 58569195 62019418 65640829
3388 65640829 69351403 73351121 77471432 81597307 85680118 89529391 93075368 96413896
3380 96413896 99254809 101556440 103392373 104749040 105507994 105690300 105506960 105019734 104191221
3371 104191221 103343031 102337825 101338051 100471692 99673002 98986120 98394302 97913415 97320445
3362 97320445 96830943 95861115 94114771 92062280 89866981 87120248 83570686 79477828
3354 79477828 75221097 70875439 66694034 62623841 58545300 54946871 51777587 48847448
3346 48847448 46221205 44041397 42178497 40459370 38996173 37832934 37066744 36606621
3338 36606621 36174371 35817382 35874801 36122224 36348988 36208383 36053249 35878625 35431300 34835579
3328 34835579 33742314 32177911 30718372 29328140 27868624 26320234 24928167 23859297
3320 23859297 22850518 22054948 21271583 20551490 20081792 19609926 19082145 18441439 17731859
3311 17731859 17314696 16774617 16249973 15866613 15240425 14911158 14556151 14140986 13663501
3302 13663501 13376679 13101895 12643118 12478310 12317025 12067621 11745866 11439759 11214443
3293 11214443 11103342 11016850 10894080 10603752 10465683 10194498 9995046 9934830 9647405 9465835
3283 9465835 9486436 9487181 9257013 9204635 9137392 9140495 8955388 8856514 8782087 8481568 8403862
3272 8403862 8377498 8330195 8304416 8263143 8152991 8142938 8044984 7974176 7925195 7932014 7997910
3261 7997910 8066101 7951221 7909597 7868381 7922376 8110379 8048287 8091266 8070060 8010674 7960369
3250 7960369 8082410 8174134 8101230 7976368 8060705 8154460 8131109 8149747 7999665 8190658 8339235
3239 8339235 8186428 8136146 8164960 8069912 7891460 7849399 7998546 8165097 8276803 8225368
3229 8225368 8197291 8046528 8145389 8127507 8168160 8316054 8402014 8535489 8557943 8645971 8590458
3218 8590458 8720334 8737351 8847954 8779020 8719719 8731623 8726672 8820624 9026184 9047515 9218816
3207 9218816 9456070 9632386 9708660 9769422 9890844 9993416 10314418 10349273 10374517 10450862
3197 10450862 10649125 10966076 11211788 11488229 11860408 12208180 12410418 12619611 12854065
3188 12854065 13166341 13290162 13592951 14026658 14315291 14629639 15081162 15413531 15692342
3179 15692342 16217468 16747674 17258256 17823462 18263465 18777527 19326424 20002465 20718441
3170 20718441 21506034 22409158 23233039 24182186 25439783 26532356 27615622 28894824 30486710
3161 30486710 32059697 33843914 35689030 37575701 39810760 42090733 44636112 47303419
3153 47303419 50230599 53256780 56702200 60439364 64608633 68802675 73276189 77940048
3145 77940048 83122882 88693472 94776780 101496776 109190374 117988400 127854061 139183104
3137 139183104 151777138 165761327 181649678 199281474 219227900 241447126 266372770
3130 266372770 293053641 320728041 348006648 370311963 382847131 384249870 376518693
3123 376518693 361586748 340837516 315889846 290596128 268652833 251784137 239177144
3116 239177144 230250618 224298090 220757859 218984949 218767649 220179790 223020386 226820030
3108 226820030 231364650 237422872 244373999 250804103 255232365 258088385 260499552 262758729
3100 262758729 264444064 265022655 265408371 265534556 264046121 260064608 253240182 243694549
3092 243694549 232125636 218869253 204888993 191149224 178429492 166994115 157106404
3085 157106404 148534816 140978568 134335537 128892017 124191437 120017307 116432626 113378594
3077 113378594 110711361 108216955 105724983 102985429 99899190 96645457 93014990 88977791
3069 88977791 84637414 80312740 76010281 71937218 68113692 64444167 61341386 58439137
3061 58439137 55895183 53423314 51118678 49006053 46883622 45057843 43275156 41491291
3053 41491291 39989395 38341928 36853939 35571199 34247593 33070591 32039205 30887452
3045 30887452 29853395 29020159 28227807 27332621 26465568 25716245 24991856 24344047 23538475
3036 23538475 22845322 22261553 21584785 21002803 20543207 20142573 19612967 19116647 18733775
3027 18733775 18246129 17927288 17591705 17167413 16835687 16543311 16182784 15787861 15483411
3018 15483411 15305617 14977324 14580060 14268346 13999804 13859904 13633192 13387188 13263360
3009 13263360 13112625 12849147 12606704 12486816 12275374 12009757 11722595 11547031 11471950 11225832
2999 11225832 11106234 10946565 10650513 10467815 10352193 10224325 10115071 10015757 9793020 9689566
2989 9689566 9721475 9564601 9433011 9253105 9093037 8936005 8848742 8818504 8680859 8544360
2979 8544360 8356138 8452088 8383435 8160295 8019647 7919095 7817274 7711160 7699066 7533690
2969 7533690 7527768 7387456 7221966 7134382 7199052 7129984 7027044 6965311 6900320 6797090 6775207
2958 6775207 6736615 6671785 6666608 6482353 6316859 6119670 6097820 6123438 6173560 6156759 6140292
2947 6140292 6032307 5802503 5711770 5705675 5527881 5604986 5517401 5345989 5244292 5374355
2937 5374355 5303808 5152291 5012264 5040778 5075708 4828553 4717810 4636778 4788088 4934964
2927 4934964 4959479 4733823 4606228 4568105 4485857 4422659 4458067 4336300 4386378 4389187 4207025
2916 4207025 4168889 4254573 4153406 4161684 4154350 4050315 3987083 3965612 3908468 3901257 3937235 3953324
2904 3953324 3938894 3844497 3680818 3641726 3591312 3512440 3610807 3697633 3792438 3773142 3791794
2893 3791794 3749604 3654520 3707896 3609166 3514111 3539482 3447867 3436332 3265336 3307371 3462378
2882 3462378 3310263 3229870 3238738 3130846 3207511 3242543 3239804 3323891 3384209 3276345 3213722
2871 3213722 3195381 3251588 3293241 3150449 3134425 3164681 3127380 3090777 3044346 3244177 3225183
2860 3225183 3344554 3331945 3180360 3337221 3332749 3352025 3367209 3430028 3475349 3484537 3507609
2849 3507609 3551510 3839020 4072289 3944025 4123669 4213223 4393816 4481064 4593257 4581726
2839 4581726 4437321 4341975 4074005 3926929 3864341 3796675 3764724 3769343 3696217 3708779 3636546
2828 3636546 3535741 3513077 3447734 3436271 3436032 3453819 3655476 3665678 3652683 3654131 3667542 3524884
2816 3524884 3367860 3379608 3422440 3414492 3348459 3434997 3343340 3305846 3261998 3261144 3148091 3069263
2804 3069263 3064575 2973364 2831585 2774770 2758609 2692852 2633736 2667727 2680343 2571744 2443359
2793 2443359 2404057 2443641 2556016 2637268 2620287 2581195 2490866 2437392 2429137 2326967 2189641
2782 2189641 2169246 2197145 2295408 2126662 1974593 2065662 2109609 2098071 2056388 1952159 1850143
2771 1850143 1908332 2006312 1965845 1899294 1903055 1838491 1803627 1809441 1700542 1780245 1706263 1738761
2759 1738761 1694717 1763086 1721479 1649463 1469172 1366081 1481293 1590557 1642926 1480159
2749 1480159 1444750 1488147 1340951 1497595 1701002 1663326 1667766 1695001 1590521 1550732 1557510
2738 1557510 1505933 1542243 1398989 1445872 1436262 1410860 1597091 1613173 1674608 1755076 1623949
2727 1623949 1647393 1560375 1482592 1496346 1460744 1460270 1410771 1336675 1324660 1210344 1219624 1236781
2715 1236781 1182500 1284188 1184522 1119492 1292472 1324847 1399376 1300225 1194697 1249791 1231789
2704 1231789 1342828 1329335 1280807 1238622 1149800 1217652 1260954 1272746 1237100 1290433 1155038
2693 1155038 1054761 1044553 1084713 1158752 1016068 971178 978979 1017356 1030521 1149655 1258187
2682 1258187 1139913 1021767 985219 1074289 969763 1014501 901575 1000005 1075584 1129037 1062815
2671 1062815 997573 1063668 1009089 1003209 842776 825158 838336 956751 994032 1046397 1103596
2660 1103596 942210 862668 923688 897269 823226 799314 906055 977280 952444 896963 917752
2649 917752 843760 850252 982808 1076019 1088665 1036267 899392 836212 919635 864242 834165
2638 834165 919297 935189 1007884 891485 817631 818255 824970 814798 982612 907360 878987 855103
2626 855103 859385 912114 856755 894592 903900 923783 870031 826889 763785 716614 795561 959998
2614 959998 754645 676043 697391 690913 761089 864271 783696 782485 773718 695243 631623 622046
2602 622046 723140 670913 680568 884617 685360 647635 692366 753505 580453 542670 609180
2591 609180 516619 483708 570206 641547 566801 625068 622737 628476 573276 651435 660594 626869
2579 626869 658859 778572 851506 824332 809729 831858 850756 818696 773056 747816 697071
2568 697071 742993 791890 925005 812130 876402 944373 1000119 861543 850546 885636 886931
2557 886931 814921 694913 662477 752596 757670 711830 627219 644396 649070 663954 641627 680178
2545 680178 705807 589410 541250 552013 518333 518556 474972 407440 502864 401229 547631
2534 547631 664806 514912 475760 600624 497570 720750 741325 635787 699984 662226
2524 662226 567517 636974 645698 601021 673971 738020 594538 558543 635219 630862 557644 516076
2512 516076 504495 618880 662538 579231 531193 636518 625012 639359 556636 540090 606777
2501 606777 577686 606562 495861 649287 703311 617570 539383 529060 553478 584671 597518
2490 597518 569812 610741 661020 508887 483170 546324 580391 732679 624516 510773 648372
2479 648372 626987 577516 560605 604005 542377 621776 602026 549099 485549 548223 629368 509252
2467 509252 532969 493563 559942 612885 640483 563350 458961 434428 457204 446335 520110
2456 520110 485287 504707 383816 417717 428029 525824 588913 547680 506416 445506 546060
2445 546060 452635 402053 454137 613853 629681 619851 469669 375341 445108 543871 585151
2434 585151 519079 546292 684338 575445 518683 559543 597940 612727 584986 564051 483339
2423 483339 551776 494653 595420 567374 644743 539626 508185 573829 405017 556802 458514
2412 458514 509260 597604 489764 447773 398407 427046 396373 531439 604219 532701 551416
2401 551416 528443 510017 351068 488168 597643 642009 683087 662897 661362 705496 589994
2390 589994 599847 626208 726984 776553 744188 636803 609458 685780 649655 761073 779472
2379 779472 678712 696021 754697 628522 664321 653241 624651 713657 723222 658311 745336
2368 745336 770662 709335 733310 750992 637084 677596 637936 633214 634666 597915 656970 704762
2356 704762 724396 659232 700302 823288 886689 927953 957444 957042 962444 1111103 1156728 1125856
2344 1125856 1076608 1149252 1214652 1277331 1191314 1285780 1322367 1435129 1682017 1785828 2002278
2333 2002278 2011247 2130409 2039649 2096457 2286970 2476464 2539451 2822362 3048474 3217710
2323 3217710 3416612 3962140 4283995 4559252 5148520 5648762 6145964 6638069 7309141 8135089
2313 8135089 8936523 9722802 10896818 12685826 14827935 17444916 20300982 23048924 26615598
2304 26615598 30901708 33621586 33149689 31575065 29316885 27146851 24191509 20011342
2296 20011342 16830947 14388368 12720384 11501355 10520782 9710927 9004903 8703898 8113897
2287 8113897 7500490 6928997 6498963 6004639 5514018 5057422 4664726 4454497 4176915 3923784
2277 3923784 3660581 3596449 3409284 3253277 3062565 2866099 2764973 2744509 2728753 2620359
2267 2620359 2532453 2383178 2152149 2150866 2178562 2079395 1942444 1970423 1944242 1924945 1819456
2256 1819456 1754219 1708258 1535680 1453365 1551247 1540378 1465649 1424683 1406397 1373909 1266199
2245 1266199 1314815 1375104 1268173 1148823 1189657 1173592 1026689 1066674 1154545 1142379 1126425
2234 1126425 1160468 1086599 937473 1060406 1005885 954236 1098844 1048049 988915 1031688 915868
2223 915868 947963 898780 846949 838146 782465 884216 940911 788314 962951 815516 790018
2212 790018 804608 776405 703956 610593 661355 604410 599984 636506 705323 703593 707668 595811
2200 595811 566977 551221 520275 598357 640122 697672 695835 568776 598746 615422 597925 591015
2188 591015 497491 679416 687699 592332 633366 545472 568585 490897 490906 616847 686755 735350
2176 735350 657229 559303 524682 559896 577819 599618 575588 480053 491394 512658 589019 617001
2164 617001 546211 595132 668934 528204 564862 478787 586150 533232 460313 436982 494093
2153 494093 434131 407373 503681 412466 416306 579471 565922 451826 529143 502131 438241
2142 438241 441474 429068 401113 451674 388593 306993 430103 542154 596220 592932 449187
2131 449187 446790 428310 467107 502593 516348 429027 298447 315296 239631 225491 216974 287995
2119 287995 305707 405149 476103 301331 419600 491431 496950 511570 467550 381944 477200
2108 477200 470604 550150 464875 460803 475091 393326 421001 359667 377727 381923 383643 436832
2096 436832 462229 370618 394841 278168 267498 311092 298905 195407 147445 144111 163762
2085 163762 275678 322216 365641 440267 349514 290757 319331 272601 294863 154394 66672
2074 66672 257178 398914 275638 162765 172286 232664 208572 233163 248648 147169 166483
2063 166483 184727 266928 364675 300712 204029 190115 243016 502709 430472 209495 250400
2052 250400 313092 249701 249309 251161 189718 235560 292172 329536 364432 348479 306249 260638
2040 260638 270521 327521 495604 327778 326018 495635 471584 496319 420115 399762 374220
2029 374220 414127 288079 448723 458174 363981 288799 310657 239013 238192 370048 448527 337870
2017 337870 218121 330602 228374 105052 212144 172711 84552 80148 212746 281053 301890
2006 301890 279249 298525 280175 358604 468193 358272 389701 382366 405157 322415 249858
1995 249858 205172 175251 199684 293453 403122 375817 310678 216058 218408 304906 202078
1984 202078 101954 28828 94176 259405 302198 268655 295621 190389 220048 358125 275642
1973 275642 215165 195643 326053 373850 204926 374163 204418 152701 265906 253461 133114
1962 133114 153648 310128 276552 204217 155390 227363 182716 68549 136494 318078 346863
1951 346863 237265 218197 204479 116219 112367 97714 181564 299223 277688 134643 188835
1940 188835 98662 81007 168998 261623 212873 82843 64430 129292 183233 118686 126041 49200
1928 49200 126959 281838 279281 465325 411896 263071 279746 240192 257024 208704 215125 235705
1916 235705 215633 206325 221019 199616 162861 210045 203877 126686 182740 243663 236063 149001
1904 149001 156141 219163 263917 240118 218365 137629 142456 149646 86562 124499 119091 124250 65722
1891 65722 101034 87176 105582 240197 283756 279677 306320 278309 46699 62315 146935 64100
1879 64100 -19859 147801 168057 122270 26407 22774 188511 158787 86959 139465 240693
1868 240693 188773 99728 18646 115916 226491 161395 172546 175363 121895 332181 275089
1857 275089 139879 16228 -4104 67345 189150 194581 81827 123544 56575 135084 120924
1846 120924 44415 -46856 17292 69421 39112 146447 112550 113970 14223 183736 199220
1835 199220 192421 151439 165678 192117 222139 240559 218540 165897 31838 189844 145972
1824 145972 109084 72559 -49661 83715 213582 183616 38390 -26551 76651 91831 122288
1813 122288 158112 155702 76552 68213 107493 93900 151814 248036 240457 153592 168766 287403
1801 287403 250076 51814 6505 128274 26324 -17473 125697 168966 99058 181098 153908
1790 153908 160484 133711 149615 109435 32368 29105 110433 112084 130193 217636 242420 299970
1778 299970 251942 250810 120711 30825 87949 174480 99624 90512 113301 105246 108333 33681
1766 33681 77078 132773 101670 69755 -6097 112752 88250 29715 -15503 -22128 -39411 9195
1754 9195 -69550 46226 101154 10431 158913 250541 193812 85466 165260 115314 48385
1743 48385 118949 154626 176752 195749 25684 39956 24806 -2999 40758 68548 8243 -7723
1731 -7723 -94017 -27121 -37509 -133896 -114755 -23981 45838 106022 107142 92329 126487 110509
1719 110509 94173 167607 99485 43992 115044 13063 152062 251339 223334 105040 72489
1708 72489 146290 76430 43053 34294 -12667 -26429 -44606 117914 71486 -58641 112304
1697 112304 107543 95365 57516 49019 73097 30702 21821 -24418 -43256 34576 173976 138752
1685 138752 35261 49625 89867 14087 89955 102870 135135 32053 -10758 144974 254539
1674 254539 197042 201834 106558 155984 131406 -160133 -67048 55691 -27715 25989 95713
1663 95713 167292 251670 174660 136684 1448 517 -63167 62529 12022 14559 -106300 -204415
1651 -204415 10991 73371 35344 52231 96565 33487 6055 -62922 -12417 1120 38099
1640 38099 87547 157308 127408 114405 136131 120814 42491 59901 85012 138469 292899 309103
1628 309103 246538 152207 63578 22446 57370 109590 94149 195039 122572 179796 291503
1617 291503 229432 207652 198994 65569 6978 164217 163912 115648 82419 -83146 -57246 46408
1605 46408 -12065 42178 59915 136448 60390 77996 161946 149381 101260 117466 52831 -46039
1593 -46039 -75461 17944 46375 113043 219721 82607 48446 36475 -1484 -16781 124848
1582 124848 236636 179723 262734 59380 -5159 130809 171197 76665 -117549 -45785 -5412
1571 -5412 -3036 -2407 84949 109485 79461 68212 64524 159021 -52329 -85121 -146689 -78675 16539
1558 16539 27474 74332 102298 57163 14541 -27334 26184 27417 -24375 67560 65164 245020
1546 245020 285227 167595 98685 151258 118822 71949 -102336 -50676 2760 103303 2959
1535 2959 -13766 -20590 -50655 70974 85829 8020 29131 145091 18455 -138906 -184977
1524 -184977 -124321 -132584 -65903 -30944 -48048 183739 161525 35029 96670 -3879 35939
1513 35939 -60272 67588 206488 124336 49025 -38346 -93848 3927 43862 33396 -50159
1502 -50159 80476 188638 80326 65 -35486 51011 117965 45196 33030 81850 99011
1491 99011 139892 59687 5790 -107571 -100824 -36298 46413 102999 160109 84219 10394 41332
1479 41332 42275 -51940 78338 -12584 62648 162206 126143 74100 72401 83072 94350 15799
1467 15799 40839 143577 187717 150384 99541 -22180 -44427 28228 -125849 -131115 46147
1456 46147 47895 -77144 105479 154829 20734 49435 6667 36118 35113 -58795 12238 53742
1444 53742 27699 -147493 -84281 -115262 -78780 54883 98125 78057 28071 -91242 -129442
1433 -129442 11452 24071 -68581 -35754 -31714 -46236 -87109 -176577 -63589 34358 -7925
1422 -7925 146429 134676 -62808 -51214 -807 -14914 64397 -19841 -33665 7277 -82234 -140343
1410 -140343 -139905 -120782 -72469 53222 425 -84053 -78199 33984 159203 189144 90827 -51179
1398 -51179 51779 106770 -3824 -654 74046 -10901 107254 43368 86718 7153 5174 98896
1386 98896 81023 75244 1929 56164 -31559 -110921 -23581 27060 47024 -12629 8309 -50152
1374 -50152 -90124 -104360 -53664 -8352 -22791 54032 -39075 -87795 -10161 -75402 48785 151254
1362 151254 -36069 38731 -70703 69843 145605 20726 -54328 -67191 14500 -2381 122279
1351 122279 190997 -14804 -3410 60818 64280 -33445 -12231 12077 19130 -5124 27707 -41554
1339 -41554 -36768 16149 83689 41726 105258 202548 -2260 -166753 -9393 200756 103636
1328 103636 -50698 -60893 37631 39060 -44314 -77226 40588 50781 -6758 13085 137849
1317 137849 76388 104651 154595 162466 207312 170472 137521 16076 -98988 -105800 38095
1306 38095 63543 -119853 -152569 23011 -19264 3717 10796 66840 -36186 -87646 -85061 5964
1294 5964 -59601 -101332 -104925 -108074 25729 -58340 -27344 11515 -51009 -86939 -39820 53058
1282 53058 -24949 -33591 124543 170498 172149 -26593 -155674 -132086 153797 103766 7612
1271 7612 -19230 88885 78257 6085 -54322 -41789 82806 -22807 -28991 67713 -24378 34734
1259 34734 75319 35518 41659 60637 118906 -57749 -60325 -21182 -30500 -24568 -38737 -116780
1247 -116780 -132659 -59031 -101398 -18069 67844 -40311 -91855 54498 48257 -52061 -140272
1236 -140272 92593 96725 64253 173546 -11087 23828 15297 -211105 -239196 -105942 -27002
1225 -27002 5012 88908 224037 136101 29861 193 -136068 -99233 -102630 26808 177645
1214 177645 26515 21602 48781 48944 -9202 -33456 40852 62044 -88477 -73230 -21951 -114337
1202 -114337 -121428 -79415 -110540 -71670 -26699 -68474 6774 108004 186528 94160 57976 43312
1190 43312 -146651 -128290 -81822 -84235 -96059 -49245 -42817 47177 -89429 -75193 -53735 -46620
1178 -46620 -50027 -85052 66952 -42648 -40352 -28465 61054 11879 -70664 -380 164289 228039
1166 228039 140107 76751 -3598 -22307 -23961 -44608 -181121 -138865 1857 59355 94005
1155 94005 -17680 -87106 -32736 23459 42654 8543 -62863 -110334 -2942 -5700 62899 78701
1143 78701 6707 -34383 -35007 -39744 -99886 -9509 9562 18887 -8574 116441 8655 -147683
1131 -147683 -102772 -166896 -74680 -12878 -130075 -39333 -11003 -37095 -42704 -122302 -14092
1120 -14092 60103 8879 -4561 -111229 14572 37104 42132 86713 50778 137679 94777 33101
1108 33101 -54151 -93860 -111403 -32239 -86182 -54198 143312 133574 119614 -48704 3283 36831
1096 36831 -94687 -96478 -2890 -35388 -72215 5025 -16884 1419 -66686 11256 -25332 -1312
1084 -1312 55964 72984 -55453 -57870 38448 -14990 -740 19797 25543 -13212 -21266 143513
1072 143513 143092 -75707 91399 47847 -108505 -73139 -165783 -36570 -16309 -37895 -39807
1061 -39807 -129163 -282163 -152127 -21598 -140961 -119073 -82355 -63351 -53294 -60884 -89530
1050 -89530 23615 -31405 -17711 -45951 -43751 -94047 -149113 -20705 -52982 -77345 -76963 111075
1038 111075 39981 58638 -64500 -124264 -10267 -4695 36250 -152723 -152670 -165538 -207999 -159591
1026 -159591 -271689 -199170 -81909 -107573 -167642 -185316 -148049 -74129 -78693 -81553 41557
1015 41557 -36105 25666 -45407 -15678 -32287 -47143 79239 41429 -43523 -36732 60759 147167
1003 147167 133266 -15977 -58805 -45125 -25322 -15056 52689 108272 101972 28968 131119
992 131119 104475 78811 55922 -47022 -28594 -221145 -235025 -155176 -190848 -216408 -233963
981 -233963 -175370 62745 152288 103765 -32365 38419 99918 43854 34075 56389 36354 54749
969 54749 -35274 -39808 -5303 78017 183365 29582 -21875 12936 -48863 -142928 -122734 -284251
957 -284251 -185394 -101467 803 -18179 -128477 -58530 -116235 -145629 -78908 -94042 -138127
946 -138127 -53084 -60146 17464 -83385 -117925 13858 58293 48476 -98846 -9987 -5570 -87361
934 -87361 19516 46154 23045 -75823 -108266 -76640 -4952 53750 58919 -76849 -55730 88983
922 88983 -57407 -157750 -68567 61488 148934 66046 78746 545 -158978 -247128 -171801
911 -171801 -175371 -211833 -115010 -50946 -141705 -217403 -37414 -2454 -14012 30292 -124755 -261017
899 -261017 -34846 3208 -2678 -23189 38284 -15324 64840 -25712 -69903 -34438 -165577 -55577
887 -55577 75152 25704 -189620 -156188 152234 16800 -53596 -79186 -113680 -45538 51289
876 51289 -48177 -24849 -47219 -183782 -80034 -42547 -130324 -187469 -126050 -74873 535 -4664
864 -4664 -20943 -51084 -64175 -47329 -20358 -73113 -32935 -62843 60162 -39562 -82788 -8179
852 -8179 103367 124712 52808 13656 -116377 -64815 -20443 -93675 -98734 -134218 -173929 -208476
840 -208476 -173467 -196779 -286992 -156522 -145083 -162960 -158294 -163312 -71256 -86992 -41048 88966
828 88966 111434 22097 41869 -33346 -136442 -102356 6168 -35178 -152877 -147594 -123165 -32244
816 -32244 60808 34714 106126 155775 -4468 -134641 -96737 -76574 49890 -110686 -82490
805 -82490 36108 -39232 36514 134601 121600 -225 -34138 -52251 32034 138481 78295
794 78295 86957 74694 -50741 -55088 -80345 -31422 -42532 18665 80455 41756 35850 57019
782 57019 68305 91420 -49327 -47342 14817 52766 39811 75415 -46295 7191 117847 30805
770 30805 38712 104364 177894 130901 65900 -43212 -63787 -69346 -50683 -138311 -63579 19265
758 19265 -65686 22597 24677 25063 13222 -27953 -59536 -155896 -168240 -62264 -26266 -112198
746 -112198 -68912 -35629 -66409 -44848 -79552 -64315 -11087 36435 159850 91067 66556 -78438
734 -78438 -154979 -83904 -66116 -97707 -42633 -87653 -119306 -86275 6912 48166 10189 -97036
722 -97036 -40676 130684 119909 203626 97273 -9152 -67484 -76368 -29457 27227 27106 27214
710 27214 -9270 -107229 -50574 -5517 -89348 16712 44814 123472 56560 33446 -195449 -125862
698 -125862 -44086 -47023 -139224 -90823 -18695 -60570 -2606 108112 17349 -172189 -89606 -60436
686 -60436 -29659 -91198 -164297 -216414 -96594 -72928 -11545 -47926 -21436 -59775 -161385 -85891
674 -85891 -45084 -13228 106591 -43955 -69462 96178 89343 -44951 1602 62659 14155
663 14155 97087 101583 -54578 -50460 -75237 -68631 -87544 -95214 -22970 53417 119136 -14410
651 -14410 -134997 -6654 -76200 -137686 40767 76005 -48356 -77901 3489 -46410 -178833
640 -178833 -136209 -81017 -148671 -118557 -170516 -31490 39103 21325 -38053 35081 81601 37484
628 37484 101165 82493 119764 69014 90273 1404 47014 -60032 -27344 -64798 -64867 -38821
616 -38821 -132978 -138498 -101630 -38165 26412 9576 -9294 71586 148339 222897 95194 3658
604 3658 -32496 -100339 -44110 32310 8769 -56503 -35400 99645 170664 161036 16965 -6424
592 -6424 -138048 -116061 -150000 -109636 -149934 -16187 -30985 87480 107618 28891 129020
581 129020 21830 30358 88528 102458 105394 93190 -30999 -19902 -40280 -71173 -117039 -18221
569 -18221 -24722 -110065 3497 12152 -212096 -141149 -18914 65205 -29714 -100338 -38099 128354
557 128354 115534 17628 13400 20930 49958 -55572 -103467 7080 -37741 -123620 -111715 -150786
545 -150786 -98906 -184619 -221506 -181479 -213622 -139714 -45771 6331 -51186 -112085 -18048 -91546
533 -91546 -18227 -44831 -23962 -962 45417 -16487 -113540 32485 192868 101096 6148 110925
521 110925 26673 -94932 -18483 38397 112734 101720 114752 57700 17291 21446 -43754 -13797
509 -13797 -6059 35774 124817 108859 -28594 -133837 -24576 12623 -74100 -156482 -97840 -113906
497 -113906 -150702 -101432 -61308 -149347 -155431 -65770 -118328 37556 83855 19113 78514 -78428
485 -78428 -240372 -186590 -276418 -295393 -270368 -100875 -101295 -105297 -26559 -120331 -66032 20325
473 20325 -37905 -47019 -82579 -24001 20162 -16375 107956 -26098 -79847 49346 -22350 -133069
461 -133069 -119546 -138261 -89292 17531 -31357 -58017 -177136 -52055 29520 1917 -91843
450 -91843 -53503 128195 160101 43342 -3151 -65617 8160 -69036 14878 58847 22168 -45376
438 -45376 -105226 -132432 -110175 59890 102727 58915 119369 10292 8449 28463 -9483 -13823
426 -13823 -23532 -75077 -81724 -75983 -137640 -74112 -15733 -21761 -2914 -28033 -107922 -13009 40922
413 40922 50093 -12461 -10072 -82732 -53149 629 58298 -90333 -98239 -70410 19772 -147787
401 -147787 -125491 -40700 34939 2961 -7814 -24609 -230676 -137398 -39484 5251 32379 556
389 556 -11004 -71914 -46862 -60854 -83946 -84448 -227244 -205183 -20668 98667 -13310 -39654
377 -39654 -13106 -90512 -135297 -107759 -147580 -132966 4365 6820 -140381 -116801 16776 -33661
365 -33661 -50749 -66462 -687 -73396 -49857 115225 119109 110291 -17793 -91988 -84628 -37493
353 -37493 66211 20341 -104846 -45658 -71600 15132 9715 38180 93132 -61515 -86328 -30305
341 -30305 -163387 -176065 75275 139143 100716 -73191 -101530 -40548 -44767 -99757 -38960 32247
329 32247 -12020 -105754 -39732 35025 -108439 -108393 -135488 -116213 -129386 -112255 -68557 15336
317 15336 80965 -57948 -121615 -134338 49913 62903 -129514 -152604 -14447 -61075 -89824
306 -89824 -40428 -14092 -162016 -123986 -57708 -170516 -22452 -109278 -57235 -98559 -34624
295 -34624 6720 -38301 -77602 91357 -25210 -279005 -124326 -98961 -93849 36760 35778 108611
283 108611 -13100 -16207 -129602 -241957 -98267 -47777 -87217 -230335 -138916 -83410 -102243
272 -102243 -230982 -121046 -2521 39778 26187 -43776 -100929 -84931 -76421 -27566 -53323
261 -53323 60575 -23023 -90120 -93255 -183966 -205020 -147636 -156738 -80224 13519 -63627 9688
249 9688 -29879 -8295 -61637 -37593 -60511 23872 -14817 123298 159176 -28335 -134188 -202240
237 -202240 -21704 39617 24666 -178910 -192689 -83037 -42917 -2995 9048 -43641 28164
226 28164 119005 13676 -31584 -207821 -234342 -160880 -240312 -218207 -142842 -109701 19764
215 19764 17355 -29057 24472 65930 17272 52489 142139 32682 -66905 -148221 -200461 -122657
203 -122657 -109035 19558 -44051 -166121 -111569 -161979 -111565 -141274 -101323 -187767 -32035
192 -32035 -85222 -103492 28149 31516 17671 -73968 -16905 20772 44959 -20832 -38031 -101248
180 -101248 -53863 -12304 93124 -40930 -62363 -122093 -109888 -10144 -127413 -58745 20196
169 20196 -13161 -55993 -62821 -46682 -85679 -129501 -96983 -115077 -1403 -38661 -113290 -139775
157 -139775 -8969 45579 -121273 -190281 -112402 -78914 -91349 -5089 -53779 -94739 -119889
146 -119889 -128116 2796 -80104 -133029 -142043 -37087 15362 -147099 -136769 -23642 -79379
135 -79379 -5723 -85059 -149532 -83015 -60752 -49324 -175761 -93469 -24641 20903 -28814 -4148
123 -4148 -38523 25201 3590 -94239 -79247 -46491 -95721 -107558 -113893 -160154 -167411 -119359 -92224
110 -92224 -55649 -63483 -87331 58496 -51651 -148903 -205919 -160366 -39066 -27997 -47724 -102456
98 -102456 -59309 93579 -9786 -79077 -123375 -138880 -133791 -78239 -70396 16341 103816 81475
86 81475 -29155 -76600 -54465 -7829 28973 1674 -13296 -88231 -99660 -17889 -40202 -137116
74 -137116 -67031 35400 -82389 -120622 4164 -7644 -47141 -87114 -107228 -144880 -134538
63 -134538 -201951 -231646 -219660 -82404 -58188 -154984 -172869 -265217 -167178 -52040 -180529
52 -180529 -212120 -195032 -175031 -121516 -119682 -13126 107845 22868 -53202 -16946 5538 -22966
40 -22966 -131090 -213741 -117658 -47935 -33724 -30590 20916 64385 17066 -37995 -64157 -89780
28 -89780 -98967 -40255 -38237 -28310 -49707 -69957 -152232 -169573 -106592 -135643 -66041 -68780 -143615
15 -143615 -106436 -27654 -83847 -43584 -9547 -117257 -156931 -170369 -115471 -44655 -45951 -64585
3 -64585 3783 -60950 -84632
0 -84632
$$ Imaginary data points
##PAGE= N=2
##DATA TABLE= (X++(I..I)), XYDATA
16383 -2301966 -2254639 -2258316 -2098913 -2101542 -2077291 -2016303 -2041411 -2116944 -2028686 -1915686 -1966417
16372 -1966417 -1914453 -1898279 -1878052 -1852190 -1764813 -1819207 -1776558 -1741643 -1652287 -1590185 -1668393
16361 -1668393 -1559449 -1567197 -1583867 -1436781 -1335292 -1396742 -1377746 -1494408 -1499369 -1416504 -1441806
16350 -1441806 -1326388 -1286792 -1194112 -1154841 -1177080 -1093477 -1064271 -1014245 -971846 -1060784 -1053574
16339 -1053574 -1013837 -838746 -843655 -829764 -758605 -785425 -787108 -836026 -910744 -774161 -650202
16328 -650202 -547748 -528873 -493084 -506185 -463038 -384957 -452488 -472386 -392548 -257976 -224883
16317 -224883 -270978 -182970 -180345 -194966 -107663 -94239 12136 21601 -207929 -90068 -30782
16306 -30782 -68768 15115 144916 179498 209432 207156 194402 148293 125212 189712 258272 270772
16294 270772 263694 354703 347498 420012 353071 391716 428285 501232 507745 501548 554988 546684
16282 546684 515527 657769 660950 687004 711096 685758 768387 758880 849739 778423 745126 752113
16270 752113 765097 801151 797918 801986 750845 853208 931620 1056414 1045339 1102278 1004948
16259 1004948 1082877 1251419 1203833 1167384 1192742 1265997 1152118 1093746 1061764 1123923 1167086
16248 1167086 1155100 1208557 1283843 1311507 1365126 1457226 1453672 1440923 1491926 1382513 1448254
16237 1448254 1478575 1470199 1499334 1471909 1532058 1494194 1463814 1579854 1600534 1533266 1511232
16226 1511232 1641870 1641742 1657709 1564596 1411394 1587297 1600882 1735846 1797717 1781414 1710277
16215 1710277 1753252 1787907 1836234 1857540 1851034 1890006 1862099 1843179 1917026 1904521 1947721
16204 1947721 1933201 1940565 2068247 2099832 1977380 1961082 1946590 1930638 1959376 1936307 2008443
16193 2008443 2146724 2098433 2040416 1942002 1916330 1955730 1894963 1985918 2092257 2162344 2043238
16182 2043238 2012911 1984893 2069833 2151174 2190259 2108463 2110589 2178974 2224065 2235315 2184686
16171 2184686 2113268 2062320 2112011 2330797 2303710 2324608 2452240 2324343 2203472 2225307
16161 2225307 2436346 2428040 2324638 2438975 2460405 2370956 2473802 2453545 2435337 2436973 2419320
16150 2419320 2363571 2371220 2425910 2433878 2389146 2424567 2445453 2380166 2365412 2356230 2457118 2461307
16138 2461307 2440395 2449852 2597766 2520896 2502076 2464825 2494794 2560805 2551269 2498291 2537199
16127 2537199 2471353 2477075 2578811 2616998 2544397 2329297 2323738 2437713 2421447 2379528 2356389
16116 2356389 2381604 2521021 2624241 2744604 2701106 2582563 2467768 2504822 2551074 2535214
16106 2535214 2557924 2598363 2632049 2600125 2530722 2589074 2707607 2754407 2600444 2451499 2538604
16095 2538604 2609225 2612732 2539008 2524156 2488197 2374696 2421582 2494311 2510616 2539999 2597247
16084 2597247 2638830 2600936 2539981 2636214 2688581 2630443 2513712 2492813 2520278 2461553 2599673
16073 2599673 2686269 2539409 2453894 2469801 2573723 2598221 2469090 2417481 2509202 2516818 2570485
16062 2570485 2625360 2624921 2657818 2610401 2644368 2644598 2488199 2528443 2521789 2480407 2605766 2803400
16050 2803400 2855293 2729298 2777472 2703378 2668584 2716778 2745721 2728828 2525897 2558321 2593512
16039 2593512 2668493 2680042 2680988 2651240 2880493 2880247 2639138 2635918 2615139 2791832 2750753 2690935
16027 2690935 2847710 2851092 2698427 2572269 2536524 2625987 2702974 2725702 2770125 2821273 2701224
16016 2701224 2690589 2733904 2695644 2604489 2671382 2713972 2712041 2695180 2647504 2713655 2749950
16005 2749950 2733606 2823977 2636681 2524585 2594698 2716994 2738530 2579365 2456919 2612477
15995 2612477 2763672 2800439 2844070 2834137 2792392 2700365 2753688 2698753 2791931 2800145 2740988
15984 2740988 2614880 2542516 2504234 2522330 2604415 2577485 2685915 2796604 2727884 2728362 2718830
15973 2718830 2783396 2833849 2743345 2744080 2699425 2572890 2463108 2489038 2666113 2644973 2594520
15962 2594520 2439319 2538606 2585564 2675016 2715876 2613274 2647449 2646982 2762905 2815967 2717148
15951 2717148 2767831 2723826 2605549 2627757 2621780 2672728 2749232 2796828 2705186 2668042 2668954 2670540
15939 2670540 2657061 2718886 2861783 2742917 2712834 2776801 2817430 2804038 2799670 2742296 2690649
15928 2690649 2843543 2791552 2676554 2682743 2738223 2746630 2790264 2724721 2636405 2662166 2753257
15917 2753257 2714542 2628978 2662050 2703722 2761025 2664663 2651964 2697024 2691054 2703751 2607221
15906 2607221 2696917 2735444 2841174 2908900 2857566 2902402 2752790 2730417 2685713 2687831 2697967
15895 2697967 2723205 2793906 2713965 2811872 2774548 2674228 2633172 2674463 2586403 2591345 2730999
15884 2730999 2840545 2775110 2691907 2665352 2676818 2667768 2733042 2702078 2705514 2593588 2638412
15873 2638412 2701309 2706382 2594096 2679291 2840854 2783533 2722547 2682217 2717326 2630837 2608921
15862 2608921 2649575 2702386 2710407 2568196 2625567 2694777 2732715 2772233 2631073 2725351 2827354
15851 2827354 2786388 2810407 2789869 2625382 2588301 2708462 2767547 2836166 2858176 2629820 2523908
15840 2523908 2592650 2695774 2677373 2768173 2749726 2635758 2709271 2718623 2597955 2613253 2702254
15829 2702254 2785366 2728921 2663357 2639720 2625772 2766772 2841646 2763063 2581777 2684442 2698029
15818 2698029 2615572 2819569 2899440 2916324 2866836 2917361 2865807 2807438 2812012 2726765 2685429
15807 2685429 2646340 2638808 2636364 2545246 2594276 2721021 2650555 2541585 2664780 2738978 2743233
15796 2743233 2656538 2696044 2602289 2540920 2685437 2681821 2676706 2618332 2533360 2512729 2557642
15785 2557642 2536601 2584800 2690173 2704914 2675193 2561960 2606555 2563334 2551801 2695170 2822005
15774 2822005 2825890 2691033 2689277 2706387 2726970 2674931 2724276 2834083 2722433 2782531 2805441
15763 2805441 2795082 2802420 2806201 2815290 2935081 2705754 2667156 2692071 2563772 2638689 2688847
15752 2688847 2704578 2604091 2760206 2824104 2791512 2779032 2698465 2872081 2831229 2716374
15742 2716374 2655927 2648661 2739293 2842110 2757018 2715667 2810604 2823091 2879709 2936595 2945387
15731 2945387 2855321 2765028 2715813 2787341 2776774 2726334 2583523 2597897 2669943 2701057 2586781
15720 2586781 2619118 2632554 2678876 2729873 2703825 2721380 2753791 2748866 2760143 2720654 2692721
15709 2692721 2646594 2677212 2775561 2756275 2737316 2612583 2678334 2632233 2504956 2773153 2693796
15698 2693796 2730747 2734582 2713915 2690447 2748741 2673153 2585235 2733706 2971079 3063958 3048913
15687 3048913 2838155 2621855 2759507 2793945 2837716 2725567 2596906 2561697 2613245 2657670
15677 2657670 2699823 2824164 2730777 2805762 2827264 2813022 2861579 2893841 2876086 2753036 2721552
15666 2721552 2557228 2519337 2620110 2634479 2718586 2649003 2696840 2783278 2718817 2765195 2772414
15655 2772414 2698378 2791349 2885765 2787047 2751355 2734607 2766770 2764142 2755526 2872459 2815948
15644 2815948 2701525 2661930 2733268 2782211 2756991 2771102 2752724 2824311 2730575 2743776 2694942
15633 2694942 2748287 2815676 2766794 2697323 2862833 2717260 2753544 2741271 2639528 2738604 2652100
15622 2652100 2707228 2782985 2711133 2732054 2727009 2792529 2796790 2674126 2618557 2658215 2778856
15611 2778856 2788988 2782124 2617923 2627686 2764801 2777638 2800900 2851940 2825658 2703626 2652014
15600 2652014 2726212 2792011 2651811 2746551 2826528 2825909 2824563 2767584 2726694 2715289 2702153 2740560
15588 2740560 2799052 2809985 2863611 2811416 2881216 2896118 2925444 2815818 2823619 2713914 2799366
15577 2799366 2685515 2603389 2731933 2763319 2763765 2778838 2621712 2576027 2651694 2805604 3004559
15566 3004559 2881526 2844459 2725665 2720285 2700876 2771404 2684303 2778493 2772770 2809977 2711687
15555 2711687 2665617 2737391 2738710 2661318 2714810 2680050 2609311 2718984 2878963 2886803 2761117
15544 2761117 2735864 2726866 2679119 2730580 2869415 2837938 2795523 2808992 2799008 2796010 2934931
15533 2934931 2845239 2706852 2654332 2788981 2879982 2839748 2872208 2744420 2692332 2581077
15523 2581077 2640686 2766164 2907877 2789345 2677251 2770922 2721104 2708088 2745244 2744663 2786844
15512 2786844 2734792 2802118 2915890 2888796 2900255 2702085 2718993 2664349 2623346 2558399 2733596
15501 2733596 2696788 2656850 2687631 2686237 2623400 2679307 2779994 2798784 2741020 2809956 2655534
15490 2655534 2666732 2726574 2781105 2736007 2860383 2882254 2804119 2677576 2637181 2799052 2801321
15479 2801321 2767952 2674204 2678549 2794262 2774054 2679886 2785784 2749145 2740682 2741247 2679252 2750147
15467 2750147 2690345 2773540 2876464 2817332 2710474 2822995 2924410 2911518 2851763 2673662
15457 2673662 2669524 2701762 2821034 2797786 2732361 2818254 2855901 2804550 2854109 2850526 2828894
15446 2828894 2796407 2741862 2871760 2856304 2851721 3000382 2752145 2862628 2850859 2880215 2838794
15435 2838794 2812751 2842711 2932973 2844511 2756396 2749147 2844280 2910135 2835488 2828999 2797097 2865904
15423 2865904 3000448 2878282 2833089 2829675 2849610 2780501 2670838 2755397 2877148 2771869
15413 2771869 2758997 2805284 2821999 2738342 2735329 2610456 2782278 2953724 2909188 2928712 2739625
15402 2739625 2733202 2790525 2858181 2841550 2798466 2705081 2925428 2911784 2757356 2827056 2777455
15391 2777455 2790805 2791871 2813574 2839712 2828306 2905053 2935866 2921183 2804482 2810169 2792210
15380 2792210 2788217 2921545 2933493 2959110 2975772 2857506 2736589 2740569 2806056 2750091 2838292
15369 2838292 2794517 2790064 2999011 3066942 3043591 2935533 2758132 2814810 2857620 2922973 2826656
15358 2826656 2847468 2763076 2797876 2709165 2787803 2874678 2973033 2877166 2851601 2871237 2927588
15347 2927588 2995377 2865718 2828440 2854511 2795789 2832579 2864590 2768537 2884188 2779885 2900235
15336 2900235 2926207 2918522 2936849 2874320 2826311 2772394 2785061 2835016 2843494 3024933 2772754
15325 2772754 2692689 2750306 2741889 2953757 2932112 2914213 2797593 2786436 2745368 2712007 2810843
15314 2810843 2831922 2921403 2849479 2880929 2900384 2811636 2779231 2699954 2767546 2820172 2822120
15303 2822120 2833877 2872467 2828885 2691949 2804382 2837678 2762234 2823238 2765409 2813620 2767955
15292 2767955 2670881 2745085 2727785 2862894 2896755 2998195 2975488 3044765 2968260 2855903 2811093
15281 2811093 2745518 2738893 2774326 2980149 2937020 2937298 2984561 2823159 2893253 2921995 2982288
15270 2982288 2925451 2945135 2873948 2856852 2917875 2861085 2774269 2877374 2909218 2869045 2908327
15259 2908327 2861219 2924820 2834840 2789412 2875545 3022293 2901226 2833319 2832534 2807530 2719754
15248 2719754 2717999 2702734 2800337 2926061 2952075 2868663 2770858 2866146 2821069 2928137 3060377
15237 3060377 2986577 3017884 2946423 2815155 2808822 2771006 2772264 3010658 2930877 2769079 2835480
15226 2835480 2956089 3022654 2922762 2877919 2812595 2640821 2594493 2688112 2875050 2817166 2770480
15215 2770480 2825613 2831799 2761273 2927745 2991772 3045327 2906304 2851117 2902183 2945876 2760680
15204 2760680 2762600 2889376 2930446 2983441 2774563 2643011 2713099 2718522 2879471 2983062 2991581
15193 2991581 2966045 2991394 2924832 2872790 2997179 2989304 2955062 3059541 3182818 3062340 2975404
15182 2975404 2961554 3048997 2789843 2792957 2958387 2889003 2802973 2777648 2857848 2892376 2831261
$$ [...]
##END NTUPLES=NMR SPECTRUM
##END=
