##TITLE=1H_DE-80H_X3
 200.13MHz, d2o
 8 sc
 
 19ns.26.2.2025
##JCAMPDX= 6.0         $$ Bruker NMR JCAMP-DX V2.0
##DATA TYPE= NMR SPECTRUM
##DATA CLASS= NTUPLES
##ORIGIN= UXNMR, Bruker Analytische Messtechnik GmbH
##OWNER= pz
$$ XWIN-NMR		Version 3.5
$$ Wed Jul 16 14:28:41 2025 Russian Standard Time (UT+4h)  Yarkov@DPX200
##.OBSERVE FREQUENCY= 200.1313
##.OBSERVE NUCLEUS= ^1H
##.ACQUISITION MODE= SIMULTANEOUS
##.ACQUISITION SCHEME= undefined
##.AVERAGES= 8
##.DIGITISER RES= 18
##SPECTROMETER/DATA SYSTEM= spect
##.PULSE SEQUENCE= zg30
##.SOLVENT NAME= CDCl3
##.SHIFT REFERENCE= (INTERNAL, CDCl3, 0, 15.4924)
##AUDIT TRAIL= $$ (NUMBER, WHEN, WHO, WHERE, WHAT)
$$ ##TITLE= Audit trail, XWIN-NMR		Version 3.5
$$ ##JCAMPDX= 5.01
$$ ##ORIGIN= Bruker BioSpin GmbH
$$ ##OWNER= Yarkov
$$ C:/Bruker/XWIN-NMR/data/yarkov2/nmr/H-C/1/pdata/1/auditp.txt
$$ ##AUDIT TRAIL=  $$ (NUMBER, WHEN, WHO, WHERE, WHAT)
(   1,<2025-07-16 14:27:14.10 +0400>,<Yarkov>,<DPX200>,
      <created by zg, POWCHK disabled, PULCHK disabled
       configuration hash MD5:
       00 E9 B6 7A A2 85 ED C7 34 08 36 98 17 FE 4E 26
       data hash MD5: 16K
       4B 82 F5 FA AC 0E 70 BE 8C 24 38 39 29 FB 24 18>)
(   2,<2025-07-16 14:27:51.26 +0400>,<Yarkov>,<DPX200>,
      <Start of raw data processing
       efp BC_mod = 2 LB = 0.25 FT_mod = 6 PKNL = 1 PHC0 = -1362.974 PHC1 = 20.39091 SI = 16K 
       data hash MD5: 16K
       09 46 77 2F E4 86 C2 10 A0 0A 90 77 61 6F B3 30>)
(   3,<2025-07-16 14:28:01.12 +0400>,<Yarkov>,<DPX200>,
      <abs ABSG = 5 
       data hash MD5: 16K
       47 F8 A4 89 CD D9 DF F0 BB 5D FF 79 C6 89 65 EE>)
$$ ##END=
$$ 
$$ hash MD5
$$ 0D 63 DD 09 EC 8C 93 7E 86 A3 7E D5 AF 12 9A D7
##$RELAX= 
##$RELAX= 
##$RELAX= 
##$RELAX= 
##$RELAX= 
##$RELAX= 
$$ Bruker specific parameters
$$ --------------------------
##$DU= <C:/Bruker/XWIN-NMR>
##$EXPNO= 1
##$NAME= <H-C>
##$PROCNO= 1
##$TYPE= <nmr>
##$USER= <yarkov2>
##$AMP= (0..31)
100 100 100 100 100 100 100 100 100 100 100 100 100 100 100 100 100 100 
100 100 100 100 100 100 100 100 100 100 100 100 100 100 
##$AQSEQ= 0
##$AQ_mod= 1
##$AUNM= <au_zg>
##$AUTOPOS= <>
##$BF1= 200.13
##$BF2= 200.13
##$BF3= 200.13
##$BF4= 200.13
##$BF5= 200.13
##$BF6= 200.13
##$BF7= 200.13
##$BF8= 200.13
##$BYTORDA= 1
##$CFDGTYP= 0
##$CFRGTYP= 5
##$CHEMSTR= <none>
##$CNST= (0..31)
1 1 145 1 1 1 1 1 1 1 1 1 1 1 1 1 1 1 1 1 1 1 1 1 1 1 1 1 1 1 1 1 
##$CPDPRG= <>
##$CPDPRG1= <>
##$CPDPRG2= <>
##$CPDPRG3= <>
##$CPDPRG4= <mlev>
##$CPDPRG5= <mlev>
##$CPDPRG6= <mlev>
##$CPDPRG7= <mlev>
##$CPDPRG8= <mlev>
##$CPDPRGB= <>
##$CPDPRGT= <>
##$D= (0..31)
0 0.7 0 0 0 0 0 0 0 0 0 0.03 0 0 0 0 0 0 0 0 0 0 0 0 0 0 0 0 0 0 0 0 
##$DATE= 1752661633
##$DBL= (0..7)
120 120 120 120 120 120 120 120 
##$DBP= (0..7)
150 150 150 150 150 150 150 150 
##$DBP07= 0
##$DBPNAM0= <>
##$DBPNAM1= <>
##$DBPNAM2= <>
##$DBPNAM3= <>
##$DBPNAM4= <>
##$DBPNAM5= <>
##$DBPNAM6= <>
##$DBPNAM7= <>
##$DBPOAL= (0..7)
0.5 0.5 0.5 0.5 0.5 0.5 0.5 0.5 
##$DBPOFFS= (0..7)
0 0 0 0 0 0 0 0 
##$DE= 6
$$ [...]
##$SUBNAM3= <"">
##$SUBNAM4= <"">
##$SUBNAM5= <"">
##$SUBNAM6= <"">
##$SUBNAM7= <"">
##$SUBNAM8= <"">
##$SUBNAM9= <"">
##$SW= 18.0517328524113
##$SWIBOX= (0..15)
0 0 2 0 0 0 0 0 0 0 0 0 0 0 0 0 
##$SW_h= 3612.71676300578
##$TD= 16384
##$TD0= 1
##$TE= 0
##$TE2= 300
##$TE3= 300
##$TEG= 300
##$TL= (0..7)
0 120 120 120 120 120 120 120 
##$TP= (0..7)
150 150 150 150 150 150 150 150 
##$TP07= 0
##$TPNAME0= <>
##$TPNAME1= <>
##$TPNAME2= <>
##$TPNAME3= <>
##$TPNAME4= <>
##$TPNAME5= <>
##$TPNAME6= <>
##$TPNAME7= <>
##$TPOAL= (0..7)
0.5 0.5 0.5 0.5 0.5 0.5 0.5 0.5 
##$TPOFFS= (0..7)
0 0 0 0 0 0 0 0 
##$TUNHIN= 0
##$TUNHOUT= 0
##$TUNXOUT= 0
##$USERA1= <user>
##$USERA2= <user>
##$USERA3= <user>
##$USERA4= <user>
##$USERA5= <user>
##$V9= 5
##$VALIST= <valist>
##$VCLIST= <CCCCCCCCCCCCCCC>
##$VD= 0
##$VDLIST= <DDDDDDDDDDDDDDD>
##$VPLIST= <PPPPPPPPPPPPPPP>
##$VTLIST= <TTTTTTTTTTTTTTT>
##$WBST= 1024
##$WBSW= 4
##$XGAIN= (0..3)
0 0 0 0 
##$XL= 0
##$YL= 0
##$YMAX_a= 97247
##$YMIN_a= -86536
##$ZGOPTNS= <>
##$ZL1= 120
##$ZL2= 120
##$ZL3= 120
##$ZL4= 120
##$ABSF1= 15.54416
##$ABSF2= -2.507691
##$ABSG= 5
##$ABSL= 3
##$ALPHA= 0
##$AQORDER= 0
##$ASSFAC= 0
##$ASSFACI= 0
##$ASSFACX= 0
##$ASSWID= 0
##$AUNMP= <proc_1d>
##$AZFE= 0.1
##$AZFW= 0.1
##$BCFW= 0
##$BC_mod= 2
##$BYTORDP= 0
##$COROFFS= 0
##$CY= -3
##$DATMOD= 1
##$DC= 0
##$DFILT= <>
##$DTYPP= 0
##$F1P= 0
##$F2P= 0
##$FCOR= 1
##$FTSIZE= 16384
##$FT_mod= 6
##$GAMMA= 0
##$GB= 0
##$INTBC= 1
##$INTSCL= 3.241238e-09
##$ISEN= 128
##$LB= 0.25
##$LEV0= 0
##$LPBIN= 0
##$MAXI= 10000
##$MC2= 0
##$MEAN= 0
##$ME_mod= 0
##$MI= 1.114404
##$NCOEF= 0
##$NC_proc= -8
##$NLEV= 6
##$NOISF1= 3.799351
##$NOISF2= 2.8
##$NSP= 0
##$NTH_PI= 0
##$NZP= 0
##$OFFSET= 15.49237
##$PC= 1
##$PHC0= -1362.974
##$PHC1= 20.39091
##$PH_mod= 1
##$PKNL= yes
##$PPARMOD= 0
##$PSCAL= 0
##$PSIGN= 0
##$REVERSE= no
##$SF= 200.130005870053
##$SI= 16384
##$SIGF1= 3
##$SIGF2= 2
##$SINO= 0.751879
##$SIOLD= 32768
##$SREGLST= <19F.Aceton>
##$SSB= 0
##$STSI= 16384
##$STSR= 0
##$SW_p= 3612.71676300578
##$SYMM= 0
##$S_DEV= 0
##$TDeff= 16384
##$TDoff= 0
##$TI= <>
##$TILT= no
##$TM1= 0
##$TM2= 0
##$TOPLEV= 0
##$USERP1= <user>
##$USERP2= <user>
##$USERP3= <user>
##$USERP4= <user>
##$USERP5= <user>
##$WDW= 1
##$XDIM= 16384
##$YMAX_p= 338528557
##$YMIN_p= -722980
$$ End of Bruker specific parameters
$$ ---------------------------------
##NTUPLES= NMR SPECTRUM
##VAR_NAME=  FREQUENCY,     SPECTRUM/REAL,   SPECTRUM/IMAG
##SYMBOL=    X,             R,               I
##VAR_TYPE=  INDEPENDENT,   DEPENDENT,       DEPENDENT
##VAR_FORM=  AFFN,          ASDF,            ASDF
##VAR_DIM=   16384,         16384,           16384
##UNITS=     HZ,            ARBITRARY UNITS, ARBITRARY UNITS
##FACTOR=    0.220516191357247, 1,           1
##FIRST=     3100.48802935465, 0,            0
##LAST=      -512.228733651129, 0,           0
##MIN=       -512.228733651129, -722980,     0
##MAX=       3100.48802935465, 338528557,    0
$$ Real data points
##PAGE= N=1
##DATA TABLE= (X++(R..R)), XYDATA
$$ [...]
$$ plain form
6050 72286 166059 127546 49042 -236472 -171644 -143791 196319 487549 274397 -7009 -266991
6039 -266991 -125799 -254990 17478 -104814 -25990 319434 591843 288315 405297 327273
6029 327273 39938 -33782 57131 -137358 62733 -32903 -21807 150559 -111984 -66143 -18715
6018 -18715 -170133 -447000 -445828 -253480 -239061 -391712 -335066 87321 -102640 -318132 -320397
6007 -320397 -175090 -169418 -280075 -181537 -139963 -295485 -411453 -56561 39442 33822 -350805
5996 -350805 -204064 -77712 42930 28710 -21425 33508 157242 -2165 -63927 309277
5986 309277 352750 -44853 -201988 -276080 -97047 -220081 -430704 -388902 -393745 10685 126128
5975 126128 199937 189901 35096 -12576 -76121 -448788 -178479 -19410 -256558 -380542
$$ packed form
6050G2286R3773l8513p8504k85514O4828K7853L40110K91230k13152k81406k59982
6039b66991J41192j29191K72468j22292P8824L45424K72409l03528J16982p8024
6029C27273k87335p3720R0913j94489K00091r5636J1096J72366k62543M5841M7428
6018a8715j51418k76867J172J92348J4419j52651N6646M22387j89961k15492k265
6007c20397J45307N672j10657R8538M1574j55522j15968L54892R6003n620l84627
5996c50805J46741J26352J20642j4220n0135N4933J23734j59407o1762L73204
5986C09277M3473l97603j57135p4092J79033j23034k10623M1802m843M04430J15443
5975A26128P3809j0036j54805m7672o3545l72667K70309J59069k37148j23984
$$ plain form
5965 -380542 -281779 -467435 -348113 -117307 -165818 -96669 -22811 57868 -203745 -214766 -53437
5954 -53437 24085 -68421 62557 -236996 -364084 -197202 -190083 49919 -91863 -105222 -123270
5943 -123270 -285479 -211827 348534 105644 -225915 -49242 -289497 -513701 -487526 -415355
5933 -415355 -207960 -30479 74161 82629 -75302 -104896 -62616 76718 211667 102235
5923 102235 167615 216026 -215174 -5224 176041 12785 234051 181329 162971 308712
5913 308712 137314 -156381 -120337 -67786 -22144 -29944 -6778 -116043 -229439 -127452 -100091
5902 -100091 -133341 -190921 -184118 74291 66025 -25182 -79067 -317548 -345615 -144104 -289502
5891 -289502 -299511 -247037 -239114 -112226 -284495 -219281 -265656 -575836 -336799 74884 144882
$$ packed form
5965c80542R8763j85656J19322K30806m8511O9149P3858Q0679k61613j1021J61329
5954e3437P7522r2506J30978k99553j27088J66882P119K40002j41782j3359j8048
5943a23270j62209P3652N60361k42890l31559J76673k40255k24204K6175P2171
5933d15355K07395J77481J04640Q468j57931k9594M2280J39334J34949j09432
5923A02235O5380M8411m31200K09950J81265j63256K21266n2722j8358J45741
5913C08712j71398k93695L6044N2551M5642p800K3166j09265j13396J01987K7361
5902a00091l3250n7580O803K58409q266r1207n3885k38481k8067K01511j45398
5891b89502j0009N2474P923J26888j72269O5214m6375l10180K39037M11683O9998
$$ plain form
5880 144882 53664 -86982 -53333 -88543 -141285 8455 183064 130735 111215 215781 257328
5869 257328 -206469 -196054 -140672 43374 -31993 -270353 -78878 -94008 -225343 -208224 60111
5858 60111 75495 -5551 -30400 95012 196774 123437 127868 223445 268160 299183 150645
5847 150645 159980 208634 108640 27483 27445 147467 24398 -21445 -105548 -135503 149125 204888
5835 204888 57042 156703 129610 201391 190652 136514 203529 -54633 -203642 139377 135443
5824 135443 24369 -208395 -183198 -126648 -113303 -246878 -321465 -195840 -331660 -300092 -57191
5813 -57191 29141 -215403 -451726 -328782 -205300 -12690 83620 8415 -98903 -310 77662
5802 77662 -19248 -189365 -23552 61588 -43981 -156354 -351292 -150593 -235200 -143754 -125141
$$ packed form
5880A44882r1218j40646L3649l5210n2742J49740J74609n2329j9520J04566M1547
5869B57328m63797J0415N5382J84046p5367k38360J91475j5130j31335J7119K68335
5858F0111J5384q1046k4849J25412J01762p3337M431R5577M4715L1023j48538
5847A50645R335M8654r9994q1157l8J20022j23069m5843q4103k9955K84628N5763
5835B04888j47846R9661k7093P1781j0739n4138O7015k58162j49009L43019l934
5824A35443j11074k32764K5197N6550J3345j33575p4587J25625j35820L1568K42901
5813e7191Q6332k44544k36323J22944J23482J92610R6310p5205j07318R8593P7972
5802G7662r6910j70117J65813Q5140j05569j12373j94938K00699q4607R1446J8613
$$ plain form
5791 -125141 37285 -15864 -262700 -85590 107282 -159039 -226234 -317851 -185305 -133086
5781 -133086 -91112 -24090 -217294 -210133 24376 71282 -46780 -55350 -206749 -340272 -424328
5770 -424328 124815 35212 -249104 -78539 -102170 27845 85933 71576 148809 146842 241646
5759 241646 457384 102965 -2536 -58392 -80912 -15216 192905 165784 96423 -27928 -147119
5748 -147119 -177646 20257 -3845 -137983 -158577 81133 41453 82771 91543 22793 234317
5737 234317 35705 56839 -103722 -76673 -178402 -168293 -22266 119038 88340 -21428
5727 -21428 155935 12271 38640 147310 164122 47678 -306760 -300635 -83694 -237971 63710
5716 63710 405663 58908 136480 91675 -228431 -133272 -58745 -62010 114176 162879 400168
$$ packed form
5791a25141J62426n3149k46836J77110J92872k66321o7195r1617J32546N2219
5781a33086M1974O7022j93204P161K34509M6906j18062q570j51399j33523q4056
5770d24328N49143q9603k84316J70565k3631J30015N8088j4357P7233j967R4804
5759B41646K15738l54419j05501n5856k2520O5696K08121k7121o9361j24351j19191
5748a47119l0527J97903k4102j34138k0594K39710l9680M1318Q772o8750K11524
5737B34317j98612K1134j60561K7049j01729J0109J46027J41304l0698j09768
5727b1428J77363j43664K6369J08670J6812j16444l54438O125K16941j54277L01681
5716F3710L41953l46755P7572m4805l20106R5159P4527l265J76186M8703K37289
$$ plain form
5705 400168 383196 332168 193660 194996 261954 336403 135883 -278789 -433771 -149080 -161679
5694 -161679 -116252 -16401 -35302 263082 177412 439325 295520 241654 165969 247586 356161
5683 356161 322303 356920 242621 178319 143018 -128173 144556 205798 -4415 -14092 117346
5672 117346 -155142 -447810 -209861 -71847 162324 6079 178910 7670 -44433 284896
5662 284896 613865 550551 300589 334145 488220 178106 -244888 -21879 61913 -14111
5652 -14111 364939 365490 219349 61744 -320 -11869 56874 -54318 114610 309983 356187
5641 356187 294276 336479 441484 271841 114932 112050 246380 328883 130889 -11825 99269
5630 99269 85761 144666 171168 118242 76341 231350 -152892 -21732 173199 103834 143108
$$ packed form
5705D00168j6972n1028j38508J336O6958P4449k00520m14672j54982K84691j2599
5694a61679M5427R9851j8901K98384q5670K61913j43805n3866p5685Q1617J08575
5683C56161l3858L4617j14299o4302l5301k71191K72729O1242k10213r677J31438
5672A17346k72488k92668K37949J38014K34171j56245J72831j71240n2103L29329
5662B84896L28969o3314k49962L3556J54075l10114m22994K23009Q3792p6024
5652a4111L79050N51j46141j57605o2064j1549O8743j11192J68928J95373M6204
5641C56187o1911M2203J05005j69643j56909k882J34330Q2503j97994j42714J11094
5630I9269j3508N8905K6502n2926m1901J55009l84242J31160J94931o9365L9274
$$ plain form
5619 143108 168763 492787 322753 -30658 101376 607831 633564 389554 377164 388719
5609 388719 318786 568606 399085 280664 394235 185792 425715 647005 479604 337927
5599 337927 498635 559549 920713 653357 445873 615945 414644 222757 444327 559238
5589 559238 419283 416176 570984 508957 458298 389941 263597 423672 408166 588037 445250
5578 445250 276379 232021 39920 -217 -89628 241765 253137 215875 393875 546450 618469
5567 618469 392337 435453 130207 129791 278172 106542 114500 172053 9322 191756 531402
5556 531402 611134 451473 409286 409438 390874 308733 432137 525920 168322 51661 187526
5545 187526 275118 259757 283763 356864 446219 361725 484488 568280 321673 259543 352354
$$ packed form
5619A43108K5655L24024j70034l53411J32034N06455K5733k44010j2390J1555
5609C88719o9933K49820j69521j18421J13571k08443K39923K21290j67401j41677
5599C37927J60708O0914L61164k67356k07484J70072k01301j91887K21570J14911
5589E59238j39955l107J54808o2027n0659o8357j26344J60075j5506J79871j42787
5578D45250j68871m4358j92101m0137q9411L31393J1372l7262J78000J52575P2019
5567F18469k26132M3116l05246m16J48381j71630P958N7553j62731J82434L39646
5556E31402P9732j59661m2187J52j8564q2141J23404R3783l57598j16661J35865
5545A87526Q7592j5361K4006P3101Q9355q4494J22763Q3792k46607o2130R2811
$$ plain form
5534 352354 226723 441319 551150 315093 374632 507459 366005 342077 397867 349002
5524 349002 171357 58488 131321 127288 214374 132139 96239 434611 425083 335507 100694
5513 100694 183187 336962 240839 309754 348422 297099 394780 41232 -36295 167323 17717
5502 17717 -92694 74655 206388 617681 377289 324096 233527 177026 403318 355795 558406
5491 558406 443227 283789 245371 314952 491229 464593 338322 485729 417432 456094 170178
5480 170178 389818 317760 345460 287471 444484 581455 181556 99398 1952 348320 584882
5469 584882 684656 945597 825442 753132 379670 345401 371446 288205 573340 510222 422619
5458 422619 665131 419551 435373 655885 614262 613365 716537 705802 446810 183194 379594
$$ packed form
5534C52354j25631K14596J09831k36057N9539J32827j41454k3928N5790m8865
5524C49002j77645j12869P2833m033Q7086q2235l5900L38372r528q9576k34813
5513A00694Q2493J53775r6123O8915L8668n1323R7681l53548p7527K03618j49606
5502A7717j10411J67349J31733M11293k40392n3193r0569n6501K26292m7523K02611
5491E58406j15179j59438l8418O9581J76277k6636j26271J47407o8297L8662k85916
5480A70178K19640p2058K7700n7989J57013J36971l99899q2158r7446L46368K36562
5469E84882R9774K60941j20155p2310l73462l4269K6045q3241K85135o3118q7603
5458D22619K42512k45580J5822K20512m1623q97J03172j0735k58992k63616J96400
$$ plain form
5447 379594 461382 305784 419465 279887 428494 692017 626445 568820 301240 492943
5437 492943 530970 439106 700310 900638 782173 459930 783097 1197516 1087421 978854
5427 978854 881381 623834 611373 502294 467576 478710 378754 396567 556451 510888 607292
5416 607292 483162 366794 389121 756209 739205 402613 590478 728499 671705 783552
5406 783552 607856 568629 575477 647561 651266 717749 533523 481988 739426 710932 542720
5395 542720 286324 625721 731490 450887 392546 489480 544318 285253 154453 349164
5385 349164 504911 395654 339362 310626 210094 490583 609243 622712 581884 448330
5375 448330 549431 280221 382773 632538 409847 274325 190397 262373 151990 183220
$$ packed form
5447C79594Q1788j55598J13681j39578J48607K63523o5572n7625k67580J91703
5437D92943L8027r1864K61204K00328j18465l22243L23167M14419j10095j08567
5427I78854r7473k57547j2461j09079l4718J1134r9956J7813J59884m5563R6404
5416F07292j24130j16368K2327L67088j7004l36592J87865J38021n6794J11847
5406G83552j75696l9227O848P2084L705O6483j84226n1535K57438k8494j68212
5395E42720k56396L39397J05769k80603n8341R6934N4838k59065j30800J94711
5385C49164J55747j09257n6292k8736j00532K80489J18660J3469m0828j33554
5375D48330J01101k69210J02552K49765k22691j35522q3928P1976j10383L1230
$$ plain form
5365 183220 216883 629262 723332 539741 451675 356299 414548 438730 575152 707594 653065
5354 653065 560168 513375 721011 839452 638894 402592 465448 411398 312847 421593 328638
5343 328638 346978 538411 512527 477061 756613 575197 800542 792724 568062 608681 623755
5332 623755 791661 651013 620672 683742 629916 708594 676001 630305 764013 832314 1058219
5321 1058219 1022976 1050780 871429 760193 887415 897166 977806 853404 811251 1214205 1082810
5310 1082810 1066380 1015792 1366476 1700647 1764671 1645272 1343569 1391004 1550965 1524917
5300 1524917 1462307 2003624 2063656 2085282 2068106 2326469 2525712 2667862 2785431 2918598
5290 2918598 3184175 3307458 3233592 3303141 3637270 3967254 4057753 4347613 4366707 4692372
$$ packed form
5365A83220L3663M12379R4070j83591q8066r5376N8249K4182J36422J32442n4529
5354F53065r2897m6793K07636J18441k00558k36302O2856n4050r8551J08746r2955
5343C28638J8340J91433k5884l5466K79552j81416K25345p818k24662M0619J5074
5332F23755J67906j40648l0341O3070n3826P8678l2593m5696J33708O8301K25905
5321A058219l5243K7804j79351j11236J27222R751Q0640j24402m2153M02954j31395
5310A082810j6430n0588L50684L34171O4024j19399l01703M7435J59961k6048
5300A524917o2610N41317O0032K1626j7176K58363J99243J42150J17569J33167
5290B918598K65577J23283p3866O9549L34129L29984R0499K89860J9094L25665
$$ plain form
5280 4692372 4920878 5000581 5090070 5233216 5539041 5642784 5727363 5927626 5739429 5600586
5270 5600586 5972327 5949616 5995207 6256254 6272961 6493326 6672135 6893598 7310608 7556879
5260 7556879 7369179 7293147 7640370 7774322 8008826 8460997 8556654 8654040 8815614 9260339
5250 9260339 9409622 9345313 9753804 9582317 9709887 9982982 9856220 9585346 9490351 8931420
5240 8931420 8521204 8419032 8365324 8317130 8162549 7994614 7754146 7564317 7126834 6812924
5230 6812924 6734034 6519163 6386530 6531407 6815573 6629785 6354020 5907638 5640860 5747223
5220 5747223 5867009 5696750 5463889 5258179 5469745 5087414 5040377 4927537 4771504 4807136
5210 4807136 4723208 4553578 3897990 3741611 3587387 3666280 3357514 3141532 2972082 2792221
$$ packed form
5280D692372K28506P9703Q9489J43146L05825J03743Q4579K00263j88197j38843
5270E600586L71741k2711M5591K61047J6707K20365J78809K21463M17010K46271
5260G556879j87700p6032L47223J33952K34504M52171R5657R7386J61574M44725
5250I260339J49283o4309M08491j71487J27570K73095j26762k70874r4995n58931
5240H931420m10216j02172n3708m8194j54581j67935k40468j89829m37483l13910
5230F812924p8890k14871j32633J44877K84166j85788k75765m46382k66778J06363
5220E747223J19786j70259k32861k05710K11566l82331m7037j12840j56033L5632
5210D807136q3928j69630o55588j56379j54224P8893l08766k15982j69450j79861
$$ plain form
5200 2792221 2606480 2355344 2320292 2113212 1910832 1896584 2193310 2076279 1664883 1560953
5190 1560953 1440776 1253908 1485100 1605508 1303328 1149717 1105526 1224704 1140439 874313
5180 874313 749501 1080050 1300085 1240113 783024 659654 743614 974022 981032 1058582 890091
5169 890091 544482 717765 817985 608561 385231 374083 319766 650493 479027 417019
5159 417019 302712 229724 269759 178765 33693 125123 394719 372127 365850 428371 293203
5148 293203 124189 503354 425447 469180 634302 578029 359991 224920 67402 -119981
5138 -119981 119114 202109 272230 341544 88369 367364 420107 266405 238104 386800 395777
5127 395777 384836 21215 -136984 117163 113409 -10354 -107968 360274 210895 -219016
$$ packed form
5200B792221j85741k51136l5052k07080k02380j4248K96726j17031m11396j03930
5190A560953j20177j86868K31192J20408l02180j53611m4191J19178q4265k66126
5180H74313j24812L30549K20035n9972m57089j23370Q3960K30408P010P7550j68491
5169H90091l45609J73283J00220k09424k23330j1148n4317L30727j71466o2008
5159D17019j14307p2988M0035r0994j45072R1430K69596k2592o277O2521j35168
5148B93203j69014L79165p7907M3733J65122n6273k18038j35071j57518j87383
5138a19981K39095Q2995P0121O9314k53175K78995N2743j53702k8301J48696Q977
5127C95777j0941l63621j58199K54147l754j23763r7614M68242j49379m29911
$$ plain form
5117 -219016 17815 111401 -192123 -306930 -331718 -904 -43699 253452 120989 -3974
5107 -3974 5688 -105751 158004 247686 76880 241664 401913 200925 180230 265813 182429
5096 182429 236504 238445 176512 308789 286081 281711 258785 129577 335045 531867 465060
5085 465060 497543 527663 338198 -254204 -226763 -61575 54474 -207996 -188633 -277217 -150227
5074 -150227 109109 -268779 -290686 -185075 -108045 194727 232429 -41675 75485 370759
5064 370759 202294 -40131 -65124 262249 171472 49561 225221 -97711 167469 -74588
5054 -74588 -315774 -139891 -127606 -301960 -225978 -251560 -302275 11156 267249 299167 80201
5043 80201 -10983 -231745 -73094 -54971 -214616 -190386 -264830 -54084 -133469 -261778 -253394
$$ packed form
5117b19016K36831R3586l03524j14807k4788L30814m2795K97151j32463j24963
5107c974R662j11439K63755Q9682j70806J64784J60249k00988k0695Q5583q3384
5096A82429N4075J941o1933J32277k2708m370k2926j29208K05468J96822o6807
5085D65060L2483L0120j89465n92402K7441J65188J16049k62470J9363q8584J26990
5074a50227K59336l77888k1907J05611P7030L02772L7702k74104J17160K95274
5064C70759j68465k42425k4993L27373r0777j21911J75660l22932K65180k42057
5054g4588k41186J75883J2285j74354P5982k5582n0715L13431K56093L1918k18966
5043H0201r1184k20762J58651J8123j59645K4230p4444K10746p9385j28309Q384
$$ plain form
5032 -253394 -267314 -211426 -36791 109176 2647 -215906 -258475 -456260 -344036 -43449
5022 -43449 -14229 -4725 234321 149190 -114663 22310 105875 -21862 -68091 -130800 -224330
5011 -224330 -91106 -209927 -245047 -184646 -246314 -99594 -107680 -106804 -150081 -93431 -165317 -265732
4999 -265732 123813 143417 1524 -162222 -139074 -365800 -187308 89188 157564 16760
4989 16760 110897 103195 172568 -45926 84743 26607 -1174 21797 187303 -92180 -301691
4978 -301691 -428729 -251655 -218402 -374515 -280896 -379041 -106779 -205393 -183695 17820 -294896
4967 -294896 -222491 89147 88412 254290 183006 -21139 -352218 -377753 -418489 -172213 -51740
4956 -51740 -12143 79818 142873 86570 -209573 -424361 -164303 -201461 -119607 114355 -42322
$$ packed form
5032b53394j3920N5888J74635J45967j06529k18553m2569j97785J12224L00587
5022d3449K9220R504K39046q5131k63853J36973Q3565j27737m6229o2709r3530
5011b24330J33224j18821l5120O0401o1668J46720q086Q76m3277N6650p1886j00415
4999b65732L89545J9604j41893j63746K3148k26726J78492K76496O8376j40804
4989A6760R4137p702O9373k18494J30669n8136k7781K2971J65506k79483k09511
4978c01691j27038J77074L3253j56113R3619r8145K72262r8614K1698K01515l12716
4967b94896P2405L11638p35J65878p1284k04145l31079k5535m0736K46276J20473
4956e1740L9597R1961O3055n6303k96143k14788K60058l7158Q1854K33962j56677
$$ plain form
4945 -42322 -74787 96322 -75010 -1610 -50208 47231 30435 185949 108917 205161 -244476
4934 -244476 -96807 50743 -53281 256466 163477 -71291 -41892 28206 187466 218215
4924 218215 178736 -181840 104046 252648 273702 207685 404343 486465 571840 593124 366793
4913 366793 433968 357587 460038 164392 213645 101434 376426 178455 108087 -44105
4903 -44105 -83722 -35361 234314 430196 412896 297602 468342 485991 383723 328470 242347
4892 242347 226470 136440 137079 163377 310788 196298 158575 199853 375625 393514 494963
4881 494963 344794 373301 585979 105885 141727 216517 439736 464730 45476 343320
4871 343320 714419 858984 832200 846321 973169 1110936 1157628 1289899 1284949 1324780 1604088
$$ packed form
4945d2322l2465J71109j71332P3400m8598R7439j6796J55514p7032R6244m49637
4934b44476J47669J47550j04024L09747r2989k34768K9399P0098J59260L0749
4924B18215l9479l60576K85886J48602K1054o6017J96658Q2122Q5375K1284k26331
4913C66793O7175p6381J02451k95646M9253j12211K74992j97971p0368j52192
4903d4105l9617M8361K69675J95882j7300j15294J70740J7649j02268n5253q6123
4892B42347j5877r0030O39K6298J47411j14490l7723M1278J75772J7889J01449
4881D94963j50169K8507K12678m80094L5842P4790K23219K4994m19254K97844
4871C43320L71099J44565k6784J4121J26848J37767M6692J32271m950L9831K79308
$$ plain form
4860 1604088 1938961 2151705 2181838 2173714 1958609 2093952 2024191 1803085 1584163 1283861
4850 1283861 867378 997295 1215543 1164568 1029014 1064178 1081580 789891 315087 546598
4840 546598 417576 280809 399951 654194 605349 471025 371850 79003 224677 251695
4830 251695 90325 191936 86384 171646 70135 139572 -94426 -14607 292081 161948
4820 161948 327 -176420 -145580 132644 187305 -34623 354797 358650 166379 204316 246007
4809 246007 266310 158491 58244 4587 178882 474060 395373 333808 165260 151254 -187082
4798 -187082 -156234 9762 -99435 135237 348277 216733 261934 98601 -23872 -255594
4788 -255594 -422623 -166464 -43802 -143438 179170 -123883 -130405 154880 568938 456233
$$ packed form
4860A604088L34873K12744L0133q124k15105J35343o9761k21106k18922l00302
4850A283861m16483J29917K18248n0975j35554L5164J7402k91689m74804K31511
4840E46598j29022j36767J19142K54243m8845j34324r9175k92847J45674K7018
4830B51695j61370J01611j05552Q5262j01511O9437k33998P9819L06688j30133
4820A61948j61621j76747L0840K78224N4661k21928L89420L853j92271L7937M1691
4809B46007K0303j07819j00247n3657J74295K95178p8687o1565j68548j4006l38336
4798a87082L0848J65996j09197K34672K13040j31544M5201j63333j22473k31722
4788b55594j67029K56159J22662r9636L22608l03053o522K85285M14058j12705
$$ plain form
4778 456233 142227 -81717 -54872 32347 53058 69254 144178 80629 -132055 -255427 -128251
4767 -128251 -101433 27087 3791 -82904 -92640 -269710 -67232 -254467 -112087 -240356 -191965
4756 -191965 152793 285911 80649 153764 133041 281928 129348 -189154 -223213 -134383
4746 -134383 120207 116966 4072 11958 203987 -140734 -397187 -319550 -224340 -154258 -73246
4735 -73246 30481 -20930 -52248 -124498 -6533 -162173 -180931 -99760 -137856 251 -79646
4724 -79646 324819 490033 6705 -162412 -95661 -127970 26189 -24968 -27957 -106742 -90366
4713 -90366 -102273 63098 202888 -17135 -138195 -216997 -235400 -371310 -435399 -308034 -233440
4702 -233440 -175413 -288655 34803 46897 -38981 -198342 -130982 57509 113841 118756 138653
$$ packed form
4778D56233l14006k23944K6845Q7219K0711J6196P4924o3549k12684j23372J27176
4767a28251K6818J28520k3296q6695r736j77070K02478j87235J42380j28269M8391
4756a91965L44758J33118k05262P3115k0723J48887j52580l18502l4059Q8830
4746a34383K54590l241j12894P886J92029l44721k56453P7637R5210P0082Q1012
4735g3246J03727n1411l1318p2250J17965j55640j8758Q1171l8096J38107p9897
4724g9646M04465J65214m83328j69117O6751l2309J54159n1157k989p8785J6376
4713i0366j1907J65371J39790k20023j21060p8802j8403j35910o4089J27365P4594
4702b33440N8027j13242L23458J2094q5878j59361O7360J88491N6332M915J9897
$$ plain form
4691 138653 218397 12774 -90781 -91824 -243833 -74304 -155734 -131116 -18616 -246005 -284770
4680 -284770 -197103 -123172 -124474 437988 230427 125631 -181791 -150549 -47246 -82565 -38419
4669 -38419 -200767 -258760 -319588 -414106 -162089 190427 353389 349380 151202 15984 3054
4658 3054 -200364 60696 -41913 24015 -35453 92901 259928 308166 209385 44671 52129
4647 52129 161279 332766 366943 637897 461657 195363 321883 287527 334698 201753
4637 201753 -209857 -273730 -72888 -91538 -212815 -172619 175261 -17252 -336371 -163057
4627 -163057 -78605 -61007 34363 180116 -49367 -105183 -83167 279167 194766 -111867 228517
4616 228517 384687 262434 399289 473862 414611 372802 163482 284296 349170 328821 633520
$$ packed form
4691A38653P9744k05623j03555j043j52009J69529q1430K4618J12500k27389l8765
4680b84770Q7667P3931j302N62462k07561j04796l07422L1242J03303l5319M4146
4669c8419j62348n7993o0828r4518K52017L52516J62962m009j98178j35218j2930
4658C054k03418K61060j02609O5928n9468J28354J67027M8238r8781j64714P458
4647E2129J09150J71487L4177K70954j76240k66294J26520l4356M7171j32945
4637B01753m11610o3873K00842j8650j21277M0196L47880j92513l19119J73314
4627a63057Q4452J7598R5370J45753k29483n5816K2016L62334q4401l06633L40384
4616B28517J56170j22253J36855P4573n9251m1809k09320J20814O4874k0349L04699
$$ plain form
4605 633520 470848 490873 472448 244953 250196 160316 77711 120556 122827 -2178 29407
4594 29407 222866 210249 161369 187538 278867 323507 282652 186495 139401 38255 139131
4583 139131 318728 427813 159535 206269 387481 448208 478321 73940 -238004 -114063
4573 -114063 105142 170730 315870 336052 292233 173961 -6426 500454 267132 205000
4563 205000 98293 22154 -69170 43651 279037 98374 420957 316930 134345 -59773
4553 -59773 206751 360545 214530 153991 29747 274578 150788 402630 581482 159855
4543 159855 -157647 213686 232520 284481 408072 269862 382897 108016 116630 125593 375072
4532 375072 209787 71783 -104765 195939 287230 32974 -55221 226811 391775 371663
$$ packed form
4605F33520j62672K0025j8425k27495N243q9880q2605M2845K271j25005L1585
4594B9407J93459j2617m8880K6169R1329M4640m0855r6157m7094j01146J00876
4583A39131J79597J09085k68278M6734J81212O0727L0113m04381l11944J23941
4573a14063K19205O5588J45140K0182m3819j18272j80387N06880k33322o2132
4563B05000j06707p6139r1324J12821K35386j80663L22583j04027j82585j94118
4553e9773K66524J53794j46015o0539j24244K44831j23790K51842J78852m21627
4543A59855l17502L71333J8834N1961J23591j38210J13035k74881Q614Q963K49479
4532C75072j65285j38004j76548L00704R1291k54256q8195K82032J64964k0112
$$ plain form
4522 371663 503739 396698 309241 -24509 239919 297115 289350 442536 175850 79407 321022
4511 321022 155972 209590 293352 73293 112832 112712 176729 549952 604443 373079 230881
4500 230881 407367 229196 63180 106275 239411 470475 496280 529902 575679 168138
4490 168138 63038 209989 457402 538825 503820 652301 648464 465717 281189 281946 432686
4479 432686 623769 440191 245734 195321 585495 743156 573400 429194 492683 519559
4469 519559 572370 572126 597782 327845 252832 352353 365622 376046 271086 678908 748417
4458 748417 504433 454933 437620 443477 406493 559106 389217 401630 521269 370865 364897
4447 364897 487668 632197 955481 680618 741851 732368 798416 778296 965076 966026 947743
$$ packed form
4522C71663J32076j07041q7457l33750K64428N7196p765J53186k66686r6443K41615
4511C21022j65050N3618Q3762k20059L9539j20O4017L73223N4491k31364j42198
4500B30881J76486j78171j66016M3095J33136K31064K5805L3622M5777m07541
4490A68138j05100J46951K47413Q1423l5005J48481l837j82747j84528P57J50740
4479D32686J91083j83578j94457n0413L90174J57661j69756j44206O3489K6876
4469E19559N2811k44K5656k69937p5013R9521J3269J0424j04960M07822O9509
4458G48417k43984m9500j7313N857l6984J52613j69889J2413J19639j50404n968
4447C64897J22771J44529L23284k74863O1233r483O6048k0120J86780R50j8283
$$ plain form
4436 947743 987163 957917 1099164 962983 1067427 993500 1009636 1117142 1006795 1189793
4426 1189793 1164389 1018936 1216107 1410285 1401540 1101489 1223325 1289138 1220813 1395900
4416 1395900 1558123 1613515 1637457 1718396 1959647 1936579 1782914 1769470 1786684 2011814 2129925
4405 2129925 2133090 2090692 2343128 2480809 2764426 2985891 3002235 3079390 3086682 2956621 3131980
4394 3131980 3187406 3153791 3105184 2962832 2918386 3036283 3333670 3160237 3226820 3316246 3482901
4383 3482901 3535215 3536112 3716137 3950517 3962161 4217690 4390034 4513354 4820550 5014152
4373 5014152 5096282 5002193 4986692 4972799 5301012 5293235 5367441 5566449 5687754 6111607 6424644
4362 6424644 6560422 6319602 7031510 7243621 7369446 7479803 7557446 7567242 7786737 7743286
$$ packed form
4436I47743L9420k9246J41247j36181J04444p3927J6136J07506j10347J82998
4426A189793k5404j45453J97171J94178q745l00051J21836O5813o8325J75087
4416A395900J62223N5392K3942Q0939K41251k3068j53665j3444J7214K25130J18111
4405B129925L165m2398K52436J37681K83617K21465J6344P7155P292j30061J75359
4394C131980N5426l3615m8607j42352m4446J17897K97387j73433O6583Q9426J66655
4383C482901N2314Q97J80025K34380J1644K55529J72344J23320L07196J93602
4373E014152Q2130r4089j5501j3893L28213p777P4206J99008J21305M23853L13037
4362F424644J35778k40820P11908K12111J25825J10357P7643R796K19495m3451
$$ plain form
4352 7743286 8219258 8490538 8676153 9008625 9252198 9727103 10003502 10149131 10620914 10547248
4342 10547248 10738756 11315023 11693044 12324996 13018292 13326244 13491563 14311835 14975857
4333 14975857 15753835 16243874 16892785 17573400 18177608 18541801 19141531 19878415 20398519
4324 20398519 21220503 22105443 22705276 23623890 24244572 24771074 25211606 25494565 25934186
4315 25934186 26506624 26746083 27171096 27432757 27695220 28166402 28568799 29104055 29387613
4306 29387613 29551185 29701221 29724195 29447874 29153254 28709964 28308504 27969338 27510590 27318996
4296 27318996 26785908 26397977 26424169 26072991 25706358 25454937 25111139 24345380 23229800
4287 23229800 22193401 21790837 21148542 20626154 19868280 18738142 18072790 17727629 17167913
$$ packed form
4352G743286M75972K71280J85615L32472K43573M74905K76399J45629M71783p3666
4342A0547248J91508N76267L78021O31952O93296L07952J65319Q20272O64022
4333A4975857P77978M90039O48911O80615O04208L64193N99730P36884N20104
4324B0398519Q21984Q84940N99833R18614O20682N26502M40532K82959M39621
4315B5934186N72438K39459M25013K61661K62463M71182M02397N35256K83558
4306B9387613J63572J50036K2974k76321k94620m43290m01460l39166m58748j91594
4296B7318996n33088l87931K6192l51178l66633k51421l43798p65759j115580
4287B3229800j036399m02564o42295n22388p57874j130138o65352l45161n59716
$$ plain form
4278 17167913 16330310 15783446 15086442 14497225 13992823 13348479 12775409 12181777 11362854
4269 11362854 10788614 10118433 9816042 9555535 9365240 9024273 8786487 8189863 7620405
4260 7620405 7427955 7277026 7041425 6912013 6611403 6284358 6270980 6286211 6359899 6120243
4250 6120243 5566974 5140015 5231067 5395880 5143060 5085668 5115470 4771022 4810561 4748058
4240 4748058 4797909 4695285 4350166 4231261 4510294 4560987 4515872 4389422 4265481 4364290
4230 4364290 4185859 4151592 4168668 4068943 3832242 3888165 4056661 4178747 3869989 3734983
4220 3734983 4139240 4435662 4298363 4286000 4494195 4721008 4578413 4056684 4110737 4257222
4210 4257222 4033922 4227061 4305491 4285434 4294897 4463696 4673047 4671703 4487923 4468821 4739786
$$ packed form
4278A7167913q37603n46864o97004n89217n04402o44344n73070n93632q18923
4269A1362854n74240o70181l02391k60507j90295l40967k37786n96624n69458
4260G620405j92450j50929k35601j29412l00610l27045j3378J5231P3688k39656
4250F120243n53269m26959R1052J64813k52820n7392K9802l44448L9539o2503
4240D748058M9851j02624l45119j18905K79033N0693m5115j26450j23941R8809
4230D364290j78431l4267J7076r9725k36701N5923J68496J22086l08758j35006
4220C734983M04257K96422j37299j2363K08195K26813j42595n21729N4053J46485
4210D257222k23300J93139P8430k0057R463J68799K09351j344j83780j9102K70965
$$ plain form
4199 4739786 4703073 4938438 5070707 4953923 5040924 5186434 5242293 5413623 5545462 5684571
4189 5684571 5912617 6290787 5882900 6224984 6313638 6355688 6368041 6700059 6922406 7211308
4179 7211308 7358064 7256337 7547518 8022496 8218965 8039457 8387880 8706034 9106693 9142718
4169 9142718 9316158 9337770 9489698 9783605 10133979 10484097 11021576 11455510 11661990 12034446
4159 12034446 12740843 13180131 13711611 14253296 14752085 15364540 15788106 16524527 17382900
4150 17382900 18458047 19269780 20098097 21112875 22299242 23693942 24931212 26299636
4142 26299636 27916577 29693796 31631651 33828571 36010543 38663242 41475307 44719214
4134 44719214 48257846 51892014 55693836 60201026 64927160 69256367 74125265 79339862
$$ packed form
4199D739786l6713K35365J32269j16784Q7001J45510N5859J71330J31839J39109
4189E684571K28046L78170m07887L42084Q8654M2050J2353L32018K22347K88902
4179G211308J46756j01727K91181M74978J96469j79508L48423L18154M00659L6025
4169I142718J73440K1612J51928K93907L50374L50118N37479M33934K06480L72456
4159A2034446P06397M39288N31480N41685M98789O12455M23566P36421Q58373
4150A7382900J075147Q11733Q28317J014778J186367J394700J237270J368424
4142B6299636J616941J777219J937855K196920K181972K652699K812065L243907
4134D4719214L538632L634168L801822M507190M726134M329207M868898N214597
$$ plain form
4126 79339862 85073860 91384384 98682785 107105336 116684988 128260370 141638620 156817586
4118 156817586 174308778 194156846 213599029 227297126 231474832 227878826 216922287
4111 216922287 199328345 180291709 163343737 146914060 131269420 117878783 106409663
4104 106409663 97384674 89649628 82852065 77049345 71829182 67317682 63493227 59923187
4096 59923187 56943041 53940014 51263017 48654971 46323071 44120923 42641845 41215905
4088 41215905 39989794 38765738 37457949 36647586 35716801 34874250 34136646 33084348 31849053
4079 31849053 30838871 29471568 28209469 27141598 26170552 25030551 24303655 23696504 23152190
4070 23152190 22717094 21963201 21402662 20487332 19985137 19517663 19048741 18476402 17865597
$$ packed form
4126G9339862N733998O310524P298401Q422551R579652J1575382J3378250J5178966
4118A56817586J7491192J9848068J9442183J3698097M177706l596006j0956539
4111B16922287j7593942j9036636j6947972j6429677j5644640j3390637j1469120
4104A06409663r024989p735046o797563n802720n220163m511500l824455l570040
4096E9923187k980146l003027k676997k608046k331900k202148j479078j425940
4088D1215905j226111j224056j307789q10363r30785q42551p37604j052298j235295
4079C1849053j010182j367303j262099j067871r71046j140001p26896o07151n44314
4070B3152190m35096p53893n60539r15330n02195m67474m68922n72339o10805
$$ plain form
4061 17865597 17171350 16553678 16329153 15851427 15545104 15310809 15036352 14712151 14596276
4052 14596276 14343081 14007036 13841802 13383363 12876949 12490069 11996236 11438149 11070230
4043 11070230 10800793 10433645 10311327 9761640 9543357 9375288 9121482 8904112 8967605 8964917
4033 8964917 8710695 8577309 8196095 8144605 7949141 7989227 8041764 7860758 7746467 7717138
4023 7717138 7799798 7780287 7738514 7377934 7235131 7091129 6958601 6949836 7108184 6981409
4013 6981409 6886931 6743826 6694692 6753842 6758929 6619917 6698003 6703130 6609526 6549725 6572599
4002 6572599 6369015 6318603 6699765 6621625 6877894 6719529 6679362 6561589 6540070 6264750
3992 6264750 6185931 6186987 6503768 6728987 6425561 6510730 6501542 6600302 6707589 6810396 6765819
$$ packed form
4061A7865597o94247o17672k24525m77726l06323k34295k74457l24201j15875
4052A4596276k53195l36045j65234m58439n06414l86880m93833n58087l67919
4043A1070230k69437l67148j22318n49687k18283j68069k53806k17370O3493k688
4033H964917k54222j33386l81214n1490j95464M0086N2537j81006j14291k9329
4023G717138Q2660j9511m1773l60580j42803j44002j32528q765J58348j26775
4013F981409r4478j43105m9134N9150N087j39012P8086N127r3604n9801K2874
4002F572599k03584n0412L81162p8140K56269j58365m0167j17773k1519k75320
3992F264750p8819J056L16781K25219l03426Q5169r188R8760J07287J02807m4577
$$ plain form
3981 6765819 6992265 6933672 6847131 6835153 7037003 7148355 7088538 7092503 7354902 7342706 7329225
3970 7329225 7373878 7485213 7734166 8123551 8351142 8693696 8765857 8792861 9259773 9658325
3960 9658325 10102087 10371023 10734801 10980367 11442772 11479748 11525318 11987086 12632597 13179464
3950 13179464 13434378 13499690 13880745 13965261 13784664 13814357 13953105 13986678 13877759 13920875
3940 13920875 14152035 14397005 14585745 14829928 14828639 14688519 14676511 14495150 14440694 14426249
3930 14426249 14368638 14096612 14061371 13921678 13668252 13671493 13897729 13742240 13735627 13868032
3920 13868032 13921222 14255669 14475083 14834299 14927168 15130704 15710280 16231400 16925452 17598199
3910 17598199 18197048 18447413 19015660 19902273 21093422 22333999 23061628 24008200 25249214
$$ packed form
3981F765819K26446n8593q6541j1978K01850J11352n9817L965K62399j2196j3481
3970G329225M4653J11335K48953L89385K27591L42554P2161K7004M66912L98552
3960I658325M43762K68936L63778K45566M62405L6976M5570M61768O45511N46867
3950A3179464K54914O5312L81055Q4516j80597K9693J38748L3573j08919M3116
3940A3920875K31160K44970J88740K44183j289j40120j2008j81361n4456j4445
3930A4426249n7611k72026l5241j39693k53426L241K26236j55489o613J32405
3920A3868032N3190L34447K19414L59216R2869K03536N79576N21120O94052O72747
3910A7598199N98849K50365N68247Q86613J191149J240577P27629R46572J241014
$$ plain form
3901 25249214 26345276 27298651 28898927 30450943 32302183 34121293 36173675 38290400
3893 38290400 40766835 43013726 45460444 48236745 50819511 53538733 56498244 59563946
3885 59563946 62305780 64729811 66998205 68992728 70663239 71875140 72430706 72653875
3877 72653875 72880465 72916140 72564605 72296936 72159899 72031339 71674457 71075595 70406091 69539600
3867 69539600 68281303 66577500 64858618 62545705 59906678 57264278 54298257 51369650
3859 51369650 48385109 45804846 43134646 40663341 38481916 36283045 34176484 32247778
3851 32247778 30836250 29491133 27872955 26431488 25155166 24235532 23293441 22482597 21643149
3842 21643149 21084248 20339577 19729868 19171816 18767841 18207840 17678764 17311423 16827283
$$ packed form
3901B5249214J096062R53375J600276J552016J851240J819110K052382K116725
3893C8290400K476435K246891K446718K776301K582766K719222K959511L065702
3885E9563946K741834K424031K268394J994523J670511J211901N55566K23169
3877G2653875K26590L5675l51535k67669j37037j28560l56882n98862o69504q66491
3867F9539600j258297j703803j718882k312913k639027k642400k966021k928607
3859E1369650k984541k580263k670200k471305k181425k198871k106561j928706
3851C2247778j411528j345117j618178j441467j276322r19634r42091q10844q39448
3842B1643149n58901p44671o09709n58052m03975n60001n29076l67341m84140
$$ plain form
3833 16827283 16344378 16069687 15925483 15619208 15439950 15218760 15201509 15281531 15047455 14573589
3823 14573589 13985466 13687546 13488209 13444602 13226510 12595964 12480792 12621514 12485007 12416690
3813 12416690 12123510 11873348 11993624 11813453 11500834 11265243 11426301 11549049 11361430
3804 11361430 11177514 11231886 11380587 11219437 11308731 11475558 11537116 11611603 11686338 12004390
3794 12004390 11915705 11915844 12274180 12584458 12638192 12462563 12547213 12857310 13382351 13411011 13426498
3783 13426498 13566339 13709695 13651795 13829030 14396422 14399649 14664986 14887618 15341588 15697997
3773 15697997 15882476 16012719 16655415 17423642 17942902 18347740 19048275 19694568 20363503
3764 20363503 20982050 21858566 22747997 23454322 23965073 24765050 25415879 25682427 25848657
$$ packed form
3833A6827283m82905k74691j44204l06275j79258k21190j7251Q0022k34076m73866
3823A4573589n88123k97920j99337m3607k18092o30546j15172J40722j36507o8317
3813A2416690k93180k50162J20276j80171l12619k35591J61058J22748j87619
3804A1361430j83916N4372J48701j61150Q9294J66827O1558P4487P4735L18052
3794A2004390q8685J39L58336L10278N3734j75629Q4650L10097N25041K8660J5487
3783A3426498J39841J43356n7900J77235N67392L227K65337K22632M53970L56409
3773A5697997J84479J30243O42696P68227N19260M04838P00535O46293O68935
3764B0363503O18547Q76516Q89431P06325N10751P99977O50829K66548J66230
$$ plain form
3755 25848657 26059564 26260398 26199629 26165255 26442344 26589037 26584452 26714566 26961643 27475736
3745 27475736 27950066 28651130 29614074 30492684 31498897 32174590 32970429 34142775 35362077
3736 35362077 36485573 37773623 38996407 40133075 41156624 42427214 43530038 44828298
3728 44828298 46298622 47843283 49493706 51233817 53080085 55059156 57613150 60504717
3720 60504717 63256180 66181126 69810991 73740923 77613307 81741112 86547651 91591751
3712 91591751 96669177 101721635 107101931 112046706 116868777 121333919 125083070 128218949
3704 128218949 130836496 132401421 133417749 133747429 133775040 133370998 132418659 131080758 129736382
3695 129736382 128143779 126543938 124929234 123145928 120629689 118116007 115430853 112481576
$$ packed form
3755B5848657K10907K00834o0769l4374K77089J46693m585J30114K47077N14093
3745B7475736M74330P01064R62944Q78610J006213O75693P95839J172346J219302
3736C5362077J123496J288050J222784J136668J023549J270590J102824J298260
3728D4828298J470324J544661J650423J740111J846268J979071K553994K891567
3720F0504717K751463K924946L629865L929932L872384M127805M806539N044100
3712I1591751N077426N052458N380296M944775M822071M465142L749151L135879
3704A28218949K617547J564925J016328L29680K7611m04042r52339j337901j344376
3695A29736382j592603j599841j614704j783306k516239k513682k685154k949277
$$ plain form
3687 112481576 109131405 105463087 101491366 97479756 92800052 88435109 83941985 79648598
3679 79648598 75504363 71415111 67800687 64120417 60813222 57327953 54152984 51641076
3671 51641076 49360160 47062985 45012460 43153154 41426910 40067059 38807987 37409046
3663 37409046 36159314 34950980 34199528 33371405 32454080 31620142 30967533 30561991 29926767
3654 29926767 29246818 28643874 28075530 28023032 27800347 27564871 27607031 27372048 27101675 26898200
3644 26898200 27119209 27083791 27091930 27128345 27012514 27173535 27320563 27425014 27552820 27423312
3634 27423312 27168952 27024512 26505502 26325273 26017568 25614141 25079132 24735142 24085652
3625 24085652 23597469 23283900 23018959 22930677 22941513 22774734 22832665 22984154 22829269 22716907
$$ packed form
3687A12481576l350171l668318l971721m011610m679704m364943m493124m293387
3679G9648598m144235m089252l614424l680270l307195l485269l174969k511908
3671E1641076k280916k297175k050525j859306j726244j359851j259072j398941
3663C7409046j249732j208334p51452q28123r17325q33938o52609m05542o35224
3654B9926767o79949o02944n68344n2498k22685k35476M2160k34983k70373k03475
3644B6898200K21009l5418Q139L6415j15831J61021J47028J04451J27806j29508
3634B7423312k54360j44440n19010j80229l07705m03427n35009l43990o49490
3625B4085652m88183l13569k64941q8282J0836j66779N7931J51489j54885j12362
$$ plain form
3615 22716907 23078105 23025985 23511689 23738396 23775842 24065065 24643738 24889690 24970642 25247881
3605 25247881 25412601 25366567 25317722 25315531 25537613 26055558 25958249 26285415 26091905 26142624
3595 26142624 26290645 26556931 26675670 26506578 26606047 26885738 26606841 26819713 27062624 27099045
3585 27099045 27288087 27593049 28062208 28254878 28679365 29222217 29600860 30631505 31719680
3576 31719680 32364170 33596716 34900632 36079236 37538720 39168399 40765046 42453102
3568 42453102 44747908 46877275 49187520 51871745 54653707 57492438 60732104 64049021
3560 64049021 67307902 71032274 74888836 78901218 82831164 86879845 90759031 94623534
3552 94623534 98376240 102007116 105191673 108251408 110572462 112796985 114881766 117049743
$$ packed form
3615B2716907L61198n2120M85704K26707L7446K89223N78673K45952Q0952K77239
3605B5247881J64720m6034m8845k191K22082N17945r7309L27166j93510N0719
3595B6142624J48021K66286J18739j69092R9469K79691k78897K12872K42911L6421
3585B7099045J89042L04962M69159J92670M24487N42852L78643J030645J088175
3576C1719680O44490J232546J303916J178604J459484J629679J596647J688056
3568D2453102K294806K129367K310245K684225K781962K838731L239666L316917
3560F4049021L258881L724372L856562M012382L929946M048681L879186L864503
3552I4623534L752706L630876L184557L059735K321054K224523K084781K167977
$$ plain form
3544 117049743 119200704 121051128 122789913 124346456 125960526 127652230 128927710 129824104
3536 129824104 130234578 130282005 129742714 128661651 127287124 125334100 123060957 120373477 117482933
3527 117482933 114724546 112322440 109624234 106811591 104378867 101785107 99344590 96888856
3519 96888856 94110728 91046374 88285557 85250134 81913146 78674615 75442286 72022486
3511 72022486 68533327 65250380 61981978 59043538 56646644 54338295 52035141 49939337
3503 49939337 48079610 46430397 44751182 43575512 42636530 41730402 40617202 39801631 39038773
3494 39038773 38676331 38320087 38073992 37645044 37577966 37590916 37446246 37392278 37256052 37466643
3484 37466643 37715220 37847574 38288617 38926333 39517932 39681933 40270826 40709980 40864897
$$ packed form
3544A17049743K150961J850424J738785J556543J614070J691704J275480Q96394
3536A29824104M10474M7427n39291j081063j374527j953024k273143k687480k890544
3527A17482933k758387k402106k698206k812643k432724k593760k440517k455734
3519I6888856k778128l064354k760817l035423l336988l238531l232329l419800
3511G2022486l489159l282947l268402k938440k396894k308349k303154k095804
3503D9939337j859727j649213j679215j175670r38982r06128j113200q15571p62858
3494C9038773l62442l56244k46095m28948o7078J2950j44670n3968j36226K10591
3484C7466643K48577J32354M41043O37716N91599J64001N88893M39154J54917
$$ plain form
3475 40864897 41082942 41122288 40988856 40368454 39872795 39427744 38638156 37834912 37137047 36463412
3465 36463412 35658530 34890555 34137183 33484756 32722491 31931202 31223428 30435380 29536828
3456 29536828 28582760 27806472 26744400 25954764 25184566 24254430 23637126 23103878 22502022
3447 22502022 22148523 21872875 21284677 20774191 20278451 20115782 19919953 19676160 19419305
3438 19419305 19150195 18886458 18680897 18438124 18332004 18344729 18361398 18338459 18237602 18253642
3428 18253642 18361708 18448849 18458349 18595125 18571109 19026813 19067261 19364602 19810238 20134794
3418 20134794 20532573 20781166 21437043 22231747 22639312 23522154 24442571 25350563 26162601
3409 26162601 27106436 28169545 29245057 30651168 32433305 33912877 35226317 36809915
$$ packed form
3475D0864897K18045L9346j33432o20402m95659m45051p89588q03244o97865o73635
3465C6463412q04882p67975p53372o52427p62265p91289p07774p88048q98552
3456B9536828r54068p76288j062072p89636p70198r30136o17304n33248o01856
3447B2502022l53499k75648n88198n10486m95740j62669j95829k43793k56855
3438A9419305k69110k63737k05561k42773j06120J2725J6669k2939j00857J6040
3428A8253642J08066Q7141R500J36776k4016M55704M0448K97341M45636L24556
3418B0134794L97779K48593O55877P94704M07565Q82842R20417R07992Q12038
3409B6162601R43835J063109J075512J406111J782137J479572J313440J583598
$$ plain form
3401 36809915 38752498 40758936 42812371 45322930 47651428 49677405 52204489 54766641
3393 54766641 57339968 60156477 62655296 65594581 68568806 72011109 75493093 78926248
3385 78926248 82416207 86220473 90146474 93256495 95732815 98265421 100162346 100858188
3377 100858188 100741167 99706147 97729262 94597754 90847181 86550587 82049173 77259714
3369 77259714 72593670 68001879 63449989 59532396 55541698 52152408 48786557 46027618
3361 46027618 43458805 41200558 38796183 36578748 34759923 32849901 31333534 29829577
3353 29829577 28481455 27139800 26012062 24986927 24052047 23061901 22145558 21286001 20619352
3344 20619352 20042927 19106447 18488750 17872123 17261515 16816622 16080090 15678702 15263902
$$ packed form
3401C6809915J942583K006438K053435K510559K328498K025977K527084K562152
3393E4766641K573327K816509K498819K939285K974225L442303L481984L433155
3385G8926248L489959L804266L926001L110021K476320K532606J896925O95842
3377A00858188j17021j035020j976885l131508l750573m296594m501414m789459
3369G7259714m666044m591791m551890l917593l990698l389290l365851k758939
3361D6027618k568813k258247k404375k217435j818825j910022j516367j503957
3353B9829577j348122j341655j127738j025135r34880r90146r16343q59557o66649
3344B0619352n76425r36480o17697o16627o10608m44893p36532m01388m14800
$$ plain form
3335 15263902 14805940 14339636 14304810 14020232 13515263 13411175 13033078 12808161 12446602 11973579
3325 11973579 11805245 11537721 11294309 11043164 11148191 10893854 10989364 10791382 10418105 10313361
3315 10313361 10060234 9896014 10008379 9698301 9230117 9278718 9394747 9274014 9282171 8944287
3305 8944287 8826904 8541728 8138105 8053700 8034620 8016454 7828483 7782734 7540192 7426579
3295 7426579 7461591 7428230 7238300 7068833 7146428 7224702 7233392 7322328 7177311 7239786 7150131
3284 7150131 7121770 7063037 7125830 7219876 7008289 6845900 6687632 7006590 6712421 6453248
3274 6453248 6672530 6575665 6554383 6793974 6757739 6678351 6830706 6726731 6639172 6358717
3264 6358717 6362124 6497129 6560136 6805860 6910284 6717955 6889122 6924857 6863522 6804534 6801842
$$ packed form
3335A5263902m57962m66304l4826k84578n04969j04088l78097k24917l61559m73023
3325A1973579j68334k67524k43412k51145J05027k54337R5510j97982l73277j04744
3315A0313361k53127j64220J12365l10078m68184M8601J16029j20733Q157l37884
3305H944287j17383k85176m03623q4405j9080j8166j87971m5749k42542j13613
3295G426579L5012l3361j89930j69467P7595P8274Q690Q8936j45017O2475q9655
3284G150131k8361n8733O2793R4046k11587j62389j58268L18958k94169k59173
3274F453248K19282r6865k1282K39591l6235p9388J52355j03975q7559k80455
3264F358717L407J35005O3007K45724J04424j92329J71167L5735o1335n8988k692
$$ plain form
3253 6801842 6902882 6922010 6721221 6723948 6673091 6887599 6998199 7401928 7368052 7191582
3243 7191582 7249433 7053220 6924208 7157991 7150700 7238663 7032355 6812689 6842622 6974821
3233 6974821 7228515 7244778 7321171 7454649 7340821 7299560 7536125 7387983 7134969 7064887
3223 7064887 7026788 7042444 7376782 7497327 7331407 7342376 7575544 7921112 8096731 8096073 8189815
3212 8189815 8150010 8140899 8437146 8514741 8598390 8897068 8735905 9020933 9008723 9164928 9157125
3201 9157125 9114096 9415700 9468255 9910609 10101057 10238094 10626912 11211049 11566359 11488996
3191 11488996 11803740 12078926 12242380 12407670 12844712 13402558 13597372 13972225 14674980
3182 14674980 15061092 15580071 16141771 16500043 17086018 17686513 18386308 18964242 19549904
$$ packed form
3253F801842J01040J9128k00789K727n0857K14508J10600M03729l3876j76470
3243G191582N7851j96213j29012K33783p291Q7963k06308k19666K9933J32199
3233F974821K53694J6263P6393J33478j13828m1261K36565j48142k53014p0082
3223G064887l8099J5656L34338J20545j65920J0969K33168L45568J75619o58R3742
3212H189815l9805r111K96247P7595Q3649K98678j61163K85028j2210J56205p803
3201I157125m3029L01604N2555M42354J90448J37037L88818N84137L55310p7363
3191A1488996L14744K75186J63454J65290M37042N57846J94814L74853P02755
3182A4674980L86112N18979N61700L58272N85975O00495O99795N77934N85662
$$ plain form
3173 19549904 20305750 20793126 21805915 22972642 23663394 24454083 25808223 26773275 27792773
3164 27792773 29014857 30260301 31791253 33353765 34556031 36129175 38230704 40288362
3156 40288362 42337634 44294236 46893510 49368905 51872329 54451330 57481589 60968631
3148 60968631 64982763 69317933 73863039 79355864 85468066 90921014 95668067 99344739
3140 99344739 101556866 103120796 103991081 104973567 106693671 109478199 112586616 116557370
3132 116557370 121093275 126246527 132386294 139147846 146769527 154994791 163768247 173359904
3124 173359904 184041985 195618708 208209998 222304043 237835798 254762746 273568745
3117 273568745 293263781 311660276 326995965 336518126 338528557 332450823 319318799
$$ packed form
3173A9549904P55846M87376J012789J166727O90752P90689J354140R65052J019498
3164B7792773J222084J245444J530952J562512J202266J573144K101529K057658
3156D0288362K049272J956602K599274K475395K503424K579001L030259L487042
3148F0968631M014132M335170M545106N492825O112202N452948M747053L676672
3140I9344739K212127J563930Q70285R82486J720104K784528L108417L970754
3132A16557370M535905N153252O139767O761552P621681Q225264Q773456R591657
3124A73359904J0682081J1576723J2591290J4094045J5531755J6926948J8805999
3117B73568745J9695036J8396495J5335689R522161K010431o077734j3132024
$$ plain form
3110 319318799 300656649 279486366 258164954 237333411 217404887 199430226 183965622
3103 183965622 170108342 157751428 146758559 136851818 127914441 119814800 112442699 105799295
3095 105799295 99670820 93950989 88468711 83567762 78980032 74654314 70672723 67230016
3087 67230016 63833901 60514431 57836685 55452258 52745520 50511390 48239603 46112447
3079 46112447 44493938 42815243 41145871 39588747 38488254 36889061 35304603 33979110
3071 33979110 32664419 31618111 30395566 29614358 28545998 27560820 26599768 25714455 24929075
3062 24929075 24059150 23498435 22790474 21811772 21166410 20883737 20394571 19756498 19087150
3053 19087150 18682096 18300156 17879282 17409036 17366072 16887095 16231443 15886022 15466136 15309166
$$ packed form
3110C19318799j8662150k1170283k1321412k0831543j9928524j7974661j5464604
3103A83965622j3857280j2356914j0992869r906741q937377q099641p372101o643404
3095A05799295o128475n719831n482278m900949m587730m325718l981591l442707
3087F7230016l396115l319470k677746k384427k706738k234130k271787k127156
3079D6112447j618509j678695j669372j557124j100493j599193j584458j325493
3071C3979110j314691j046308j222545p81208j068360r85178r61052q85313p85380
3062B4929075q69925n60715p07961r78702o45362k82673m89166o38073o69348
3053A9087150m05054l81940m20874m70246m2964m78977o55652l45421m19886j56970
$$ plain form
3043 15309166 15102925 14609900 14162571 14016108 13730546 13657883 13433222 12807773 12618156 12530622
3033 12530622 12498237 12277880 12341273 12000358 11662731 11495778 11269375 10925201 10470888 10716717
3023 10716717 10528722 10155204 10005667 10142292 10048157 9927357 9794769 9493119 9133844 8938123
3013 8938123 9076558 8834866 8641018 8753408 8456516 8448398 8261913 8162422 8149052 8120800
3003 8120800 8073006 7617223 7597116 7445801 7357061 7748299 7464645 7318844 7225236 6979518
2993 6979518 6502085 6575610 6580945 6674573 6660839 6210281 6225578 5921411 5726865 5990021 5977951
2982 5977951 5861831 5959612 5943309 6023089 5690432 5515337 5410133 5382261 5520521 5304119
2972 5304119 5296749 5424067 5620147 5372968 5257691 5152486 5106517 5358026 5327962 5293723
$$ packed form
3043A5309166k06241m93025m47329j46463k85562p2663k24661o25449j89617q7534
3033A2530622l2385k20357O3393l40915l37627j66953k26403l44174m54313K45829
3023A0716717j87995l73518j49537J36625r4135j20800j32588l01650l59275j95721
3013H938123J38435k41692j93848J12390k96892q118j86485r9491j3370k8252
3003H120800m7794m55783k0107j51315q8740L91238k83654j45801r3608k45718
2993F979518m77433P3525N335R3628j3734m50558J5297l04167j94546K63156j2070
2982E977951j16120R7781j6303P9780l32657j75095j05204k7872J38260k16402
2972E304119p370J27318J96080k47179j15277j05205m5969K51509l0064l4239
$$ plain form
2962 5293723 5186361 4918547 4405150 4373210 4344948 4627950 4345397 4226888 4286628 4029859
2952 4029859 4065256 4119512 4235226 3849700 3656961 3778890 3631791 3906702 4003599 3856959
2942 3856959 3706318 3666084 3799393 3761607 3309935 3209954 3037197 3191764 3277254 2917325
2932 2917325 3083738 3284786 3361910 3417895 3155478 3004993 2874512 2678678 2840158 2993659
2922 2993659 2881040 2596357 2650770 2650148 2695625 2701307 2494252 2523100 2848248 2597968 2484999
2911 2484999 2662876 2436807 2380964 2564058 2595959 2490735 2515249 2463607 2370087 2225535
2901 2225535 2304204 2366385 2553813 2486983 2457281 2229603 2380035 2602270 2432052 2378610
2891 2378610 2730332 2626072 2356859 2482594 2473523 2317363 2206196 2424837 2528656 2310209
$$ packed form
2962E293723j07362k67814n13397l1940k8262K83002k82553j18509N9740k56769
2952D029859L5397N4256J15714l85526j92739J21929j47099K74911R6897j46640
2942C856959j50641m0234J33309l7786m51672r9981j72757J54567Q5490l59929
2932B917325J66413K01048P7124N5985k62417j50485j30481j95834J61480J53501
2922B993659j12619k84683N4413o22M5477N682k07055K8848L25148k50280j12969
2911B484999J77877k26069n5843J83094L1901j05224K4514n1642r3520j44552
2901B225535P8669O2181J87428o6830k9702k27678J50432K22235j70218n3442
2891B378610L51722j04260k69213J25735r071j56160j11167K18641J03819k18447
$$ plain form
2881 2310209 2085117 2087040 2001232 2204214 1988073 1993425 2093898 2324934 2363522 2302721 2409096
2870 2409096 2406523 2265954 2033927 1924223 2144631 2184880 2130851 2254078 2300156 2266706 2146585
2859 2146585 2108780 1951076 1936944 2089260 2337825 2375787 2336179 2166904 2222681 2456195
2849 2456195 2466051 2438186 2337721 2242797 2016223 1957998 2199847 2507348 2435389 2681860 2723837
2838 2723837 2451779 2571849 2716052 2699794 2613266 2821751 2855328 3148871 3225406 3252264
2828 3252264 3015083 2764638 2649326 2532331 2945141 2680152 2251520 2402175 2433029 2016808
2818 2016808 1929692 1759910 1594955 1892013 2180004 1903503 1999485 2062362 1881106 1677979
2808 1677979 1739645 1565082 1818136 1750623 1610205 1524215 1433661 1535056 1618518 1785945
$$ packed form
2881B310209k25092J923q5808K02982k16141N352J00473K31036L8588o0801J06375
2870B409096k573j40569k32027j09704K20408M0249n4029J23227M6078l3450j20121
2859B146585l7805j57704j4132J52316K48565L7962l9608j69275N5777K33514
2849B456195R856k7865j00465r4924k26574n8225K41849L07501p1959K46471M1977
2838B723837k72058J20070J44203j6258q6528K08485L3577K93543P6535K6858
2828C252264k37181k50445j15312j16995M12810k64989m28632J50655L0854m16221
2818B016808q7116j69782j64955K97058K87991k76501R5982O2877j81256k03127
2808A677979O1666j74563K53054o7513j40418q5990r0554J01395Q3462J67427
$$ plain form
2798 1785945 1533020 1443505 1379761 1567193 1646969 1696240 1561544 1494318 1520696 1571146 1424918
2787 1424918 1323044 1494083 1331366 1156182 1336165 1420989 1299855 1345235 1213395 1279388
2777 1279388 1241937 1102598 1192983 936235 898694 1087328 1044172 1040184 1060658 1033725 968443
2766 968443 1149970 1700189 1554292 1186398 1162501 1297420 1114317 1036115 1098986 1063134
2756 1063134 1285733 1381166 1290702 1283124 1125708 999804 1157409 1196969 1271563 1471652 1553554
2745 1553554 1393772 969730 974262 955507 827703 925123 760569 715054 487748 845841
2735 845841 824847 630457 799880 1039404 1128208 1007607 881691 901456 870280 590995
2725 590995 845111 877548 1196970 1261843 875078 638767 832674 944743 844390 903456
$$ packed form
2798A785945k52925q9515o3744J87432P9776M9271j34696o7226K6378N0450j46228
2787A424918j01874J71039j62717j75184J79983Q4824j21134M5380j31840O5993
2777A279388l7451j39339R0385k56748l7541J88634m3156l988K0474k6933o5282
2766I68443J81527N50219j45897l67894k3897J34919j83103p8202O2871l5852
2756A063134K22599R5433r0464p578j57416j25904J57605L9560P4594K00089Q1902
2745A553554j59782m24042M532j8755j27804R7420j64554m5515k27306L58093
2735H45841k0994j94390J69423K39524Q8804j20601j25916J9765l1176k79285
2725E90995K54116L2437L19422O4873l86765k36311J93907J12069j00353N9066
$$ plain form
2715 903456 1185766 1080886 1074543 1091410 1027260 840655 1106918 962049 756550 463235
2705 463235 641230 971778 828494 748709 1160835 922981 872146 723561 614543 980243
2695 980243 830151 1106532 975035 806978 813233 858242 847771 591688 613766 623229 493133
2684 493133 364846 482344 455459 557513 556929 556256 764515 744560 818540 583702 633939
2673 633939 631518 685367 636219 765130 671268 516933 520374 656867 476981 257827 371466
2662 371466 584980 464630 396621 553682 549432 349732 455920 726109 708964 627027 795705
2651 795705 835102 721756 717301 620336 597832 621850 498573 494103 393285 602967 555551
2640 555551 518731 707442 494378 219596 509702 539425 489214 443937 447609 447990 562233
$$ packed form
2715I03456K82310j04880o343J6867o4150j86605K66263j44869k05499k93315
2705D63235J77995L30548j43284p9785M12126k37854n0835j48585j09018L65700
2695I80243j50092K76381j31497j68057O255M5009j0471k56083K2078R463j30096
2684D93133j28287J17498k6885J02054n84o73K08259j9955P3980k34838N0237
2673F33939k421N3849m9148J28911r3862j54335L441J36493j79886k19154J13639
2662C71466K13514j20350o8009J57061m250j99700J06188K70189j7145q1937J68678
2651G95705L9397j13346m455r6965k2504K4018j23277m470j00818K09682m7416
2640E55551l6820J88711k13064k74782K90106K9723n0211m5277L672L81J14243
$$ plain form
2629 562233 763666 688050 811275 763048 503009 472588 487571 557411 559259 787564 514076
2618 514076 378426 456207 822362 1059567 579470 426232 374202 512955 569717 587115
2608 587115 558912 337345 671236 659353 508694 612919 718485 487761 496566 516043 762905
2597 762905 633278 365974 418317 483817 782146 966631 1023430 830022 1107690 969055
2587 969055 698522 488391 601564 467884 604689 507787 568821 569480 658821 607694 533850
2576 533850 543551 605699 664605 489147 449993 449049 175655 433727 444274 420751 619711
2565 619711 598279 518099 393129 497087 479840 342363 286262 379708 357981 209895 383844
2554 383844 78857 124577 250606 67048 92274 331304 333588 509563 560541 307076 280613
$$ packed form
2629E62233K01433p5616J23225m8227k60039l0421J4983O9840J848K28305k73488
2618E14076j35650P7781L66155K37205m80097j53238n2030J38753N6762J7398
2608E87115k8203k21567L33891j1883j50659J04225J05566k30724Q805J9477K46862
2597G62905j29627k67304N2343O5500K98329J84485N6799j93408K77668j38635
2587I69055k70533k10131J13173j33680J36805r6902O1034O59Q9341n1127p3844
2576E33850R701O2148N8906j75458l9154r44k73394K58072J0547k3523J98960
2565F19711k1432q0180j24970J03958j7247j37477n6101R3446k1727j48086J73949
2554C83844l04987M5720J26029j83558K5226K39030K284J75975N0978k53465k6463
$$ plain form
2543 280613 285961 285376 132438 337449 307257 241163 532454 567893 568241 611705 711196 471743
2531 471743 320967 380874 364514 374578 354006 487193 650656 645805 454950 489267 537555
2520 537555 451212 453291 648556 610967 790459 358943 239165 371038 471966 460913 620214
2509 620214 830161 571026 328603 267926 346245 207616 141646 548872 595481 285306
2499 285306 75395 218692 299790 431451 756683 677210 266947 172249 244726 370555
2489 370555 334318 439356 480688 618070 587367 546229 497749 299343 158411 411808 633249
2478 633249 601457 406996 508822 457578 424100 488943 450207 359059 177063 159782 550884
2467 550884 737270 300562 307525 367994 636910 487077 475040 384898 497623 709830 622883
$$ packed form
2543B80613N348n85j52938K05011l0192o6094K91291L5439L48M3464R9491k39453
2531D71743j50776N9907j6360J0064k0572J33187J63463m851j90855L4317M8288
2520E37555q6343K079J95265l7589J79492m31516j19778J31873J00928j1053J59301
2509F20214K09947k59135k42423o0677P8319j38629o5970M07226M6609l10175
2499B85306k09911J43297Q1098J31661L25232p9473m10263r4698P2477J25829
2489C70555l6237J05038M1332J37382l0703m1138m8480j98406j40932K53397K21441
2478F33249l1792j94461J01826n1244l3478O4843l8736r1148j81996j7281L91102
2467E50884J86386m36708O963O0469K68916j49833j2037r0142J12725K12207q6947
$$ plain form
2456 622883 359966 450072 438838 353668 355855 533652 752066 414037 373028 488568 285528
2445 285528 422782 407648 370790 317074 552909 749949 629317 661068 786504 607186
2435 607186 486013 589039 447303 858508 862199 778991 779778 690272 530475 381342 681178
2424 681178 822625 682313 553533 670556 417465 323735 503075 791936 772664 549278
2414 549278 625027 551401 547305 829472 764858 670614 569305 709282 661332 570928 606127
2403 606127 808287 704409 455990 463419 842599 1257560 1148122 1113941 1056994 1000559 1049454
2392 1049454 1230209 1279440 1170098 1222706 1234225 1138715 1535974 1571012 1496441 1360805 1382898
2381 1382898 1401099 1529982 1559471 1439645 1413890 1611965 1863227 2124401 2216101 2344947
$$ packed form
2456F22883k62917R0106j1234q5170K187J77797K18414l38029m1009J15540k03040
2445B85528J37254j5134l6858n3716K35835J97040j20632L1751J25436j79318
2435F07186j21173J03026j41736M11205L691q3208P87q9506j59797j49133K99836
2424F81178J41447j40312j28780J17023k53091r3730J79340K88861j9272k23386
2414E49278P5749p3626m096K82167o4614r4244j01309J39977m7950r0404L5199
2403F06127K02160j03878k48419P429L79180M14961j09438l4181n6947n6435M8895
2392A049454J80755M9231j09342N2608J1519r5510L97259L5038p4571j35636K2093
2381A382898J8201J28883K9489j19826k5755J98075K51262K61174R1700J28846
$$ plain form
2371 2344947 2357027 2360667 2641414 2453056 2504309 2671165 2871630 2836794 2941214 3408740
2361 3408740 3276692 3426062 3782826 4233191 4089035 4420238 4944773 5291209 5602668 5851336
2351 5851336 6217437 6332876 6776192 7434093 8050135 8744497 9429097 10617668 11440770
2342 11440770 12235588 13375521 14498268 15782630 16817912 17950353 18984476 20341132
2334 20341132 21994212 23952515 26384970 28930230 31695404 35650591 40512932 45992308
2326 45992308 52856660 61125764 67152630 68087112 66255727 60638491 52321008 46315582
2318 46315582 41088725 35612300 31023345 27823507 24871323 22680273 21033403 19404535
2310 19404535 18350657 17260938 16062946 15012334 14151906 13253262 12352464 11430305 10487140
$$ packed form
2371B344947J2080L640K80747j88358N1253J66856K00465l4836J04420M67526
2361C408740j32048J49370L56764M50365j44156L31203N24535L46436L11459K48668
2351E851336L66101J15439M43316O57901O16042O94362O84600J188571Q23102
2342A1440770P94818J139933J122747J284362J035282J132441J034123J356656
2334B0341132J653080J958303K432455K545260K765174L955187M862341N479376
2326D5992308O864352Q269104O026866R34482j831385n617236q317483o005426
2318D6315582n226857n476425m588955l199838k952184k191050j646870j628868
2310A9404535j053878j089719j197992j050612q60428q98644r00798r22159r43165
$$ plain form
2301 10487140 10054051 9338085 8658499 8185956 7717923 7373734 7332524 6934572 6417975 6365405
2291 6365405 6024411 5573134 5767201 5525404 5117336 4907738 4805511 5026754 4913812 4648259
2281 4648259 4203043 3952068 3846644 3814979 3646422 3447211 3398059 3177002 3337986 3246592
2271 3246592 2875561 2640076 2424882 2188742 2216117 2301794 2138094 2207413 1928774 2262767
2261 2262767 2561536 2249730 1955352 1982059 1804894 1770929 1847685 1822739 1920343 1645360
2251 1645360 1415597 1559237 1416747 1575370 1520017 1619091 1804580 1642885 1390324 1319501
2241 1319501 1286686 1462947 1370144 1223472 1461056 1391181 1190749 1120809 1092120 1057976 1165967
2230 1165967 1474814 1351477 1245117 1255089 1474057 1369174 1308190 1239788 1010795 1106286
$$ packed form
2301A0487140m33089p15966o79586m72543m68033l44189m1210l97952n16597n2570
2291F365405l40994m51277J94067k41797m08068k09598j02227K21243j12942k65553
2281D648259m45216k50975j05424l1665j68557j99211m9152k21057J60984r1394
2271C246592l71031k35485k15194k36140K7375Q5677j63700O9319k78639L33993
2261B262767K98769l11806k94378K6707j77165l3965P6756k4946R7604k74983
2251A645360k29763J43640j42490J58623n5353R9074J85489j61695k52561p0823
2241A319501l2815J76261r2803j46672K37584o9875k00432o9940k8689l4144J07991
2230A165967L08847j23337j06360R972K18968j04883o0984o8402k28993R5491
$$ plain form
2220 1106286 826486 944416 1119594 1123874 966212 1116022 1044571 1287947 1195408 1222883
2210 1222883 1093280 1087324 984464 679686 835458 827855 781080 620416 724945 1029475
2200 1029475 1081152 1215077 841435 655620 630636 637992 812613 1001183 981565 1065095 942316
2189 942316 529892 597618 774930 849388 696890 522904 560693 826044 737404 557568
2179 557568 470907 412302 333296 455448 543993 695538 469015 422717 613510 540416 452676
2168 452676 564245 372334 951061 911282 578379 590031 449738 582761 502455 501277 605448
2157 605448 534635 291970 349640 562235 641161 630231 591160 505264 779317 991082 691084
2146 691084 383603 299557 289690 336606 254976 198934 326326 413258 533913 306306 174876
$$ packed form
2220A106286k79800J17930J75178M280j57662J49810p1451K43376r2539K7475
2210A222883j29603n956j02860l04778J55772p603m6775j60664J04529L04530
2200A029475N1677J33925l73642j85815k4984P356J74621J88570j9618Q3530j22779
2189I42316m12424O7726J77312P4458j52498j73986L7789K65351q8640j79836
2179E57568q6661n8605p9006J22152Q8545J51545k26523m6298J90793p3094q7740
2168D52676J11569j91911N78727l9779l32903J1652j40293J33023q0306j178J04171
2157F05448p0813k42665N7670K12595P8926j0930l9071q5896K74053K11765k99998
2146F91084l07481q4046r867M6916q1630n6042J27392Q6932J20655k27607j31430
$$ plain form
2135 174876 278892 302224 564551 470771 523158 611027 530850 495999 280711 658320 619733
2124 619733 453920 342423 248010 333264 239868 281410 352939 522935 285834 42160 -9878
2113 -9878 154624 128444 315797 505883 464497 221099 349569 615343 637622 581953 194772
2102 194772 167118 360698 466747 564509 399323 383301 392263 487291 508433 491022 117850
2091 117850 225686 284072 291656 210164 51302 -82477 -98396 167865 471620 780149 594453
2080 594453 327375 288302 534062 43206 21572 99798 195198 342493 384078 244185 221952
2069 221952 176681 -22848 14948 140536 349247 541593 501778 240020 461039 788490
2059 788490 681225 635900 655489 557760 581574 742468 589506 401950 350155 567231 356876
$$ packed form
2135A74876J04016K3332K62327r3780N2387Q7869q0177l4851k15288L77609l8587
2124F19733j65813j11497r4413Q5254r3396M1542P1529J69996k37101k43674n2038
2113i878J64502k6180J87353J90086m1386k43398J28470K65774K2279n5669l87181
2102A94772k7654J93580J06049R7762j65186j6022Q962R5028K1142j7411l73172
2091A17850J07836N8386P584q1492j58862j33779j5919K66261L03755L08529j85696
2080E94453k67078l9073K45760m90856k1634P8226R5400J47295M1585j39893k2233
2069B21952m5271j99529L7796J25588K08711J92346l9815k61758K21019L27451
2059G88490j07265m5325J9589r7729K3814J60894j52962j87556n1795K17076k10355
$$ plain form
2048 356876 316161 567978 426940 366657 209081 196865 266906 588276 353137 290086 249743
2037 249743 132434 224869 98936 302875 688654 612666 359374 -25076 -227335 -202850
2027 -202850 -10266 470731 346883 -2745 128497 240245 401046 428072 169030 191471
2017 191471 378997 473152 287432 199881 207625 342179 -36290 -32176 21644 -17175 140223
2006 140223 459258 548504 433186 400082 112368 -35435 -6591 254673 90827 285777
1996 285777 455155 459634 206155 62864 -46804 150298 196126 11073 65830 233893
1986 233893 261516 245597 264558 75051 -29376 49541 307657 152128 128591 -211332 -381330
1975 -381330 -172936 31894 -138015 -167104 -108605 71005 -125205 -262928 -309808 -190799
$$ packed form
2048C56876m0715K51817j41038o0283j57576j2216P0041L21370k35139o3051m0343
2037B49743j17309R2435j25933K03939L85779p5988k53292l84450k02259K4485
2027b02850J92584M80997j23848l49628J31242J11748J60801K7026k59042K2441
2017A91471J87526R4155j85720q7551P744J34554l78469M114N3820l8819J57398
2006A40223L19035Q9246j15318l3104k87714j47803K8844K61264j63846J94950
1996B85777J69378M479k53479j43291j09668J97102M5828j85053N4757J68063
1986B33893K7623j5919J8961j89507j04427P8917K58116j55529k3537l39923j69998
1975c81330K08394K04830j69909k9089N8499J79610j96210j37723m6880J19009
$$ plain form
1965 -190799 -15056 -257063 -387126 -93303 -140743 -138456 179508 5097 -47682 243222
1955 243222 108830 -81216 20092 12523 78133 388800 146194 206185 334995 -3769
1945 -3769 -11907 -204594 -390376 -325681 27969 -5217 -44664 109764 36285 -316424 -256967
1934 -256967 -262325 109401 179989 72271 205597 284295 366802 225132 -117763 195805 64173
1923 64173 -83767 153505 267177 -92788 -200324 -60562 -370748 -178327 -93083 -188858
1913 -188858 -75046 212502 239808 101951 138696 126632 68103 -11047 11879 29088 -91700
1902 -91700 179510 241606 64859 15602 -164362 -204549 100954 139506 163427 210647 44825
1891 44825 1575 7080 19739 90348 47514 -42685 -12859 -117317 -151027 13707 -43698 -298985
$$ packed form
1965a90799J75743k42007j30063K93823m7440K287L17964j74411n2779K90904
1955B43222j34392j90046J01308p569O5610L10667k42606N9991J28810l38764
1945c769q138j92687j85782O4695L53650l3186l9447J54428p3479l52709N9457
1934b56967n358L71726P0588j07718J33326P8698Q2507j41670l42895L13568j31632
1923F4173j47940K37272J13672l59965j07536J39762l10186J92421Q5244r5775
1913a88858J13812K87548K7306j37857L6745j2064n8529p9150K2926J7209j20788
1902i1700K71210O2096j76747m9257j79964m0187L05503L8552K3921M7220j65822
1891D4825m3250N505J2659P0609m2834r0199K9826j04458l3710J64734n7405k55287
$$ plain form
1879 -298985 -241584 31786 320254 -6225 980 75949 -88368 314977 472180 367939
1869 367939 -95654 3594 283445 156481 119471 125479 2730 54491 -23397 -195010 -237516
1858 -237516 -238652 -108025 -123239 -125851 -41384 258361 16978 86091 81919 -22202 -12329 41890
1846 41890 -85384 -44651 -85232 -249454 239756 464514 224886 -109274 -88551 -44348 -103822
1835 -103822 -275267 -79817 -97861 49972 -66260 -92594 65498 176557 -66649 17715
1825 17715 305946 314634 257492 55474 -37135 52319 29427 249784 323469 263269 273533
1814 273533 284004 198608 122524 26237 54669 196268 263378 276924 400530 142701 -138618
1803 -138618 -233193 -102539 -24096 -28377 -128203 -197645 34002 -16085 138027 275109 309881
$$ packed form
1879b98985N7401K73370K88468l26479P205P4969j64317M03345J57203j04241
1869C67939m63593R9248K79851j26964l7010O008j22749N1761p7888j71613m2506
1858b37516j136J30627j5214k612Q4467K99745k41383O9113m172j04121R873N4219
1846D1890j27274M0733m0581j64222M89210K24758k39628l34160K0723M4203n9474
1835a03822j71445J95450j8044J47833j16232k6334J58092J11059k43206Q4364
1825A7715K88231Q688n7142k02018r2609Q9454k2892K20357P3685o0200J0264
1814B73533J0471q5396p6084r6287K8432J41599O7110J3546J23606k57829k81319
1803a38618r4575J30654P8443m281r9826o9442K31647n0087J54112J37082L4772
$$ plain form
1792 309881 251566 -30722 40264 -38807 -106551 13507 -167661 68998 63806 -75835 -41100
1781 -41100 105772 -79956 -160588 -46561 117147 262169 373696 -2942 -60886 -309207
1771 -309207 -144614 59166 91310 154918 -161115 -245862 -12121 131121 75162 -48231
1761 -48231 -141149 -58998 -51818 -193659 -153261 -98603 -58080 186709 26213 340802 118699
1750 118699 13119 -144447 -59770 -15164 -247239 100649 108599 137918 -50778 139843 -2185
1739 -2185 20295 31584 281832 266348 106717 275415 318717 372998 316481 343323 337056 217992
1727 217992 20754 22834 113826 119594 79769 10485 -97546 -174898 -259039 -259567 -356707 -226022
1715 -226022 -76384 5872 134211 156721 69118 -77472 82772 87003 105496 199153 432957
$$ packed form
1792C09881n8315k82288P0986p9071o7744J20058j81168K36659n192j39641L4735
1781d1100J46872j85728q0632J14027J63708J45022J11527l76638n7944k48321
1771c09207J64593K03780L2144O3608l16033q4747K33741J43242n5959j23393
1761d8231r2918Q2151P180j41841M0398N4658M0523K44789j60496L14589k22103
1750A18699j05580j57566Q4677M4606k32075L47888P950K9319j88696J90621j42028
1739b185K2480J1289K50248j5484j59631J68698M3302N4281n6517K6842o267j19064
1727B17992j97238K080R0992N768l9825o9284j08031p7352q4141n28r7140J30685
1715b26022J49638Q2256J28339K2510q7603j46590J60244M231J8493R3657K33804
$$ plain form
1704 432957 189407 36698 -106853 -85161 12923 16338 -238840 -218465 -57877 -79233 4223
1693 4223 -139385 -98342 -174503 -251607 -98118 131774 1037 -86110 -89690 98702 305825
1682 305825 194947 -200145 -529602 -390858 -178268 -141111 24732 -104600 -33092 -39849
1672 -39849 -71169 -106881 -29983 8109 -229877 47311 14958 25821 127925 -87743 194430
1661 194430 76735 120616 363597 250195 122801 -14237 -205791 121358 278781 256581
1651 256581 62150 -29511 -146133 2344 -192978 -31674 29848 39939 130463 145127 57949
1640 57949 210383 -45080 -243751 11714 -19103 -81812 35249 -302000 -212879 286290
1630 286290 132715 206646 371161 365517 122311 -338248 -403884 -111044 -81675 -249766 -217443
$$ packed form
1704D32957k43550j52709j43551K1692R8084L415k55178K0375J60588k1356Q3456
1693D223j43608M1043p6161p7104J53489K29892j30737q7147l580J88392K07123
1682C05825j10878l95092l29457J38744K12590L7157J65843j29332P1508o757
1672c9849l1320l5712P6898L8092k37986K77188l2353J0863J02104k15668K82173
1661A94430j17695M3881K42981j13402j27394j37038j91554L27149J57423k2200
1651B56581j94431r1661j16622J48477j95322J61304O1522J0091R0524J4664q7178
1640E7949J52434k55463j98671K55465l0817o2709J17061l37249Q9121M99169
1630B86290j53575P3931J64515n644k43206m60559o5636K92840K9369j68091L2323
$$ plain form
1619 -217443 -344187 -40014 179093 -80103 275083 87864 11765 -53372 -55446 -229032
1609 -229032 -69400 82657 67687 -8982 99426 -42479 -245200 -154713 47962 -17007
1599 -17007 196305 355412 -3030 -75715 86879 -208473 -84658 197750 146141 267371
1589 267371 115349 -248315 -187812 -45061 93568 88751 8828 -42340 -7646 -83246 309956
1578 309956 268355 103715 -6639 -25047 -40055 -196363 -90626 -17977 -17828 -38037 -195099
1567 -195099 -180674 -57425 130203 21710 -341259 -75040 335302 117785 -141923 21851
1557 21851 55965 -42581 -92516 -103089 31403 124211 -133929 -111258 -152680 -157263 -236475 -329711
1545 -329711 -480174 -346662 4110 -118735 9557 -91164 -52799 -26474 102392 408342
$$ packed form
1619b17443j26744L04173K19107k59196L55186j87219p6099o5137k074j73586
1609b29032J59632J52057j4970p6669J08408j41905k02721R0487K02675o4969
1599a7007K13312J59107l58442p2685J62594k95352J23815K82408n1609J21230
1589B67371j52022l63664O0503J42751J38629m817p9923n1168L4694p5600L93202
1578C09956m1601j64640j10354j8408j5008j56308J05737P2649J49k0209j57062
1567a95099J4425J23249J87628j08493l62969K66219M10342k17517k59708J63774
1557B1851L4114r8546m9935j0573J34492R2808k58140K2671m1422m583p9212r3236
1545c29711j50463J33512L50772j22845J28292j00721L8365K6325J28866L05950
$$ plain form
1535 408342 210645 265978 164079 63747 119135 270862 424389 48479 -203829 -44844
1525 -44844 59480 336197 270906 124613 -56898 -67835 19605 336384 80863 -77421
1515 -77421 -49566 -114567 22271 148888 3985 279042 570895 496731 309401 294961 215500
1504 215500 -39233 -22778 69069 -166872 -209449 -340341 -390972 -328430 -505273 -301413 -185815
1493 -185815 -372685 -149428 -147519 -179786 -153988 17069 270908 -26250 152900 228019 196345
1482 196345 23561 -255074 -230576 -181835 22468 195144 159287 206603 15474 -83071 -38303
1471 -38303 -179022 -2212 44421 -91438 -115253 -93074 3325 -289455 -202010 62611 159973
1460 159973 27127 -171952 -174312 -186491 -364644 117939 291971 -39168 -102730 -11267 227962
$$ packed form
1535D08342j97697N5333j01899j00332N5388J51727J53527l75910k52308J58985
1525d4844J04324K76717o5291j46293j81511j0937Q7440L16779k55521j58284
1515g7421K7855o5001J36838J26617j44903K75057K91853p4164j87330j4440p9461
1504B15500k54733J6455R1847k35941m2577j30892n0631O2542j76843K03860J15598
1493a85815j86870K23257J909l2267K5798J71057K53839k97158J79150P5119l1674
1482A96345j72784k78635K4498M8741K04303J72676l5857M7316j91129r8545M4768
1471c8303j40719J76810M6633j35859k3815K2179R6399k92780Q7445K64621R7362
1460A59973j32846j99079k360j2179j78153M82583J74032l31139o3562R1463K39229
$$ plain form
1449 227962 242298 63150 55783 182564 -136838 -280853 61339 311648 323467 237594 266311
1438 266311 184441 74256 97677 174200 24219 -3416 -121669 -128066 -277406 -232728 9719
1427 9719 -87408 6364 -222877 -235445 -150225 3450 65910 -159261 -20425 130873 43081
1416 43081 -180721 -17597 107226 160805 218189 -26349 19152 -102490 -61284 211636 296321
1405 296321 -41037 -76663 147158 -127211 -93419 -153247 101772 92133 50667 -44820 -166438
1394 -166438 -140507 -108356 213054 138267 370361 321240 134608 66626 52765 29467 -198327
1383 -198327 -554655 -217799 -73299 58055 133359 87670 144146 -13594 91719 -115761
1373 -115761 -206876 -185284 -114859 58903 -90614 -223613 -124936 -59141 -224814 -189707 -151594
$$ packed form
1449B27962J4336j79148p367J26781l19402j44015L42192K50309J1819q5873K8717
1438B66311q1870j10185K3421P6523j49981k7635j18253o397j49340M4678K42447
1427I719r7127R3772k29241j2568Q5220J53675O2460k25171J38836J51298q7792
1416D3081k23802J63124J24823N3579N7384k44538M5501j21642M1206K72920Q4685
1405B96321l37358l5626K23821k74369L3792n9828K55019r639m1466r5487j21618
1394a66438K5931L2151L21410p4787K32094m9121j86632o7982j3861k3298k27794
1383a98327l56328L36856J44500J31354P5304m5689N6476j57740J05313k07480
1373a15761r1115K1592P0425J73762j49517j32999R8677O5795j65673L5107L8113
$$ plain form
1362 -151594 -217592 126018 201340 -24492 -159394 -86908 154606 -28451 -40699 47317 11262
1351 11262 60005 112473 -37333 226786 213932 155646 241784 212414 194071 -68801 58296
1340 58296 10988 -45074 19149 -174961 -434571 -263945 -105291 86069 194932 53082
1330 53082 -208428 -171768 -75718 -25978 5371 -165752 -229763 38364 88356 -64603 -16860
1319 -16860 273026 8733 -305346 -168196 289702 324732 18781 59688 -198072 -469051
1309 -469051 -257458 -260680 -354516 -322182 47145 -119229 -288586 -160267 184271 189194 -35671
1298 -35671 235623 -50120 107189 240383 1472 122540 -127365 -180870 -126126 -212449
1288 -212449 -168497 -156593 -113800 -288523 -293812 -386228 -311348 -173808 -167949 -300349 -309755 -190149
$$ packed form
1362a51594o5998L43610P5322k25832j34902P2486K41514j83057j2248Q8016l6055
1351A1262M8743N2468j49806K64119j2854n8286Q6138k9370j8343k62872J27097
1340E8296m7308n6062O4223j94110k59610J70626J58654J91360J08863j41850
1330E3082k61510L6660R6050M9740L1349j71123o4011K68127M9992j52959M7743
1319a6860K89886k64293l14079J37150M57898L5030l05951M0907k57760k70979
1309d69051K11593l222r3836L2334L69327j66374j69357J28319L44538M923k24865
1298c5671K71294k85743J57309J33194k38911J21068k49905n3505N4744q6323
1288b12449M3952J1904M2793j74723n289r2416P4880J37540N859j32400r406J19606
$$ plain form
1276 -190149 -143025 -170838 -210172 74685 62346 63157 198975 44837 42516 233306 181231
1265 181231 -135642 36131 -60450 216690 -47322 -280356 -231676 -56328 30429 -77162
1255 -77162 -49264 -152370 167743 296470 102612 -78533 -330843 -107777 -108035 -360140 -269996
1244 -269996 -117334 -200787 -144656 77046 -73149 -159968 -200529 -205479 -114411 -312591 -303850
1233 -303850 33392 126545 -68167 -231416 -39844 100778 160885 -21024 -197505 -143132
1223 -143132 -70440 -72043 -47495 36889 -121232 -340901 -187289 -265614 -117835 -81194 -216736
1212 -216736 -197981 31045 -37938 211096 44288 -125174 105068 30501 214608 190055
1202 190055 -73375 -227956 -228607 -234179 -178611 -128885 48731 171704 47366 -178246 -328745
$$ packed form
1276a90149M7124k7813l9334K84857j2339Q11J35818j54138k321J90790n2075
1265A81231l16873J71773r6581K77140k64012k33034M8680J75348Q6757j07591
1255g7162K7898j03106L20113J28727j93858j81145k52310K23066k58k52105R0144
1244b69996J52662q3453N6131K21702j50195q6819m0561m950R1068j98180Q741
1233c03850L37242R3153j94712j63249J91572J40622O0107j81909j76481N4373
1223a43132P2692j603K4548Q4384j58121k19669J53612p8325J47779L6641j35542
1212b16736J8755K29026o8983K49034j66808j69462K30242p4567J84107k4553
1202A90055k63430j54581o51n572N5568M9726J77616J22973j24338k25612j50499
$$ plain form
1191 -328745 -133981 43767 -23922 -100298 84466 -15496 50748 -27138 88673 116636 4325
1180 4325 -166255 -308795 -205370 -345904 -245138 -214302 -352894 -314713 81007 6591 -185355
1169 -185355 -81912 4425 -183329 28900 286580 5205 -360262 -101707 28716 -11310
1159 -11310 -206697 -49334 80268 30968 104417 123523 -381825 -137654 83506 -102411
1149 -102411 -167580 -269727 -337656 -149339 -71474 2345 37595 -208090 -151096 -71258 139827
1138 139827 56599 -93890 -189736 55517 -91766 -325029 -193957 -4391 82340 -30562
1128 -30562 -141933 -31687 -175906 -537912 -439552 -115676 15520 27163 -91694 72712
1118 72712 183102 30474 54899 293989 234208 232499 40583 -200900 -132173 -121369 -26122
$$ packed form
1191c28745J94764J77748o7689p6376J84764r9962O6244p7886J15811K7963j12311
1180D325j70580j42540J03425j40534J00766L0836j38592L8181L95720p4416j91946
1169a85355J03443Q6337j87754K12229K57680k81375l65467K58555J30423m0026
1159a1310j95387J57363J29602m9300P3449J9106n05348K44171K21160j85917
1149a02411o5169j02147o7929J88317P7865P3819L5250k45685N6994P9838K11085
1138A39827q3228j50489r5846K45253j47283k33263J31072J89566Q6731j12902
1128c0562j11371J10246j44219l62006R8360L23876J31196J1643j18857J64406
1118G2712J10390j52628K4425K39090n9781j709j91916k41483O8727J0804R5247
$$ plain form
1107 -26122 109909 -108388 242357 -74537 -153913 28626 -31865 -257894 -348911 -343404 -139219
1096 -139219 142462 -14740 112211 27774 131038 92805 -172094 -224864 79446 87092 -39722
1085 -39722 -91840 -130319 -29181 7564 -28692 42203 -23177 -84461 -193418 -61402 173249
1074 173249 275067 4066 143043 213436 -50232 -95473 -80138 -115503 -184540 -88957 10512
1063 10512 185204 -15468 -90813 81708 220897 -12450 24403 -143340 -100533 144249
1053 144249 46988 -214619 -180204 19158 -75490 -185959 -146577 -187795 -110062 166778 79870
1042 79870 170413 213838 87694 -55986 236389 154756 196355 111739 285427 311151 318390
1031 318390 214488 -152946 18437 -133545 -347288 -208425 -146243 -56422 -119615 -285485
$$ packed form
1107b6122J36031k18297L50745l16894p9376J82539o0491k26029r1017N507K04185
1096a39219K81681j57202J26951q4437J03264l8233k64899n2770L04310P646j26814
1085c9722n2118l8479J01138L6745l6256P0895o5380o1284j08957J32016K34651
1074A73249J01818k71001J38977P0393k63668m5241J5335l5365o9037R5583R9469
1063A0512J74692k00672p5345J72521J39189k33347L6853j67743M2807K44782
1053A44249r7261k61607L4415J99362r4648j10469L9382m1218P7733K76840q6908
1042G9870R0543M3425j26144j43680K92375q1633M1599q4616J73688K5724P239
1031C18390j03902l67434J71383j51982k13743J38863O2182Q9821o3193j65870
$$ plain form
1021 -285485 -227726 -158568 -155416 -4634 4897 135987 403806 297424 135942 -152578 -308864
1010 -308864 -373330 -64473 105468 -185862 10785 -140182 -91592 12629 50574 60100 -245419
999 -245419 -75033 -10854 296029 204709 99907 143292 58898 -67836 80135 250451 9451
988 9451 196252 191956 14423 189030 102577 -165241 -143158 -254393 -190176 -240632 -157302
977 -157302 68995 -26215 -131536 -5671 267952 107906 266306 378490 105416 -11629
967 -11629 270201 -20580 -213030 -41968 162895 107247 336888 145686 -221418 -33105
957 -33105 -298607 -138560 -157312 -104894 -88318 72288 128085 280080 6286 -45865 225216
946 225216 -7106 -20011 184493 445215 270616 -9211 120578 -66860 116869 129287
$$ packed form
1021b85485N7759O9158L152J50782R531J31090K67819j06382j61482k88520j56286
1010c08864o4466L08857J69941k91330J96647j50967M8590J04221L7945R526l05519
999b45419J70386O4179L06883r1320j04802M3385q4394j26734J47971J70316k41000
988I451J86801m296j77533J74607q6453k67818K2083j11235O4217n0456Q3330
977a57302K26297r5210j05321J25865K73623j60046J58400J12184k73074j17045
967a1629K81830k90781j92450J71062K04863n5648K29641j91202l67104J88313
957c3105k65502J60047j8752N2418J6576J60606N5797J51995k73794n2151K71081
946B25216k32322j2905K04504K60722j74599k79827J29789j87438J83729J2418
$$ plain form
936 129287 -45480 2124 217602 161258 100600 134014 34597 -9217 18070 120613 -73060
925 -73060 -184435 -171553 135395 256198 40430 -38910 18714 -84105 256759 187513 212113
914 212113 190968 -61237 14897 -284687 -153235 24595 -188809 3304 15565 309666
904 309666 373299 307599 45169 -82974 -205470 106368 53145 -146325 -202356 7823 -25054
893 -25054 89156 127637 -110402 -70035 -42613 83304 93645 -137291 -74642 -45000 16400
882 16400 -10707 -203527 185399 108534 35273 -70365 -23741 -188522 -94464 119439 110206
871 110206 3750 -49856 36470 229733 244427 -62182 59771 204342 190441 190435 185290 17642
859 17642 -212311 -329383 -79701 -79380 -248068 -226750 10272 82030 69895 144346 -10922
$$ packed form
936A29287j74767M7604K15478n6344o0658L3414r9417m3814K7287J02543j93673
925g3060j11375J2882L06948J20803k15768p9340N7624j02819L40864o9246K4600
914B12113k1145k52205P6134k99584J31452J77830k13404J92113J2261K94101
904C09666O3633o5700k62430j28143j22496L11838n3223j99470n6031K10179l2877
893b5054J14210L8481k38039M0367K7422J25917J0341k30936O2649K9642O1400
882A6400k7107j92820L88926p6865p3261j05638M6624j64781R4058K13903r233
871A10206j06456n3606Q6326J93263J4694l06609J21953J44571j3901on145j67648
859A7642k29953j17072K49682L21j68688K1318K37022P1758j2135P4451j55268
$$ plain form
848 -10922 -51695 -39474 129239 3381 -118262 -190541 -276678 -161688 74294 167052 -25424
837 -25424 -227705 191782 -141114 36382 90803 -274127 -221617 -157330 -28845 61388 -69406
826 -69406 -172052 -93141 -113714 -78822 -260688 -256181 -156239 -39900 253537 163999 -8939
815 -8939 -224658 -135807 -36631 -53721 196755 1837 -75992 152775 -227508 -21315 16067
804 16067 56136 103619 46384 -106222 -158514 -256289 -263810 -483644 -364236 -120151 -12022
793 -12022 22226 -60557 -147732 -116232 -166190 -202666 -20445 -138307 -272031 -453429 -202360
782 -202360 131688 93420 -172136 162628 119124 166288 -228624 -40110 -57740 230326 378544
771 378544 197631 20021 75477 238649 137473 76849 23507 64773 -112281 -81401 61866
$$ packed form
848a0922m0773J2221J68713j25858j21643p2279q6137J14990K35982R2758j92476
837b5424k02281M19487l32896J77496N4421l64930N2510O4287J28485R0233j30794
826f9406j02646P8911k0573L4892j81866M507R9942J16339K93437q9538j72938
815h939k15719Q8851R9176j7090K50476j94918p7829K28767l80283K06193L7382
804A6067M0069M7483n7235j52606n2292r7775p521k19834J19408K44085J08129
793a2022L4248q2783q7175L1500m9958l6476J82221j17862j33724j81398K51069
782b02360L34048l8268k65556L34764m3504M7164l94912J88514j7630K88066J48218
771C78544j80913j77610N5456J63172j01176o0624n3342M1266j77054L0880J43267
$$ plain form
760 61866 147943 -89419 -167704 -199239 -62605 70671 -74482 148548 111679 12605 3018
749 3018 -30688 118647 40847 67888 -137615 -247249 -156963 -112489 57785 -152725 -149388
738 -149388 -193239 -122146 -155106 -109073 -147522 -21493 -78629 87973 450806 237939 167489
727 167489 157564 299634 308243 83215 -14468 6369 46219 -7455 289869 316978 217262 191952
715 191952 -42099 209720 74653 213900 116249 9046 30325 -70306 -272110 -354793
705 -354793 -24738 255568 122923 51246 -188082 14913 23977 -92616 134618 -85054
695 -85054 133570 152693 77097 -15654 -115624 -172747 -114468 -198562 66253 -78622 -192713
684 -192713 153363 117690 -89413 4012 199936 130725 -1956 112332 -88118 -179296 -182992
$$ packed form
760F1866Q6077k37362p8285l1535J36634J33276j45153K23030l6869r9074r587
749C018l3706J49335p7800K7041k05503j09634R0286M4474J70274k10510L337
738a49388m3851P1093l2960M6033l8449J26029n7136J66602L62833k12867p0450
727A67489r925J42070Q609k25028r7683K0837L9850n3674K97324K7109r9716k5310
715A91952k34051K51819j35067J39247r7651j07203K1279j00631k01804q2683
705c54793L30055K80306j32645p1677k39328K02995R064j16593K27234k19672
695h5054K18624J9123p5596r2751r9970n7123N8279q4094K64815j44875j14091
684a92713L46076l5673k07103R3425J95924o9211j32681J14288k00450r1178l696
$$ plain form
673 -182992 -186553 -194513 -385638 -163509 -155445 111352 266138 376914 288300 216476 2771
662 2771 -92048 -151753 -96821 -34499 -55230 53042 145513 155830 5129 -37861 -386156 -303850
650 -303850 -81461 -39780 -35790 -111590 -135102 -233585 171281 144717 165551 108394 200600 257596
638 257596 -73815 -349782 -116780 119301 113459 139272 27817 7037 53159 47908 -90010
627 -90010 -59958 -104959 -211154 152919 154270 71897 -111320 -53012 -171276 -208476 149422
616 149422 36784 33498 197222 326498 82305 -122920 -65824 -126047 -111733 123472 130904
605 130904 95119 -34486 99391 239044 44179 -91567 93293 47481 16472 -75752 -41908
594 -41908 71220 -78146 -134498 -160729 -92277 -178326 -321445 -26380 -100290 -99941 -198333 -251608
$$ packed form
673a82992l561p960j91125K22129Q064K66797J54786J10776q8614p1824k13705
662B771r4819n9705N4932O2322k0731J08272R2471J0317j50701m2990l48295Q2306
650c03850K22389M1681L990p5800k3512r8483M04866k6564K0834n7157R2206N6996
638B57596l31411k75967K33002K36081n842K5813j11455k0780M6122n251j37918
627i0010L0052m5001j06195L64073J351q2373j83217N8308j18264l7200L57898
616A49422j12638l286J63724J29276k44193k05225N7096o0223J4314K35205P432
605A30904l5785j29605J33877J39653j94865j35746J84860m5812l1009r2224L3844
594d1908J13128j49366n6352k6231O8452q6049j43119K95065p3910L49r8392n3275
$$ plain form
582 -251608 287073 205735 111200 81645 -33357 29779 -101034 -151590 -80153 -7639 -58509
571 -58509 -171286 -42084 -190015 -336218 -34947 -111384 -186387 -392854 -261977 -29980
561 -29980 168328 58519 -136768 21298 -33389 -35183 69060 51493 94487 -98286 -244776
550 -244776 -55831 155259 194695 132321 -8590 63434 175260 179531 139156 175603 249456
539 249456 33699 -48408 -197213 -143344 -77573 -3628 -157239 -192495 77089 -51276 -91856
528 -91856 -234154 -264708 -201900 -129398 -67747 1055 30009 -108835 -214403 -105492 60415
517 60415 168764 147087 -89086 -119554 -10682 -253547 -273661 -336110 -403930 -47167 -42063
506 -42063 -145152 -34601 160931 98458 80140 -104007 -266954 -237080 -40564 -4327 -111649
$$ packed form
582b51608N38681q1338r4535k9555j15002O3136j30813n0556P1437P2514n0870
571e8509j12777J29202j47931j46203L01271p6437p5003k06467J30877K31997
561b9980J98308j09809j95287J58066n4687j794J04243j7567M2994j92773j46490
550b44776J88945K11090L9436o2374j40911P2024J11826M271m0375L6447P3853
539B49456k15757q2107j48805N3869O5771P3945j53611l5256K69584j28365m0580
528i1856j42298l0554O2808P2502O1651O8802K8954j38844j05568J08911J65907
517F0415J08349k1677k36173l0468J08872k42865k0114o2449o7820L56763N104
506d2063j03089J10551J95532o2473j8318j84147j62947K9874J96516L6237j07322
$$ plain form
495 -111649 -103504 -157562 -168254 72110 81480 -189448 -26149 62433 -119337 -31126 -285896
484 -285896 -11433 161365 54034 -74878 35103 -79072 -149648 -34367 -91192 -171093
474 -171093 -353045 34653 -46368 -88431 -111623 12101 -210418 -226931 -86461 28744 320348
463 320348 182402 151651 181276 71600 -9789 245580 223203 -15138 -67879 81648 308798
452 308798 375322 395425 403005 143816 -153746 13235 -191203 -344465 -233273 -275050 -80531
441 -80531 68000 74313 88851 286418 -30458 -148678 -156728 -80164 -108741 -234674 -239967 -39808
429 -39808 -19571 -39090 132452 160428 210162 355477 161840 78242 24124 49988 206357
418 206357 212764 -74405 -18536 39610 -228536 -123854 -98383 192381 45702 -293667 -106331
$$ packed form
495a11649Q145n4058j0692K40364R370k70928J63299Q8582j81770Q8211k54770
484b85896K74463J72798j07331j28912J09981j14175p0576J15281n6825p9901
474a71093j81952L87698q1021m2063k3192J23724k22519j6513J40470J15205K91604
463C20348j37946l0751K9625j09676q1389K55369k2377k38341n2741J49527K27150
452C08798O6524K0103P580k59189k97562J66981k04438j53262J11192m1777J94519
441h0531J48531O313J4538J97567l16876j18220q050P6564k8577j25933n293K00159
429c9808K0237j9519J71542K7976M9734J45315j93637q3598n4118K5864J56369
418B06357O407k87169N5869N8146k68146J04682K5471K90764j46679l39369J87336
$$ plain form
407 -106331 152637 204315 136785 -66029 -206953 -228997 -58387 -69417 -64443 142586 332682
396 332682 365453 494019 388706 385724 273727 109022 308924 146446 68998 305315 248959
385 248959 273798 233715 302433 223904 -61807 -29071 94804 -407300 -582165 -271014 -212754
374 -212754 -41878 403525 365278 60772 179845 104776 -121158 251217 73856 73370 226881
363 226881 149292 164669 164283 65082 236899 438663 278195 291622 307820 297051 295744 286152
351 286152 -182141 -148100 -123353 -157313 -57160 -77604 -224330 123891 277844 -113517 157183
340 157183 235637 -9609 130355 530230 222220 -17319 101305 -77076 97015 208744
330 208744 405055 354553 13716 -52638 126088 348168 433387 190081 118754 -106350 26662
$$ packed form
407a06331K58968N1678o7530k02814j40924k2044J70610j1030M974K07029J90096
396C32682L2771J28566j05313k982j11997j64705J99902j62478p7448K36317n6356
385B48959K4839m0083O8718p8529k85711L2736J23875n02104j74865L11151N8260
374b12754J70876M45403l8247l04506J19073p5069k25934L72375j77361m86J53511
363B26881p7589J5377l86r9201J71817K01764j60468J3427J6198j0769j307r592
351B86152m68293L4041K4747l3960J00153k0444j46726L48221J53953l91361K70700
340A57183P8454k45246J39964L99875l08010k39539J18624j78381J74091J11729
330B08744J96311n0502l40837o6354J78726K22080Q5219k43306p1327k25104J33012
$$ plain form
319 26662 264068 278424 302068 130927 138088 -4395 50155 266627 -45120 48867 130415
308 130415 -68749 -146275 -291719 -300976 -114501 -81342 51439 48439 17433 43332 159293
297 159293 363936 317625 306967 164038 259168 553618 211718 152100 326121 95742 132331
286 132331 349737 358196 101987 67425 -168797 -105785 -85197 -86585 283000 217954 -164382
275 -164382 -166564 -44777 179295 190830 94163 23562 53171 358015 278928 -456 -97393
264 -97393 -65799 20823 47980 106575 -13084 199687 135739 -155280 91539 105195 161181
253 161181 8897 -173327 -127195 -111895 135641 356422 117270 -200982 -111 -30708
243 -30708 23480 16528 23280 121299 35666 39377 20710 19996 29887 -55413 30907 17418 42028
$$ packed form
319B6662K37406J4356K3644j71141P161j42483N4550K16472l11747R3987Q1548
308A30415j99164p7526j45444r257J86475L3159J32781l000l1006K5899J15961
297A59293K04643m6311j0658j42929R5130K94450l41900n9618J74021k30379L6589
286A32331K17406Q459k56209l4562k36222O3012K0588j388L69585o5046l82336
275a64382k182J21787K24072J1535r6667p0601K9609L04844p9087k79384r6937
264i7393L1594Q6622K7157N8595j19659K12771o3948k91019K46819J3656N5986
253A61181j52284j82224M6132J5300K47536K20781k39152l18252K00871l0597
243c0708N4188o952O752R8019q5633L711j8667p14R891q5300Q6320j3489K4610
$$ plain form
230 42028 175066 -22575 122567 261608 399351 244660 300727 339501 24291 51175 209478
219 209478 81388 -57085 49914 261166 273636 -101920 -107880 1112 124421 171575 318475
208 318475 571861 238388 162331 83326 -161839 -7048 180797 383191 415800 47113
198 47113 258599 267534 130699 214307 76830 -73910 -74388 -93802 -132319 -39949 148867 217605
186 217605 241902 269621 162645 -12345 69961 239297 61927 343548 485046 113579
176 113579 56265 230645 151680 283976 227479 340568 242838 50106 375877 212990 181755
165 181755 110385 50506 46420 82480 80183 -107427 57459 299417 107269 -84657 -158396
154 -158396 -173703 -203679 9085 119332 78312 56619 -54259 -52844 42233 233945 176653
$$ packed form
230D2028J33038j97641J45142J39041J37743j54691N6067L8774l15210K6884J58303
219B09478j28090j38473J06999K11252J2470l75556n960J08992J23309M7154J46900
208C18475K53386l33473p6057p9005k45165J54791J87845K02394L2609l68687
198D7113K11486Q935j36835Q3608j37477j50740m78j9414l8517R2370J88816O8738
186B17605K4297K7719j06976j74990Q2306J69336j77370K81621J41498l71467
176A13579n7314J74380p8965J32296n6497J13089r7730j92732L25771j62887l1235
165A81755p1370n9879m086L6060k297j87610J64886K41958j92148j91926p3739
154a58396j5307k9976K12764J10247m1020k1693j10878J415R5077J91712n7292
$$ plain form
143 176653 286951 137668 111957 225773 268978 96806 112316 60635 -17201 115901 49950
132 49950 144923 121967 214275 289703 177124 187586 234999 367478 223186 127806 175681
121 175681 101622 77336 58375 -56232 53232 69582 -64604 -198651 -19352 136599 280944
110 280944 229616 122888 173630 161579 110685 124367 10661 -48501 -151872 -123716 227918
99 227918 41158 -36945 -137559 -126550 132393 86969 -89424 -178418 15984 159320 181952
88 181952 158843 164275 272395 240768 280996 104614 187450 216210 106421 -603 2705 245178
76 245178 189158 87012 147148 33015 -108766 -98082 -27481 63518 118266 166990 30833
65 30833 -96330 -85896 7438 127781 16823 103190 243911 207854 48393 41574 148606
$$ packed form
143A76653J10298j49283k5711J13816M3205j72172J5510n1681p7836J33102o5951
132D9950R4973k2956R2308P5428j12579J0462M7413J32479j44292r5380M7875
121A75681p4059k4286j8961j14607J09464J6350j34186j34047J79299J55951J44345
110B80944n1328j06728N0742j2051n0894J3682j13706n9162j03371K8156L51634
99B27918j86760p8103j00614J1009K58943m5424j76393q8994J94402J43336K2632
88A81952k3109N432J08120l1627M0228j76382Q2836K8760j09789j07024L308K42473
76B45178n6020j02146O0136j14133j41781J0684P0601R0999N4748M8724j36157
65C0833j27163J0434R3334J20343j10958Q6367J40721l6057j59461o819J07032
$$ plain form
54 148606 222435 296894 379939 220168 101800 177943 315482 138058 69985 -20747 -23974
43 -23974 -62524 62853 107031 -66034 90153 177646 -7441 -47618 -86101 -125881 141163
32 141163 127075 45790 -6365 36796 244750 317995 253913 -88860 -51068 120683 94410
21 94410 78721 45664 316725 455271 354543 49829 63016 79724 196583 35071 60232
10 60232 103730 124165 297111 214177 62546 -107810 -66470 -49315 97675 204769
0 204769
$$ packed form
54A48606P3829P4459Q3045j59771j18368P6143J37539j77424o8073r0732l227
43b3974l8550J25377M4178j73065J56187Q7493j85087m0177l8483l9780K67044
32A41163j4088q1285n2155M3161K07954P3245o4082l42773L7792J71751k6273
21I4410j5689l3057K71061J38546j00728l04714J3187J6708J16859j61512K5161
10F0232M3498K0435J72946q2934j51631j70356M1340J7155J46990J07094
0B04769
$$ Imaginary data points
##PAGE= N=2
##DATA TABLE= (X++(I..I)), XYDATA
$$ plain form
16383 -1709821 -1784853 -1727910 -1742187 -1641790 -1613684 -1618325 -1533256 -1416934 -1440176 -1480634 -1346476
$$ packed form
16383a709821p5032N6943j4277J00397K8106m641Q5069J16322k3242m0458J34158
$$ [...]
##END NTUPLES=NMR SPECTRUM
##END=
