##TITLE=1H_DE-80H_X3
 200.13MHz, d2o
 8 sc
 
 19ns.26.2.2025
##JCAMPDX= 6.0         $$ Bruker NMR JCAMP-DX V2.0
##DATA TYPE= NMR SPECTRUM
##DATA CLASS= NTUPLES
##ORIGIN= UXNMR, Bruker Analytische Messtechnik GmbH
##OWNER= pz
$$ XWIN-NMR		Version 3.5
$$ Tue Jul 15 14:23:39 2025 Russian Standard Time (UT+4h)  Yarkov@DPX200
##.OBSERVE FREQUENCY= 200.1313
##.OBSERVE NUCLEUS= ^1H
##.ACQUISITION MODE= SIMULTANEOUS
##.ACQUISITION SCHEME= undefined
##.AVERAGES= 8
##.DIGITISER RES= 18
##SPECTROMETER/DATA SYSTEM= spect
##.PULSE SEQUENCE= zg30
##.SOLVENT NAME= CDCl3
##.SHIFT REFERENCE= (INTERNAL, CDCl3, 0, 15.4902)
##AUDIT TRAIL= $$ (NUMBER, WHEN, WHO, WHERE, WHAT)
$$ ##TITLE= Audit trail, XWIN-NMR		Version 3.5
$$ ##JCAMPDX= 5.01
$$ ##ORIGIN= Bruker BioSpin GmbH
$$ ##OWNER= Yarkov
$$ C:/Bruker/XWIN-NMR/data/yarkov2/nmr/H-C/1/pdata/1/auditp.txt
$$ ##AUDIT TRAIL=  $$ (NUMBER, WHEN, WHO, WHERE, WHAT)
(   1,<2025-07-15 14:22:32.45 +0400>,<Yarkov>,<DPX200>,
      <created by zg, POWCHK disabled, PULCHK disabled
       configuration hash MD5:
       00 E9 B6 7A A2 85 ED C7 34 08 36 98 17 FE 4E 26
       data hash MD5: 16K
       62 17 7B 3C FB CB C4 23 9B A1 40 0F A4 C4 98 D3>)
(   2,<2025-07-15 14:22:43.70 +0400>,<Yarkov>,<DPX200>,
      <Start of raw data processing
       efp BC_mod = 2 LB = 0.25 FT_mod = 6 PKNL = 1 PHC0 = -1358.325 PHC1 = 12.79091 SI = 16K 
       data hash MD5: 16K
       E4 33 F6 02 12 65 CA 54 97 36 EE 07 82 CF 8C 55>)
(   3,<2025-07-15 14:22:52.59 +0400>,<Yarkov>,<DPX200>,
      <abs ABSG = 5 
       data hash MD5: 16K
       AC 79 43 E7 F7 27 E2 E4 CE A9 AC 82 55 26 F5 88>)
$$ ##END=
$$ 
$$ hash MD5
$$ 27 65 25 4B BA 34 59 05 1A DE 0D 72 E9 24 2A C0
##$RELAX= 
##$RELAX= 
##$RELAX= 
##$RELAX= 
##$RELAX= 
##$RELAX= 
$$ Bruker specific parameters
$$ --------------------------
##$DU= <C:/Bruker/XWIN-NMR>
##$EXPNO= 1
##$NAME= <H-C>
##$PROCNO= 1
##$TYPE= <nmr>
##$USER= <yarkov2>
##$AMP= (0..31)
100 100 100 100 100 100 100 100 100 100 100 100 100 100 100 100 100 100 
100 100 100 100 100 100 100 100 100 100 100 100 100 100 
##$AQSEQ= 0
##$AQ_mod= 1
##$AUNM= <au_zg>
##$AUTOPOS= <>
##$BF1= 200.13
##$BF2= 200.13
##$BF3= 200.13
##$BF4= 200.13
##$BF5= 200.13
##$BF6= 200.13
##$BF7= 200.13
##$BF8= 200.13
##$BYTORDA= 1
##$CFDGTYP= 0
##$CFRGTYP= 5
##$CHEMSTR= <none>
##$CNST= (0..31)
1 1 145 1 1 1 1 1 1 1 1 1 1 1 1 1 1 1 1 1 1 1 1 1 1 1 1 1 1 1 1 1 
##$CPDPRG= <>
##$CPDPRG1= <>
##$CPDPRG2= <>
##$CPDPRG3= <>
##$CPDPRG4= <mlev>
##$CPDPRG5= <mlev>
##$CPDPRG6= <mlev>
##$CPDPRG7= <mlev>
##$CPDPRG8= <mlev>
##$CPDPRGB= <>
##$CPDPRGT= <>
##$D= (0..31)
0 0.7 0 0 0 0 0 0 0 0 0 0.03 0 0 0 0 0 0 0 0 0 0 0 0 0 0 0 0 0 0 0 0 
##$DATE= 1752574951
##$DBL= (0..7)
120 120 120 120 120 120 120 120 
##$DBP= (0..7)
150 150 150 150 150 150 150 150 
##$DBP07= 0
##$DBPNAM0= <>
##$DBPNAM1= <>
##$DBPNAM2= <>
##$DBPNAM3= <>
##$DBPNAM4= <>
##$DBPNAM5= <>
##$DBPNAM6= <>
##$DBPNAM7= <>
##$DBPOAL= (0..7)
0.5 0.5 0.5 0.5 0.5 0.5 0.5 0.5 
##$DBPOFFS= (0..7)
0 0 0 0 0 0 0 0 
##$DE= 6
$$ [...]
##$SUBNAM3= <"">
##$SUBNAM4= <"">
##$SUBNAM5= <"">
##$SUBNAM6= <"">
##$SUBNAM7= <"">
##$SUBNAM8= <"">
##$SUBNAM9= <"">
##$SW= 18.0517328524113
##$SWIBOX= (0..15)
0 0 2 0 0 0 0 0 0 0 0 0 0 0 0 0 
##$SW_h= 3612.71676300578
##$TD= 16384
##$TD0= 1
##$TE= 0
##$TE2= 300
##$TE3= 300
##$TEG= 300
##$TL= (0..7)
0 120 120 120 120 120 120 120 
##$TP= (0..7)
150 150 150 150 150 150 150 150 
##$TP07= 0
##$TPNAME0= <>
##$TPNAME1= <>
##$TPNAME2= <>
##$TPNAME3= <>
##$TPNAME4= <>
##$TPNAME5= <>
##$TPNAME6= <>
##$TPNAME7= <>
##$TPOAL= (0..7)
0.5 0.5 0.5 0.5 0.5 0.5 0.5 0.5 
##$TPOFFS= (0..7)
0 0 0 0 0 0 0 0 
##$TUNHIN= 0
##$TUNHOUT= 0
##$TUNXOUT= 0
##$USERA1= <user>
##$USERA2= <user>
##$USERA3= <user>
##$USERA4= <user>
##$USERA5= <user>
##$V9= 5
##$VALIST= <valist>
##$VCLIST= <CCCCCCCCCCCCCCC>
##$VD= 0
##$VDLIST= <DDDDDDDDDDDDDDD>
##$VPLIST= <PPPPPPPPPPPPPPP>
##$VTLIST= <TTTTTTTTTTTTTTT>
##$WBST= 1024
##$WBSW= 4
##$XGAIN= (0..3)
0 0 0 0 
##$XL= 0
##$YL= 0
##$YMAX_a= 52195
##$YMIN_a= -46532
##$ZGOPTNS= <>
##$ZL1= 120
##$ZL2= 120
##$ZL3= 120
##$ZL4= 120
##$ABSF1= 15.47915
##$ABSF2= -2.5727
##$ABSG= 5
##$ABSL= 3
##$ALPHA= 0
##$AQORDER= 0
##$ASSFAC= 0
##$ASSFACI= 0
##$ASSFACX= 0
##$ASSWID= 0
##$AUNMP= <proc_1d>
##$AZFE= 0.1
##$AZFW= 0.1
##$BCFW= 0
##$BC_mod= 2
##$BYTORDP= 0
##$COROFFS= 0
##$CY= -3
##$DATMOD= 1
##$DC= 0
##$DFILT= <>
##$DTYPP= 0
##$F1P= 0
##$F2P= 0
##$FCOR= 1
##$FTSIZE= 16384
##$FT_mod= 6
##$GAMMA= 0
##$GB= 0
##$INTBC= 1
##$INTSCL= 3.241238e-09
##$ISEN= 128
##$LB= 0.25
##$LEV0= 0
##$LPBIN= 0
##$MAXI= 10000
##$MC2= 0
##$MEAN= 0
##$ME_mod= 0
##$MI= 1.114404
##$NCOEF= 0
##$NC_proc= -9
##$NLEV= 6
##$NOISF1= 3.799351
##$NOISF2= 2.8
##$NSP= 0
##$NTH_PI= 0
##$NZP= 0
##$OFFSET= 15.49017
##$PC= 1
##$PHC0= -1358.325
##$PHC1= 12.79091
##$PH_mod= 1
##$PKNL= yes
##$PPARMOD= 0
##$PSCAL= 0
##$PSIGN= 0
##$REVERSE= no
##$SF= 200.130006309964
##$SI= 16384
##$SIGF1= 3
##$SIGF2= 2
##$SINO= 0.751879
##$SIOLD= 32768
##$SREGLST= <19F.Aceton>
##$SSB= 0
##$STSI= 16384
##$STSR= 0
##$SW_p= 3612.71676300578
##$SYMM= 0
##$S_DEV= 0
##$TDeff= 16384
##$TDoff= 0
##$TI= <>
##$TILT= no
##$TM1= 0
##$TM2= 0
##$TOPLEV= 0
##$USERP1= <user>
##$USERP2= <user>
##$USERP3= <user>
##$USERP4= <user>
##$USERP5= <user>
##$WDW= 1
##$XDIM= 16384
##$YMAX_p= 405091057
##$YMIN_p= -4765038
$$ End of Bruker specific parameters
$$ ---------------------------------
##NTUPLES= NMR SPECTRUM
##VAR_NAME=  FREQUENCY,     SPECTRUM/REAL,   SPECTRUM/IMAG
##SYMBOL=    X,             R,               I
##VAR_TYPE=  INDEPENDENT,   DEPENDENT,       DEPENDENT
##VAR_FORM=  AFFN,          ASDF,            ASDF
##VAR_DIM=   16384,         16384,           16384
##UNITS=     HZ,            ARBITRARY UNITS, ARBITRARY UNITS
##FACTOR=    0.220516191357247, 1,           1
##FIRST=     3100.04772480998, 0,            0
##LAST=      -512.669038195802, 0,           0
##MIN=       -512.669038195802, -4765038,    0
##MAX=       3100.04772480998, 405091057,    0
$$ Real data points
##PAGE= N=1
##DATA TABLE= (X++(R..R)), XYDATA
$$ [...]
5987d51049l82034N78173K15046j41166j69412j12967n492J53l06218J53543M07503
$$ -451049 -833083 -254910 -39864 -181030 -350442 -463409 -468901 -468748 -774966 -621423 -213920
5976b13920L5282J88201J51372K73066o64028l00207k3086J86868m52912K58137
$$ -213920 -178638 9563 160935 434001 -230027 -530234 -553320 -366452 -819364 -561227
5966e61227P94350M6184j63627J5270m4160j17796O26389m06583n25482K4325
$$ -561227 233123 279307 115680 130950 86790 -31006 595383 188800 -336682 -312357
5956c12357j95749L05303K47746j40245K58827L4877k44895l0237j35357j68655
$$ -312357 -508106 -202803 44943 -95302 163525 198402 -46493 -76730 -212087 -380742
5946c80742p4084O2975L13538L82756l41719j32342j62195J80645M40988k81383
$$ -380742 -454826 -391851 -78313 304443 -37276 -169618 -331813 -151168 289820 8437
5936H437p62473o2495K10383K94397K73750k77801J62408J83789R6955J80341
$$ 8437 -754036 -816531 -606148 -311751 -38001 -315802 -153394 30395 127350 307691
5926C07691n5674J47434j53515m75229k47792J55802N0795L1745m66511l63895
$$ 307691 252017 399451 245936 -229293 -477085 -321283 -270488 -238743 -705254 -1069149
5916a069149P61936L43413J92688J34549o546j33416K62185j63348m08344j66724
$$ -1069149 -307213 36200 228888 363437 356891 223475 485660 322312 -86032 -252756
5906b52756M44543n695q795R631p2318q0569j62989m01718M25903N8098L09559
$$ -252756 191787 186092 177297 186928 114610 34041 -128948 -530666 -104763 -46665 262894
5895B62894j0367j66871J5937K16713J36002j91822k37874J64220q0534j90098
$$ 262894 252527 85656 101593 318306 454308 262486 24612 188832 108298 -81800
5885h1800J26799p2570o6182n08296J957l41890L73287N76789j04207N3338J32307
$$ -81800 44999 -27571 -93753 -602049 -600092 -941982 -568695 8094 -96113 -42775 89532
5874H9532K21149K75989o98970l18342N603P2908J29526J64801k83252k19345
$$ 89532 310681 586670 -112300 -430642 -425039 -352131 -222605 -57804 -341056 -560401
5864e60401N63731O9608l55439M82305l25848k48801O77109k31628n20146L08324
$$ -560401 3330 72938 -282501 199804 -126044 -374845 302264 70636 -449510 -141186
5854a41186L03574l61669M9669j54972P1432J25139K99566k91423n54582P76041
$$ -141186 162388 -199281 -149612 -304584 -233152 -108013 191553 -99870 -654452 121589
5844A21589J89550Q0646o02649m74950j10967k3055M56727L42983K54030M4715
$$ 121589 311139 391785 -210864 -685814 -796781 -819836 -363109 -20126 233904 278619
5834B78619j92028j60480M2577p29343L95713n739K6923k40404M14201L6067n06914
$$ 278619 86591 -73889 -31312 -760655 -364942 -370681 -343758 -584162 -169961 -133894 -640808
5823f40808P5601J81422M80544J33407k5635K4909L76474n27958r1921l06647
$$ -640808 -565207 -383785 96759 230166 204531 229440 605914 77956 -13965 -320612
5813c20612K99514J33910M96285m16258l20650J96567M76973k28175M15649l57015
$$ -320612 -21098 112812 609097 192839 -127811 68756 545729 317554 733203 376188
5803C76188j024719j84276N91682K47321k06199k90000N2853L10541k35349J30790
$$ 376188 -648531 -832807 -241125 6196 -200003 -490003 -437150 -126609 -361958 -231168
5793b31168J68473M97908m63142L06477k81086o0633j28877J87693o5000M97961
$$ -231168 -62695 435213 -27929 278548 -2538 -63171 -192048 -4355 -69355 428606
5783D28606n7414n64182J18281k9434m13205p9517J60232J41254N15304R4939
$$ 428606 371192 -192990 -74709 -104143 -517348 -596865 -436633 -295379 219925 314864
5773C14864m30106N9924J86689L12972n7409K3774l4647m12232j26739J46084
$$ 314864 -115242 -55318 131371 444343 386934 410708 376061 -36171 -162910 -16826
5763a6826R4158n16538Q9934k00807L06637Q68748N4881k70819p51521k51415
$$ -16826 77332 -439206 -349272 -550079 -243442 625306 680187 409368 -342153 -593568
5753e93568K22421K11022M7453K63069L57179j03327K65747k98898k20652L18870
$$ -593568 -371147 -160125 -112672 150397 507576 404249 669996 371098 150446 469316
5743D69316k93356J28418q6274n98570j42069N87438K55998k21327J3458j66465
$$ 469316 175960 304378 218104 -380466 -522535 64903 320901 99574 113032 -53433
5733e3433M61155l47207L81927M9107l73054o2294l03799N29604P3396o7232l34201
$$ -53433 407722 60515 442442 491549 118495 56201 -247598 282006 355402 288170 -46031
5722d6031n81599L53637O85182k9674l09011j72246M02843L48231K88337j66151
$$ -46031 -627630 -273993 411189 381515 72504 -99742 303101 651332 939669 773518
5712G73518K64532j40122q89860k89117N54344k0363k65644J87387N46441K53800
$$ 773518 1038050 897928 8068 -281049 273295 252932 -12712 174675 721116 974916
5702I74916m66882l19892k74118q2617l9398P7313P00509K72266n72882K64031
$$ 974916 508034 188142 -85976 -168593 -207991 -130678 569831 842097 269215 533246
5692E33246N77103n69593L6867M42464l67682J45483m26436R5462m26780K09679
$$ 533246 1110349 540756 577623 1020087 652405 797888 371452 466914 40134 249813
5682B49813K60142O5982j13453m6057j17675Q162l18489N88108o27028j3670P34387
$$ 249813 509955 575937 462484 416427 298752 306914 -11575 576533 -50495 -64165 670222
5671F70222o8553k12872N0424k6491p8605L26298J61660n50075j20760q3761k65225
$$ 670222 601669 388797 439221 412730 334125 660423 822083 272008 151248 67487 -197738
5660a97738P21103K69368k34394L7090j46985q3673K29694O5715K16676l90408
$$ -197738 523365 792733 558339 595429 448444 364771 594465 660180 876856 486448
5650D86448M3388M416L13413l51504K2154l6981j67296k98981M59252M17325p5012
$$ 486448 529836 534252 847665 496161 518315 481334 314038 15057 474309 891634 816622
5639H16622l76663J2250l08103j58205k19254m33707R9590N80164O21034J87248
$$ 816622 439959 452209 144106 -14099 -233353 -667060 -567470 12694 633728 820976
5629H20976q690m59122l00039P07142l78408k30499l1643J42559J42310J5353
$$ 820976 812286 353164 53125 760267 381859 151360 119717 262276 404586 419939
5619D19939l85364O49612K16585k63463q1214n4485L97253m65502j049M00305
$$ 419939 34575 684187 900772 637309 556095 501610 898863 433361 432312 832617
5609H32617r3680l90519m3261Q5902N83815K17711j56744M48751n20180l15372
$$ 832617 738937 348418 305157 391059 974874 1192585 1035841 1484592 964412 649040
5599F49040O21003n01568L92242m49924k57222N74752K39365k20248m42062N5589
$$ 649040 1270043 768475 1160717 710793 453571 1028323 1267688 1047440 605378 660967
5589F60967M8767j25827k27268o0289m1228j52831j35882J18797P36750J72320
$$ 660967 709734 583907 356639 296350 255122 102291 -33591 85206 821956 994276
5579I94276j68731j10160n9820m0189p8390p3860n2166N52311P0750n2194k48890
$$ 994276 825545 715385 655565 615376 536986 463126 410960 963271 1034021 981827 732937
5568G32937J74486M08670j47576k31210m87323j69668L76447J59382l5626k61227
$$ 732937 907423 1316093 1168517 937307 449984 280316 656763 816145 780519 519292
5558E19292J27988p3060K66641j25491O6437k76213r9185n22330M7088P80611
$$ 519292 647280 574220 840861 715370 781807 505594 406409 -115921 -68833 711778
5548G11778m0062l24561o8108J25797J76451L14071l86171k22920O3738O73466
$$ 711778 671716 347155 279047 404844 581295 895366 509195 286275 350013 1023479
5538A023479k80877k75488L5510O33651l75760o9260l57591J49577k09741j54641
$$ 1023479 742602 467114 502624 1136275 760515 691255 333664 483241 273500 118859
5528A18859J64382K18544J69642J27162j24268p17152l38001N87088K0745M78806
$$ 118859 283241 501785 671427 798589 674321 -42831 -380832 206256 227001 705807
5518G05807J54770k31115j01630K86514j52656J05592M06433n17165l84519N02720
$$ 705807 860577 629462 527832 814346 661690 767282 1173715 656550 272031 774751
5508G74751K97478l17801J92933l16512O36651K49871p0274p19341l02610Q4349
$$ 774751 1072229 754428 947361 630849 1267500 1517371 1447097 727756 425146 509495
5498E09495r9283R20304L1960m61784l41052l1717K42933J22436k44685l3611
$$ 509495 410212 1330516 1362476 900692 559640 527923 770856 893292 648607 614996
5488F14996M62001M7218l48684n74402K22317k92514L06974K2889P6665n1950
$$ 614996 1076997 1124215 775531 201129 423446 130932 437906 460795 537460 485510
5478D85510L08679o1335l10197J2174J49807K98044K402j26754O18673j34870
$$ 485510 794189 732854 422657 434831 584638 882682 885084 758330 1377003 1242133
5468A242133O6525m41197n3871M5323j04883M02816n3509l02812j66826J28518
$$ 1242133 1308658 867461 813590 858913 754030 1156846 1103337 800525 633699 762217
5458G62217M04608j69601p99751M13285M7447j03993j76577J12642J00358p8421
$$ 762217 1166825 997224 197473 610758 658205 554212 377635 490277 590635 512214
5448E12214K62325k72959L13973m2863m35552K85482j3049L48668J21303L48846
$$ 512214 774539 501580 815553 772690 337138 622620 609571 958239 1079542 1428388
5438A428388n53523M14104j82249j31420J63422J92737k19397j36102j12502Q584
$$ 1428388 874865 1288969 1106720 975300 1138722 1331459 1112062 975960 863458 872042
5428H72042q3571k83358K21483j4924o36537J53929K78931l49099M61246R4804
$$ 872042 788471 505113 726596 711672 75135 229064 507995 158896 620142 714946
5418G14946m0898M04582L00487k06336R0295o37414K52031m7385m1913k35072
$$ 714946 674048 1078630 1379117 1172781 1263076 625662 877693 830308 788395 553323
5408E53323j48824J87208K24518j11316j08918k8834n9859l4952m46158K40159
$$ 553323 404499 591707 816225 704909 595991 567157 507298 472346 26188 266347
5398B66347N64388J11256L0804O9979j5807J32614N1971k24154o7676k65866L32042
$$ 266347 830735 941991 972795 1042774 1026967 1159581 1211552 987398 919722 653856 985898
5387I85898L32170k46917K7914M709m33908J79880j51903k51299K77820k74440
$$ 985898 1318068 1071151 1099065 1103774 669866 849746 697843 446544 724364 449924
5377D49924k09154K99938J25180j48407p4983L4770j26270j12570K62452p59410
$$ 449924 240770 540708 665888 517481 442498 477268 350998 238428 500880 -258530
5367b58530l9641O61929J6526j36746K29527j89377k22633O35142r3419j59164
$$ -258530 -298171 363758 380284 243538 473065 283688 61055 696197 602778 443614
5357D43614k0522j03308K47202M56982k47796k17774j73373k70720P3961K06796
$$ 443614 423092 319784 566986 1023968 776172 558398 385025 114305 188266 395062
5347C95062K62453L25897j87013j76492j93242M56748K28695J74845l00586m14906
$$ 395062 657515 983412 796399 619907 426665 883413 1112108 1286953 986367 571461
5337E71461M10241l72384J9986m0130J08331K45748P5683n70784m8829l5217M71384
$$ 571461 981702 609318 629304 589174 697505 943253 1018936 448152 399323 364106 835490
5326H35490l5012J67760k01934n5426J80498k32626o8610O28370o35222k72375
$$ 835490 800478 968238 766304 710878 891376 658750 590140 1218510 583288 310913
5316C10913N24557K49052K62652L43020n66887j00681K86826J40860M73872k32167
$$ 310913 835470 1084522 1347174 1690194 1123307 1022626 1309452 1450312 1924184 1692017
5306A692017n0369k22003K28677N93646q7293O6728M52233l26001l4442P0753
$$ 1692017 1641648 1419645 1648322 2241968 2154675 2221403 2673636 2347635 2313193 2383946
5296B383946K73915K55823k14056O45185L00960m24593M02173L18885K26304N48976
$$ 2383946 2657861 2913684 2699628 3344813 3645773 3221180 3623353 3942238 4168542 4717518
5286D717518K83386j22019J58887K37702K82583P47663N54840m8694K91017K60295
$$ 4717518 5000904 4878885 5037772 5275474 5558057 6305720 6860560 6811866 7102883 7363178
5276G363178p8959K3875l5059K58066K13380m24919K42674K35064j92318J87168
$$ 7363178 7284219 7308094 7273035 7531101 7744481 7319562 7562236 7797300 7604982 7792150
5266G792150Q95119m01405L68299P8665J99142L47791K36133N5310M81632N52775
$$ 7792150 8687269 8285864 8654163 8732828 8931970 9279761 9515894 9571204 10052836 10605611
5256A0605611L67231N73716o5913P3263Q13658J71589j27133M97607Q1604M42690
$$ 10605611 10972842 11546558 11480645 11553908 12367566 12539155 12412022 12909629 12991233 13433923
5246A3433923j38739j52387N3602m13568q6834n04537o99720l31205l65920l05226
$$ 13433923 13295184 13142797 13196399 12782831 12695997 12191460 11491740 11160535 10794615 10489389
5236A0489389k59866j76564L70034O0748k20204q93964n65788j5674l39159k86077
$$ 10489389 10229523 10052959 10422993 10483741 10263537 9369573 8803785 8788111 8448952 8162875
5226H162875M20892k28407n31957K51486k4118L5304J54550R6108k06015l9068
$$ 8162875 8583767 8355360 7823403 8074889 8050771 8086075 8240625 8336733 8130718 8091650
5216H091650q20465n55912R0120l17517p9555q5331k42955R906m85078o68540
$$ 8091650 7271185 6715273 6805393 6487876 6408321 6322990 6080035 6089941 5604863 4936323
5206D936323m27822L99481m53290k86489K58835Q7193m39527q63110m1602l0051
$$ 4936323 4508501 4907982 4454692 4168203 4427038 4514231 4074704 3211594 3169992 3139941
5196C139941n75764P4920j23121j529j20934m16912J2663L02707o59926M11381
$$ 3139941 2564177 2639097 2515976 2514447 2393513 1976601 1989264 2291971 1632045 2043426
5186B043426J29800m0262m41006K75230L84186l18050l64354J79949k58061p38735
$$ 2043426 2173226 2132964 1691958 1967188 2351374 2033324 1668970 1848919 1590858 852123
5176H52123L29706K75849m4773r2599l20667l89609J37315J79593K17785m33J94700
$$ 852123 1181829 1457678 1412905 1320306 999639 610030 747345 926938 1144723 1144290 1338990
5165A338990J07549m87744J62746J2637n16369J49760j74803N52610l04498k6223
$$ 1338990 1446539 958795 1121541 1134178 617809 767569 592766 1145376 840878 814655
5155H14655L96536K27091J02693n72085l49294K68587N1294l13027N4102J37301
$$ 814655 1211191 1438282 1540975 968890 619596 888183 939477 626450 680552 817853
5145H17853n0305l5128O0413k12593K50183O1183k50088K96042l94155L21978
$$ 817853 767548 732420 792833 580240 830423 891606 641518 937560 543405 865383
5135H65383l22340K0460j00433m16048J09987N66369j48561l45477l29289K69396
$$ 865383 543043 563503 463070 47022 157009 723378 574817 229340 -99949 169447
5125A69447L45354J17589l57609j93721M9846J78040J09217m87272M85988k80875
$$ 169447 514801 632390 274781 81060 130906 308946 418163 -69109 416879 136004
5115A36004P498j31746p2116N5133p895K97455j02768L16765o61535N0827N13022
$$ 136004 143502 11756 -60360 -5227 -13122 284333 181565 498330 -163205 -112378 400644
5104D00644J83939k2132J45445k74297Pk1199j83248K22062q9672Q7125M395j01399
$$ 400644 584583 562451 707896 433599 433606 412407 229159 451221 361549 448674 453069 351670
5092C51670k00945j91306j61480m82868L05984N74402N7606J91245j87930o8470
$$ 351670 150725 -40581 -202061 -684929 -378945 195457 253063 444308 256378 187908
5082A87908k32765k12785l92264L52318M23467K75026J60872L8121m14057R1417
$$ 187908 -44857 -257642 -649906 -297588 125879 400905 561777 599898 185841 277258
5072B77258Q9976J8480m08291j29535P38790n38471l02358M70138k30692P98322
$$ 277258 367234 385714 -22577 -152112 586678 48207 -254151 215987 -14705 783617
5062G83617k51999j09219j63924j74693J98509L9624N84N06085j01296k73166
$$ 783617 531618 422399 258475 83782 282291 321915 322499 828584 727288 454122
5052D54122j01578m91462p8665N48161m67380l04207M34338P3232L41767n12475
$$ 454122 352544 -138918 -217583 330578 -136802 -441009 -6671 66561 408328 -104147
5042a04147N6039n5807k4619K28687j90747k10521P6835J96657M638m9184K95006
$$ -104147 -48108 -103915 -128534 100153 -90594 -301115 -224280 -27623 -22985 -72169 222837
5031B22837J1842J74253J65942j86676l50848j73402M88331k73964K57995o07374
$$ 222837 234679 408932 574874 388198 37350 -136052 352279 78315 336310 -271064
5021b71064q9732L01904p09566O26538j8280L58603l73449P2427J7593n16636
$$ -271064 -360796 -58892 -768458 -141920 -160200 198403 -175046 -102619 -85026 -601662
5011f01662j70158L28525K01656k5284P4684l3325N26707l63243o14857O36152
$$ -601662 -771820 -443295 -241639 -266923 -192239 -225564 301143 -62100 -676957 -40805
5001d0805J44695J10965k14887O8742P1042L809J04673N3785j66827l18542K78679
$$ -40805 103890 214855 -32 68710 139752 143561 248234 302019 135192 -183350 95329
4990I5329K08623m56554L8947j58055l71216k0515K47739O91337K87662l33598
$$ 95329 303952 -152602 -113655 -271710 -642926 -663441 -415702 275635 563297 229699
4980B29699n72197n5352J63497P4317J01952J12615K96742k3877n9289k84781
$$ 229699 -342498 -397850 -234353 -160036 -58084 54531 351273 327396 268107 -16674
4970a6674q98237K22177K51192N60660L2227j16135l34134K80067j39982P7091
$$ -16674 -914911 -692734 -441542 119118 151345 35210 -298924 -18857 -158839 -81748
4960h1748N49557L85442l41208j89443m17657M2276j5960k91223K26540N78570
$$ -81748 467809 853251 512043 322600 -95057 -52781 -68741 -359964 -133424 445146
4950D45146l86349j67799K99503o53281L12605j03786N2495O11128j97184k81728
$$ 445146 58797 -109002 190501 -462780 -150175 -253961 -201466 409662 212478 -69250
4940f9250M3979K82528K79405k91077l3352q3855J33909l00734k00992O0433J62346
$$ -69250 -25271 257257 536662 245585 212233 128378 262287 -38447 -239439 -179006 -16660
4929a6660j26942j36859K81068P0777R8311K71813m16025o83608N02573m31166
$$ -16660 -143602 -280461 607 71384 169695 441508 25483 -658125 -155552 -586718
4919e86718M87050M95573j091473K52695K17402O0749J39009M2930K82300N13722
$$ -586718 -99668 395905 -695568 -442873 -225471 -164722 -25713 17217 299517 813239
4909H13239q93266o5943K27651k68243K18915N7627l8279J67802p6047J32266
$$ 813239 -80027 -145970 81681 -186562 32353 89980 51701 219503 143456 275722
4899B75722k36670r1131K54814j67076K47031M27999K66602k23270n10543m59068
$$ 275722 39052 -52079 202735 35659 282690 710689 977291 754021 243478 -215590
4889b15590N954P3517p2010M26049o6639j16277L09133M30144K76906K0484p52866
$$ -215590 -209636 -136119 -208129 217920 151281 35004 344137 774281 1051187 1071671 318805
4878C18805j4685K18047K71014o8396R1066j76798L84014N29775k54218L08195
$$ 318805 304120 522167 793181 724785 815851 639053 1023067 1552842 1298624 1606819
4868A606819J44868J90728M27027J90213p2424K72146O16801L65623L26872K28627
$$ 1606819 1751687 1942415 2369442 2559655 2487231 2759377 3376178 3741801 4068673 4297300
4858D297300m6674q35311o78947m44302q26962k88974J40630M04015l57926l92937
$$ 4297300 4250626 3415315 2736368 2292066 1465104 1176130 1316760 1720775 1362849 969912
4848I69912o3193K83029K17001j01966j21388j08723m46614J87761N4732K58979
$$ 969912 906719 1189748 1406749 1304783 1183395 1074672 628058 815819 870551 1129530
4838A129530K73275k98309m57776k45049k45268O6724m92462N0128M82368L11704
$$ 1129530 1402805 1104496 646720 401671 156403 223127 -269335 -219207 263161 574865
4828E74865k33903m9928k44207K19564K5844N35544J52733o45801j70123p39635
$$ 574865 340962 291034 46827 266391 292235 827779 980512 334711 164588 -575047
4818e75047K63816O1241k3187Q24388p58570J60801M67116k36912L90378P0388
$$ -575047 -311231 -249990 -273177 551211 -207359 -46558 420558 183646 574024 644412
4808F44412o16338q9072J73635K33560K53594l33583m8657m76399N578L5355J15969
$$ 644412 28074 -60998 112637 346197 599791 266208 217551 -258848 -253270 -217915 -101946
4797a01946O05611K92217k03421P8867l77898l86845j94196J54207J063681J55651
$$ -101946 503665 795882 592461 671328 293430 -93415 -287611 -133404 930277 1085928
4787A085928n24615m89979N2495l3319n6466l4220p2340P07752m52982R0504K28246
$$ 1085928 561313 71334 123829 90510 34044 -176 -72516 635236 182254 272758 501004
4776E01004l08358r2417k14664o8011j10833l37749j88881Q67736K52729k49599
$$ 501004 192646 100229 -114435 -182446 -293279 -631028 -819909 47827 300556 50957
4766E0957K4643k75348n6034j50751k20553K62025L16728k32485K86089j89385
$$ 50957 75600 -199748 -255782 -406533 -627086 -365061 -48333 -280818 5271 -184114
4756a84114j25809j70527k34947L61402l35021M036O4666j41542O5969M33072
$$ -184114 -309923 -480450 -715397 -353995 -689016 -684980 -620314 -761856 -695887 -262815
4746b62815O9205M21522m48472p9099J74160j5168p6049k21101M26031l2991k14016
$$ -262815 -193610 227912 -220560 -299659 -125499 -140667 -216716 -437817 -11786 -44777 -258793
4735b58793L64037n2483K0501m37668j19576N17091k75718J51604R8119L383J99768
$$ -258793 105244 52761 73262 -364406 -483982 33109 -242609 -91005 7114 10497 210265
4724B10265K82578l99218j79687k46213O1388J97615K62793K4441l00257r86080
$$ 210265 492843 93625 -86062 -332275 -270887 -73272 189521 213962 -86295 -1072375
4714a072375M54740K21396j04573j07154M44612J03081K62219j25328n13565J47872
$$ -1072375 -617635 -396239 -500812 -607966 -163354 -60273 201946 76618 -436947 -289075
4704b89075K29899J34746k35195L6557j8477q1645j39326p1131M50919l92631
$$ -289075 -59176 75570 -159625 -123068 -141545 -223190 -362516 -433647 17272 -375359
4694c75359L61798J55302l40248K67764K69541o8274r32470Q43193M54646n33126
$$ -375359 -13561 141741 -198507 69257 338798 270524 -661946 181247 635893 102767
4684A02767j28402J50785k4123N9704l55022m64730L45743K43366l90953k95573
$$ 102767 -25635 125150 101027 160731 -194291 -659021 -313278 -69912 -460865 -756438
4674g56438M8399O12739p4386j33935M6076M52710l92447n13172L24335J72515
$$ -756438 -708039 -95300 -169686 -303621 -257545 195165 -197282 -710454 -386119 -213604
4664b13604k25515J57369K07848m9331k5543l77802o2430P47108R664k1838j95241
$$ -213604 -439119 -281750 -73902 -123233 -148776 -526578 -589008 158100 167764 145926 -49315
4653d9315k23372j37599P3134J65190k1568M84788l08751J99650m13099l99660
$$ -49315 -272687 -410286 -337152 -171962 -193530 291258 -17493 182157 -230942 -630602
4643f30602M57592J65700L69180J90705o70935K01939Q8653O2643K14446l33682
$$ -630602 -173010 -7310 361870 552575 -118360 83579 172232 234875 449321 115639
4633A15639l48420K76080m36379K82935M73010m90733j14123L53363L65709k24190
$$ 115639 -232781 43299 -393080 -110145 362865 -127868 -241991 111372 477081 252891
4623B52891L57544l22945l61361O8103Q37318j3030n00423K29768J10342m59939
$$ 252891 610435 287490 -73871 -5768 831550 818520 318097 547865 658207 198268
4613A98268j0239k86492R2432j73052p1075K87691O9083j0665M4809M19313k83208
$$ 198268 188029 -98463 -6031 -179083 -250158 37533 106616 95951 140760 560073 276865
4602B76865J90923j42336j9071K97370j31711k33699J13593O76599k44683p08743
$$ 276865 467788 325452 306381 603751 472040 238341 351934 1028533 783850 75107
4592G5107K16412J95950l76037k8363l23216q5661P72286J11833m30844J22856
$$ 75107 291519 487469 111432 83069 -240147 -325808 446478 558311 127467 250323
4582B50323M3439l25683l25326N97277j54060K41209k75966J11660k7033j81990
$$ 250323 293762 -31921 -357247 240030 85970 327179 51213 162873 135840 -46150
4572d6150P13651J43350K3925q73804k70950N87835n14120K75634j27212l93667
$$ -46150 667501 810851 834776 -39028 -309978 277857 -236263 39371 -87841 -481508
4562d81508Q63179K69079l04676N5316l71884o82961K07544N94152L23492j8177
$$ -481508 381671 650750 346074 401390 29506 -653455 -445911 148241 471733 453556
4552D53556P7866J64879m61724m5085J67276l86791j72957L5648N90317m11202
$$ 453556 531422 696301 234577 189492 356768 -30023 -202980 -167332 422985 11783
4542A1783M1325k48515N53519J02568l12520p42938M65869O21733m04117K27124
$$ 11783 53108 -195407 358112 460680 148160 -594778 -128909 492824 88707 315831
4532C15831N80958l71140l28297j36654O94428L27126j13100j03346n99317l76613
$$ 315831 896789 525649 197352 60698 755126 1082252 969152 865806 266489 -110124
4522a10124P1022l20395L23549r969R8763j97123M53548m79802n56211L78506
$$ -110124 -39102 -359497 -35948 -45917 52846 -144277 309271 -170531 -726742 -348236
4512c48236k8467J59944n1655Q24702K7978l45347j38793M09097m00993m5008
$$ -348236 -376703 -216759 -268414 556288 584266 238919 100126 509223 108230 63222
4502F3222m82015o2839L41926M14645R1873l13612L19108l43573k66351O60138
$$ 63222 -418793 -481632 -139706 274939 366812 53200 372308 28735 -237616 422522
4492D22522K23870o3270p5161l4956m12025l29163q1062N00472N9792k87039K68891
$$ 422522 646392 583122 507961 473005 60980 -268183 -349245 151227 211019 -76020 192871
4481A92871L85027J92839l17418k6038K16594l74351l27610j97092J13363n5183
$$ 192871 577898 770737 453319 427281 643875 269524 -58086 -255178 -141815 -196998
4471a96998J184714m54652m12498K24264O52110M5570l39745P8465J30867k80544
$$ -196998 987716 533064 120566 344830 996940 1042510 702765 781230 912097 631553
4461F31553j04430O38918k39903L45308n8407o70945j21359O78283P7438n38183
$$ 631553 527123 1166041 926138 1271446 1213039 542094 420735 1099018 1176456 638273
4451F38273J94440l32059j16207M19295k92421J13630k15032J29547R5161K23443
$$ 638273 832713 500654 384447 803742 511321 624951 409919 539466 634627 858070
4441H58070M39607q33300K27299Q11114r5612L94942k01335l28252n60103r1745
$$ 858070 1297677 464377 691676 1502790 1407178 1802120 1600785 1272533 712430 620685
4431F20685l18947K52930N62561r1530l67250k04288M79111K77345K3132L72535
$$ 620685 301738 554668 1117229 1025699 658449 454161 933272 1210617 1233749 1606284
4421A606284l58103j44270K19541k2456j19485M37282O53306o13812l12706R5023
$$ 1606284 1248181 1103911 1323452 1300996 1181511 1618793 2272099 1658287 1345581 1440604
4411A440604K55326l887l5192R91523L32499j52601K77466N44802l31063n3285
$$ 1440604 1695930 1692043 1656851 2648374 2980873 2828272 3105738 3650540 3319477 3266192
4401C266192k14477l91523j85988r4334N97988j21048k69036L92052L333j38124
$$ 3266192 3051715 2660192 2474204 2379870 2977858 2856810 2587774 2979826 2983159 2845035
4391B845035L41741m58342m81920L23140K85467M15342q6657N4573M92904J10937
$$ 2845035 3186776 2728434 2246514 2569654 2855121 3270463 3183806 3238379 3731283 3842220
4381C842220j91657L34792N08417r1641L8634j17019r5279j22608P61853J89560
$$ 3842220 3650563 3985355 4493772 4402131 4440765 4323746 4228467 4105859 4867712 5057272
4371E057272k74083L68948J20401j91655J75620M43468M11793M85591M75979J35531
$$ 5057272 4783189 5152137 5272538 5080883 5256503 5699971 6111764 6597355 7073334 7208865
4361G208865K69915j28601N7736N87919j19000L06708p4079Q5666J54333K32191
$$ 7208865 7478780 7350179 7407915 7995834 7876834 8183542 8109463 8195129 8349462 8581653
4351H581653O32319M50737j00839l0149O31299K95702K79688J40262M11941K30305
$$ 8581653 9213972 9664709 9563870 9533721 10165020 10460722 10740410 10880672 11292613 11522918
4341A1522918K56926L58107N38008O24445Q30561L00213N04427Q63734N32673
$$ 11522918 11779844 12137951 12675959 13300404 14130965 14431178 14935605 15799339 16332012
4332A6332012M93364M93170O41253L05335J361022L16191M86541J072845J201360
$$ 16332012 16825376 17318546 17959799 18265134 19626156 19942347 20428888 21501733 22703093
4323B2703093Q70581N68782J155910K15402Q10854Q02088N23579K69949L42333
$$ 22703093 23573674 24142456 25298366 25513768 26324622 27126710 27650289 27920238 28262571
4314B8262571K11457R9551K74130P18741J030018Q87207L17409N88109L5899R3838
$$ 28262571 28474028 28573579 28847709 29566450 30596468 31483675 31801084 32389193 32425092 32518930
4304C2518930k03677p11962p73245M77825k46480m27040o26767j165859J17343
$$ 32518930 32315253 31603291 30830046 31307871 31061391 30634351 30007584 28841725 28959068
4295B8959068q1673n09193m54990m5284o62800l09980r80452j021518r37960r41143
$$ 28959068 28877395 28368202 27913212 27867928 27205128 26895148 25914696 24893178 23955218 23014075
4285B3014075p15780j028632j023914k29042m22941o75536l50843k84725n67090
$$ 23014075 22298295 21269663 20245749 20016707 19593766 18918230 18567387 18282662 17715572
4276A7715572j078869m79250j066335l92048r80917j382092l01511l1025n38793
$$ 17715572 16636703 16157453 15091118 14699070 13718153 12336061 12034550 12003525 11464732
4267A1464732j585289l08424J416j48234n06780m63169l6179l02046j11773l41632
$$ 11464732 9879443 9571019 9572435 9424201 8917421 8454252 8418073 8116027 8004254 7662622
4257G662622n74799j58731q64570n4402N37143j09025j02432l95107K59876m31650
$$ 7662622 7087823 6929092 6064522 6010120 6547263 6438238 6335806 5940699 6200575 5768925
4247E768925J35845k33907n72030k12833q4088L3292k72515R6334m56591L05014
$$ 5768925 5904770 5670863 5098833 4886000 4801912 4835204 4562689 4659023 4202432 4507446
4237D507446M08414K01127p6751l56577j38484J40024k15695k58372J16142k90092
$$ 4507446 4915860 5116987 5040236 4683659 4545175 4685199 4469504 4211132 4327274 4037182
4227D037182k91777J15371J48483L64876k21195k19586K18558J87651m86124K23083
$$ 4037182 3745405 3860776 4009259 4374135 4152940 3933354 4151912 4339563 3853439 4076522
4217D076522O597R1051L83232m02458K12116K27191n34806j07682l71064J93632
$$ 4076522 4083119 4174170 4557402 4154944 4367060 4594251 4059445 3951763 3580699 3774331
4207C774331O8174L05442M36596Q339L70252N7457j76651p09405n2105J84915
$$ 3774331 3842505 4147947 4584543 4592882 4963134 5020591 4843940 4134535 4082430 4267345
4197D267345m36692k4502J46354K87973M33835J47563K0616j40628k36613Q42358
$$ 4267345 3830653 3806151 3952505 4240478 4674313 4821876 4842492 4701864 4465251 5307609
4187E307609K53669k26036q0577m74643K59389K39168j77571M17018L85796J24721
$$ 5307609 5561278 5335242 5254665 4780022 5039411 5278579 5101008 5518026 5903822 6028543
4177F028543N38539M27283O7071L31987N98768L55763l72434R0832O58502r7692
$$ 6028543 6567082 6994365 7061436 7393423 7992191 8347954 7975520 8066352 8724854 8627162
4167H627162M6771P97583L51255r9355K45330j80063M72504J200112J45767n76
$$ 8627162 8673933 9471516 9822771 9723416 9968746 9788683 10261187 11461299 11607066 11606490
4157A1606490J027955R17158M45452M01312N01699O67915N54460J307796J491818
$$ 11606490 12634445 13551603 13997055 14398367 14900066 15567981 16122441 17430237 18922055
4148A8922055J220549J281004O73506J201176J546839J315782J525933J995568
$$ 18922055 20142604 21423608 22097114 23298290 24845129 26160911 27686844 29682412
4140B9682412J927183K348411K617413L085391L389758M242652M269294M807756
$$ 29682412 31609595 33958006 36575419 39660810 43050568 47293220 51562514 56370270
4132E6370270N605466O594082P515081Q821880R498268J0222271J0793368J2431966
$$ 56370270 61975736 68569818 76084899 84906779 94405047 104627318 115420686 127852652
4124A27852652J3847402J6404101J9049398K2186917K7650759L4171547L6051134
$$ 127852652 141700054 158104155 177153553 199340470 226991229 261162776 297213910
4117B97213910J9706896j5474541l8299305l8598286l1954498k5743656k0227404
$$ 297213910 316920806 301446265 263146960 224548674 192594176 166850520 146623116
4110A46623116j5311849j1931982j0524718r281333p423704n600685n270181m957560
$$ 146623116 131311267 119379285 108854567 99573234 92149530 86548845 81278664 76321104
4102G6321104m145863m328788l701348l322133l334034k360335j765441k270749
$$ 76321104 72175241 67846453 64145105 60822972 57488938 55128603 53363162 51092413
4094E1092413j806502j742295k141217j781560p30803r27956r07763j027025K53261
$$ 51092413 49285911 47543616 45402399 43620839 42890036 41962080 41054317 40027292 40280553
4085D0280553o04079q27669j398673j779585j960297j220029j643710j674900
$$ 40280553 39676474 38848805 37450132 35670547 33710250 32490221 30846511 29171611
4077B9171611q59233k58180m79254j106426q32561o95358l05006q12881r13622
$$ 29171611 28312378 28054198 27574944 26468518 25635957 24940599 24635593 23822712 22909090
4068B2909090n98380j57121m77537j094981j148312o3394L3168l81119j311539
$$ 22909090 22310710 22153589 21676052 20581071 19432759 19369365 19402533 19021414 17709875
4059A7709875m24604J8511l54983j48802K99603o5621j53472n73459r41548q21653
$$ 17709875 17285271 17303782 16948799 16799997 17099600 17033979 16880507 16307048 15365500 14543847
4049A4543847K68557n38581o00084M2864j021082n02876K73482j95643r66585
$$ 14543847 14812404 14273823 13673739 13716603 12695521 12192645 12466127 12270484 11303899
4040A1303899n78117m22576l10785k42909J58735J65306J15649o27829L9433m5908
$$ 11303899 10725782 10303206 9992421 9749512 9908247 10073553 10189202 9561373 9600806 9554898
4030I554898l13240o20690m85516L11426K13025j55127k29043N1980P5870K6652
$$ 9554898 9241658 8620968 8135452 8446878 8659903 8504776 8275733 8327713 8403583 8430235
4020H430235m92789p5244L00477n73202k20201N05720p6544l10602J60613k89290
$$ 8430235 7937446 7862202 8162679 7589477 7369276 7874996 7798452 7487850 7648463 7359173
4010G359173q6833l32161k23084K01372k02052j6525m19309o6403k2054K93119
$$ 7359173 7272340 6940179 6717095 6918467 6716415 6699890 6280581 6214178 6192124 6485243
4000F485243J24479o71479j2301N8778l0738J84820P50126o48610M05102L51625
$$ 6485243 6609722 5938243 5925942 5984720 5953982 6138802 6888928 6240318 6645420 6997045
3990F997045m50312p55084K09782L51042L95108k4682j32873j83776j95303K00237
$$ 6997045 6546733 5791649 6001431 6352473 6747581 6722899 6590026 6406250 6210947 6411184
3980F411184N38968L67811m83015o158K23390J37933q2631k87266J69118J08604
$$ 6411184 6950152 7317963 6834948 6828790 7052180 7190113 7107482 6820216 6989334 7097938
3970G097938K81838m15145K80154O39774j13180R63884Q48565K6461r9147Q63396
$$ 7097938 7379776 6964631 7244785 7884559 7771379 8735263 9583828 9610289 9511142 10374538
3960A0374538Q65946Q90499M96004M17975J16471M21284J77177K23432O69374
$$ 10374538 11240484 12130983 12626987 13044962 13161433 13582717 13759894 13983326 14652700
3951A4652700O87719N85951n22341K46546J18318l64626K21146K56956L83123
$$ 14652700 15340419 15926370 15404029 15650575 15768893 15404267 15625413 15882369 16265492
3942A6265492j95097J59352J79455M02577k85363N86416l82856m44727o65647
$$ 16265492 16070395 16229747 16409202 16811779 16526416 17112832 16729976 16285249 15619602
3933A5619602p68223n45000j4983k77223l85785k4520m82832q18118k97316j59526
$$ 15619602 14851379 14306379 14291396 14014173 13628388 13603868 13121036 12302918 12005602 11846076
3923A1846076M31656K03340m2734o9322M70237M73679J65025K342K46204K89581
$$ 11846076 12277732 12481072 12438338 12369016 12839253 13312932 13477957 13480299 13726503 14016084
3913A4016084j06319L48190r7907P93520P53563K42677J72362N92276J106565
$$ 14016084 13909765 14257955 14160048 14953568 15707131 15949808 16122170 16714446 17821011
3904A7821011J070160J053601Q51352J098322J243751J190254J511077J584449
$$ 17821011 18891171 19944772 20796124 21894446 23138197 24328451 25839528 27423977
3896B7423977J645766K420007K269205K425957K216785K580042K891444L149315
$$ 27423977 29069743 31489750 33758955 36184912 38401697 40981739 43873183 47022498
3888D7022498L254567L220357M280418L567805L517128L943358L245062K432156
$$ 47022498 50277065 53497422 57777840 61345645 64862773 68806131 72051193 74483349
3880G4483349K225891J693467J264668P86465L18167l30672k36660l37025M7432
$$ 74483349 76709240 78402707 79667375 80453840 80772007 80441335 80204675 79867650 79915082
3871G9915082M26647k64840m55196l92185p27959j170895k135789k015448k379359
$$ 79915082 80341729 80076889 79621693 79229508 78501549 77330654 75194865 73179417 70800058
3862G0800058k738952l264991l181216l539371k888008l762722l454992k526625
$$ 70800058 68061106 64796115 61614899 58075528 55187520 51424798 47969806 45443181
3854D5443181l511829k714375k035159j913529j246975j939652k367294j627864
$$ 45443181 41931352 39216977 37181818 35268289 34021314 32081662 29714368 28086504
3846B8086504j244218n31935r38007j049751j472109j70054p16523k87181m81716
$$ 28086504 26842286 26310351 25372344 24322593 22850484 22680430 21963907 21676726 21195010
3837B1195010q61213r60035o27834J91224m51670q07478n30847K65236J58061
$$ 21195010 20333797 19373762 18745928 18937152 18485482 17678004 17147157 17412393 17570454
3828A7570454o7385j014422o37848N1710m19889o86056n42488l96286l08917O1696
$$ 17570454 17503069 16488647 15850799 15902509 15482620 14796564 14254076 13857790 13548873 13610569
3818A3610569l45478k5109L5937n57672J67014M6322P3824L30385m38680l47869
$$ 13610569 13265091 13239982 13275919 12718247 12885261 12931583 13005407 13335792 12897112 12549243
3808A2549243j006759l81974L25512l10512k6084N18080M57760k61215J23634
$$ 12549243 11542484 11160510 11486022 11175510 11149426 11667506 12125266 11864051 11987685
3799A1987685O8868k89279o2665q2038K94533O95944k52071N01472K29317K91312
$$ 11987685 12056553 11767274 11704609 11622571 11917104 12613048 12360977 12862449 13091766 13383078
3789A3383078j59989J66980m10961j36534m97264N3660J73685O72095L42620m24831
$$ 13383078 13223089 13390069 12979108 12842574 12345310 12398970 12572655 13244750 13587370 13162539
3779A3162539m9908n0922L29157K37731P42051N6428j08812M73864K94207M42739
$$ 13162539 13112631 13061709 13390866 13628597 14370648 14427076 14318264 14792128 15086335 15529074
3769A5529074P27009M34522O11331J124113R23527P96183P98104Q88502J495075
$$ 15529074 16256083 16690605 17301936 18426049 19349576 20145759 20943863 21832365 23327440
3760B3327440J031419L69637O38643O42190K90136M61289L02548j98899M45108
$$ 23327440 24358859 24728496 25367139 26009329 26299465 26760754 27063302 26864403 27309511
3751B7309511n11339Q7949M41070m40283M58206Q33528J49402M82423J002613
$$ 27309511 26798172 26886121 27327191 26886908 27345114 28178642 28328044 28810467 29813080
3742B9813080J122851R82475R98475J126312J2165N86556J136385L33331M01825
$$ 29813080 30935931 31918406 32916881 34043193 34055358 34641914 35778299 36111630 36513455
3733C6513455R42123R22010M12957N25591Q21086J294231J366298O98280J478372
$$ 36513455 37455578 38377588 38790545 39316136 40137222 41431453 42797751 43496031 44974403
3724D4974403J887694K177550K044336L193360L130786K830053L373868M159787
$$ 44974403 46862097 49039647 51083983 54277343 57408129 60238182 63612050 67771837
3716F7771837M523912N034576N476920O058635O108565N044148N275152O504845
$$ 67771837 72295749 77330325 82807245 88865880 94974445 100018593 105293745 111798590
3708A11798590N959943O447149N767767N563900L867585K858238K670371K236257
$$ 111798590 117758533 124205682 129973449 135537349 139404934 142263172 144933543 147169800
3700A47169800O66125k5645j34869o02389q53362j244941j639679r80982j438990
$$ 147169800 147835925 147810280 147675411 147073022 146219660 144974719 143335040 142354058 140915068
3691A40915068k376338k257724k418530k683650l317661m153390m120752m732276
$$ 140915068 138538730 136281006 133862476 131178826 127861165 123707775 119587023 114854747
3683A14854747m853293m726431n547320m871056n387097m814186m906070m809659
$$ 114854747 110001454 105275023 99727703 94856647 89469550 84655364 79749294 74939635
3675G4939635m428166m289895l542006l186950k589110k903738k610068k511718
$$ 74939635 70511469 66221574 62679568 59492618 56903508 53999770 51389702 48877984
3667D8877984j785811k032841j648741j311661j537277j786336j145790j033296
$$ 48877984 47092173 45059332 43410591 42098930 40561653 38775317 37629527 36596231
3659C6596231j432404j181982j284752m35379l35214r78690p43524l67730k8073
$$ 36596231 35163827 33981845 32697093 32261714 31926500 30947810 30204286 29836556 29808483
3650B9808483p59813q96175P02849j48527l55187k70300P7112J65138J26269L93069
$$ 29808483 29048670 28152495 28855344 28706817 28351630 28081330 28158442 28323580 28449849 28842918
3640B8842918l26901q0719M55556J01008M63407n5355k44662j8379K0375j65578
$$ 28842918 28516017 28435298 28890854 28991862 29455269 29399914 29155252 29136873 29157248 28991670
3630B8991670k5415n79038p20890l27574o54596n49919m27961m26321l78872n96812
$$ 28991670 28966255 28387217 27666327 27338753 26684157 26134238 25706277 25279956 24901084 24304272
3620B4304272n9226p1417N10917k11391j90923m94004l4246N71457K14306L90089
$$ 24304272 24245046 24173629 24684546 24473155 24282232 23788228 23753982 24325439 24539745 24929834
3610B4929834R57048N07223k023J7271L82777k27594j33373P7413j17526j64773
$$ 24929834 25886882 26394105 26392082 26409353 26792130 26564536 26431163 26508576 26391050 26226277
3600B6226277L0323j77661K3815l9679k12572K86664j45363L73239j13399l35354
$$ 26226277 26256600 26078939 26102754 26063075 25850503 26137167 25991804 26365043 26251644 25916290
3590B5916290k42278j90308j74421P333L37994j89657L6999Q1972N22658P10040
$$ 25916290 25674012 25483704 25309283 25316616 25654610 25464953 25501952 25583924 26106582 26816622
3580B6816622O87884R67601J027625O86518Q07311J125432J514295J430397J413303
$$ 26816622 27504506 28472107 29499732 30186250 30993561 32118993 33633288 35063685 36476988
3571C6476988J842088K271909K229978K330468K861471L216653L475992L175828
$$ 36476988 38319076 40590985 42820963 45151431 48012902 51229555 54705547 57881375
3563E7881375L336774L770348L649513L883534M561054M938334N028612N326289
$$ 57881375 61218149 64988497 68638010 72521544 77082598 82020932 87049544 92375833
3555I2375833M916448M680781M409769L903539L642410L307787K884983K783322
$$ 92375833 97292281 101973062 106382831 110286370 113928780 117236567 120121550 122904872
3547A22904872K828560J883721J761318K635462K717337K790672K038108J409655
$$ 122904872 125733432 127617153 129378471 132013933 134731270 137521942 139560050 140969705
3539A40969705J465506J151820J425440j2994q74489j184014j849745k807262
$$ 140969705 142435211 143587031 145012471 144999477 144124988 142940974 141091229 138283967
3531A38283967k537852l055593k924589l139057l242187l075517k878812l112574
$$ 138283967 135746115 132690522 129765933 126626876 123384689 120309172 117430360 114317786
3523A14317786k528430k437461k671583k918839l486311k912618l471778m194852
$$ 114317786 111789356 109351895 106680312 103761473 100275162 97362544 93890766 89695914
3515H9695914m142872m538258m471565m206894l716181l322662l102257k849115
$$ 89695914 85553042 81014784 76543219 72336325 68620144 65297482 62195225 59346110
3507E9346110k897003k596746k747828k230360j552410j534431j823687j305194
$$ 59346110 56449107 53852361 51104533 48874173 47321763 45787332 43963645 42658451
3499D2658451j64415j381674j267152m68103L4632n04589n72562n9998n21097
$$ 42658451 42494036 41112362 39845210 39377107 39411739 38907150 38334588 38274590 37753493
3490C7753493k50771k76260j52099k61635O43773n06125L3526K29215M72779O58078
$$ 37753493 37502722 37226462 37074363 36812728 37456501 36950376 36983902 37213117 37685896 38343974
3480C8343974L48001O84932N69074L9584Q513j55217j223166q33086N7493m21515
$$ 38343974 38691975 39376907 39945981 39985565 39994078 39838861 38615695 37782609 37840102 37418587
3470C7418587j229933n14407o74582k12323j153085n30512o20469o70036l77556
$$ 37418587 36188654 35674247 34999665 34787342 33634257 33103745 32483276 31813240 31435684
3461C1435684j48864j191832j135486r07733j089704j150438j067920r65426q51716
$$ 31435684 31286820 30094988 28959502 28051769 26962065 25811627 24743707 23778281 22926565
3452B2926565m21872l10804k37628o14857r10322m49443o68113o06258J36829
$$ 22926565 22504693 22193889 21956261 21341404 20431082 19981639 19313526 18707268 18844097
3443A8844097J10079l93113n17642p19644n0375L91036p7191o0039l71556J48049
$$ 18844097 18954176 18561063 18043421 17323777 17273402 17664438 17587247 17527208 17155652 17303701
3433A7303701j75226n60656p45738o6032o2087O76203M42371k57167R4080L40828
$$ 17303701 17128475 16567819 15822081 15756049 15693962 16370165 16812536 16555369 16649449 16990277
3423A6990277n38058L84526J18931M77416Q07456P19906K85163J77963R21741
$$ 16990277 16452219 16836745 16955676 17433092 18240548 18960454 19245617 19423580 20345321
3414B0345321O52380O88716J65433Q57663J725745J285696J290187J677648J321845
$$ 20345321 20997701 21686417 21851850 22709513 24435258 25720954 27011141 28688789 30010634
3405C0010634J630675J734739K349848J844810J911741K566165K535371L032291
$$ 30010634 31641309 33376048 35725896 37570706 39482447 42048612 44583983 47616274
3397D7616274K541053L265374K865751K866661L063296L483736L617969M247630
$$ 47616274 50157327 53422701 56288452 59155113 62218409 65702145 69320114 73567744
3389G3567744M267787M214391M479493M468024M591831M390034M440901M163166
$$ 73567744 77835531 82049922 86529415 90997439 95589270 99979304 104420205 108583371
3381A08583371L312006K253997J721441n49049j047923k221601l664794m659493
$$ 108583371 111895377 114149374 115870815 115321766 114273843 112052242 108387448 103727955
3373A03727955n981679o264344n954054n308923n443326n379920m613572m807568
$$ 103727955 97746276 91481932 85527878 80218955 74775629 69395709 64782137 59974569
3365E9974569m171160l395651l222929k541660k934267j687887k338868k541242
$$ 59974569 55803409 52407758 49184829 46643169 43708902 42021015 39682147 37140905
3357C7140905j816993k121868j927733j420523j122917j161915j023650j827968
$$ 37140905 35323912 33202044 31274311 29853788 28730871 27568956 26545306 24717338
3349B4717338j299843o64804q59209q36147j025392j003849j68317o37859q26846
$$ 24717338 23417495 22752691 21893482 21057335 20031943 19028094 18859777 18221918 17395072
3340A7395072j209742k97358L1127j297602n53615o6715r7319k41998m50890k37227
$$ 17395072 16185330 15887972 15919099 14621497 14067882 14001167 13903848 13661850 13210960 12973733
3330A2973733j53024n3013o37822o96070L4831o79109L83438k48299J07773n56990
$$ 12973733 12820709 12767696 12129874 11433804 11468635 10789526 11172964 10924665 11032438 10475448
3320A0475448k02500J10803l9156Q6073l39670k88468o54333j28984M5662K7439
$$ 10475448 10272948 10383751 10344595 10430668 10090998 9802530 9148197 9019213 9064875 9092314
3310I092314O3342K33637m43463k15424M6655k07146j02830K6048n2444O8066
$$ 9092314 9155656 9389293 8945830 8730406 8777061 8569915 8467085 8493133 8440689 8508755
3300H508755n74640l08440j04943J2199m01112m31787j99940n63702M81550N47980
$$ 8508755 7934115 7625675 7520732 7532931 7131819 6700032 6500092 5936390 6417940 6965920
3290F965920L50747k50563o29621j54571N0304K67081o1660m2903N93397n10195
$$ 6965920 7316667 7066104 6436483 6281912 6332216 6599297 6537637 6494734 7088131 6577936
3280F577936m36941K98718J50061J46987m99741N2577M06637M97093n2638j95902
$$ 6577936 6140995 6439713 6589774 6736761 6237020 6289597 6696234 7193327 7140689 6944787
3270F944787j63327j73964p003O84347j44058n96895M14838l14667l97309J31392
$$ 6944787 6781460 6607496 6600493 7284840 7140782 6543887 6958725 6644058 6246749 6378141
3260F378141K70841k37365J63367L13070j66786l57355l40314K43881j64507M4844
$$ 6378141 6648982 6411617 6574984 6888054 6721268 6363913 6023599 6267480 6102973 6147817
3250F147817p95340N00943N90919N7557k88361J42753Q129k15430M08976R62563
$$ 6147817 5352477 5853420 6444339 6501896 6213535 6356288 6364417 6148987 6557963 7520526
3240G520526n94712k49349r4851J64673q57827L36166M22491N5336m31537J4627
$$ 7520526 6925814 6676465 6581614 6746287 5888460 6224626 6647117 6702453 6270916 6285543
3230F285543J81384m69065Q57215j18253M82006k43704Q7755j12120j61044L24555
$$ 6285543 6466927 5997862 6855077 6736824 7218830 6975126 7062881 6950761 6789717 7114272
3220G114272K41988l09955N8280j6003j38687P19511O38699l38215l80753m1160
$$ 7114272 7356260 7046305 7104585 7088582 6949895 7669406 8308105 7969890 7589137 7547977
3210G547977N16874o28762K05230Q20613j43555J00615M50174o8392j99865M37736
$$ 7547977 8064851 7436089 7641319 8461932 8318377 8418992 8869166 8800774 8600909 9038645
3200I038645l10042k58621M10561L79319N54222p4129j32033J26593J87199P30254
$$ 9038645 8728603 8469982 8880543 9259862 9814084 9739955 9607922 9734515 9921714 10651968
3190A0651968O0914M39778P02288j00675L87192k10256O76270M16130J15404N35232
$$ 10651968 10712882 11152660 11854948 11754273 12141465 11931209 12607479 13023609 13139013 13674245
3180A3674245J075771N5313J4599J016294P78752O43659R69902J081071K03951
$$ 13674245 14750016 14805329 14819928 15836222 16614974 17258633 18228535 19309606 19513557
3171A9513557K85795Q79027J588411R18881Q17440J301870O25197L74280J614122
$$ 19513557 19799352 20678379 22266790 23185671 24003111 25304981 25930178 26304458 27918580
3162B7918580J915294R70642K028675J724496K284464K283561K733782L288687
$$ 27918580 29833874 30804516 32833191 34557687 36842151 39125712 41859494 45148181
3154D5148181K725028L251136L887643L916758M237644M407318N768559O370578
$$ 45148181 47873209 51124345 55011988 58928746 63166390 67573708 73342267 79712845
3146G9712845P304457Q020011P772563O435334J246773k007181l177048l046285
$$ 79712845 87017302 95037313 102809876 109245210 110491983 108484802 105307754 102261469
3138A02261469j086597n8004N55309K608162L561349M742003N466204P341512
$$ 102261469 101174872 101116868 101672177 104280339 107841688 112583691 118049895 125391407
3130A25391407R046667R349755J1358107J3136233J2858193J3731857J4565797
$$ 125391407 134438074 143787829 155145936 168282169 181140362 194872219 209438016
3123B09438016J6097711J8722887J9829872K2217379K5319428K6925491K7210810
$$ 209438016 225535727 244258614 264088486 286305865 311625293 338550784 365761594
3116C65761594K3806589J4690250Q32624j4537547k6205063l1599415l0678449
$$ 365761594 389568183 404258433 405091057 390553510 364348447 332749032 302070583
3109C02070583k8524244k5255463k2091674j8786839j5994203j4834626j3142165
$$ 302070583 273546339 248290876 226199202 207412363 191418160 176583534 163441369
3102A63441369j1362335j0876638r169633q271006p979910p065052o704014n313637
$$ 163441369 152079034 141202396 132032763 123761757 115781847 108716795 102012781 96699144
3094I6699144n682100n574402m565434m650684m713367m138000l124207k863381
$$ 96699144 91017044 85442642 80877208 76226524 71513157 67375157 64250950 61387569
3086F1387569k608521k638241l305391k588941k032741k157543k332225k229775
$$ 61387569 58779048 56140807 52835416 50246475 48213734 46056191 43723966 41494191
3078D1494191j568852r09734j348851j741113j361548j037253p88078j023494
$$ 41494191 39925339 39015605 37666754 35925641 34564093 33526840 32738762 31715268
3070C1715268j268723j444515j109832m18241j236761o64715r54161j213936m31176
$$ 31715268 30446545 29002030 27892198 27473957 26237196 25572481 24618320 23404384 22973208
3061B2973208l14918j259848n17172o81969p54848m09761Q9839j003276m65200
$$ 22973208 22658290 21398442 20881270 20199301 19444453 19034692 19124531 18121255 17656055
3052A7656055j68142k9857Q28921k29003p49875k50695n56210j34407m65084q48502
$$ 17656055 17487913 17458056 18286977 18057974 17308099 17057404 16501194 16366787 15901703 15053201
3042A5053201j50395k35875p15553k15890M00353n00608k52347o98241j01058
$$ 15053201 14902806 14666931 13951378 13735488 14135841 13635233 13382886 12684645 12583587
3033A2583587n92499o47135k7619l84909l83108J10497L01312j50047p52959o35862
$$ 12583587 11991088 11343953 11316334 10931425 10548317 10658814 10960126 10810079 10057120 9421258
3023I421258O5113K2416j61350M86219m8274m48984n27072l86107L56298m94628
$$ 9421258 9486371 9508787 9347437 9833656 9785382 9336398 8809326 8423219 8779517 8284889
3013H284889k02976L00762M1862m22604K6840j67796l4865k8120r01740j65193
$$ 8284889 8081913 8382675 8424537 8001933 8028773 7860977 7826112 7797992 6896252 6731059
3003F731059K20893q81650m49098J43069P13688n547o21403l36574l11708m74586
$$ 6731059 6951952 6070302 5621204 5764273 6477961 6472414 5851011 5514437 5202729 4728143
2993D728143o0723N70198j39567l82328J28719K8386K98865M76880l39543j43426
$$ 4728143 4667420 5237618 5098051 4715723 4844442 4872828 5171693 5648573 5309030 5165604
2983E165604j18171K60379l79116k01194l87730j47801l29717L15634K36160l21680
$$ 5165604 5047433 5307812 4928696 4727502 4339772 4191971 3862254 4177888 4414048 4092368
2973D092368r4237J77009n75078l02376K59763k52903o6922J69370p3276L32657
$$ 4092368 3998131 4175140 3600062 3297686 3557449 3304546 3237624 3406994 3333718 3666375
2963C666375j24474j59101l02392k87966K58568L82331k14785K76190L0003o7715
$$ 3666375 3541901 3382800 3080408 2792442 3051010 3433341 3218556 3494746 3524749 3457034
2953C457034o00086m64991n3515M30092N03960j73121q880L58147k21124j84868
$$ 3457034 2856948 2391957 2338442 2768534 3272494 3099373 3090493 3448640 3227516 3042648
2943C042648L1912J64672p4876m87392R0239l26029J02084m44992K33658K11745
$$ 3042648 3074560 3239232 3164356 2676964 2767203 2441174 2543258 2098266 2331924 2543669
2933B543669l0510K37327k69814j32073k25054m01764L38796N3201P5896j64870
$$ 2543669 2513159 2750486 2480672 2348599 2123545 1721781 2060577 2113778 2189674 2024804
2923B024804l03779Q7199O57189o5839k24306j03758k46126j92192k355l32086
$$ 2024804 1721025 1808224 2465413 2399574 2175268 2071510 1825384 1633192 1630837 1298751
2913A298751j39769Q68043k8264o04356J42599P2639L56213N84644m264p99033
$$ 1298751 1158982 2027025 1998761 1394405 1537004 1609643 1965856 2550500 2546236 1747203
2903A747203p0223Q7514J68051n09366j92113K3507q7197R97L2057L99110l60833
$$ 1747203 1676980 1764494 1932545 1423179 1231066 1254573 1167376 1168373 1200430 1599540 1238707
2892A238707K37097P847j89831K8249m01421R4770J16463k07132O12169J19127
$$ 1238707 1475804 1483651 1293820 1322069 920648 1015418 1131881 924749 1536918 1656045
2882A656045l39435J28278k49147l32249N08513j66923l95391k76202O16931L24416
$$ 1656045 1316610 1444888 1195741 863492 1372005 1205082 809691 533489 1150420 1474836
2872A474836j75001j6283m37893q6008O7922O13176j72819l12355k89478M92376
$$ 1474836 1299835 1283552 845659 759651 827573 1440749 1267930 955575 666097 1158473
2862A158473M31354k2602J24563k70830K3034p05574O74845O23481n33632m27948
$$ 1158473 1589827 1567225 1691788 1420958 1443992 738418 1413263 2036744 1503112 1075164
2852A075164K25180O79033q8504m69627j86429J97317L87810L79459J99502m92381
$$ 1075164 1300344 1979377 1890873 1421246 1234817 1432134 1819944 2199403 2398905 1906524
2842A906524J40844K81071J99455m23324m66720K40857M01015L85837j44290K39295
$$ 1906524 2047368 2328439 2527894 2104570 1637850 1878707 2279722 2665559 2521269 2760564
2832B760564K90772L08701J12537n67490k62567M84201l59257n54583M85125K59877
$$ 2760564 3051336 3360037 3472574 2905084 2642517 3126718 2767461 2212878 2698003 2957880
2822B957880m01202k34321p99315l38339k78587P1887R5642J39224M69665k18743
$$ 2957880 2556678 2322357 1523042 1184703 906116 978003 1073645 1212869 1682534 1463791
2812A463791o56663K48996K18529l6825Q9909L4129m78239L66493K25320j63721
$$ 1463791 807128 1056124 1274653 1237828 1327737 1361866 883627 1250120 1475440 1311719
2802A311719Q6299J43741P8990m17212j28004K03854M24784l94813m91809J20073
$$ 1311719 1398018 1541759 1620749 1203537 1075533 1279387 1704171 1309358 817549 937622
2792I37622Q9589r3821O5154l41456k15048K63297L5063l48648L73098j09098
$$ 937622 1027211 933390 998544 657088 442040 705337 740400 391752 764850 655752
2782F55752j52154N74759n84164L36042K16869M0460L03419o07126m87866m75675
$$ 655752 503598 1078357 494193 830235 1047104 1087564 1390983 783857 295991 -179684
2772a79684J80617K29320M93086n2704L63983k08090J50233K77815K12126n98491
$$ -179684 933 230253 723339 670635 1034618 826528 976761 1254576 1466702 868211
2762H68211q36227L33684M48913l35441n9626j0011k80366P113J399K43831J41608
$$ 868211 31984 365668 814581 479140 419514 409503 129137 136250 137649 381480 523088
2751E23088l55613l14446N21670J92876M7586m29975P46420r7577j93651k49972
$$ 523088 167475 -146971 374699 567575 615161 185186 931606 834029 640378 390406
2741C90406k14741m99431j49864N42326J94028J99918n52893N46403Q3687M1170
$$ 390406 175665 -323766 -473630 68696 262724 462642 -90251 456152 539839 581009
2731E81009o9027J58611M52048n49985j74226J94819L82628n84805J87671N57905
$$ 581009 511982 670593 1122641 572656 398430 593249 975877 391072 578743 1136648
2721A136648r4896J77798p77978j03571J09717M91235k34320o18643n198K23048
$$ 1136648 1041752 1219550 441572 338001 447718 938953 704633 85990 80792 303840
2711C03840K005j24313K5365j22768K92266K87705n84053j17586M57102L095K28881
$$ 303840 305845 181532 206897 84129 376395 664100 80047 -37539 419563 422658 651539
2700F51539L03665m29675q188j6707m83322P0261L40146k56823j67076M45395
$$ 651539 955204 525529 517341 500634 17312 87573 427719 170896 3820 449215
2690D49215k01108j51849N3741L52194m80711R2259P8792o0700k84028N8132P1997
$$ 449215 248107 96258 149999 502193 21482 113741 192533 131833 -152195 -94063 -22066
2679b2066M05587m2074m40869O56547K87393k48251L16107P0636m21908l15390
$$ -22066 383521 341447 -99422 557125 844518 596267 912374 983010 561102 245712
2669B45712K79265K56763N8609j21974j80871k79368L48207j64541n41657m46
$$ 245712 524977 781740 840349 718375 537504 258136 606343 441802 -99855 -100301
2659a00301M53020P453o3206m48412o251Q25865j38037J43880k29668R1157j10442
$$ -100301 352719 360172 296966 -151446 -157697 668168 530131 674011 444343 535500 425058
2648D25058j98595r0726l80213Q85299J47214r10513K27652Q6699R9908R1067
$$ 425058 226463 135737 -244476 640823 788037 -122476 105176 191875 291783 382850
2638C82850M28559n17911K16338j5058j45556m11501j35067L03028K35528k82896
$$ 382850 811409 293498 509836 494778 349222 -62279 -197346 105682 341210 58314
2628E8314P7863n05522K69399R71141m70175l67352m3442j34902Q9204K09150
$$ 58314 136177 -369345 -99946 871195 401020 33668 -9774 -144676 -55472 153678
2618A53678O51824L8674k35037m67221p9627K61272m1936J65921k61844k17297
$$ 153678 805502 844176 609139 141918 62291 323563 281627 447548 185704 -31593
2608c1593q6097L57589j57822P89947j79374l35523K83682o39126j33793L32120
$$ -31593 -117690 239899 82077 872024 692650 357127 640809 1683 -132110 200010
2598B00010K45176j79453J48417J86345l29483M64233M86649k85556j96416n34070
$$ 200010 445186 265733 414150 600495 271012 735245 1221894 936338 739922 205852
2588B05852q4779M30650n7614n89715n54127J70520J103112M93821k19049j92110
$$ 205852 121073 551723 494109 -95606 -649733 -479213 623899 1117720 898671 706561
2578G06561j88903L27504l12460j08114k26121k98257J85860J84168m63329Q777
$$ 706561 517658 845162 532702 424588 198467 -99790 86070 270238 -193091 -184314
2568a84314l9529L98656J40588L34714J09460l37187L1204L16286J7041o50975
$$ -184314 -223843 174813 315401 650115 759575 422388 453592 769878 786919 135944
2558A35944l64520N21124L1309j12664K11249Q6639n9298K48702k31733l51397
$$ 135944 -228576 292548 323857 211193 422442 509081 449783 698485 466752 115355
2548A15355L5307k87639M12468p5180k43551n68200N21860L87130J42259K01327
$$ 115355 150662 -136977 275491 200311 -43240 -611440 -89580 297550 439809 641136
2538F41136n27656L8166L67517O91541j50590l11908k9359K40175m78240m65672
$$ 641136 113480 151646 519163 1210704 1060114 748206 718847 959022 480782 15110
2528A5110j08251j44194K09496k62078L5552R5332j10881K143N821J61566J01972
$$ 15110 -93141 -237335 -27839 -289917 -254365 -159033 -269914 -267771 -261950 -100384 1588
2517A588m04344J90443J48642M45916M0319m99552K37677M22956J92370l28578
$$ 1588 -402756 -212313 -63671 382245 422564 -76988 160689 583645 776015 447437
2507D47437l20437j93910K17568P1657o8031L34757L01467o11268m11665k6333
$$ 447437 127000 -66910 150658 222315 154284 489041 790508 179240 -232425 -258758
2497b58758J75307k108N9835R3843j46602N48599o695j53428k09428J9231M62057
$$ -258758 -83451 -85559 -25724 68119 -78483 470116 463421 309993 100565 119796 581853
2486E81853j88600j68806M48652k30794k08021N0738r7267L75091n26347k61209
$$ 581853 393253 224447 673099 442305 234284 285022 187755 562846 36499 -224710
2476b24710K50622J41411P0136M71561K70616M9177j51407l96563J20252O9831
$$ -224710 25912 167323 237459 709020 979636 1028813 877406 480843 601095 670926
2466F70926J42955o0481J36790j92740m64152m05832L2752O40767j94786J11977
$$ 670926 813881 753400 890190 697450 233298 -172534 -139782 500985 306199 418176
2456D18176J94704n87211J34374n54773O3659M20825J18920Q077j81666L41461
$$ 418176 612880 25669 160043 -394730 -331071 89754 208674 216751 35085 376546
2446C76546j64196J45297K45255O3959n05638k51588J09522O99477j7204j71831
$$ 376546 212350 357647 602902 666861 161223 -90365 19157 718634 701430 529599
2436E29599K38998J49224K00425n8144l21080j31660k04555L91846P5893m71556
$$ 529599 768597 917821 1118246 1060102 739022 607362 402807 794653 870546 398990
2426C98990M38369o29822M32071L58639J07269m47336p4279m66616N06153L21744
$$ 398990 837359 207537 639608 998247 1105516 658180 583901 117285 623438 945182
2416I45182p0880l80148n4872k96829M39372L98270k17001l52888k03831N64941
$$ 945182 874302 494154 439282 142453 581825 980095 763094 410206 206375 771316
2406G71316L12251l8150l51571L55178n7107k67015l1758J50617k12033k07709
$$ 771316 1083567 1045417 693846 1049024 991917 724902 693144 843761 631728 424019
2396D24019q4300R91271k4448j11647N44331j78640l01106n76733M33080M03222
$$ 424019 339719 1330990 1306542 1194895 1739226 1560586 1259480 682747 1115827 1519049
2386A519049j02587J21246K70080J20466K18651N34849m94354j26786k71595j03684
$$ 1519049 1416462 1537708 1807788 1928254 2146905 2681754 2187400 2060614 1789019 1685335
2376A685335J0351J85858L64542J9488L95601O807k24485j16057M47749l22633
$$ 1685335 1695686 1881544 2246086 2265574 2661175 2667982 2443497 2327440 2775189 2452556
2366B452556l0796M23186L36902L65746L93668L35487L32959J27224j3853L66409
$$ 2452556 2421760 2844946 3181848 3547594 3941262 4276749 4609708 4736932 4723079 5089488
2356E089488Q52635k64927J16532L54057L80997M01773J04518J067903O84992
$$ 5089488 5942123 5677196 5793728 6147785 6528782 6930555 7035073 8102976 8787968
2347H787968J084723R31203J391047R27974J721251J333845J864022K153657K070948
$$ 8787968 9872691 10803894 12194941 13122915 14844166 16178011 18042033 20195690 22266638
2338B2266638J770663K394608K707750L446152L412802L382969M304199O206737
$$ 22266638 24037301 26431909 29139659 32585811 35998613 39381582 43685781 49892518
2330D9892518O301364P261954R469910J4287412K0332630J6168517r825499k3291951
$$ 49892518 56193882 63455836 72925746 87213158 107545788 123714305 113888806 90596855
2322I0596855j7063434j2485182q881799o676472n078001m213886k954967k705311
$$ 90596855 73533421 61048239 52166440 45489968 40411967 36198081 33243114 30537803
2314C0537803k616881k352105j382062m65498j789402j897141j310678j319323
$$ 30537803 27920922 25568817 24186755 23721257 21931855 20034714 18724036 17404713
2306A7404713o41171j226679p99827q22670j086706q25561r0771r46711r31587
$$ 17404713 16763542 15536863 14737036 13914366 12827660 12002099 11911328 10964617 10033030
2297A0033030n82529o24598o12251k34722n15318k33056n22064o19880o08120
$$ 10033030 9450501 8825903 8213652 7978930 7463612 7230556 6708492 6088612 5480492
2288E480492k05184J03424J89336o24156K79512K83272p45651j75212K20885l30421
$$ 5480492 5275308 5378732 5568068 4943912 5223424 5506696 4761045 4585833 4806718 4476297
2278D476297J1991n54765m85741k78286j51686l9757O07712o24359l92579M48874
$$ 4476297 4488288 3933523 3447782 3169496 3017810 2978053 3585765 2961406 2568827 3017701
2268C017701m69759l13951L59684R4090J67686O1133k28126p34469p30053J01136
$$ 3017701 2547942 2233991 2593675 2687765 2855451 2916584 2688458 1953989 1223936 1325072
2258A325072L71729J38034L87969r2949M72551j71033m64860L18418K08735l98958
$$ 1325072 1696801 1834835 2222804 2129855 2602406 2431373 1966513 2284931 2493666 2094708
2248B094708o886l45403m8605K8741j58353k18672k10381j42400n39052J090019
$$ 2094708 2087822 1742419 1693814 1722555 1564202 1345530 1135149 992749 453697 1543716
2238A543716N71664m29861j923J32332N6588k12720n93235M02360O2515n53948
$$ 1543716 2115380 1685519 1683596 1815928 1872516 1659796 1066561 1468921 1531436 977488
2228I77488K34400O67188o57665o07015J65996n1834m46480R20075N13743J2663
$$ 977488 1211888 1879076 1221411 614396 780392 728558 282078 1202153 1715896 1728559
2218A728559n41222j28854J35016l54458n47883K72608q0620j97110N81720N67394
$$ 1728559 1187337 1058483 1193499 839041 291158 563766 483146 286036 867756 1435150
2208A435150k40690l62525N28134n04870n56379M22775k2250m85949J93134K78840
$$ 1435150 1194460 831935 1360069 855199 298820 721595 699345 213396 406530 685370
2198F85370j17401K93702J12313n2162m54958j02238q8018r934k11513n83081
$$ 685370 567969 861671 973984 921822 466864 364626 276608 266674 55161 -527920
2188e27920N8793L93478P49819n80425o77664N83804M58693L63008n38310k59011
$$ -527920 -469127 -75649 674170 93745 -583919 -115 458578 821586 283276 24265
2178B4265R2152k18446L44364J24298N29699l47424j54244J83898r5890j0932
$$ 24265 116417 -102029 242335 366633 896332 548908 394664 578562 482672 471740
2168D71740N48218r21742k76754K23311p0238N86882l80940P124k60876l9760
$$ 471740 1019958 98216 -178538 44773 -25465 561417 180477 187601 -73275 -113035
2158a13035j48049J65989K88852k04158k42758Q05438j69359k90557K29030j1748
$$ -113035 -261084 -95095 193757 -10401 -253159 552279 382920 92363 321393 309645
2148C09645M46114k79931k28462M9484J76021J64439k37427j13975k48126j19289
$$ 309645 755759 475828 247366 296850 472871 637310 399883 285908 37782 -81507
2138h1507K8025J57725J15698L35736j71415l40723L25127N21489l01555P4481
$$ -81507 -53482 104243 219941 555677 384262 43539 368666 890155 588600 663081
2128F63081J28186j37701k32681o82300J61143R0092J3605M33256o7218n64215
$$ 663081 791267 653566 420885 -261415 -100272 -10180 3425 436681 369463 -194752
2118a94752J07546j17260J32860J49182m05492r7678M4177m220M06933K37117
$$ -194752 -87206 -204466 -71606 77576 -327916 -425594 -381417 -385637 21296 258413
2108B58413P096Q8423m48310K14737K42369R7284n50012k51894L97724N69020
$$ 258413 265509 353932 -94378 120359 362728 460012 -90000 -341894 55830 624850
2098F24850J27130k62466N58733l31973o08706q48144N39010L01006K96454O038
$$ 624850 751980 489514 1048247 716274 107568 -740576 -201566 99440 395894 401932
2088D01932j82814j96555K6861N0809J55320q7159m05447l18898O03713L11002
$$ 401932 219118 22563 49424 100233 255553 168394 -237053 -555951 47762 358764
2078C58764j90070j87493l46292j26632l39894J66066K8182Q52372O10170m10927
$$ 358764 168694 -18799 -365091 -491723 -831617 -665551 -637369 215003 825173 414246
2068D14246l15656k05841L69185j13168k87641O99256J518k00727n58314K40145
$$ 414246 98590 -107251 261934 148766 -138875 560381 561899 361172 -197142 43003
2058D3003J83511k97247O54792l42790j93214K77659k3849k08217j45535j95664
$$ 43003 226514 -70733 584059 241269 48055 325714 301865 93648 -51887 -247551
2048b47551J20979j37907n7187J99140O42913O47961o55345k13875l95618o973
$$ -247551 -126572 -264479 -321666 -122526 520387 1168348 513003 299128 -96490 -103463
2038a03463O1726O46881l29700n81739J4463N38807j11403o57768K01247M35692
$$ -103463 -41737 605144 275444 -306295 -291832 246975 135572 -522196 -320949 114743
2028A14743k11042k02966p3074L9299k88707L54180L6297K70402J77347p06976
$$ 114743 -96299 -299265 -372339 -333040 -621747 -267567 -231270 39132 216479 -490497
2018d90497m4953N8754L7046J61061Q34095L71783m67111m48129j8749O67526
$$ -490497 -535450 -476696 -439650 -278589 555506 927289 460178 12049 -6700 660826
2008F60826l94042q34590L02433O06127j51379q01369K92750J12343P6384K92986
$$ 660826 266784 -567806 -265373 340754 189375 -611994 -319244 -206901 -130517 162469
1998A62469J73198l38121O9360l81202k28351K03309J56443m00746J25008N03185
$$ 162469 335667 -2454 66906 -314296 -542647 -339338 -182895 -583641 -458633 44552
1988D4552L0827J52857K89789j34834l54315j11920l81071M566J17615m6444J8277
$$ 44552 75379 228236 518025 383191 28876 -83044 -464115 -459549 -341934 -388378 -370101
1977c70101O02514n54042k65578M15259J22337m3388q4188j64881m60932J24268
$$ -370101 232413 -321629 -587207 -171948 -49611 -92999 -177187 -342068 -803000 -678732
1967f78732P49006J3031m34160k2025l31776N41871J51281m51903m03345J34148
$$ -678732 70274 83305 -350855 -372880 -704656 -162785 -11504 -463407 -866752 -732604
1957g32604O94604k21454k93936J70192J82168M64365O4966j09312l33394J58334
$$ -732604 -38000 -259454 -553390 -383198 -201030 263335 328301 218989 -114405 43929
1947D3929J46050k56035k70031K97226l65283M66462k39978k10858J44887L22025
$$ 43929 189979 -66056 -336087 -38861 -404144 62318 -177660 -388518 -243631 78394
1937G8394j73791k98118K1524k19629n9306J41452L2612j80412O92973o75893
$$ 78394 -95397 -393515 -371991 -591620 -650926 -509474 -476862 -657274 35699 -640194
1927f40194O62027k10507Q4558o3473K06300n8275m71699l81666L65269K27299
$$ -640194 21833 -188674 -104116 -167589 38711 -19564 -491263 -872929 -507660 -280361
1917b80361l24488J10828K13811K51803o39582p4679N77593M18334m03709J93118
$$ -280361 -604849 -494021 -280210 -28407 -667989 -742668 -165075 253259 -150450 42668
1907D2668R8701l51458K36883K52457l81911j11747j5384o6829N26365M00639
$$ 42668 141369 -210089 26794 279251 -102660 -214407 -229791 -296620 229745 630384
1897F30384l15851j27479J46904m14491m86252N27342L6010n7915L0774M32490
$$ 630384 314533 187054 333958 -80533 -566785 -39443 -3433 -61348 -30574 401916
1887D01916l34878j87361J23733j30700J23666L23878m76710L11004j7888m24463
$$ 401916 67038 -120323 3410 -127290 -3624 320254 -156456 154548 136660 -287803
1877b87803k49666M5082N24971p3034j00108K63006R5686K6194k12314J56742
$$ -287803 -537469 -492387 32584 -40450 -140558 122448 218134 244328 32014 188756
1867A88756L58647J25938k44034n47520M3537k51959M15696l90015M01409J31285
$$ 188756 547403 673341 429307 -118213 -74676 -326635 89061 -300954 100455 231740
1857B31740j97161K56568q9394N9848N2275N90109K53519j243459l16891M10374
$$ 231740 34579 291147 201753 261601 313876 903985 1157504 -85955 -402846 7528
1847G528R8118p03741M60087K68895K75859k31775j19002m49547p4186j07979
$$ 7528 105646 -598095 -138008 130887 406746 174971 55969 -393578 -467764 -575743
1837e75743k9096L29619K60422j51356M93061K85346m01516n43967K74101O63075
$$ -575743 -604839 -275220 -14798 -166154 326907 612253 210737 -333230 -59129 603946
1827F03946l11281l75371m04359k2472J56888M984k99907N09296K71017N883j05264
$$ 603946 292665 -82706 -487065 -509537 -352649 -347665 -647572 -138276 132741 138624 33360
1816C3360l0157j94831n73703J91881M15041L1356J23758j02055K88230m06509
$$ 33360 3203 -191628 -765331 -573450 -158409 -127053 -3295 -105350 182880 -223629
1806b23629m1152K28874p2156j38292l9275K53286J36207N4965L01722m53609
$$ -223629 -264781 -35907 -108063 -246355 -285630 -32344 103863 158828 460550 6941
1796F941l59293M53302P0292j24652o0578l66024j88044Q7881L20986n54468N19265
$$ 6941 -352352 100950 171242 46590 -13988 -380012 -568056 -480175 -159189 -713657 -194392
1785a94392J15238l03350K13303J5423j97603N33982J80792o970k61418j00485
$$ -194392 -79154 -382504 -169201 -153778 -351381 182601 363393 356423 95005 -5480
1775e480J43268k29070K54504j81881l779m25965L72857j21653l93962J84640
$$ -5480 137788 -91282 163222 -18659 -22438 -448403 -75546 -197199 -591161 -406521
1765d06521n9536K10854K39237k75571p4829j89296M65986K4471k98435J8487
$$ -406521 -466057 -255203 -15966 -291537 -366366 -555662 -89676 -65205 -363640 -345153
1755c45153k73414M78155k6966J47276p2421O45875k63779l43352k84849j64428
$$ -345153 -618567 -140412 -167378 -20102 -92523 553352 289573 -53779 -338628 -503056
1745e03056L12186J36613L46981L47720K20344m03264m94567l76995m8629K04483
$$ -503056 -190870 -54257 292724 640444 860788 457524 -37043 -414038 -462667 -258184
1735b58184K74183R2409j44135J98367l53104J70140o77857r2548K38268O7808
$$ -258184 15999 108408 -35727 162640 -190464 -20324 -698181 -790729 -552461 -484653
1725d84653L277M3909M22628K37275N54973k68986l03719R7482l1824k64474k33352
$$ -484653 -481376 -437467 -14839 222436 777409 508423 204704 302186 270362 5888 -227464
1714b27464j28076N58249j71994q0117M33727k29968j87036J36546N3971j60114
$$ -227464 -355540 202709 30715 -49402 384325 154357 -32679 103867 157838 -2276
1704b276k73099K30994l4237m44805k28265P8500L92038j25331k975N5105j77418
$$ -2276 -275375 -44381 -78618 -523423 -751688 -673188 -281150 -406481 -409456 -354351 -531769
1693e31769L94113p5320J28875K09536l21782l5181N9993L42610K53621p03861
$$ -531769 -137656 -212976 -84101 125435 -196347 -231528 -171535 171075 424696 -279165
1683b79165q5956K97023L89847K04126j41012p65873Q0218L29770l25096k0042
$$ -279165 -365121 -68098 321749 525875 384863 -381010 -300792 28978 -296118 -316160
1673c16160j43706m93775K49742l1287q1523K70269K03924m56887K64060k49795
$$ -316160 -459866 -953641 -703899 -735186 -816709 -546440 -342516 -799403 -535343 -785138
1663g85138K00610L00284J46313J3534k29622O0663j09578K31514L43891K18015
$$ -785138 -584528 -284244 -137931 -124397 -354019 -293356 -402934 -171420 172471 390486
1653C90486k98284N1586k74012n63083N02606l05041M00560J0883k4053K79950
$$ 390486 92202 143788 -130224 -693307 -190701 -495742 -95182 -84299 -108352 171598
1643A71598o45823q0046P8257O95567l54385m52567O40259k2958m74477K59798
$$ 171598 -474225 -554271 -476014 219553 -134832 -587399 52860 29902 -444575 -184777
1633a84777M36006K83506l95774l93878J52034L92823o06492N92414K62352l01343
$$ -184777 251229 534735 138961 -254917 -102883 289940 -316552 275862 538214 236871
1623B36871K09718l10541m31750J91465N56089l39746m24313L72424P57001l64761
$$ 236871 446589 136048 -295702 -104237 451852 112106 -312207 60217 817218 452457
1613D52457m94130J63253M90838j65950l97747o7293j73933m20300K3726J40110
$$ 452457 -41673 121580 612418 446468 48721 -18572 -192505 -612805 -589079 -448969
1603d48969l2994k66358K35992L27048n89539O66221N24656k36929L86957k13060
$$ -448969 -481963 -748321 -512329 -185281 -774820 -108599 416057 179128 566085 353025
1593C53025k10009m3964l131K10822K20398k7435j63069L2032n16390l44609Q6491
$$ 353025 143016 99052 95921 306743 527141 499706 336637 368669 -147721 -492330 -405839
1582d05839j61401L22540K83288p02138j56137n8826N0571j23282n7748M26416
$$ -405839 -567240 -244700 38588 -663550 -819687 -878513 -827942 -951224 -1008972 -582556
1572e82556M10449M9094k0677j36735j2863J1705Q4670k41773j18020O15040l11064
$$ -582556 -172107 -123013 -143690 -280425 -293288 -281583 -196913 -438686 -556706 58334 -252730
1561b52730o65700p2959l5526J3689M73501N30437m33120N5243K1983K47635n39520
$$ -252730 -918430 -991389 -1026915 -1013226 -539725 -9288 -442408 -387165 -365182 -117547 -657067
1550f57067J04949K44221j36312o3579m09676M09072M36824p18133P5585J50977
$$ -657067 -552118 -307897 -444209 -507788 -917464 -508392 -71568 -789701 -714116 -563139
1540e63139R571j27830p7273k3013K02945O69013p28652L44887J47247K1261k15200
$$ -563139 -553568 -681398 -758671 -781684 -578739 90274 -638378 -293491 -146244 -124983 -340183
1529c40183o0728N70000j28191J94928J22051l19606n28072j36244Q46694O0542
$$ -340183 -400911 169089 40898 235826 357877 38271 -489801 -626045 220649 281191
1519B81191m21722j91905j55840K02333L27351j23485l64660O41662j75472L31577
$$ 281191 -140531 -332436 -488276 -285943 41408 -82077 -446737 194925 19453 351030
1509C51030j62279l56838L5470m70865L95336r2409o0935K78031k17205J57140
$$ 351030 188751 -168087 -132617 -603482 -208146 -300555 -361490 -83459 -300664 -143524
1499a43524k86736M8115J62605L65699M4398j22928k63010L6849j44462L91123
$$ -143524 -430260 -382145 -219540 146159 190557 67629 -195381 -158532 -302994 88129
1489H8129k1477j25401L68942l66207K0107l03059M07161M63075k6378m63400
$$ 88129 66652 -58749 310193 -56014 -35907 -338966 68195 531270 504892 41492
1479D1492j54062l83349o07098N89388O32060l94609K86753J34568J08255M9942
$$ 41492 -112570 -495919 -1103017 -513629 118431 -276178 10575 145143 253398 303340
1469C03340K21775n29035m81760L25855L81364o79289L44236l63129J31727J54736
$$ 303340 525115 -3920 -485680 -159825 221539 -457750 -113514 -476643 -344916 -190180
1459a90180m5902K02939K78749j63619n75505K73470J61461n61655K76976L19391
$$ -190180 -236082 -33143 245606 81987 -493518 -220048 -58587 -620242 -343266 -23875
1449b3875j32067k74462j86920n5649j58051l93588R46518R19508j75152l18211
$$ -23875 -155942 -430404 -617324 -672973 -831024 -1224612 -278094 641414 466262 148051
1439A48051j0571J22657O2230j46551k127m82417J73638k25088K540M0333j32958
$$ 148051 137480 260137 322367 175816 173689 -308728 -135090 -360178 -357638 -317305 -450263
1428d50263J74188L06229n545l66860k42391K91035k7688m23202K71175m5591
$$ -450263 -276075 30154 24609 -342251 -584642 -293607 -321295 -744497 -473322 -518913
1418e18913J31877n5282L20904k82652N26933j53398j26288K95101m7582o68501
$$ -518913 -387036 -442318 -121414 -404066 122867 -30531 -156819 138282 90700 -577801
1408e77801J97263J14459Q5069k71636j42212P0316q9898l60266K47359m36148
$$ -577801 -380538 -266079 -181010 -452646 -594858 -524542 -614440 -974706 -727347 -1163495
1398a163495L8861L59252N02955K64289m04207n59840L5636L99877M1175K47003
$$ -1163495 -1124634 -765382 -262427 1862 -402345 -962185 -926549 -526672 -485497 -238494
1388b38494N37167R8559l79493J2336K80823k00990l03313J78155J34009l285
$$ -238494 298673 397232 17739 30075 310898 109908 -193405 -15250 118759 115474
1378A15474r5461j36078L96417k49395J84538K43107K32518j08090p71428j92254
$$ 115474 20013 -116065 280352 30957 215495 458602 691120 583030 -188398 -380652
1368c80652K74140K28644n81323J71165L08608n371n93393K88799P2278p8789
$$ -380652 -106512 122132 -459191 -288026 20582 15211 -578182 -289383 -217105 -295894
1358b95894M36397p80558J004377j70848l05028K72812n45330j31825L46927L93287
$$ -295894 140503 -640055 364322 193474 -111554 161258 -384072 -515897 -168970 224317
1348B24317L9415J6875l81714l07313M18122l79497J23553M62559j20901J18440
$$ 224317 263732 280607 -101107 -408420 9702 -369795 -246242 216317 95416 213856
1338B13856k8245L47467j06398n95527k25316J42691k73214M96434L01786p64024
$$ 213856 185611 533078 426680 -168847 -394163 -251472 -524686 -28252 273534 -490490
1328d90490l83821P93750K98730m01396m95554j76730P81346j44475l86024O23038
$$ -490490 -874311 -80561 218169 -183227 -678781 -855511 -74165 -218640 -604664 18374
1318A8374j26423L47239j2697l40922l85744J08584K83222j18981k41631J69335
$$ 18374 -108049 239190 226493 -114429 -500173 -391589 -108367 -227348 -468979 -299644
1308b99644L50L67344p9904J40102J12266k56704j97144L0918J72185J94487r409
$$ -299644 -299294 68050 -11854 128248 240514 -16190 -213334 -182416 -10231 184256 174847
1297A74847L6893j73814K8971N69349n20757J28546k03668q14914L76796L65505
$$ 174847 211740 37926 66897 636246 115489 244035 40367 -774547 -397751 -32246
1287c2246K43259n9116J85108n845j29009l5347p03905j9734R46769j86963p6861
$$ -32246 211013 151897 337005 331160 202151 166804 -537101 -556835 389934 202971 126110
1276A26110j26751m54248J37487J49405o2769M25134K0997l43586L14674m14859
$$ 126110 -641 -454889 -317402 -167997 -230766 194368 215365 -128221 186453 -228406
1266b28406J24241M37821n88812j57607K15530Q1692k37726O8732N36142k31252
$$ -228406 -104165 333656 -255156 -412763 -197233 -115541 -353267 -284535 251607 20355
1256B0355j01457K19629k21321N31889P4348n44164N45620l14051L31491j53124
$$ 20355 -81102 138527 -82794 449095 523443 -20721 524899 210848 542339 389215
1246C89215l82084M2341k84101N90716k32578n20608J41282o7053k2083l52139
$$ 389215 7131 49472 -234629 356087 123509 -397099 -255817 -322870 -344953 -697092
1236f97092l20609o6048M82160K84944K98253K60262m20088L07272q0318n98242
$$ -697092 -1017701 -1083749 -601589 -316645 -18392 241870 -178218 129054 48736 -549506
1226e49506J56154K40208K53502m71747j52026P9685M68166J28908k16643O1740
$$ -549506 -393352 -153144 100358 -371389 -523415 -443730 24436 153344 -63299 -1559
1216a559M53982j39989k85243j13168m4660L6745j08581m0589P2716P5612L41438
$$ -1559 452423 312434 27191 -85977 -130637 -93892 -202473 -243062 -170346 -94734 246704
1205B46704n15759M35690N18437k29074j55372l67797l2442p626K40231l40028
$$ 246704 -269055 166635 685072 455998 300626 -67171 -99613 -107239 132992 -207036
1195b07036l33260L1092N93661l50255J3564j26956J52721k65843L03833K38309
$$ -207036 -540296 -509204 84457 -265798 -252234 -379190 -226469 -492312 -188479 49830
1185D9830j85890M19711k70938k56822O04112k71393n06885J93315j99393L9535
$$ 49830 -136060 283651 12713 -244109 360003 88610 -418275 -224960 -424353 -384818
1175c84818k8117M93948J28912J51122K61636n0651l02723l86177j40970K75914
$$ -384818 -412935 81013 209925 361047 622683 572032 269309 -116868 -257838 18076
1165A8076n874m42787K65780j03991o0518J10312l8498K14563K27586j75000J07151
$$ 18076 12202 -430585 -164805 -268796 -329314 -219002 -257500 -42937 184649 9649 116800
1154A16800l82269L24050k90257O6110K40059n34134l07426L14382R76464o3595
$$ 116800 -265469 58581 -231676 -165566 74493 -459641 -767067 -452685 523779 460184
1144D60184R4613n54420J05271K06861P0062j76113K13846l3966l35694Q567J17075
$$ 460184 554797 377 105648 312509 382571 206458 420304 386338 50644 59211 176286
1133A76286m46209j14705n35653k63801M81329J72412J14272j79270l08849M82575
$$ 176286 -269923 -384628 -920281 -1184082 -702753 -530341 -416069 -595339 -904188 -421613
1123d21613M79631O8038j96799k52318K26416p8240L16082k76050Q5134K91732
$$ -421613 58018 126056 -70743 -323061 -96645 -174885 141197 -134853 -49719 242013
1113B42013k62914L97694K80672l02145n33696O6866R1080l62582j6031N00985
$$ 242013 -20901 376793 657465 355320 -178376 -111510 -20430 -383012 -399043 101942
1103A01942M48687m95991j16861l46152O73184J92812m91987j59407j22538P35178
$$ 101942 550629 54638 -62223 -408375 264809 457621 -34366 -193773 -316311 418867
1093D18867m19823l38849q4263l09891M13493O84409M11520m37061o49773M0803
$$ 418867 -956 -339805 -424068 -733959 -320466 363943 775463 338402 -311371 -270568
1083b70568K39962q2240M20060J20052j85025l62980L6851J01060k00868K30951
$$ -270568 -30606 -112846 307214 427266 242241 -120739 -83888 17172 -183696 47255
1073D7255J02622J75286o5014j21741K2279M14507j66839p15072L12999K94299
$$ 47255 149877 325163 260149 138408 160687 575194 408355 -306717 6282 300581
1063C00581J93445J35648R8740j255723K06474M93079o8138p1635j69118j49215
$$ 300581 494026 629674 728414 -527309 -320835 172244 104106 32471 -136647 -285862
1053b85862J22986P16821m00756k61841q1435J43838P27023L41692N34873p69537
$$ -285862 -162876 553945 153189 -108652 -190087 -46249 680774 1022466 1557339 787802
1043G87802m12090n65185M1252J60614p2413N03845m03521J49818M87022J28042
$$ 787802 375712 -189473 -148221 12393 -60020 443825 40304 190122 677144 805186
1033H05186o19318L33845l00534k20741l50774P1716K03254K14906l46170M52086
$$ 805186 185868 519713 219179 -1562 -352336 -280620 -77366 137540 -208630 243456
1023B43456L08511k49823k32119j87894l55117K52507J46387K02191J9708m22358
$$ 243456 551967 302144 70025 -117869 -472986 -220479 -74092 128099 147807 -274551
1013b74551N62577O158o11107j89669L26381K51202J4258K16510j48717O6420
$$ -274551 288026 294184 -316923 -506592 -180211 70991 85249 301759 153042 219462
1003B19462O6281k63498M7816j92995N22562l66318k69740K48725J0898J50914
$$ 219462 285743 22245 70061 -122934 399628 33310 -236430 12295 23193 174107
993A74107l0517L07745o37689M48116n8838N7059l6048j39569p3322l56291l01233
$$ 174107 143590 451335 -186354 261762 202924 259983 223935 84366 11044 -345247 -646480
982f46480J0039N78386J16094j2126o7503J41690k04488L98592l26994J30289
$$ -646480 -636441 -58055 58039 45913 -21590 120100 -84388 314204 -12790 117499
972A17499K36408k60040k96263M52j37390K04925m0534J94231M99769l3507Q8859
$$ 117499 353907 93867 -202396 -201944 -339334 -134409 -174943 19288 519057 485550 574409
961E74409k41036L2282K35339J27845o7720p19553j67919K80654J88339j07359
$$ 574409 333373 365655 600994 728839 661119 -58434 -226353 54301 242640 135281
951A35281K14312k77023K49664k96622n83955L81248K8584j19373j31247O59115
$$ 135281 349593 72570 322234 25612 -558343 -177095 -148511 -267884 -399131 259984
941B59984J07172k90496M57176o8076K09918k43018l20797j32995n07331j70207
$$ 259984 367156 76660 533836 465760 675678 432660 111863 -21132 -528463 -698670
931f98670L78708r5610L05506l15660L26036Q66252m70175K0316j81671l24144
$$ -698670 -319962 -415572 -110066 -425726 -99690 766562 296387 316703 135032 -189112
921a89112L732n4740L30650J87601n36436O6634m8326L28338p7906l48261j21928
$$ -189112 -185380 -240120 90530 278131 -258305 -191671 -239997 88341 10435 -337826 -459754
910d59754M46029K32280L0187K51098J24148j57807n4554R6178K05210r00770
$$ -459754 -13725 218555 248742 499840 623988 466181 411627 507805 713015 -187755
900a87755n07408l758K2419L38716N34763K29514m98347p7140j96519M44913j317
$$ -187755 -695163 -698921 -676502 -337786 196977 426491 -71856 -148996 -345515 99398 98081
889I8081J51533l31339J74188l25939k47456K39573M59904K42659k57981M60720
$$ 98081 249614 -81725 92463 -233476 -480932 -241359 218545 461204 203223 663943
879F63943k29241o3607l35782j59251K83982j5355m486K70361q26333J72124M59828
$$ 663943 434702 371095 35313 -123938 160044 144689 140203 410564 -415769 -243645 216183
868B16183J8209M8466R2301o9319l89242N1606R8978M97356J18350m69275O03921
$$ 216183 234392 282858 375159 305840 -83402 -31796 67182 564538 682888 213613 817534
857H17534R2251l20949l09844j16577j28119m59324k33275K33663N37058k61780
$$ 817534 909785 588836 278992 162415 34296 -425028 -658303 -424640 112418 -149362
847a49362k89389L4442L79982N0448j5273j35551j73819L49094K29169k2626J20746
$$ -149362 -438751 -404309 -24327 26121 10848 -124703 -298522 50572 279741 257115 377861
836C77861p359J64731j52995l0274j41889m9080r1550K25796k58340j94694R4364
$$ 377861 370502 535233 382238 351964 210075 160995 69445 295241 36901 -157793 -63429
825f3429L75125O0790m19885j01881l72821K00623O61433J3355j15788l57581
$$ -63429 311696 372486 -47399 -149280 -522101 -321478 339955 353310 237522 -120059
815a20059l37465L54788O03333N20654n27586J6412k51645m01993j9524M83237
$$ -120059 -457524 -102736 500597 1021251 493665 510077 258432 -143561 -163085 320152
805C20152m96862j46321J98031j00384L46905L9577R8616J23959l15412k03057
$$ 320152 -176710 -323031 -125000 -225384 121521 161098 259714 383673 68261 -134796
795a34796j70398L08748M15918n27612K45089P5262q9390K23986k97754J930R600
$$ -134796 -305194 3554 419472 -108140 136949 212211 122821 346807 49053 50983 60583
784F0583p00358K77005J84389L70581j11407j61242k22455M04351M30858o35493
$$ 60583 -639775 -362770 -178381 192200 80793 -80449 -302904 101447 532305 -103188
774a03188k28489J34933J95335P4875L64230k19258K38310n79910M384J2051m89692
$$ -103188 -331677 -196744 -1409 73466 437696 218438 456748 -123162 -118778 -106727 -596419
763e96419L78614m3836L23425K61563m28375m20520K50714L34697J3549m77124
$$ -596419 -217805 -261641 61784 323347 -105028 -525548 -274834 59863 73412 -403712
753d03712M41566J49697j5893J91111l20517K60768n87984K98747J27918k31573
$$ -403712 37854 187551 171658 362769 42252 303020 -284964 13783 141701 -89872
743h9872m8522N6556Q6823k44467K99721Q73290j15186l52675p05882L77239O28839
$$ -89872 -138394 -81838 4985 -239482 60239 933529 818343 465668 -240214 137025 765864
732G65864J01378p96385k39421k29986k02922M65273N5632J20391k6978M02558
$$ 765864 867242 70857 -168564 -398550 -601472 -136199 -80567 39824 12846 415404
722D15404J5184L61102m79918j26597J38412j94106o058J34783n427N3288k26653
$$ 415404 430588 791690 311772 185175 323587 129481 123423 258206 252779 306067 79414
711G9414j41138k56372L37512k36774k0678J9090K91739n161L47203j25313l62425
$$ 79414 -61724 -318096 19416 -217358 -238036 -218946 72793 67632 414835 289522 -72903
700g2903k16860N05492l61660k72120L6069M58554K29119k98300M4329K6126q1126
$$ -72903 -289763 215729 -145931 -418051 -381982 76572 305691 7391 51720 77846 -3280
689c280m09891M52785m6076J06098n82419k7611j30918K91144M51992P0039M37217
$$ -3280 -413171 39614 -6462 99636 -482783 -510394 -641312 -350168 101824 171863 609080
678F09080k57908J14332k00456q48450P90962M78949j55326o74809l52704K58394
$$ 609080 351172 465504 265048 -583402 207560 686509 531183 -143626 -496330 -237936
668b37936k78294k72052L02401Q84015k24746k87154J41651j67652M37564j21457
$$ -237936 -516230 -788282 -485881 398134 173388 -113766 27885 -139767 297797 176340
658A76340o3317n90643l19302J74534O30132j22533K20352M37656j78577k56536
$$ 176340 113023 -477620 -796922 -622388 7744 -114789 105563 543219 364642 108106
648A08106j94635M41177k07276l37410K37085L56446j099290L85677J74718K28312
$$ 108106 -86529 354648 147372 -190038 47047 403493 -695797 -310120 -135402 92910
638I2910L66203K33818J62718k41827l09145m37293j94846n4906n1579j71777
$$ 92910 459113 692931 855649 613822 304677 -132616 -327462 -382368 -433947 -605724
628f05724O7727n3791L89374N70975K58994j02881j05683j62612l9604k43800
$$ -605724 -537997 -591788 -202414 368561 627555 524674 418991 256379 216775 -27025
618b7025M41695l92639L7162N15032r80424N62336J28732o44541Q5923N44044
$$ -27025 414670 22031 59193 574225 -406199 156137 284869 -359672 -273749 270295
608B70295J99335J5966k99204q02691J56183j6249K09418n80517K94862L09663
$$ 270295 469630 485596 186392 -616299 -460116 -476365 -266947 -847464 -552602 -242939
598b42939j421K85544P3072o20970K54502j67371J3531j40956K73779N43206k27575
$$ -242939 -244360 41184 114256 -506714 -252212 -419583 -406052 -547008 -273229 269977 42402
587D2402J46040p0506J62993j72747L05497n00192j96322K86384l1272K61880
$$ 42402 188442 117936 280929 108182 413679 -86513 -282835 3549 -27723 234157
577B34157m02583j27500J14974j00352L71418k16290K23548M8920K08872J05443
$$ 234157 -168426 -295926 -180952 -281304 90114 -126176 97372 146292 355164 460607
567D60607m80063k10363j03020L98186O35793L97651k67976n49477m59270K89446
$$ 460607 -19456 -229819 -332839 65347 701140 1098791 830815 281338 -177932 111514
557A11514m52204m08759M76221K79346m04782J3567L18349k80062j30103M93827
$$ 111514 -340690 -749449 -273228 6118 -398664 -385097 -66748 -346810 -476913 16914
547A6914M6788k01622o955K76499k83152j9017M80559m08378q4045N6107O27706
$$ 16914 63702 -137920 -144875 131624 -151528 -170545 310014 -98364 -182409 -126302 501404
536E01404l37477k7388J46523j92408k26056N21415K7981l41554K66876K02494
$$ 501404 163927 136539 283062 90654 -135402 386013 413994 72440 339316 541810
526E41810m79833k7146k03533L9205M09136L03274k29682k45585l05971k02913
$$ 541810 61977 34831 -168702 -129497 279639 582913 353231 107646 -198325 -401238
516d01238j89501L77639N16617m2594l2073o6873j06878m33966N50934j60861
$$ -401238 -590739 -213100 303517 260923 228850 161977 55099 -378867 172067 11206
506A1206k90272K28471o9852L7634L20541K94301j110755n5152N39181o8330K47530
$$ 11206 -279066 -50595 -120447 -82813 237728 532029 -578726 -633878 -94697 -163027 84503
495H4503L77923L03080o927k26917J23149J28119n73866K22191l40097L0396M5573
$$ 84503 462426 765506 758579 531662 654811 782930 209064 431255 91158 121554 167127
484A67127j06040J20084m21270q5691K42734j58137K42201l31045R1730j39122
$$ 167127 61087 181171 -240099 -325790 -83056 -241193 1008 -330037 -238307 -377429
474c77429j83178L48588J37317J38357j61225J49693k06938j08935K74845m2121
$$ -377429 -560607 -212019 -74702 63655 -97570 52123 -154815 -263750 11095 -31026
464c1026n16214Q81492L28601q63157J69202k5245o04216Q9340J340959j59930
$$ -31026 -547240 334252 662853 -200304 -31102 -56347 -660563 -571223 769736 609806
454F09806m92657k38947j66395J15203p6731K71335J30647L81008K11334n1058
$$ 609806 117149 -121798 -288193 -172990 -249721 21614 152261 533269 744603 693545
444F93545l02967j07884l10076J22971j63020k21336K66130K06643l01247O90235
$$ 693545 390578 282694 -27382 95589 -67431 -288767 -22637 184006 -117241 572994
434E72994q803l06519J17784q77945N88609J65985j20388K58320J11692l92592
$$ 572994 564191 257672 375456 -502489 86120 252105 131717 390037 501729 109137
424A09137K8763L28434m82205J47429L98950m15873l45670L52273L39360o01843
$$ 109137 137900 466334 -15871 131558 530508 114635 -231035 121238 460598 -141245
414a41245p2963l21915j98245N76369J92326J05601k22186J05990n00021m00436
$$ -141245 -214208 -536123 -734368 -157999 34327 139928 -82258 23732 -476289 -876725
404h76725L53879K14488O12797K16575M90927j13903n94588m82680n6899M96177
$$ -876725 -522846 -308358 304439 521014 1011941 898038 303450 -179230 -236129 260048
394B60048N8007m66762m20773K32881j1864N79950J87981K0624j49580K85620
$$ 260048 318055 -148707 -569480 -336599 -348463 231487 419468 440092 290512 576132
384E76132l7099k35780M02089l26177j08171m423m97894j30296O64657n896M9078
$$ 576132 539033 303253 705342 379165 270994 266571 -231323 -361619 303038 297142 346220
373C46220r11420m82060N03828L51589N55269P3526o11832j78081M60043m99380
$$ 346220 -565200 -1047260 -543432 -191843 363426 436952 -174880 -352961 107082 -392298
363c92298N1383L24898K3679j13581k49085K15205k67797K13825P93305J71750
$$ -392298 -340915 -16017 7662 -105919 -355004 -139799 -407596 -193771 599534 771284
353G71284o12259l01851k45168N13873M92757p81042l49396K74412L3599J66762
$$ 771284 159025 -142826 -387994 125879 618636 -162406 -511802 -237390 -203791 -37029
343c7029j71847K78697R1584J23837K00840n32265Q7055j07063l86220K82304
$$ -37029 -208876 69821 161405 285242 486082 -46183 40872 -66191 -452411 -170107
333a70107K00445j3476Q4905j25235K90692K5644l15204L80165m65841o1723N97107
$$ -170107 30338 16862 101767 -23468 267224 292868 -22336 357829 -108012 -169735 427372
322D27372l84931M9533m7515J68070k77149n93878L30909K66741J97296P49492
$$ 427372 42441 91974 44459 212529 -64620 -658498 -327589 -60848 136448 885940
312H85940q96515j47956M05753j44386k67251N88735k71529j21326j9350N0080
$$ 885940 -10575 -158531 247222 102836 -164415 424320 152791 31465 12115 62195
302F2195K79285m59513J6830j03655M22114j10153l4274L75205k91574j00049
$$ 62195 341480 -118033 -101203 -204858 217256 107103 72829 448034 156460 56411
292E6411L5502K8548P8098K94388n8328J84184n76726K02431K29240r8681N5942
$$ 56411 91913 120461 198559 492947 434619 618803 42077 244508 473748 375067 431009
281D31009m67180L11112M4014m09445l73139k33449P9281Q23876j46143k01009
$$ 431009 -36171 274941 318955 -90490 -463629 -697078 -617797 206079 59936 -141073
271a41073l15636L3173k1912J0968K52341k09594L35675L19992j26035j54863
$$ -141073 -456709 -423536 -445448 -434480 -182139 -391733 -56058 263934 137899 -16964
261a6964L22715j50997P9508l3071m53650J5586j07361N941j01754L00477j10885
$$ -16964 305751 154754 234262 201191 -252459 -236873 -344234 -338293 -440047 -139570 -250455
250b50455M28867J60512l7620j27900L25066J4829q8962j71606M92058l47164
$$ -250455 178412 338924 301304 173404 498470 513299 424337 252731 744789 397625
240C97625q7584k44053k61569k28791k81319M97004J5727L17752m44535r0420
$$ 397625 310041 65988 -195581 -424372 -705691 -208687 -192960 124792 -319743 -410163
230d10163J78578K9627M08373M22460P0476n35235l15155P32576M9594j1734l52733
$$ -410163 -231585 -201958 206415 628875 699351 164116 -151039 581537 631131 619397 266664
219B66664m6500l41269l19474M26617r4936r2193Q0239m4696J45810n7018K72140
$$ 266664 220164 -121105 -440579 -13962 -108898 -201091 -120852 -165548 -19738 -76756 195384
208A95384p3315j60125K37343L13237j19553k98548n65141q7183L83128l28427
$$ 195384 122069 -38056 199287 512524 392971 94423 -470718 -557901 -174773 -503200
198e03200J23093J46257k09354K54770j98575J39899N18584O5778l32254K72580
$$ -503200 -380107 -233850 -443204 -188434 -387009 -247110 271474 337252 4998 277578
188B77578O7133n67430J75488j94430J09918j55092K7677J60667J00928k6659
$$ 277578 344711 -222719 -47231 -241661 -131743 -286835 -259158 -98491 2437 -24222
178b4222L051K97547J80984J45877k46233k48580J53310N81904j8494l72052o33463
$$ -24222 -21171 276376 457360 603237 357004 108424 261734 843638 825144 453092 -180371
167a80371j81705J86427r8442K60821l155L01341J71686J14675l95498k56548
$$ -180371 -362076 -175649 -274091 -13270 -16425 284916 456602 571277 175779 -80769
157h0769M27218k44217n53025P60643M07424n27567l8268K33863l3237k79621
$$ -80769 346449 102232 -450793 309850 717274 189707 151439 385302 352065 72444
147G2444j31244N4230J5355K56435k19624k50820k9500j05530K81576N8026j17613
$$ 72444 -58800 -4570 10785 267220 47596 -203224 -232724 -338254 -56678 1348 -116265
136a16265k12661K16743K65327k69796J41496K76680j39133n34781k01586J79986
$$ -116265 -328926 -112183 153144 -116652 24844 301524 162391 -372390 -573976 -393990
126c93990k13763M51743M6690J80156r2660K04929q980q3546K44610n10058n6522
$$ -393990 -607753 -156010 -109320 70836 -21824 183105 174125 90579 335189 -174869 -231391
115b31391j15101Q4247J48690J11497K03463K25994l55043l16583M36833j42772
$$ -231391 -346492 -262245 -113555 -2058 201405 427399 72356 -244227 192606 49834
$$ [...]
##END NTUPLES=NMR SPECTRUM
##END=
