##TITLE=1H_DE-80H_X3
 200.13MHz, d2o
 8 sc
 
 19ns.26.2.2025
##JCAMPDX= 6.0         $$ Bruker NMR JCAMP-DX V2.0
##DATA TYPE= NMR SPECTRUM
##DATA CLASS= NTUPLES
##ORIGIN= UXNMR, Bruker Analytische Messtechnik GmbH
##OWNER= pz
$$ XWIN-NMR		Version 3.5
$$ Mon Jul 14 14:41:11 2025 Russian Standard Time (UT+4h)  Yarkov@DPX200
##.OBSERVE FREQUENCY= 200.1313
##.OBSERVE NUCLEUS= ^1H
##.ACQUISITION MODE= SIMULTANEOUS
##.ACQUISITION SCHEME= undefined
##.AVERAGES= 8
##.DIGITISER RES= 18
##SPECTROMETER/DATA SYSTEM= spect
##.PULSE SEQUENCE= zg30
##.SOLVENT NAME= CDCl3
##.SHIFT REFERENCE= (INTERNAL, CDCl3, 0, 15.5045)
##AUDIT TRAIL= $$ (NUMBER, WHEN, WHO, WHERE, WHAT)
$$ ##TITLE= Audit trail, XWIN-NMR		Version 3.5
$$ ##JCAMPDX= 5.01
$$ ##ORIGIN= Bruker BioSpin GmbH
$$ ##OWNER= Yarkov
$$ C:/Bruker/XWIN-NMR/data/yarkov2/nmr/H-C/1/pdata/1/auditp.txt
$$ ##AUDIT TRAIL=  $$ (NUMBER, WHEN, WHO, WHERE, WHAT)
(   1,<2025-07-14 14:40:06.32 +0400>,<Yarkov>,<DPX200>,
      <created by zg, POWCHK disabled, PULCHK disabled
       configuration hash MD5:
       00 E9 B6 7A A2 85 ED C7 34 08 36 98 17 FE 4E 26
       data hash MD5: 16K
       0A 07 AA 0F 3B 71 F5 50 AC 40 DF 64 39 B3 C3 DD>)
(   2,<2025-07-14 14:40:09.70 +0400>,<Yarkov>,<DPX200>,
      <Start of raw data processing
       efp BC_mod = 2 LB = 0.25 FT_mod = 6 PKNL = 1 PHC0 = -1364.521 PHC1 = 15.99091 SI = 16K 
       data hash MD5: 16K
       76 85 2E CA 43 22 B1 5E 24 B9 52 FD B5 4D F7 8E>)
(   3,<2025-07-14 14:40:13.62 +0400>,<Yarkov>,<DPX200>,
      <abs ABSG = 5 
       data hash MD5: 16K
       46 C4 23 74 82 DE 91 EA 81 1D B5 8F 4E 07 5B EC>)
(   4,<2025-07-14 14:40:26.76 +0400>,<Yarkov>,<DPX200>,
      <pk PHC0 = 6.19629 PHC1 = -3.2 
       data hash MD5: 16K
       04 2E 21 90 46 C3 55 89 77 4B AA 9E 3A 7D F9 B6>)
(   5,<2025-07-14 14:40:31.40 +0400>,<Yarkov>,<DPX200>,
      <abs ABSG = 5 
       data hash MD5: 16K
       ED E4 68 9F 1B 04 55 76 B3 BA 17 81 F7 82 36 D7>)
$$ ##END=
$$ 
$$ hash MD5
$$ C7 24 6B 94 9E 3D 8B 5D 10 47 E3 21 0B E3 68 2B
##$RELAX= 
##$RELAX= 
##$RELAX= 
##$RELAX= 
##$RELAX= 
##$RELAX= 
$$ Bruker specific parameters
$$ --------------------------
##$DU= <C:/Bruker/XWIN-NMR>
##$EXPNO= 1
##$NAME= <H-C>
##$PROCNO= 1
##$TYPE= <nmr>
##$USER= <yarkov2>
##$AMP= (0..31)
100 100 100 100 100 100 100 100 100 100 100 100 100 100 100 100 100 100 
100 100 100 100 100 100 100 100 100 100 100 100 100 100 
##$AQSEQ= 0
##$AQ_mod= 1
##$AUNM= <au_zg>
##$AUTOPOS= <>
##$BF1= 200.13
##$BF2= 200.13
##$BF3= 200.13
##$BF4= 200.13
##$BF5= 200.13
##$BF6= 200.13
##$BF7= 200.13
##$BF8= 200.13
##$BYTORDA= 1
##$CFDGTYP= 0
##$CFRGTYP= 5
##$CHEMSTR= <none>
##$CNST= (0..31)
1 1 145 1 1 1 1 1 1 1 1 1 1 1 1 1 1 1 1 1 1 1 1 1 1 1 1 1 1 1 1 1 
##$CPDPRG= <>
##$CPDPRG1= <>
##$CPDPRG2= <>
##$CPDPRG3= <>
##$CPDPRG4= <mlev>
##$CPDPRG5= <mlev>
##$CPDPRG6= <mlev>
##$CPDPRG7= <mlev>
##$CPDPRG8= <mlev>
##$CPDPRGB= <>
##$CPDPRGT= <>
##$D= (0..31)
0 0.7 0 0 0 0 0 0 0 0 0 0.03 0 0 0 0 0 0 0 0 0 0 0 0 0 0 0 0 0 0 0 0 
$$ [...]
##$SUBNAM3= <"">
##$SUBNAM4= <"">
##$SUBNAM5= <"">
##$SUBNAM6= <"">
##$SUBNAM7= <"">
##$SUBNAM8= <"">
##$SUBNAM9= <"">
##$SW= 18.0517328524113
##$SWIBOX= (0..15)
0 0 2 0 0 0 0 0 0 0 0 0 0 0 0 0 
##$SW_h= 3612.71676300578
##$TD= 16384
##$TD0= 1
##$TE= 0
##$TE2= 300
##$TE3= 300
##$TEG= 300
##$TL= (0..7)
0 120 120 120 120 120 120 120 
##$TP= (0..7)
150 150 150 150 150 150 150 150 
##$TP07= 0
##$TPNAME0= <>
##$TPNAME1= <>
##$TPNAME2= <>
##$TPNAME3= <>
##$TPNAME4= <>
##$TPNAME5= <>
##$TPNAME6= <>
##$TPNAME7= <>
##$TPOAL= (0..7)
0.5 0.5 0.5 0.5 0.5 0.5 0.5 0.5 
##$TPOFFS= (0..7)
0 0 0 0 0 0 0 0 
##$TUNHIN= 0
##$TUNHOUT= 0
##$TUNXOUT= 0
##$USERA1= <user>
##$USERA2= <user>
##$USERA3= <user>
##$USERA4= <user>
##$USERA5= <user>
##$V9= 5
##$VALIST= <valist>
##$VCLIST= <CCCCCCCCCCCCCCC>
##$VD= 0
##$VDLIST= <DDDDDDDDDDDDDDD>
##$VPLIST= <PPPPPPPPPPPPPPP>
##$VTLIST= <TTTTTTTTTTTTTTT>
##$WBST= 1024
##$WBSW= 4
##$XGAIN= (0..3)
0 0 0 0 
##$XL= 0
##$YL= 0
##$YMAX_a= 144289
##$YMIN_a= -154099
##$ZGOPTNS= <>
##$ZL1= 120
##$ZL2= 120
##$ZL3= 120
##$ZL4= 120
##$ABSF1= 15.52322
##$ABSF2= -2.528629
##$ABSG= 5
##$ABSL= 3
##$ALPHA= 0
##$AQORDER= 0
##$ASSFAC= 0
##$ASSFACI= 0
##$ASSFACX= 0
##$ASSWID= 0
##$AUNMP= <proc_1d>
##$AZFE= 0.1
##$AZFW= 0.1
##$BCFW= 0
##$BC_mod= 2
##$BYTORDP= 0
##$COROFFS= 0
##$CY= -3
##$DATMOD= 1
##$DC= 0
##$DFILT= <>
##$DTYPP= 0
##$F1P= 0
##$F2P= 0
##$FCOR= 1
##$FTSIZE= 16384
##$FT_mod= 6
##$GAMMA= 0
##$GB= 0
##$INTBC= 1
##$INTSCL= 3.241238e-09
##$ISEN= 128
##$LB= 0.25
##$LEV0= 0
##$LPBIN= 0
##$MAXI= 10000
##$MC2= 0
##$MEAN= 0
##$ME_mod= 0
##$MI= 1.114404
##$NCOEF= 0
##$NC_proc= -8
##$NLEV= 6
##$NOISF1= 3.799351
##$NOISF2= 2.8
##$NSP= 0
##$NTH_PI= 0
##$NZP= 0
##$OFFSET= 15.50449
##$PC= 1
##$PHC0= -1358.325
##$PHC1= 12.79091
##$PH_mod= 1
##$PKNL= yes
##$PPARMOD= 0
##$PSCAL= 0
##$PSIGN= 0
##$REVERSE= no
##$SF= 200.130003443531
##$SI= 16384
##$SIGF1= 3
##$SIGF2= 2
##$SINO= 0.751879
##$SIOLD= 32768
##$SREGLST= <19F.Aceton>
##$SSB= 0
##$STSI= 16384
##$STSR= 0
##$SW_p= 3612.71676300578
##$SYMM= 0
##$S_DEV= 0
##$TDeff= 16384
##$TDoff= 0
##$TI= <>
##$TILT= no
##$TM1= 0
##$TM2= 0
##$TOPLEV= 0
##$USERP1= <user>
##$USERP2= <user>
##$USERP3= <user>
##$USERP4= <user>
##$USERP5= <user>
##$WDW= 1
##$XDIM= 16384
##$YMAX_p= 448041860
##$YMIN_p= -1180618
$$ End of Bruker specific parameters
$$ ---------------------------------
##NTUPLES= NMR SPECTRUM
##VAR_NAME=  FREQUENCY,     SPECTRUM/REAL,   SPECTRUM/IMAG
##SYMBOL=    X,             R,               I
##VAR_TYPE=  INDEPENDENT,   DEPENDENT,       DEPENDENT
##VAR_FORM=  AFFN,          ASDF,            ASDF
##VAR_DIM=   16384,         16384,           16384
##UNITS=     HZ,            ARBITRARY UNITS, ARBITRARY UNITS
##FACTOR=    0.220516191357247, 1,           1
##FIRST=     3102.91361681335, 0,            0
##LAST=      -509.803146192432, 0,           0
##MIN=       -509.803146192432, -1180618,    0
##MAX=       3102.91361681335, 448041860,    0
$$ Real data points
##PAGE= N=1
##DATA TABLE= (X++(R..R)), XYDATA
$$ [...]
$$ plain form
5900 340290 496863 636376 373012 199165 445362 484975 338795 194065 170144 140413
5890 140413 172270 500920 570192 415604 209071 239546 381583 206336 42375 150999
5880 150999 219094 261480 349450 452093 573207 368945 444278 368390 441811 496622 604691
5869 604691 525304 558570 535299 271851 100364 220515 443254 573078 482622 257094
5859 257094 257272 388517 528985 461154 291234 394242 319409 177829 368590 685025 705949
5848 705949 670972 511767 218257 246702 184683 255301 624253 471821 496209 371301 595179
5837 595179 787298 624404 441396 511693 890914 709330 708610 597321 636911 444137 434570
5826 434570 396729 610858 671807 541562 476601 369149 507011 562490 503629 464968 632509
$$ packed form
5900C40290J56573J39513k63364j73847K46197L9613j46180j44730k3921k9731
5890A40413L1857L28650O9272j54588k06533L0475J42037j75247j63961J08624
5880A50999O8095M2386Q7970J02643J21114k04262P5333p5888P3421N4811J08069
5869F04691p9387L3266k3271k63448j71487J20151K22739J29824r0456k25528
5859B57094J78J31245J40468o7831j69920J03008p4833j41580J90761L16435K0924
5848G05949l4977j59205k93510K8445o2019P0618L68952j52432K4388j24908K23878
5837E95179J92119j62894j83008P0297L79221j81584p20j11289L9590j92774r567
5826D34570l7841K14129O0949j30245o4961j07452J37862N5479n8861l8661J67541
$$ plain form
5815 632509 613860 532933 537480 414533 439449 576498 569043 684729 862496 654146 774762
5804 774762 746136 594594 700198 580914 355534 403701 417009 552989 500352 609364
5794 609364 451547 465945 664273 833224 616292 516916 688413 447381 280185 302527
5784 302527 -14312 47986 215074 23675 463858 599204 759475 615295 500820 585741
5774 585741 670437 494862 566000 396342 380785 611570 645738 635500 689730 498635 427606
5763 427606 518551 686355 904956 1016940 839240 530771 412162 549181 596274 590981
5753 590981 810831 905232 777841 925350 1184478 1088362 772790 766264 704229 827148 743452
5742 743452 559989 731753 822301 962185 1015378 984211 1018760 794151 634022 596431 426555
$$ packed form
5815F32509j8649q0927M547j22947K4916J37049p455J15686J77767k08350J20616
5804G74762k8626j51542J05604j19284k25380M8167J3308J35980n2637J09012
5794F09364j57817J4398J98328J68951k16932r9376J71497k41032j67196K2342
5784C02527l16839O2298J67088j91399M40183J35346J60271j44180j14475Q4921
5774E85741Q4696j75575P1138j69658j5557K30785L4168j0238N4230j91095p1029
5763D27606R0945J67804K18601J11984j77700l08469j18609J37019M7093n293
5753E90981K19850R4401j27391J47509K59128r6116l15572o526o2035J22919q3696
5742G43452j83463J71764R0548J39884N3193l1167L4549k24609j60129l7591j69876
$$ plain form
5731 426555 451650 318498 564667 948370 958525 797600 747660 744291 529344 578042 972666
5720 972666 1269658 1182479 899036 966025 943903 616888 729161 818028 809940 1074498 913255
5709 913255 979659 1165876 1095333 952410 994933 1195712 1255845 964311 1057675 1211917 1222211
5698 1222211 1052908 1000002 1075697 984740 887965 722577 1026105 1090374 1068518 1393371 1352626
5687 1352626 1205199 960388 918566 869025 985453 1210689 1256600 1203964 1005185 1129244
5677 1129244 1403150 1221410 1092426 1260949 1328958 1191897 1330752 1374435 1236939 1377932
5667 1377932 1511449 1245956 1281921 1208771 1169194 1232291 1280844 1648750 1453269 1491108 1361610
5656 1361610 1505510 1466250 1440541 1711395 1462830 1188995 1309624 1372089 1616566 1567362
$$ packed form
5731D26555K5095j33152K46169L83703J0155j60925m9940l369k14947M8698L94624
5720I72666K96992q7179k83443O6989k2122l27015J12273Q8867q088K64558j61243
5709I13255O6404J86217p0543j42923M2523K00779O0133k91534R3364J54242J0294
5698A222211j69303n2906P5695r0957r6775j65388L03528O4269k1856L24853m0745
5687A352626j47427k44811m1822m9541J16428K25236M5911n2636j98779J24059
5677A129244K73906j81740j28984J68523O8009j37061J38855M3683j37496J40993
5667A377932J33517k65493L5965p3150l9577O3097M8553L67906j95481L7839j29498
5656A361610J43900l9260k5709K70854k48565k73835J20629O2465K44477m9204
$$ plain form
5646 1567362 1350517 1294725 1612049 1702203 1557952 1869107 2035045 2122194 2397317 2037067
5636 2037067 1977647 2131984 2009226 2298436 2092534 2307183 2307525 2442105 2468748 2725806
5626 2725806 2784360 2569221 2617296 2313591 2371240 2512432 2723563 2806916 2769678 2856619 2854556
5615 2854556 2895106 3173190 3110452 2994200 3023063 3389379 3250048 3245739 3484361 3648402
5605 3648402 3814702 3791861 3806499 3955860 3895902 3937169 4065044 4141432 4411624 4462257 4591071
5594 4591071 4535945 4789823 5017300 5236165 5246939 5343331 5423624 5759477 6135397 6132546 6309170
5583 6309170 6812282 6988104 7130890 7347188 7216849 7529315 7787087 7978316 8190621 8310394
5573 8310394 8475455 8572484 8586270 8497695 8726448 8982612 9402434 9710837 9910534 9910392 10262620
$$ packed form
5646A567362k16845n5792L17324R0154j44251L11155J65938Q7149K75123l60250
5636B037067n9420J54337j22758K89210k05902K14649L42J34580K6643K57058
5626B725806N8554k15139M8075l03705N7649J41192K11131Q3353l7238Q6941k063
5615B854556M0550K78084o2738j16252K8863L66316j39331m309K38622J64041
5605C648402J66300k2841J4638J49361n9958M1267J27875P6388K70192N0633J28814
5594D591071n5126K53878K27477K18865J0774R6392Q0293L35853L75920k851J76624
5583F309170N03112J75822J42786K16298j30339L12466K57772J91229K12305J19773
5573H310394J65061R7029J3786q8575K28753K56164M19822L08403J99697j42L52228
$$ plain form
5562 10262620 10528611 10779703 11124679 11454081 11742819 11785204 11830830 12027266 12420590 12593657
5552 12593657 12587827 12858330 13113056 13379843 13529706 13536079 13810058 14087249 14270989 14516980
5542 14516980 14494205 14433400 14922773 15071913 15341648 15546219 15767060 15865141 16280617 16415193
5532 16415193 16385823 16399053 16535640 16705495 16866068 16722226 16887631 17273290 17369572 17288607
5522 17288607 17688681 17669692 17713752 17808896 17914943 18125917 18256742 18146285 18200083 18260298
5512 18260298 18357706 18255436 18292540 18430359 18349881 18331826 18376085 18647264 18596767 18665737 18719141
5501 18719141 18727420 18477199 18322138 18086423 18390623 18352914 18219928 18005092 17841039 18004873
5491 18004873 18228592 18398973 18390234 18315145 18477545 18527809 18935830 19320302 19701198 20193283
$$ packed form
5562A0262620K65991K51092L44976L29402K88738M2385M5626J96436L93324J73067
5552A2593657n830K70503K54726K66787J49863O373K73979K77191J83740K45991
5542A4516980k2775o0805M89373J49140K69735K04571K20841R8081M15476J34576
5532A6415193k9370J3230J36587J69855J60573j43842J65405L85659R6282q0965
5522A7288607M00074j8989M4060R5144J06047K10974J30825j10457N3798O0215
5512A8260298R7408j02270L7104J37819q0478j8055M4259K71179n0497O8970N3404
5501A8719141Q279k50221j55061k35715L04200l7709j32986k14836j64053J63834
5491A8004873K23719J70381q739p5089J62400N0264M08021L84472L80896M92085
$$ plain form
5481 20193283 20892799 21463281 21640136 21490485 20745547 19561234 18209281 17246069 16312749
5472 16312749 15406718 15069248 14474835 13882869 13657648 13396661 13046540 12521613 12322966
5463 12322966 11821220 11409213 11103976 10830228 10621294 10584948 10363722 9988023 9914647 9454266
5453 9454266 9445201 9228377 9038827 8964358 8692882 8326528 8309749 7926607 7362836 7150929
5443 7150929 6741716 6559587 6566554 6752611 6425066 5946447 5891350 5648716 5639578 5206541
5433 5206541 5164520 5222815 5062244 4856232 4873303 4748364 4268731 4215324 4274290 4115313
5423 4115313 3669120 3506507 3402415 3577025 3568764 3530619 3344183 3625000 3368307 3213266
5413 3213266 3326622 3274135 3012246 3001966 2618547 2449282 2675653 2838091 2728746 2554166
$$ packed form
5481B0193283O99516N70482J76855j49651p44938j184313j351953r63212r33320
5472A6312749r06031l37470n94413n91966k25221k60987l50121n24927j98647
5463A2322966n01746m12007l05237k73748k08934l6346k21226l75699p3376m60381
5453I454266r065k16824j89550p4469k71476l66354j6779l83142n63771k11907
5443G150929m09213j82129O967J86057l27545m78619n5097k42634r138m33037
5433E206541m2021N8295j60571k06012J7071j24939m79633n3407N8966j58977
5423D115313m46193j62613j04092J74610q261l8145j86436K80817k56693j55041
5413C213266J13356n2487k61889j0280l83419j69265K26371J62438j09345j74580
$$ plain form
5403 2554166 2593104 2718613 2627150 2343821 2442340 2622693 2760501 2308075 2224327 2388942
5393 2388942 2206344 2295846 2377224 2067965 1892668 2020825 2277633 2028375 2039537 2136354
5383 2136354 2289262 2037964 1760085 1644927 1890158 1868068 1930777 1892385 1714686 1729289
5373 1729289 1816679 1692966 1837363 1803793 1623468 1733605 1726364 1476757 1369332 1506016
5363 1506016 1356285 1442005 1382733 1581965 1469068 1523709 1701992 1869447 1795803 1865782
5353 1865782 1960912 1859740 1635228 1629701 1556024 1706677 1784465 1874925 1837342 1678937 1730060
5342 1730060 1932136 1881226 1710954 1592655 1587995 1655493 1653465 1810179 1831959 1721593 1941884
5331 1941884 1980216 1592500 1339631 1352599 1530797 1208855 1206115 1343200 1460377 1604440
$$ packed form
5403B554166L8938J25509r1463k83329R8519J80353J37808m52426q3748J64615
5393B388942j82598Q9502Q1378l09259j75297J28157K56808k49258J1162R6817
5383B136354J52908k51298k77879j15158K45231k2090O2709l8392j77699J4603
5373A729289Q7390j23713J44397l3570j80325J10137p241k49607j07425J36684
5363A506016j49731Q5720n9272J99232j12897N4641J78283J67455p3644O9979
5353A865782R5130j01172k24512n527p3677J50653P7788R0460l7583j58405N1123
5342A730060K02076n0910j70272j18299m660O7498k028J56714K1780j10366K20291
5331A941884L8332l87716k52869J2968J78198l21942k740J37085J17177J44063
$$ plain form
5321 1604440 1764577 1412322 1425249 1418896 1265577 1377237 1332433 1379163 1288370 1216421 1398985
5310 1398985 1538282 1406269 1484377 1708511 1535369 1527904 1533224 1304528 1500442 1593920 1632738
5299 1632738 1560562 1420247 1224268 1294238 1282172 1333616 1325365 1085348 1278536 1288987 1328332
5288 1328332 1328446 1332335 1424509 1209923 1209896 1033626 1086840 816471 950715 1335116 1363754 1308831
5276 1308831 1302245 1271871 1317342 1515950 1242626 896160 1205274 1544556 1329895 1364678
5266 1364678 1456667 1599857 1490506 1523832 1467063 1480016 1704019 1818687 1661963 1568378
5256 1568378 1483179 1464205 1476041 1502683 1302214 1494657 1650822 1557133 1555600 1369008 1292963
5245 1292963 1220569 1498819 1626674 1659261 1450702 1431555 1592924 1713949 1562092 1579359
$$ packed form
5321A604440J60137l52255J2927o353j53319J11660m4804M6730r0793p1949J82564
5310A398985J39297j32013P8108K24134j73142p465N320k28696J95914R3478L8818
5299A632738p2176j40315j95979O9970j2066N1444q251k40017J93188J0451L9345
5288A328332J14L889R2174k14586k7j76270N3214k70369J34244L84401K8638n4923
5276A308831o586l0374M5471J98608k73324l46466L09114L39282k14661L4783
5266A364678R1989J43190j09351L3326n6769J2953K24003J14668j56724r3585
5256A568378q5199j8974J1836K6642k00469J92443J56165r3689j533j86592p6045
5245A292963p2394K78250J27855L2587k08559j9147J61369J21025j51857J7267
$$ plain form
5235 1579359 1533997 1433549 1400838 1378197 1809016 1588202 1548369 1614805 1760779 1824726 1879988
5224 1879988 1939564 1645477 1772141 1979827 1762929 1772662 1497827 1454406 1610402 1416463
5214 1416463 1529523 1787583 1741081 1764719 1857800 1756227 1871272 1751495 1711886 2035693
5204 2035693 1877335 1851639 2030657 2237080 2102911 1977569 2180282 2188583 1996058 2113339
5194 2113339 2004762 2063102 2079703 2116809 2092443 2351943 2228649 2152110 2207522 2447252 2467266
5183 2467266 2364414 2695979 2785945 2900894 2819040 2912369 2787034 2756968 2761635 2757954 2846320
5172 2846320 2922058 2807745 2750448 2846047 3073210 3311511 3474884 3467193 3506749 3352797 3388312
5161 3388312 3558446 3655525 3646763 3875415 3831745 3993281 4142852 4064611 4038373 4365432 4432167
$$ packed form
5235A579359m5362j00448l2711k2641M30819k20814l9833O6436J45974O3947N5262
5224A879988N9576k94087J26664K07686k16898R733k74835m3421J55996j93939
5214A416463J13060K58060m6502K3638R3081j01573J15045j19777l9609L23807
5204B035693j58358k5696J79018K06423j34169j25342K02713Q301j92525J17281
5194B113339j08577N8340J6601L7106k4366K59500j23294p6539N5412K39730K0014
5183B467266j02852L31565Q9966J14949q1854R3329j25335l0066M667l681Q8366
5172B846320P5738j14313n7297R5599K27163K38301J63373p691L9556j53952L5515
5161C388312J70134R7079q762K28652m3670J61536J49571p8241k6238L27059O6735
$$ plain form
5150 4432167 4604296 4984693 4984199 5095746 5134614 5223438 5474299 5497094 5790277 5716479 5612751
5139 5612751 5958300 6212142 6215372 6383145 6711234 6885331 6799934 7045949 7147082 6996085
5129 6996085 7189670 7607744 7699238 7966866 8046163 8206735 8451550 8717526 9132776 9179654
5119 9179654 9210483 9519812 9833761 10047256 10229673 10306164 10514335 10853599 10931543 11084097
5109 11084097 11262810 11509356 11699668 11766161 11903402 12452684 12837852 12940697 13281459 13035738
5099 13035738 13329598 13587155 13899054 14059377 14011669 14283706 14459644 15039769 15586261 15486533
5089 15486533 15365592 15656727 15642859 15885191 16098608 16347763 16704507 16648639 16820333 16891484
5079 16891484 17005737 17338715 17640622 17969280 18403958 18652428 18745764 18946693 19463979 19975437
$$ packed form
5150D432167J72129L80397m94J11547L8868Q8824K50861K2795K93183p3798j03728
5139E612751L45549K53842L230J67773L28089J74097q5397K46015J01133j50997
5129F996085J93585M18074R1494K67628P9297J60572K44815K65976M15250M6878
5119I179654L0829L09329L13949K13495J82417P6491K08171L39264P7944J52554
5109A1084097J78713K46546J90312O6493J37241N49282L85168J02845L40762k45721
5099A3035738K93860K57557L11899J60323m7708K72037J75938N80125N46492r9728
5089A5486533j20941K91135j3868K42332K13417K49155L56744n5868J71694P1151
5079A6891484J14253L32978L01907L28658M34678K48470R3336K00929N17286N11458
$$ plain form
5069 19975437 20437298 20489055 20689738 20877325 21075394 21221439 21184400 21258099 21406707 21506901
5059 21506901 21536094 21264403 20869268 20565602 20137335 19558847 19415610 19519430 19445926 19277844
5049 19277844 19232126 18987695 18925482 18991201 18752328 18374433 18542186 18507987 18490374 18314618
5039 18314618 17931563 17715331 17873132 17749147 17463170 17311767 17278689 17249722 17085363 17114343
5029 17114343 17289773 17120124 16941607 16619901 16558567 16303706 16506556 16473576 16139049 15925177
5019 15925177 15771215 16220012 15972731 15647081 15468838 15218875 15281752 15421892 15237478 15446009
5009 15446009 14899982 14480875 14536729 14474079 14671753 14475485 14231874 14272925 14088335 14186052
4999 14186052 14241689 14108100 14271034 14288906 14469127 14371314 14074119 13914909 14088139 14285083
$$ packed form
5069A9975437M61861N1757K00683J87587J98069J46045l7039P3699J48608J00194
5059B1506901K9193k71691l95135l03666m28267n78488j43237J03820p3504j68082
5049A9277844m5718k44431o2213O5719k38873l77895J67753l4199j7613j75756
5039A8314618l83055k16232J57801j23985k85977j51403l3078k8967j64359K8980
5029A7114343J75430j69649j78517l21706o1334k54861K02850l2980l34527k13872
5019A5925177j53962M48797k47281l25650j78243k49963O2877J40140j84414K08531
5009A5446009n46027m19107N5854o2650J97674j96268k43611M1051j84590R7717
4999A4186052N5637j33589J62934J7872J80221r7813k97195j59210J73230J96944
$$ plain form
4989 14285083 14274838 14242128 14383304 14403727 14427442 14162706 14171709 14446109 14442037 14865089 14473155
4978 14473155 14225217 14242307 14590854 14647281 14714648 14871825 15183022 15254824 15082890 14965017
4968 14965017 15125950 15072705 15313279 15569492 15509610 15863580 15791503 15722569 15928111 15823451
4958 15823451 16069468 16250498 16151625 16111517 16401792 16332193 16411591 16642727 16852777 17199757
4948 17199757 17290653 17441052 17766566 18200014 18623006 18755679 18768882 18962655 19254176 19643099
4938 19643099 20146798 20708520 20881553 21050019 21461080 21923804 22511499 22837283 23260667
4929 23260667 24111685 24606210 25081076 25834361 26558295 27294156 27768784 28403162 29050094
4920 29050094 29749172 29967488 30171502 30286200 30491176 30797750 30603544 30741689 30924103
$$ packed form
4989A4285083j0245l2710J41176K0423K3715k64736R003K74400m072M23052l91934
4978A4473155k47938J7090L48547N6427O7367J57177L11197P1802j71934j17873
4968A4965017J60933n3245K40574K56213n9882L53970p2077o8934K05542j04660
4958A5823451K46017J81030r8873m0108K90275o9599P9398K31136K10050L46980
4948A7199757R0896J50399L25514M33448M22992J32673J3203J93773K91521L88923
4938A9643099N03699N61722J73033J68466M11061M62724N87695L25784M23384
4929B3260667Q51018M94525M74866P53285P23934P35861M74628O34378O46932
4920B9050094O99078K18316K04014J14698K04976L06574j94206J38145J82414
$$ plain form
4911 30924103 30781715 30695297 30397428 30654621 30548798 29929177 29599347 29592293 29514725 28829052
4901 28829052 28544800 28155033 27507232 26898037 26436934 25850609 25159037 24617911 23851172
4892 23851172 23199639 22579775 21867172 21416022 20757710 20081148 19286092 18718687 18284503
4883 18284503 17463572 16666250 16250801 15678556 15251974 14640514 14128355 13457115 13181465
4874 13181465 12496249 12160258 11896825 11852550 11271775 10870399 10451552 10184828 9903661 9518621
4864 9518621 9335027 9092907 8861213 8513539 8370661 8085649 8205505 7913271 7567494 7667526
4854 7667526 7456859 7010537 6791257 6477299 6492256 6461397 6204229 6060103 5748084 5620581
4844 5620581 5337972 5290617 5347890 5328977 5259986 4974394 4997796 5201738 4883133 4452800
$$ packed form
4911C0924103j42388q6418k97869K57193j05823o19621l29830p054p7568o85673
4901B8829052k84252l89767o47801o09195m61103n86325o91572n41126p66739
4892B3851172o51533o19864p12603m51150o58312o76562p95056n67405m34184
4883A8284503q20931p97322m15449n72245m26582o11460n12159o71240k75650
4874A3181465o85216l35991k63433m4275n80775m01376m18847k66724k81167l85040
4864I518621j83594k42120k31694l47674j42878k85012J19856k92234l45777J00032
4854G667526k10667m46322k19280l13958J4957l0859k57168j44126l12019j27503
4844E620581k82609m7355N7273j8913o8991k85592K3402K03942l18605m30333
$$ plain form
4834 4452800 4303046 4263379 4574098 4191582 3969548 4111418 4209364 4228614 4229417 4249245 3970163
4823 3970163 3610961 3535902 3606666 3211835 3347631 3382269 3241512 3123243 3328440 3440512
4813 3440512 3244828 3109401 3111939 2903971 2781534 2919898 2963141 3250292 2908190 2747743
4803 2747743 2664841 2671768 2521032 2702635 2605094 2380278 2287248 2527309 2113444 1959434
4793 1959434 2144581 2011505 2342260 2528976 2463385 2127223 1957371 2275216 2437940 2296641
4783 2296641 2197000 2271365 2205510 2298552 2264522 1824689 1633422 1844814 1940919 1763093 1886338
4772 1886338 2065647 1936576 1859222 1943851 1893286 1891096 1901690 1857831 1801877 1794836 1948713
4761 1948713 1924783 2126453 2018486 1892641 1759746 1676553 1693670 1965967 1953268 1812044
$$ packed form
4834D452800j49754l9667L10719l82516k22034J41870R7946J9250Q03J9828k79082
4823C970163l59202p5059P0764l94831J35796L4638j40757j18269K05197J12072
4813C440512j95684j35427K538k07968j22437J38364M3243K87151l42102j60447
4803B747743q2902O927j50736J81603r7541k24816r3030K40061m13865j54010
4793A959434J85147j33076L30755J86716o5591l36162j69852L17845J62724j41299
4783B296641r9641P4365o5855R3042l4030m39833j91267K11392R6105j77826J23245
4772A886338J79309j29071p7354Q4629n0565k190J0594m3859n5954p041J53877
4761A948713k3930K01670j07967j25845j32895q3193J7117K72297j2699j41224
$$ plain form
4751 1812044 1596203 1752319 1821296 1830581 1552285 1282353 1730206 1693789 1283105 1396467
4741 1396467 1632144 1568645 1654378 1577857 1567419 1715223 1680381 1691820 2013387 2004102 1694902
4730 1694902 1494617 1543922 1516317 1622361 1531209 1493835 1764471 1684175 1343513 1395641 1418381
4719 1418381 1339073 1510052 1518003 1245308 1534155 1538119 1408068 1456613 1602677 1644212 1763127
4708 1763127 1926401 1997727 1596233 1655589 1585677 1580346 1854411 1740932 1635701 1856641
4698 1856641 1756406 1624933 1523501 1490767 1708203 1780387 1658221 1659840 1537590 1439312
4688 1439312 1393103 1444880 1358249 1664072 1762202 1557936 1721294 1668551 1419785 1124224
4678 1124224 1248821 1447685 1603210 1544965 1732542 1908095 1883376 1519724 1591112 1660721
$$ packed form
4751A812044k15841J56116O8977R285k78296k69932M47853l6417m10684J13362
4741A396467K35677o3499Q5733p6521j0438J47804l4842J1439L21567r285l09200
4730A694902k00285M9305k7605J06044r1152l7374K70636q0296l40662N2128K2740
4719A418381p9308J70979P951k72695K88847L964j30051M8545J46064M1535J18915
4708A763127J63274P1326m01494N9356o9912n331K74065j13479j05231K20940
4698A856641j00235j31473j01432l2734K17436P2184j22166J619j22250r8278
4688A439312m6209N1777q6631L05823R8130k04266J63358n2743k48766k95561
4678A124224J24597J98864J55525n8245J87577J75553k4719l63652P1388O9609
$$ plain form
4668 1660721 1729633 1443102 1527421 1544468 1406123 1826966 1984278 1801026 2013114 2112120
4658 2112120 1803944 1722167 1426928 1160759 1506152 1740071 1592727 1825300 1576930 1451590
4648 1451590 1693208 1606094 1458444 1612164 1711815 1703206 1893820 1967102 1878226 1693864 1769249
4637 1769249 1590599 1539309 1509926 1631021 1749658 1664798 1731808 1648548 1686762 1962975 2018896
4626 2018896 1736182 1597579 1692713 1909196 1892910 1677129 1755881 1943244 1690376 1656042
4616 1656042 1580144 1581258 1804794 1831473 1715554 1697483 2038541 1922725 1736226 1580038
4606 1580038 1497445 1462018 1245295 1737421 1999392 2011865 1783102 1902136 2243613 1938469
4596 1938469 1732774 1656835 1839965 1954037 2274377 2358993 1823028 1740803 1796824 2038010
$$ packed form
4668A660721O8912k86531Q4319J7047j38345M20843J57312j83252K12088R9006
4658B112120l08176q1777k95239k66169L45393K33919j47344K32573k48370j25340
4648A451590K41618q7114j47650J53720R9651q609J90614P3282q8876j84362P5385
4637A769249j78650n1290k9383J21095J18637q4860O7010q3260L8214K76213N5921
4626B018896k82714j38603R5134K16483j6286k15781P8752J87363k52868l4334
4616A656042p5898J114K23536K6679j15919j8071L41058j15816j86499j56188
4606A580038q2593l5427k16723M92126K61971J2473k28763J19034L41477l05144
4596A938469k05695p5939J83130J14072L20340Q4616n35965q2225N6021K41186
$$ plain form
4586 2038010 2263885 2056480 1835791 1910700 2175408 1968302 1500814 1540619 1537870 1596277
4576 1596277 1916618 1750821 1833886 2065291 2061100 2159420 1779511 1645757 1739579 1665948 1661172
4565 1661172 1941739 1963804 1520093 1777993 1823949 1734663 1646442 1650958 1627584 1689658 1753431
4554 1753431 1918127 1779886 1724647 2004615 2161325 2194520 2179674 1935824 1667994 1644507
4544 1644507 1646230 1826071 1928442 2034630 1973132 1815571 1939065 2052171 1758554 1812313
4534 1812313 2166319 2118142 2087921 2218680 2040151 1734709 1837460 2291690 2300453 2280342
4524 2280342 2056026 1802575 1928689 2154828 2032693 2108165 2249134 2084783 2319264 2581026
4514 2581026 2355047 2484154 2429773 2299929 2474988 2520388 2476122 2125801 2191747 2365647
$$ packed form
4586B038010K25875k07405k20689P4909K64708k07106m67488L9805k749N8407
4576A596277L20341j65797Q3065K31405m191R8320l79909j33754R3822p3631m776
4565A661172K80567K2065m43711K57900M5956q9286q8221M516k3374O2074O3773
4554A753431J64696j38241n5239K79968J56710L3195j4846k43850k67830k3487
4544A644507J723J79841J02371J06188o1498j57561J23494J13106k93617N3759
4534A812313L54006m8177l0221J30759j78529l05442J02751M54230Q763k0111
4524B280342k24316k53451J26114K26139j22135P5472J40969j64351K34481K61762
4514B581026k25979J29107n4381j29844J75059M5400m4266l50321O5946J73900
$$ plain form
4504 2365647 2574461 2422908 2402516 2382284 2422814 2499938 2593071 2600578 2246043 2374025 2634429
4493 2634429 2593546 2685114 2860534 2830565 2860695 2799579 2677212 2726584 2902904 2530216 2615619
4482 2615619 3251700 3210380 2990386 2852352 2808570 2937680 3013275 3019214 3325413 3292640 3310727
4471 3310727 3436075 3447114 3496915 3053343 3123634 3289244 3599007 3819879 3719104 3886409
4461 3886409 4046621 4069233 4088230 4437317 4470635 4309172 4198599 4296538 4320966 4647717
4451 4647717 4949478 4987021 5258093 5256521 5484970 5526561 5706649 5524050 5658946 6188162
4441 6188162 6318695 6705472 6984275 7297265 7116809 7502939 7843984 7928005 8296699 8633156
4431 8633156 9201218 9610083 10107373 10368142 10960523 11472812 11738020 12119139 12496362 12992030
$$ packed form
4504B365647K08814j51553k0392k0232M0530P7124R3133P507l54535J27982K60404
4493B634429m0883R1568J75420k9969L0130o1116j22367M9372J76320l72688Q5403
4482B615619O36081m1320k19994j38034m3782J29110P5595N939L06199l2773J8087
4471C310727J25348J1039M9801m43572P0291J65610L09763K20872j00775J67305
4461C886409J60212K2612J8997L49087L3318j61463j10573R7939K4428L26751
4451D647717L01761L7543K71072j572K28449M1591J80088j82599J34896N29216
4441F188162J30533L86777K78803L12990j80456L86130L41045Q4021L68694L36457
4431H633156N68062M08865M97290K60769N92381N12289K65208L81119L77223M95668
$$ plain form
4421 12992030 13507977 13716837 13911756 14429817 15116004 15772268 16085795 16445782 17251711
4412 17251711 17802322 18299478 19029516 19495247 20032891 20292646 20678002 21365425 21539612
4403 21539612 21970566 22316879 22624170 22859774 23283587 23594338 24215270 24629202 24551443 24626082
4393 24626082 24934941 25269148 25154590 25021018 25118205 25445343 25221393 25367527 25520993 25745462
4383 25745462 25668840 25899507 26125038 26194978 26182210 26086773 25815872 25462446 25722469 25604514
4373 25604514 25596688 25470443 25771104 25769221 25945808 26033198 26090708 26593757 26700601 26574653
4363 26574653 26563719 26897271 27106097 27469166 27768191 28368179 28706967 29026004 29556637 30129070
4353 30129070 30638437 31161268 31782187 32541698 32871735 33418622 34397803 34905470 35806245
$$ packed form
4421A2992030N15947K08860J94919N18061O86187O56264L13527L59987Q05929
4412A7251711N50611M97156P30038M65731N37644K59755L85356O87423J74187
4403B1539612M30954L46313L07291K35604M23813L10751O20932M13932p7759P4639
4393B4626082L08859L34207j14558j33572R7187L27138k23950J46134J53466K24469
4383B5745462p6622K30667K25531O9940j2768r5437k70901l53426K60023j17955
4373B5604514p826j26245L00661j883J76587Q7390N7510N03049J06844j25948
4363B6574653j0934L33552K08826L63069K99025N99988L38788L19037N30633N72433
4353C0129070N09367N22831O20919P59511L30037N46887R79181N07667R00775
$$ plain form
4344 35806245 36615609 37270853 38106953 39080247 40232535 41023403 41660165 42237022 43014297
4335 43014297 43949053 45012823 45974661 47284291 48395361 49387963 50398316 51289833 52351379
4326 52351379 53255361 53597799 54153458 54622441 55042128 55477503 56073579 56521894 56575299 57012300
4316 57012300 57564238 57990738 57897492 57648145 57435766 57172853 56734455 56203812 55344431 54536280
4306 54536280 53970421 53450830 52815620 52134356 51266975 50510584 49630246 48544695 47536442
4297 47536442 46496291 45037140 43616576 42147189 40867347 39812240 38866359 37865954
4289 37865954 36836043 35618263 34269423 33074755 32052122 31192553 30131505 28893120
4281 28893120 28082695 27037856 26107003 25166593 24148117 23470935 22675936 21948722 21377088
$$ packed form
4344C5806245Q09364O55244Q36100R73294J152288P90868O36762N76857P77275
4335D3014297R34756J063770R61838J309630J111070R92602J010353Q91517J061546
4326E2351379R03982L42438N55659M68983M19687M35375N96076M48315N3405M37001
4316E7012300N51938M26500r3246k49347k12379k62913m38398n30643q59381q08151
4306E4536280n65859n19591o35210o81264q67381p56391q80338j085551j008253
4297D7536442j040151j459151j420564j469387j279842j055107r45881j000405
4289C7865954j029911j217780j348840j194668j022633q59569j061048j238385
4281B8893120q10425j044839r30853r40410j018476o77182p94999p27214n71634
$$ plain form
4272 21377088 20704803 19958675 19332657 18499875 18152579 17603993 17174009 16691161 16189766
4263 16189766 15593542 15222866 14847428 14523841 14266616 13633038 13295813 12947652 12746921
4254 12746921 12893709 12646557 12202487 11980224 11838560 11848955 11244715 10941389 11020130 10923714
4244 10923714 10737364 10383023 10013157 10180706 10138727 9950603 9800671 9561083 9430850 9340770
4234 9340770 9354519 9069891 9051510 8919367 8560034 8379953 8478382 8857535 8674425 8377732
4224 8377732 8168737 8059181 7861030 7789493 7953749 7918966 8016555 7966351 7740466 7804553
4214 7804553 7899413 8154193 8108020 7930014 7717114 7841692 7862380 7806157 7831652 7855586 7783638
4203 7783638 7428159 7678866 7712978 7507849 7364493 7358750 7487288 7602930 7505519 7396841
$$ packed form
4272B1377088o72285p46128o26018q32782l47296n48586m29984m82848n01395
4263A6189766n96224l70676l75438l23587k57225o33578l37225l48161k00731
4254A2746921J46788k47152m44070k22263j41664J0395o04240l03326P8741r6416
4244A0923714j86350l54341l69866J67549m1979j88124j49932k39588j30233r0080
4234I340770J3749k84628j8381j32143l59333j80081R8429L79153j83110k96693
4224H377732k08995j09556j98151p1537J64256l4783R7589n0204k25885O4087
4214G804553R4860K54780m6173j78006k12900J24578K0688n6223K5495K3934p1948
4203G783638l55479K50707L4112k05129j43356n743J28538J15642r7411j08678
$$ plain form
4193 7396841 7410098 7238041 7311739 7495482 7843545 7793522 7530300 7529548 7847679 7869165 7902626
4182 7902626 7864140 7827240 7881304 7977874 8266809 8089407 8142036 8149451 8341993 8227863 8266972
4171 8266972 8293596 8574286 8711650 8662094 8550594 8321963 8457395 8714865 8665928 8650837
4161 8650837 8870929 8917255 8882937 9067430 9031394 8936395 8942289 9187973 9420515 9577060 9760168
4150 9760168 9854589 9983809 10274934 10380390 10183616 10189094 10577237 10858179 11041110 11189212
4140 11189212 11412072 11425209 11312914 11619807 11678116 11783464 12015388 11940046 11999743 12209539
4130 12209539 12629267 12923773 13100190 13094938 13264466 13300647 13559731 13809242 14011771 14165679
4120 14165679 14257799 14516430 14458788 14862447 15322176 15759924 15932307 15887271 16076593 16539407
$$ packed form
4193G396841J3257j72057P3698J83743L48063n0023k63222p52L18131K1486L3461
4182G902626l8486l6900N4064R6570K88935j77402N2629P415J92542j14130L9109
4171H266972K6624K80690J37364m9556j11500k28631J35432K57470m8937j5091
4161H650837K20092M6326l4318J84493l6036r4999N894K45684K32542J56545J83108
4150I760168R4421J29220K91125J05456j96774N478L88143K80942J82931J48102
4140A1189212K22860J3137j12295L06893N8309J05348K31924p5342N9697K09796
4130A2209539M19728K94506J76417n252J69528L6181K59084K49511K02529J53908
4120A4165679R2120K58631n7642M03659M59729M37748J72383m5036J89322M62814
$$ plain form
4110 16539407 16718420 16966547 17358785 17620613 18034588 18196819 18424713 18960419 19324260
4101 19324260 19689717 20050794 20419906 20906849 21525016 22013077 22203099 22556086 22910336
4092 22910336 23691322 24320649 24753566 25183346 25617115 26411605 27040874 27766663 28304351
4083 28304351 29128180 29730085 29969664 30649615 31552731 32135243 32755665 33331131 34155284
4074 34155284 34767332 35639482 36294987 37137409 38191591 39094787 39701036 40420678 41313494
4065 41313494 42312958 43523498 44865700 45646718 47003221 48485311 49696968 50980132
4057 50980132 52450929 54389433 55920731 57518723 59349847 61494367 63605688 65673546
4049 65673546 68436528 70979244 73717657 76701353 80014539 83913089 87532527 91351400
$$ packed form
4110A6539407J79013K48127L92238K61828M13975J62231K27894N35706L63841
4101A9324260L65457L61077L69112M86943O18167M88061J90022L52987L54250
4092B2910336P80986O29327M32917M29780M33769P94490O29269P25789N37688
4083B8304351Q23829O01905K39579O79951R03116N82512O20422N75466Q24153
4074C4155284O12048Q72150O55505Q42422J054182R03196O06249P19642Q92816
4065D1313494R99464J210540J342202P81018J356503J482090J211657J283164
4057E0980132J470797J938504J531298J597992J831124K144520K111321K067858
4049F5673546K762982K542716K738413K983696L313186L898550L619438L818873
$$ plain form
4041 91351400 95480732 99994083 104541584 109041685 113505273 117723323 121783189 125558024
4033 125558024 129222330 132401561 135059826 137288732 138999219 140448446 141541869 142217531
4025 142217531 142330209 142163018 141900641 141273662 140214114 139081750 137712462 135027932 132120354
4016 132120354 129450599 126026518 122387025 118144867 114080855 109678102 105265863 100786620
4008 100786620 96338860 91944182 87775101 83772901 79689919 75423044 71856441 68329994
4000 68329994 65299667 62799006 59962744 57360884 54972893 52644644 51180175 49254280
3992 49254280 47281892 45660032 44180696 42494705 41136342 39991402 38364555 37419355
3984 37419355 36486557 35562267 34610221 33800340 33187413 32463811 31773543 31080199 30486178
$$ packed form
4041I1351400M129332M513351M547501M500101M463588M218050M059866L774835
4033A25558024L664306L179231K658265K228906J710487J449227J093423O75662
4025A42217531J12678j67191k62377o26979j059548j132364j369288k684530k907578
4016A32120354k669755l424081l639493m242158m064012m402753m412239m479243
4008A00786620m447760m394678m169081m002200m082982m266875l566603l526447
4000F8329994l030327k500661k836262k601860k387991k328249j464469j925895
3992D9254280j972388j621860j479336j685991j358363j144940j626847r45200
3984C7419355r32798r24290r52046q09881o12927p23602o90268o93344n94021
$$ plain form
3975 30486178 29790932 29092588 28496958 28083788 27685368 27059319 26640631 26284004 25605484
3966 25605484 24936518 24604317 24571876 24235260 23803163 23562116 23126816 22944090 22866370 22616545
3956 22616545 22501633 22234808 22045656 22057093 22119070 22217453 21930204 21651840 21662830 21718538
3946 21718538 21982762 22276321 22345432 22332451 22424616 22486903 22790000 22826877 23243201 23638971
3936 23638971 23822980 24156770 24361234 24945024 25556475 26195329 26601244 27233244 28234002
3927 28234002 29371986 30085127 31116814 32116645 33086231 34117516 35330219 36233006 36840512
3918 36840512 37405329 37887726 38007421 37777536 37451719 37412877 37147485 36743535 36181065 36237939
3908 36237939 36265817 36254585 36038948 36283398 36502648 36628174 37301361 37836077 38247333 38854614
$$ packed form
3975C0486178o95246o98344n95630m13170l98420o26049m18688l56627o78520
3966B5605484o68966l32201l2441l36616m32097k41047m35300j82726p7720k49825
3956B2616545j14912k66825j89152J1437O1977R8383k87249k78364J0990N5708
3946B1718538K64224K93559O9111j2981R2165O2287L03097L6877M16324L95770
3936B3638971J84009L33790K04464N83790O11451O38854M05915O32000J000758
3927B8234002J137984P13141J031687R99831R69586J031285J212703R02787O07506
3918C6840512N64817M82397J19695k29885l25817l8842k65392m03950n62470N6874
3908C6237939K7878j1232k15637K44450K19250J25526O73187N34716M11256O07281
$$ plain form
3898 38854614 39658675 40407267 41536240 42647188 43821083 45561890 47393559 48988017
3890 48988017 50829720 52639246 54810930 56939842 59184425 62197473 65323336 68421664
3882 68421664 71610381 75252687 79589588 83791145 88207724 93355117 98501964 103994291
3874 103994291 109904176 115740663 121751000 127897571 133907597 139798601 145225170 149961060
3866 149961060 154093035 157787307 160905855 163038653 164644107 165781051 166277828 166440309
3858 166440309 166158002 165710580 165479234 165181056 164485323 163606286 162521407 161234332 160416701
3849 160416701 159263906 157488123 155551854 153341957 150372553 147383119 144042005 140364031
3841 140364031 136709740 133151125 129306879 125246176 121443886 118001957 114715638 111607355
$$ packed form
3898C8854614Q04061P48592J128973J110948J173895J740807J831669J594458
3890D8988017J841703J809526K171684K128912K244583L013048L125863L098328
3882F8421664L188717L642306M336901M201557M416579N147393N146847N492327
3874A03994291N909885N836487O010337O146571O010026N891004N426569M735890
3866A49961060M131975L694272L118548K132798J605454J136944M96777J62481
3858A66440309k82307m47422k31346k98178o95733q79037j084879j287075q17631
3849A60416701j152795j775783j936269k209897k969404k989434l341114l677974
3841A40364031l654291l558615l844246m060703l802290l441929l286319l108283
$$ plain form
3833 111607355 108777590 106428139 104736918 103100439 101771726 100910029 100265033 100072798
3825 100072798 100174145 100436402 100967832 101558009 102241595 102880301 103568545 104263992 104719105
3816 104719105 105108232 104945078 105324547 105151568 104375098 103424266 102577052 101629433 100047706
3807 100047706 98681049 96824789 94948412 93019595 90898091 89075046 87075384 85103282
3799 85103282 82994753 80762013 78718094 76029791 73946516 72031539 69666359 67202001
3791 67202001 64995317 62443837 59679199 57426657 55205573 53146036 50713352 48582459
3783 48582459 46706351 44527869 42484748 40947675 39401886 38037284 36562023 35388392
3775 35388392 34268821 33140950 32473876 31472528 30195146 29473814 28889739 28193819 27390923
$$ packed form
3833A11607355k829765k349451j691221j636479j328713q61697o44996j92235
3825A00072798J01347K62257N31430N90177O83586O38706O88244O95447M55113
3816A04719105L89127j63154L79469j72979p76470r50832q47214r47619j581727
3807A00047706j366657j856260j876377j928817k121504j823045j999662j972102
3799H5103282k108529k232740k043919k688303k083275j914977k365180k464358
3791F7202001k206684k551480k764638k252542k221084k059537k432684k130893
3783D8582459j876108k178482k043121j537073j545789j364602j475261j173631
3775C5388392j119571j127871o67074j001348j277382p21332n84075o95920q02896
$$ plain form
3766 27390923 26645896 26301751 26044919 25768825 25389983 24828307 24541526 24421288 24455970 24279704
3756 24279704 23896551 23550557 23242049 23167629 23293182 23043355 22351492 22077019 22041627 22091027
3746 22091027 21685277 21008900 20357577 20034875 19734721 19242791 18752082 18336290 18069178
3737 18069178 17840060 17258386 16676389 16482995 16098556 15725378 15545961 15443351 15385875 15084097
3727 15084097 14706438 14062944 13846064 13802063 13632175 13462346 13347660 13370143 13329737 12726259
3717 12726259 12782791 12725855 12346031 12303218 12309705 12000887 12162148 12029487 12052030 12166605
3707 12166605 12218742 12018026 11838981 11880526 11501947 11522154 11424745 11169665 11085589 11170510
3697 11170510 11486479 11646328 11458733 11229909 11195312 11155395 10976578 11135892 11071247 10981380
$$ packed form
3766B7390923p45027l44145k56832k76094l78842n61676k86781j20238L4682j76266
3756B4279704l83153l45994l08508p4420J25553k49827o91863k74473l5392M9400
3746B2091027m05750o76377o51323l22702l00154m91930m90709m15792k67112
3737A8069178k29118n81674n81997j93394l84439l73178j79417j02610n7476l01778
3727A5084097l77659o43494k16880m4001j69888j69829j14686K2483m0406o03478
3717A2726259N6532n6936l79824m2813O487l08818J61261j32661K2543J14575
3707A2166605N2137k00716j79045M1545l78579K0207r7409k55080q4076Q4921
3697A1170510L15969J59849j87595k28824l4597l9917j78817J59314o4645q9867
$$ plain form
3687 10981380 10880041 10983911 10923107 10988147 11129868 11475879 11514049 11525620 11299421 11259120
3677 11259120 11204123 11414970 11368973 11365273 11727651 11663147 11838363 12000405 11657418 11695026
3667 11695026 12126752 12253709 12391509 12615374 12667044 12807431 12625771 12882423 13439836 13735823
3657 13735823 13950394 13960989 14377307 14453577 14878245 15273706 15487922 15611026 16004891 16468941
3647 16468941 17097466 17792357 18326793 18975326 19514611 20239697 20935218 21709392 22343236
3638 22343236 23227569 24029795 24755937 25520875 26325783 27452956 28484621 29671257 30660392
3629 30660392 31976787 33128133 34133582 34902275 35763872 36840625 37741620 38318063 38984509
3620 38984509 39304003 39823212 40195166 40436335 40618036 40861891 41344789 41721478 42100214
$$ packed form
3687A0981380j01339J03870o0804O5040J41721L46011L8170J1571k26199m0301
3677A1259120n4997K10847m5997l700L62378o4504J75216J62042l42987L7608
3667A1695026M31726J26957J37800K23865N1670J40387j81660K56652N57413K95987
3657A3735823K14571J0595M16318P6270M24668L95461K14216J23104L93865M64050
3647A6468941O28525O94891N34436O48533N39285P25086O95521P74174O33844
3638B2343236Q84333Q02226P26142P64938Q04908J127173J031665J186636R89135
3629C0660392J316395J151346J005449P68693Q61597J076753R00995N76443O66446
3620C8984509L19494N19209L71954K41169J81701K43855M82898L76689L78736
$$ plain form
3611 42100214 42502731 42649629 42955065 43343364 43461660 43560380 43765226 43765423 43776787 44212756
3601 44212756 44715050 45230836 45956568 46934417 47872039 49383987 50858210 52647689 54487888
3592 54487888 56759870 59305183 61697040 64805612 68232403 71989254 76012219 80099282
3584 80099282 84712805 89439970 94215018 99359804 104704174 109936431 115293381 120753964
3576 120753964 126232598 131279402 136233923 141137053 146036211 150282256 154377841 157470634
3568 157470634 160340378 162474257 164358515 165725157 166366806 166314885 165835452 165026146 163705520
3559 163705520 161776928 159445399 156419224 153155424 149885118 146275354 142639570 138634582
3551 138634582 134552128 130103939 125976458 122176264 118306711 114527677 111262581 108020568
$$ packed form
3611D2100214M02517J46898L05436L88299J18296R8720K04846J97J1364M35969
3601D4212756N02294N15786P25732R77849R37622J511948J474223J789479J840199
3592E4487888K271982K545313K391857L108572L426791L756851M022965M087063
3584H0099282M613523M727165M775048N144786N344370N232257N356950N460583
3576A20753964N478634N046804M954521M903130M899158M246045M095585L092793
3568A57470634K869744K133879J884258J366642O41649n1921m79433q09306j320626
3559A63705520j928592k331529l026175l263800l270306l609764l635784m004988
3551A38634582m082454m448189m127481l800194l869553l779034l265096l242013
$$ plain form
3543 108020568 104790282 102067149 100010718 98168042 96567496 95599266 95450599 95304575
3535 95304575 95033928 95553673 96267533 96994395 98375086 99729199 100873756 102302079 103315631
3526 103315631 104145528 105248224 105675247 106073552 106476966 106713635 106857956 106544824 105902251
3517 105902251 105639178 105206930 104321232 103362551 102801624 101488971 99749731 97789521 95564754
3508 95564754 92903081 89914746 86598508 83139152 79692963 76407078 72483735 68942555
3500 68942555 65997064 63175622 60594464 58173407 56001219 53882939 52045733 50624130
3492 50624130 49285662 48014785 46767189 45692491 44821761 44271265 44168038 44125710 44049380
3483 44049380 44364361 44598876 44641691 44648750 44852712 45088877 45240574 45069868 44858080 44931861
$$ packed form
3543A08020568l230286k723133k056431j842676j600546r68230j48667j46024
3535I5304575k70647N19745P13860P26862J380691J354113J144557J428323J013552
3526A03315631Q29897J102696M27023L98305M03414K36669J44321l13132o42573
3517A05902251k63073m32248q85698r58681n60927j312653j739240j960210k224767
3508I5564754k661673k988335l316238l459356l446189l285885l923343l541180
3500F8942555k945491k821442k581158k421057k172188k118280j837206j421603
3492E0624130j338468j270877j247596j074698q70730n50496j03227m2328p6330
3483D4049380L14981K34515M2815P059K03962K36165J51697j70706k11788P3781
$$ plain form
3473 44931861 45249596 45584725 45535430 46098942 46815875 46868263 47162479 47334496 47438434 47597843
3463 47597843 47561146 47898282 48397674 48462854 48373354 48369967 48439164 48627001 48465757 48285611
3453 48285611 48079555 48147134 47741709 47079488 46546201 45835515 45000212 44308390 43460223 42746223
3443 42746223 42177063 41548636 40818050 40579424 40562603 40791035 40912665 41176038 41508958 41809042
3433 41809042 42994929 44095209 45023366 46336386 47714563 49672017 51701912 54103393
3425 54103393 56590617 59568659 62669710 66024726 69725439 73608438 77442477 81237196
3417 81237196 84541592 87197868 89282468 90392465 90637490 90418872 89539139 88480858 87044477
3408 87044477 85449649 84356162 83491125 82494363 81911108 82041487 82559532 83265531 84522799
$$ packed form
3473D4931861L17735L35129m9295N63512P16933N2388K94216J72017J03938J59409
3463D7597843l6697L37136M99392O5180q9500l387O9197J87837j61244j80146
3453D8285611k06056O7579m05425o62221n33287p10686q35303o91822q48167p14000
3443D2746223n69160o28427p30586k38626j6821K28432J21630K63373L32920L00084
3433D1809042J185887J100280R28157J313020J378177J957454K029895K401481
3425E4103393K487224K978042L101051L355016L700713L882999L834039L794719
3417H1237196L304396K656276K084600J109997K45025k18618q79733j058281j436381
3408H7044477j594828j093487q65037r96762n83255J30379N18045P05999J257268
$$ plain form
3399 84522799 86153827 87756016 89845648 91518600 93526428 95030476 96278514 97455659
3391 97455659 98105304 98603110 99012277 99184109 99028223 98700183 98975264 98631666 98175184
3382 98175184 97958021 97728534 97279680 96940584 96346326 95562661 94511174 92982127 91259488
3373 91259488 89603046 87304543 84407187 81359662 78092496 74874512 71614799 68193490
3365 68193490 64762519 61316777 57596880 54239584 51270220 48541807 46006607 43453493
3357 43453493 41278988 39374399 37604398 35806217 34265601 32877691 31701163 30850009
3349 30850009 29827318 28913268 27810376 26914120 26081693 25284795 24494921 24023740 23585704
3340 23585704 23147637 22831200 22635043 21895791 21271940 21003292 20420589 20089754 19576921
$$ packed form
3399H4522799J631028J602189K089632J672952K007828J504048J248038J177145
3391I7455659O49645M97806M09167J71832j55886l28040K75081l43598m56482
3382I8175184k17163k29487m48854l39096n94258p83665j051487j529047j722639
3373I1259488j656442k298503k897356l047525l267166l217984l259713l421309
3365F8193490l430971l445742l719897l357296k969364k728413k535200k553114
3357D3453493k174505j904589j770001j798181j540616j387910j176528q51154
3349C0850009j022691r14050j102892q96256q32427p96898p89874m71181m38036
3340B3585704m38067l16437j96157p39252o23851k68648n82703l30835n12833
$$ plain form
3331 19576921 19359287 19540116 19458237 19454142 19328158 19249961 19342394 19378299 19468165 19902777 20147550
3320 20147550 20139724 19910071 19889894 19711954 19581210 19367191 18954068 18432752 17893684 17270899
3310 17270899 16679623 16241173 15860082 15713913 15186456 14443769 14107996 13450679 12987075
3301 12987075 12841946 12564627 12443542 12392345 12118257 11744210 11792394 11894773 11727098 11218866
3291 11218866 11084322 11189628 11060388 10830876 10739205 10506674 10408624 10278351 10228813 10294870
3281 10294870 10053753 10204272 10202333 9953245 10020937 10079980 10177058 10123678 10085027 9983382 9579310
3270 9579310 9543459 9730331 9792426 9706821 9858475 10099773 9936645 9820603 9401381 9330203
3260 9330203 9539650 9517182 9517931 9535113 9648292 9600357 9407178 9362921 9233148 9459210 9634731
$$ packed form
3331A9576921k17634J80829q1879m095j25984p8197R2433L5905Q9866M34612K44773
3320B0147550p826k29653k0177j77940j30744k14019m13123n21316n39068o22785
3310A7270899n91276m38450l81091j46169n27457p42687l35773o57317m63604
3301A2987075j45129k77319j21085n1197k74088l74047M8184J02379j67675n08232
3291A1218866j34544J05306j29240k29512r1671k32531r8050j30273m9538O6057
3281A0294870k41117J50519j939k49088O7692N9043R7078n3380l8651j01645m04072
3270I579310l5851J86872O2095q5605J51654K41298j63128j16042m19222p1178
3260I330203K09447k2468P49J7182J13179m7935j93179m4257j29773K26062J75521
$$ plain form
3249 9634731 9548577 9282400 9183727 9175790 9549415 9408743 9411796 9767402 9781263 9899337 9912980
3238 9912980 10157538 10121478 10011719 9928296 10166098 10139198 10210188 10135778 10367345 10517954
3228 10517954 10494126 10762807 10982434 11087226 11087809 11485109 11548528 11498074 11436097 11715051 12060668
3217 12060668 12307025 12408699 12668928 12629848 13045253 13289526 13365264 13774137 13978421 14048077
3207 14048077 14333762 14465543 15013913 15371894 15979358 16074622 16169186 16650699 17363232 18006446
3197 18006446 18733834 19267161 19568693 20065052 20427652 21022311 21804331 22495700 23368313
3188 23368313 24191488 25047952 26167185 26948903 28179455 29111252 30590965 32152570 33718915
3179 33718915 35314782 37314562 39076252 41188859 43336592 45274059 47377534 49863692
$$ packed form
3249I634731q6154k66177r8673p937L73625j40672L053L55606J3861J18074J3643
3238I912980K44558l6060j09759q3423K37802k6900P0990p4410K31567J50609
3228A0517954k3828K68681K19627J04792N83L97300O3419n0454o1977K78954L45617
3217A2060668K46357J01674K60229l9080M15405K44273P5738M08873K04284O9656
3207A4048077K85685J31781N48370L57981O07464R5264R4564M81513P12533O43214
3197A8006446P27388N33327L01532M96359L62600N94659P82020O91369Q72613
3188B3368313Q23175Q56464J119233P81718J230552R31797J479713J561605J566345
3179C3718915J595867J999780J761690K112607K147733J937467K103475K486158
$$ plain form
3171 49863692 51953474 54489573 57587962 61129180 65017220 69199604 73637448 78853475
3163 78853475 84591182 90964930 98390405 106903574 116234824 126847155 139310454 153815815
3155 153815815 170094894 187979389 205778316 221385641 231825598 235839736 232941435
3148 232941435 222941402 207675514 190355989 173343143 157890609 144602008 133631697
3141 133631697 124810803 117245656 111304080 106471268 102463100 99167602 96566001 94820532
3133 94820532 93754029 92754627 92180950 91989807 92165792 92238296 92784567 93643942 94655641
3124 94655641 95659335 96738347 98477584 100543484 102737562 105480994 108060119 111192207
3116 111192207 114793832 118669950 122919634 127727152 133001033 139219928 146182219 153965494
$$ packed form
3171D9863692K089782K536099L098389L541218L888040M182384M437844N216027
3163G8853475N737707O373748P425475Q513169R331250J0612331J2463299J4505361
3155A53815815J6279079J7884495J7798927J5607325J0439957M014138k898301
3148B32941435j0000033j5265888j7319525j7012846j5452534j3288601j0970311
3141A33631697q820894p565147n941576m832812m008168l295498k601601j745469
3133I4820532j066503r99402n73677j91143J75985P2504N46271Q59375J011699
3124I4655641J003694J079012J739237K065900K194078K743432K579125L132088
3116A11192207L601625L876118M249684M807518N273881O218895O962291P783275
$$ plain form
3108 153965494 162866534 172308903 183611816 195970104 209832299 225634361 243186795
3101 243186795 262926809 284905601 309275238 335829254 363545932 390597901 415364672
3094 415364672 434904951 446230030 448041860 439750255 422330333 397618160 369104086
3087 369104086 339533503 310623076 284185477 259721685 238079572 218992357 201696688
3080 201696688 186451859 172828374 160677959 149806849 139727589 130813532 122784754
3073 122784754 115642826 108915786 103020077 97448400 92007224 87583770 83497338 79794625
3065 79794625 76196839 72631464 69469009 66467825 63819887 61104215 58689320 56475980
3057 56475980 54369991 52277576 50494007 48889865 47190248 45585703 43842388 42121304
$$ packed form
3108A53965494Q901040R442369J1302913J2358288J3862195J5802062J7552434
3101B43186795J9740014K1978792K4369637K6554016K7716678K7051969K4766771
3094D15364672J9540279J1325079J811830q291605j7419922k4712173k8514074
3087C69104086k9570583k8910427k6437599k4463792k1642113j9087215j7295669
3080B01696688j5244829j3623485j2150415j0871110j0079260q914057q028778
3073A22784754p141928o727040n895709n571677n441176m423454m086432l702713
3065G9794625l597786l565375l162455l001184k647938k715672k414895k213340
3057E6475980k105989k092415j783569j604142j699617j604545j743315j721084
$$ plain form
3049 42121304 40617813 39454193 38331514 37120795 35822949 34632908 33220372 32263262
3041 32263262 31212475 30113892 29258651 28460662 27609444 26927809 26505096 25684220 24749618
3032 24749618 23843531 23338464 22853327 22170133 21524167 20722337 20106541 19654795 19173473
3023 19173473 18786165 18711199 18402909 17697528 17291509 16655191 16219926 16080890 15548825 15361433
3013 15361433 14830840 14553243 14420026 14032530 13803546 13324500 12779843 12394559 12382280 12377740
3003 12377740 12069630 11678720 11224338 11005358 11205945 11004830 10818160 10704229 10234039
2994 10234039 10119472 10047750 9697821 9751440 9468230 9157947 9236225 9268793 8637158 8283355
2984 8283355 8505913 8395406 8048051 7913931 7942817 7674538 7539022 7640559 7452189 7367134
$$ packed form
3049D2121304j503491j163620j122679j210719j297846j190041j412536r57110
3041C2263262j050787j098583q55241p97989q51218o81635m22713q20876r34602
3032B4749618r06087n05067m85137o83194o45966q01830o15796m51746m81322
3023A9173473l87308p4966l08290p05381m06019o36318m35265j39036n32065j87392
3013A5361433n30593k77597j33217l87496k28984m79046n44657l85284j2279m540
3003A2377740l08110l90910m54382k18980K00587k01115j86670j13931m70190
2994A0234039j14567p1722l49929N3619k83210l10283P8278L2568o31635l53803
2984H283355K22558j10507l47355j34120K8886k68279j35516J01537j88370q5055
$$ plain form
2974 7367134 7280520 7071163 6949296 7011614 7073667 7052675 6623210 6494078 6701642 6412120
2964 6412120 6240908 6113729 6213583 6130841 6309585 6127781 5848135 5847920 5593289 5388027
2954 5388027 5452956 5341866 5531108 5270067 4721122 4880061 5339777 5147438 4891949 4897765
2944 4897765 4639292 4615454 4560919 4416021 4428320 4436130 4318422 4248889 4422432 4164000 3896581
2933 3896581 3987763 3999638 4021126 3854033 4010061 3852775 3733410 3830687 3563937 3556198 3351208
2922 3351208 3236470 3424177 3444959 3569304 3367793 3338901 3300462 3155170 3095414 3055875
2912 3055875 3355148 3062295 2984262 2991920 2895475 2736202 2515552 2457989 2572166 2579880 2512929
2901 2512929 2895625 2943436 2617533 2752330 2595468 2519197 2254029 2060521 2218983 2388438
$$ packed form
2974G367134q6614k09357j21867O2318O2053k0992m29465j29132K07564k89522
2964F412120j71212j27179R9854q2742J78744j81804k79646k15k54631k05262
2954E388027O4929j11090J89242k61041n48945J58939M59716j92339k55489N816
2944D897765k58473k3838n4535j44898J2299P810j17708o9533J73543k58432k67419
2933C896581R1182J1875K1488j67093J56028j57286j19365R7277k66750p739k04990
2922C351208j14738J87707K0782J24345k01511k8892l8439j45292n9756l9539
2912C055875K99273k92853p8033P658r6445j59273k20650n7563J14177P714o6951
2901B512929L82696M7811l25903J34797j56862p6271k65168j93508J58462J69455
$$ plain form
2891 2388438 2332240 2241557 2126954 2335739 2439368 2241195 2145204 1952615 2175373 1956265
2881 1956265 2065948 2306037 2253119 2142648 2003569 2152808 2167354 2116205 2121092 2205161 2292670
2870 2292670 2179957 2437389 2471552 2656845 2730801 2743781 2757684 2491442 2542553 2512722 2371178
2859 2371178 2193911 2007194 1986854 1833487 1824163 1934432 2128976 2073114 2050527 1764857
2849 1764857 1689583 1641023 1570981 1509079 1411968 1473137 1674320 1666429 1499701 1623860 1765024
2838 1765024 1877644 1623401 1679849 1902762 1705074 1727358 1753487 1872980 1853865 1767641
2828 1767641 1560497 1551692 1567812 1656807 1717153 1495007 1579551 1895236 1884714 1936360 2160384
2817 2160384 2185978 2162469 2512205 2683422 2727212 2915309 2602163 2815662 2953906 2903208
$$ packed form
2891B388438n6198r0683j14603K08785J03629j98173r5991j92589K22758k19108
2881A956265J09683K40089n2918j10471j39079J49239J4546n1149M887Q4069Q7509
2870B292670j12713K57432L4163J85293P3956J2980J3903k66242N1111k9831j41544
2859B371178j77267j86717k0340j53367r324J10269J94544n5862k2587k85670
2849A764857p5274m8560p0042o1902r7111O1169K01183p891j66728J24159J41164
2838A765024J12620k54243N6448K22913j97688K2284K6129J19493j9115q6224
2828A767641k07144q805J6120Q8995O0346k22146Q4544L15685j0522N1646K24024
2817B160384K5594k3509L49736J71217M3790J88097l13146K13499J38244n0698
$$ plain form
2807 2903208 3052840 2935474 2740104 2681466 2287013 2071942 2259027 2397111 2385855 2116810
2797 2116810 1897858 1753288 1831648 2152210 1736308 1354929 1314023 1018201 887317 872958
2787 872958 1199803 1139244 1166145 1107124 961039 1103972 1166115 1248564 1153015 1063758 914649
2776 914649 850898 755423 630611 371779 688628 805150 689906 958251 967541 635189
2766 635189 627026 733387 808070 867856 805340 532222 529797 480278 549944 438412 348602
2755 348602 362266 401588 364863 460777 678791 583704 300853 430656 396202 233127 398020
2744 398020 441968 406824 448625 404479 412283 407695 357041 301755 214325 325701 119537 32904
2732 32904 286337 552390 503864 761302 621622 421449 351542 421954 372958 475118 499185
$$ packed form
2807B903208J49632j17366j95370n8638l94453k15071J87085J38084j1256k69045
2797B116810k18952j44570P8360L20562m15902l81379m0906k95822j30884j4359
2787H72958L26845o0559K6901n9021j46085J42933O2143Q2449r5549q9257j49109
2776I14649o3751r5475j24812k58832L16849J16522j15244K68345R290l32352
2766F35189q163J06361P4683N9786o2516k73118k425m9519O9666j11532q9810
2755C48602J3664L9322l6725R5914K18014r5087k82851J29803l4454j63075J64893
2744C98020M3948l5144M1801m4146P804m588n0654n5286q7430J11376k06164q6633
2732C2904K53433K66053m8526K57438j39680k00173o9907P0412m8996J02160K4067
$$ plain form
2721 499185 603948 588623 212069 169160 336426 312426 509795 492820 225450 101894
2711 101894 183282 155816 188108 120603 331919 399075 163653 238158 -29288 278185 415232
2700 415232 101096 125040 198788 386941 471830 439244 288668 324723 377794 305412 137329
2689 137329 59794 25495 -119926 194563 2787 114202 232063 301494 379706 120119
2679 120119 -78895 33830 -34746 -48056 -91390 161440 130151 274415 163855 179496 190565
2668 190565 359166 470140 420129 177809 310245 373609 215677 284337 -141713 -197558
2658 -197558 -295070 -86825 191776 289828 -79402 -53254 25714 227108 312917 123754 60726
2647 60726 -12586 134184 14174 -76501 68623 102875 211223 359018 233671 66279
$$ packed form
2721D99185J04763j5325l76554m2909J67266k4000J97369j6975k67370j23556
2711A01894Q1388k7466L2292o7505K11316O7156k35422P4505k67446L07473J37047
2700D15232l14136K3944P3748J88153Q4889l2586j50576L6055N3071p2382j68083
2689A37329p7535l4299j45421L14489j91776J11415J17861O9431P8212k59587
2679A20119j99014J12725o8576j3310m3334K52830l1289J44264j10560J5641J1069
2668A90565J68601J10974n0011k42320J32436O3364j57932O8660m26050n5845
2658a97558r7512K08245K78601R8052l69230K6148P8968K01394Q5809j89163o3028
2647F0726p3312J46770j20010r0675J45124L4252J08348J47795j25347j67392
$$ plain form
2637 66279 287 -68179 36305 -74664 92065 189205 2522 -91281 -54104 -64924 -18640
2626 -18640 -167323 49704 65919 41786 102411 59672 10944 -213774 -442823 -282739 7503
2615 7503 16321 163068 55573 -23602 135772 87179 169828 138223 -80106 -38737 229968
2604 229968 337350 118969 -215205 -252397 -146311 -203004 104252 427742 436642 316876
2594 316876 113057 28023 -54015 -28862 61533 46250 297446 193085 226515 319846 303146
2583 303146 194291 221833 492584 258032 267860 470577 272965 166204 299066 269629
2573 269629 76404 -54872 151372 103517 243221 101334 15881 -111741 213026 289833
2563 289833 114272 281097 30993 10698 200863 -70199 -95013 -295660 -136460 96388
$$ packed form
2637F6279o5992o8466J04484j10969J66729R7140j86683r3803L7177j0820M6284
2626a8640j48683K17027J6215k4133O0625m2739m8728k24718k29049J60084K90242
2615G503Q818J46747j07495p9175J59374m8593Q2649l1605k18329M1369K68705
2604B29968J07382k18381l34174l7192J06086n6693L07256L23490Q900j19766
2594C16876k03819q5034q2038K5153R0395j5283K51196j04361L3430R3331j6700
2583C03146j08855K7542K70751k34552R828K02717j97612j06761J32862k9437
2573B69629j93225j31276K06244m7855J39704j41887q5453j27622L24767P6807
2563B89833j75561J66825k50104k0295J90165k71062k4814k00647J59200K32848
$$ plain form
2553 96388 -171915 -56972 71832 160914 183904 161974 176438 231865 297688 42017 -93150
2542 -93150 -102613 46812 363142 76564 39023 -116331 -66817 105601 -92053 -109367 -6967
2531 -6967 -8840 42063 -10450 125592 31206 -173117 -275796 -47420 209279 231646 -27142
2520 -27142 79392 229771 -160310 -100385 149542 48560 -110087 -123839 67890 -250071
2510 -250071 -303158 18331 -148158 -178065 23021 -129872 -39485 -215732 -51008 129126
2500 129126 71912 -143971 -114891 73088 120961 -47144 -187812 -229632 -270112 -257326 45322
2489 45322 34120 -88156 -15900 45656 -17925 -99292 -57340 195622 -10947 -193165 -76319
2478 -76319 214756 100487 -100696 14570 289259 323485 -255959 92262 201329 121945
$$ packed form
2553I6388k68303J14943J28804Q9082K2990k1930J4464N5427O5823k55671j35167
2542i3150r463J49425L16330k86578l7541j55354M9514J72418j97654j7314J02400
2531f967j873N0903n2513J36042r4386k04323j02679K28376K56699K2367k58788
2520b7142J06534J50379l90081N9925K49927j00982j58647j3752J91729l17961
2510b50071n3087L21489j66489k9907K01086j52893R0387j76247J64724J80134
2500A29126n7214k15883K9080J87979M7873j68105j40668m1820m0480J2786L02648
2489D5322j1202j22276P2256O1556o3581q1367M1952K52962k06569j82218J16846
2478g6319K91075j14269k01183J15266K74689L4226n79444L48221J09067p9384
$$ plain form
2468 121945 -73818 -6769 133283 168529 118409 -52387 207172 201993 -38073 -42987 51990
2457 51990 123957 222755 293598 114859 226705 205278 141050 83909 133602 -50088 132052
2446 132052 319496 140444 -56106 63620 292707 347117 319418 284975 210202 131565 -133744
2435 -133744 -56619 -24992 107554 395306 407562 425203 212242 117050 361415 451842 400744
2424 400744 354721 547920 482719 423852 455019 256661 95982 -64512 152674 124316 410346
2413 410346 420321 469527 568727 531702 732874 412779 519100 337872 311393 233192 335039
2402 335039 578626 670367 650923 543013 807398 823189 795817 533172 492554 781215 655009
2391 655009 605643 703866 565468 557979 599383 625801 696982 912486 925607 909172 1003449
$$ packed form
2468A21945j95763O7049J40052L5246n0120j70796K59559n179k40066m914R4977
2457E1990P1967R8798P0843j78739J11846k1427o4228n7141M9693j83690J82140
2446A32052J87444j79052j96550J19726K29087N4410k7699l4443p4773p8637k65309
2435a33744P7125L1627J32546K87752J2256J7641k12961r5192K44365R0427n1098
2424D00744m6023J93199o5201n8867L1167j98358j60679j60494K17186k8358K86030
2413D10346R975M9206R9200l7025K01172l20095J06321j81228k6479p8201J01847
2402C35039K43587R1741j9444j07910K64385J5791k7372k62645m0618K88661j26206
2391F55009m9366R8223j38398p489M1404K6418P1181K15504J3121j6435R4277
$$ plain form
2380 1003449 878688 742796 953384 1044603 1047670 1023501 1075329 1014235 953369 1086303 1097560
2369 1097560 1289607 1112608 1192818 1643861 1699419 1512419 1666698 1690634 1630255 1472948
2359 1472948 1516738 1925132 1849267 2104907 2051948 2277878 2581998 2784278 2855402 2926331
2349 2926331 3082830 3332501 3539463 3688121 3951958 4190624 4484713 4811610 5387117 5862265
2339 5862265 6588043 7228524 7971519 8488073 8625659 8540402 9271562 10288678 10803648 11893988
2329 11893988 12867127 14148679 15233588 15996008 17232446 18204411 19322419 21125376 22904373
2320 22904373 25273401 28737861 33586579 39772542 47296549 57893846 69598304 80243379
2312 80243379 84440076 83872489 79237742 66246790 52577894 42751569 35337586 30094845
$$ packed form
2380A003449j24761j35892K10588R1219L067k4169N1828o1094o0866J32934J1257
2369A097560J92047j76999Q0210M51043N5558j87000J54279K3936o0379j57307
2359A472948M3790M08394p5865K55640n2959K25930L04120K02280P1124P0929
2349B926331J56499K49671K06962J48658K63837K38666K94089L26897N75507M75148
2339E862265P25778O40481P42995N16554J37586q5257P31160J017116N14970J090340
2329A1893988R73139J281552J084909P62420J236438R71965J118008J802957J778997
2320B2904373K369028L464460M848718O185963P524007J0597297J1704458J0645075
2312H0243379M196697n67587m634747j2990952j3668896r826325p413983n242741
$$ plain form
2304 30094845 26190269 23171068 20942362 19017257 17507774 16369392 15339896 14477360
2296 14477360 13553806 12684934 11903680 10858372 9955896 8888784 8310287 7826334 7602574
2287 7602574 7094137 6858325 6761223 6411653 6133492 6060337 5991480 5428136 4945401 4562001
2277 4562001 4669506 4570470 4292591 4376995 3993696 3855372 3799802 3727595 3783228 3307318
2267 3307318 2983061 3219414 3115402 2866308 2770180 2787063 2897341 2723143 2601468 2401297
2257 2401297 2168663 1796309 1580969 1830862 1645335 1531488 1749964 1762286 1577877 1230936
2247 1230936 1326145 1415100 1328927 1311372 1427223 1175983 1253133 1534897 1358783 1171652
2237 1171652 1229539 1380301 1188835 1251463 1238131 1256935 971041 1022325 1073554 1112493 1359920
$$ packed form
2304C0094845l904576l019201k228706j925105j509483j138382j029496q62536
2296A4477360r23554q68872p81254j045308r02476j067112n78497m83953k23760
2287G602574n08437k35812r7102l49570k78161p3155o8857n63344m82735l83400
2277D562001J07505r9036k77879Q4404l83299j38324n5570p2207N5633m75910
2267C307318l24257K36353j04012k49094r6128J6883J10278j74198j21675k00171
2257B401297k32634l72354k15340K49893j85527j13847K18476J2322j84409l46941
2247A230936R5209Q8955q6173j7555J15851k51240P7150K81764j76114j87131
2237A171652N7887J50762j91466O2628j3332J8804k85894N1284N1229L8939K47427
$$ plain form
2226 1359920 1490027 1430444 942417 848450 817679 699157 602265 856393 987330 740046
2216 740046 806134 648866 735641 923009 713818 819576 819808 690663 744547 802258 853994
2205 853994 460673 366006 451580 390383 248608 139532 388761 554272 683581 717770
2195 717770 592060 336903 295469 315738 478845 494727 456828 492110 459698 292086 282019
2184 282019 166246 433432 464240 369171 212955 345732 292765 546949 650462 478610
2174 478610 268475 140226 272989 251363 174077 228241 40940 98665 282391 168500
2164 168500 212840 298958 204710 208307 236135 325815 -35507 -358946 -109533 271565 469654
2153 469654 296539 216923 75456 118029 307435 131845 46032 -78870 40299 5721
$$ packed form
2226A359920J30107n9583m88027r3967l0771j18522r6892K54128J30937k47284
2216G40046O6088j57268Q6775J87368k09191J05758K32j29145N3884N7711N1736
2205H53994l93321r4667Q5574o1197j41775j09076K49229J65511J29309L4189
2195G17770j25710k55157m1434K0269J63107J5882l7899L5282l2412j67612j0067
2184B82019j15773K67186L0808r5069j56216J32777n2967K54184J03513j71852
2174D78610k10135j28249J32763k1626p7286N4164j87301N7725J83726j13891
2164A68500M4340Q6118r4248L597K7828Q9680l61322l23439K49413L81098J98089
2153D69654j73115p9616j41467M2573J89406j75590q5813j24902J19169l4578
$$ plain form
2143 5721 -46742 163565 42768 234102 -10324 -118935 210659 30439 82782 198339
2133 198339 190653 399798 150834 132090 181060 175382 44718 12218 81500 221036 113781
2122 113781 60440 -58129 -175781 -64990 -281852 -301370 53728 132399 -97959 -158080
2112 -158080 -153075 -332023 -209454 -89312 87575 -2996 8226 55012 -136420 -309301 -267856
2101 -267856 -441067 -303451 -251465 -276684 -260288 -35485 190026 216551 328667 202634
2091 202634 -92500 -33586 47820 222786 252430 257521 131050 20669 -74094 30775 77967
2080 77967 25611 66311 -82610 -147723 -174909 -181486 28140 -244348 -404582 -269484 -135573
2069 -135573 -122484 -61827 -80394 -293814 -159184 117288 241437 255419 353638 135452 98315
$$ packed form
2143E721n2463K10307j20797J91334k44426j08611L29594j80220N2343J15557
2133A98339p686K09145k48964j8744M8970n678j30664l2500O9282J39536j07255
2122A13781n3341j18569j17652J10791k16862j9518L55098P8671k30358o0121
2112a58080N005j78948J22569J20142J76887r0571J1222M6786j91432j72881M1445
2101b67856j73211J37616N1986k5219J6396K24803K25511K6525J12116j26033
2091B02634k95134N8914Q1406J74966K9644N091j26471j10381r4763J04869M7192
2080G7967n2356M0700j48921o5113k7186o577K09626k72488j60234J35098J33911
2069a35573J3089O0657j8567k13420J34630K76472J24149J3982R8219k18186l7137
$$ plain form
2058 98315 -79156 66163 331859 264458 256251 27294 183739 197565 3470 -17447 225817
2047 225817 238092 -43190 72847 -32161 67846 -30845 236324 92763 103581 -885
2037 -885 18948 46800 113486 142729 146393 233954 117492 -122715 -44834 -197595 -246236 -164617
2025 -164617 54958 386553 413701 286459 64626 95878 -122927 -132879 -185480 -72020 39767
2014 39767 -112997 -104707 -173392 14779 -86503 -227991 -287303 -303077 -120675 -201561 36669
2003 36669 89795 -115693 231296 18649 -35714 71920 -203947 -424119 -358091 -256874
1993 -256874 -68538 -241810 -204957 126650 155735 -34611 -149088 40883 180748 -57000
1983 -57000 -72992 58599 38962 -53229 -183707 87083 -123468 -112065 -52212 -100113 -144861
$$ packed form
2058I8315j77471J45319K65696o7401q207k28957J56445J3826j94095k0917K43264
2047B25817J2275k81282J16037j05008J00007r8691K67169j43561J0818j04466
2037h85J9833K7852O6686K9243L664Q7561j16462k40207P7881j52761m8641Q1619
2025a64617K19575L31595K7148j27242k21833L1252k18805r952n2601J13460J11787
2014C9767j52764Q290o8685J88171j01282j41488n9312j5774J82402q0886K38230
2003C6669N3126k05488L46989k12647n4363J07634k75867k20172O6028J01217
1993b56874J88336j73272L6853L31607K9085j90346j14477J89971J39865k37748
1983e7000j5992J31591j9637r2191j30478K70790k10551J1403N9853m7901m4748
$$ plain form
1972 -144861 -60204 -22436 48072 -282096 -208880 -95579 70990 118918 182167 145574 193561
1961 193561 232 185216 76640 -329840 -32423 -40491 -123525 -115969 175114 44320 -75730
1950 -75730 -156505 63635 270265 -266117 -188612 -161044 -161518 96033 266017 237499 242803
1939 242803 238398 -84290 -187528 -39298 -59863 14038 -30573 -95797 -10408 66848 104693
1928 104693 -262844 -294142 -164444 -42021 28740 -8269 -28632 -146156 -88380 -126431 -80800
1917 -80800 -229513 -59370 264812 -18961 75801 -33458 -82621 -134106 -211410 -223689 -476684
1906 -476684 -535112 -379192 -73274 -62832 -103814 -6393 174195 218436 -135915 -68130 -1121
1895 -1121 55507 181067 51300 -228568 -70827 -106065 -172829 -25446 65751 219112 50044
$$ packed form
1972a44861Q4657L7768P0508l30168P3216J13301J66569M7928O3249l6593M7987
1961A93561j93329J84984j08576m06480K97417q068q3034P556K91083j30794j20050
1950g5730q0775K20140K06630n36382P7505K7568m74K57551J69984k8518N304
1939B42803m405l22688j03238J48230k0565P3901m4611o5224Q5389P7256L7845
1928A04693l67537l1298J29698J22423P0761l7009k0363j17524N7776l8051M5631
1917h0800j48713J70143L24182k83773R4762j09259m9163n1485p7304j2279k52995
1906d76684n8428J55920L05918J0442m0982R7421J80588M4241l54351O7785O7009
1895a121N6628J25560j29767k79868J57741l5238o6764J47383R1197J53361j69068
$$ plain form
1884 50044 -156712 -120354 -54841 123955 -165805 -225945 -280854 16773 -107096 -248482 -294536
1873 -294536 -214959 56276 23393 -117938 -166603 129438 100520 96730 -30180 -83990 -322266
1862 -322266 -312560 -266875 -247813 -148232 -110660 -78790 -129205 -72498 79919 -14771 -142589
1851 -142589 106227 98001 -73523 82061 -168093 -348324 -341936 -206204 -215071 -311458 -273823
1840 -273823 -121208 -161214 -314500 -279442 -299318 -497729 -318453 -342109 -114882 -37228 177030
1829 177030 379556 -24159 -45065 -321367 -320087 -256757 -256363 -6853 121189 204686 51827
1818 51827 -143091 -11020 3142 -158598 -156042 74095 -277973 -476703 9390 -26750 -103112
1807 -103112 -77792 -180101 -221719 -226741 -245762 -175809 -21141 -2750 52256 52196 185690 168497
$$ packed form
1884E0044k06756L6358O5513J78796k89760o0140n4909K97627j23869j41386m6054
1873b94536P9577K71235l2883j41331m8665K96041k8918l790j26910n3810k38276
1862c22266R706M5685J9062R9581L7572L1870n0415N6707J52417r4690j27818
1851a42589K48816q226j71524J55584k50154j80231O388J35732q867r6387L7635
1840b73823J52615m0006j53286L5058j9876j98411J79276k3656K27227P7654K14258
1829A77030K02526m03715k0906k76302J280O3330L94K49510J28042Q3497j52859
1818E1827j94918J32071J4162j61740K556K30137l52068j98730M86093l6140p6362
1807a03112K5320j02309m1618n022j9021O9953J54668J8391N5006o0J33494j7193
$$ plain form
1795 168497 85121 -44229 -73478 -21737 -139072 -285789 -216504 -157319 43687 255933 -11005
1784 -11005 -90592 135801 -87608 -228799 19041 -94097 -53890 -229872 -340343 -283855
1774 -283855 -23138 35028 44708 -158031 -507696 -90748 -70707 -298287 -354166 -237100 -326337
1763 -326337 -495848 -467451 -295851 -108680 -134459 -91383 -50251 48063 -147126 86985 141783
1752 141783 -4202 190063 6346 -123543 -351898 -74829 54728 -84575 33613 24239
1742 24239 -118464 -139343 -114680 -422297 -350038 -308396 -283308 -406190 -390179 -153365 31906
1731 31906 244512 153925 84979 104688 -316997 -366510 -430782 -324676 -286820 -342232 -141697
1720 -141697 26484 -207079 -455519 -155292 -23795 -272880 -374830 -56354 -118462 -196505
$$ packed form
1795A68497q3376j29350k9249N1741j17335j46717O9285N9185K01006K12246k66938
1784a1005p9587K26393k23409j41191K47840j13138M0207j75982j10471N6488
1774b83855K60717N8166R680k02739l49665M16948K0041k27580n5879J17066q9237
1763c26337j69511K8397J71600J87171k5779M3076M1132R8314j95189K34111N4798
1752A41783j45985J94265j83717j29889k28355K77069J29557j39303J18188r374
1742B4239j42703k0879K4663l07617P2259M1642K5088j22882J6011K36814J85271
1731C1906K12606r0587o8946J9709m21685m9513o4272J06106L7856n5412K00535
1720a41697J68181k33563k48440L00227J31497k49085j01950L18476o2108p8043
$$ plain form
1710 -196505 -59791 -198957 -210032 40529 -137904 -276109 -300960 -192222 -381025 -274171
1700 -274171 -265963 -453010 -288420 -249174 -346989 -352242 -348657 -287464 -199210 -108764 -264530 -78723
1688 -78723 -117321 -147154 -136487 -43241 225199 45263 -203555 -154529 -220967 -41043 -60096
1677 -60096 -212465 -369809 -399977 -189703 -158389 -220649 -114898 -263657 -166916 -65137 36132
1666 36132 168731 7208 -84273 -173312 -87154 46826 172091 -18011 -86064 -5774 102628
1655 102628 -72729 -101858 337244 283095 -31910 -82647 -124787 -162281 -314025 -294713 -118115
1644 -118115 -157984 -267738 -163520 -155790 -88267 -141791 -119381 110808 172952 24821 -34503
1633 -34503 -198412 -291364 -325695 -85393 -218523 -351874 -337711 -209788 47757 22275 126611
$$ packed form
1710a96505J36714j39166j1075K50561j78433j38205k4851J08738j88803J06854
1700b74171Q208j87047J64590L9246r7815n253L585O1193Q8254R0446j55766J85807
1688g8723l8598k9833J0667R3246K68440j79936k48818M9026o6438J79924j9053
1677f0096j52369j57344l0168K10274L1314o2260J05751j48759R6741J01779J01269
1666C6132J32599j61523r1481q9039Q6158J33980J25265j90102o8053Q0290J08402
1655A02628j75357k9129M39102n4149l15005n0737m2140l7494j51744J9312J76598
1644a18115l9869j09754J04218P730O7523n3524K2410K30189O2144j48131n9324
1633c4503j63909r2952l4331K40302j33130j33351J4163J27923K57545k5482J04336
$$ plain form
1622 126611 148798 -19268 -119831 -11816 469321 409756 84526 -123337 -193513 -203190 -184675
1611 -184675 -87105 80688 254187 5872 -133036 -24639 -85505 -29465 -62696 -80912 -224546
1600 -224546 -251858 -164532 -169126 -133724 -263919 -314857 -131937 449 -37787 125757 -46669
1589 -46669 28195 -19707 106249 229112 278620 1110 -272881 -226214 -277787 -471884 -393043
1578 -393043 -245420 -200176 -63126 -296986 -311342 -412064 -160724 -63588 -61977 -437814 -331896
1567 -331896 -158640 -143683 13217 43614 193662 -87099 -345242 -269222 -21210 24358
1557 24358 154041 63278 -33418 136151 -178585 -162614 -216343 -138772 -419730 -417525 -206612
1546 -206612 -97535 56125 16946 10240 -107918 -323618 -222196 -60091 51154 -232389
$$ packed form
1622A26611K2187j68066j00563J08015M81137n9565l25230k07863p0176r677J8515
1611a84675R7570J67793J73499k48315j38908J08397o0866N6040l3231j8216j43634
1600b24546k7312Q7326m594L5402j30195n0938J82920J32386l8236J63544j72426
1589d6669P4864m7902J25956J22863M9508k77510k73991M6667n1573j94097P8841
1578c93043J47623M5244J37050k33860j4356j00722K51340R7136J611l75837J05918
1567c31896J73256J4957J56900L0397J50048k80761k58143P6020K48012M5568
1557B4358J29683r0763r6696J69569l14736J5971n3729P7571k80958K205K10913
1546b06612J09077J53660l9179o706j18158k15700J01422J62105J11245k83543
$$ plain form
1536 -232389 -388727 -229538 -283931 -209169 -13246 198230 21863 -47317 -87160 236474
1526 236474 160063 19310 -40226 -19757 -64726 -49134 -229508 -284869 -5699 185162 117682
1515 117682 -24922 -261475 73099 2318 -258335 -25363 220124 -8586 29761 143473
1505 143473 142721 -15035 -241523 -255637 -144063 107549 -39986 -258136 -247452 -85648 64086
1494 64086 75790 132626 -78028 -214089 -57382 42800 88016 -56067 -276654 -154695
1484 -154695 -155661 -156880 -141691 -256984 -98145 72670 142735 -199134 -397903 -177031 -350521
1473 -350521 -387120 -441958 -420633 -159432 -31542 22861 -684 196232 212419 157069 65902
1462 65902 187408 40319 72024 166 -61435 98523 154350 513769 264394 261552 105042
$$ packed form
1536b32389j56338J59189n4393P4762J95923K11476j76367o9180l9843L23634
1526B36474p6411j40753n9536K0469m4969J5592j80374n5361K79170J90861o7480
1515A17682j42604k36553L34574p0781k60653K32972K45487k28710L8347J13712
1505A43473p52j57756k26488j4114J11574K51612j47535k18150J0684J61804J49734
1494F4086J1704N6836k10654j36061J56707J00182M5216j44083k20587J21959
1484a54695r66j219J5189j15293J58839J70815P0065l41869j98769K20872j73490
1473c50521l6599n4838K1325K61201J27890N4403k3545J96916J6187n5350r1167
1462F5902J21506j47089L1705p1858o1601J59958N5827L59419k49375k842j56510
$$ plain form
1451 105042 86756 43909 102904 224973 92600 33238 4563 12470 -29629 101538 137579
1440 137579 53447 135728 102277 -371001 -254910 -180857 -170643 137125 156056 75096 145720
1429 145720 -109302 -516013 -596648 -134020 -229899 -280776 -51544 -128734 -196562 -116510 69658
1418 69658 201146 35039 -50051 68024 358818 286039 54499 221357 384701 101876
1408 101876 13343 -37415 -254301 -435123 -273553 -255594 -26282 34164 52509 -171106 -50752
1397 -50752 -55749 -132204 110256 205957 227085 160492 138082 -26369 -11777 246212 50673
1386 50673 -153854 -13106 -266374 -237584 -122444 -52103 32857 -17574 -255613 -410034 -308126
1375 -308126 -194516 -43212 81324 -41344 -139798 -104630 -118661 -35721 -79621 -76365 -14414
$$ packed form
1451A05042j8286m2847N8995J22069j32373n9362k8675P907m2099J31167L6041
1440A37579q4132Q2281l3451m73278J16091P4053J0214L07768J8931q0960P0624
1429A45720k55022m06711q0635M62628r5879n0877K29232p7190o7828Q0052J86168
1418F9658J31488j66107q5090J18075K90794p2779k31540J66858J63344k82825
1408A01876q8533n0758k16886j80822J61570J7959K29312O0446J8345k23615J20354
1397e0752m997p6455K42460R5701K1128o6593k2410j64451J4592K57989j95539
1386E0673k04527J40748k53268K8790J15140P0341Q4960n0431k38039j54421J01908
1375c08126J13610J51304J24536j22668r8454L5168j4031Q2940m3900L256O1951
$$ plain form
1364 -14414 -95483 115567 -161417 5800 146990 242047 19818 -46723 110982 203907 245096
1353 245096 106176 228842 -115319 -4635 -54748 -24571 50850 -261097 -229846 -212059 -36418
1342 -36418 42846 86898 147191 -119199 -45046 -49615 -56987 -16869 -238292 -127059 18909
1331 18909 -11532 -137120 126579 113939 -54684 -139587 -31124 -18255 -109763 -46305 149521
1320 149521 163007 59381 38734 -55920 -194968 -100833 -275997 -514886 -199128 -54034
1310 -54034 -192332 -105785 189571 135098 76647 -43348 -255558 6120 -137284 -41235 16809
1299 16809 -110242 -38039 184799 182601 25758 115735 151857 265939 77646 73610 -101936
1288 -101936 -77367 81824 -42082 -176360 -113793 116133 66139 -102635 -158575 60914
$$ packed form
1364a4414q1069K11050k76984J67217J41190R5057k22229o6541J57705R2925M1189
1353B45096j38920J22666l44161J10684n0113L0177P5421l11947L1251J7787J75641
1342c6418P9264M4052O0293k66390P4153m569p372M0118k21423J11233J45968
1331A8909l0441j25588K63699j2640j68623q4903J08463J2869r1508O3458J95826
1320A49521J3486j03626k0647r4654j39048R4135j75164k38889L15758J45094
1310e4034j38298Q6547K95356n4473n8451j19995k12210K61678j43404R6049N8044
1299A6809j27051P2203K22838k198j56843Q9977L6122J14082j88293m036j75546
1288a01936K4569J59191j23906j34278O2567K29926m9994j68774n5940K19489
$$ plain form
1278 60914 15703 -56752 -169825 -170716 -238863 -37226 -262965 -211217 -75773 -78314 -23925 -156727
1266 -156727 -27832 -201592 -32499 -87196 282559 -6772 -7619 22820 295305 180700 6905
1255 6905 199149 39671 26434 -35502 145703 138732 366495 327391 225037 -86461 -61656
1244 -61656 -181792 -94087 122296 -167755 -269043 -19020 281261 286545 -42218 -223166
1234 -223166 13520 -108762 -266435 -102483 -17152 129063 4826 129468 -78015 -161023
1224 -161023 -11827 -141780 32684 -65802 -41872 -252763 -224364 -193989 -333293 -250407 89397
1213 89397 1586 -89638 -266898 -208771 -64481 143540 4805 -16457 41882 198261 163654
1202 163654 -141202 96681 73150 -267452 -52227 -76438 -78844 370696 318450 307316 231941
$$ packed form
1278F0914m5211p2455j13073q91o8147K01637k25739N1748J35444k541N4389j32802
1266a56727J28895j73760J69093n4697L69755k89331q47L0439K72485j14605j73795
1255F905J92244j59478j3237o1936J81205o971K27763l9104j02354l11498K4805
1244f1656j20136Q7705K16383k90051j01288K50023L00281N284l28763j80948
1234b23166K36686j22282j57673J63952Q5331J46215j24237J24642k07483q3008
1224a61023J49196j29953J74464r8486K3930k10891K8399L0375j39304Q2886L39804
1213H9397q7811r1224j77260N8127J44290K08021j38735k1262N8339J56379l4607
1202A63654l04856K37883k3531l40602K15225k4211k406M49540n2246j1134p5375
$$ plain form
1191 231941 36439 -72631 91424 97084 27379 116799 -9488 -54627 265147 125593 124014
1180 124014 -241136 -139892 -50390 40185 36083 65929 148429 58822 167820 178640 350960
1169 350960 176789 35932 26171 -80692 -64256 132369 377056 152279 -164458 -196994
1159 -196994 22326 -42968 -115581 -45602 52890 124101 -275315 -138640 124478 188721 210951
1148 210951 19150 -197929 -230820 -252307 -37708 2224 71627 -128160 -335763 -193909
1138 -193909 -176333 -50651 34969 -151041 -311522 -382892 -298407 -20451 -147854 -232019 -179361
1127 -179361 106616 402870 298934 -32531 -202274 204921 -36857 -202407 124251 188941
1117 188941 171861 -26943 216209 381193 430481 217707 178155 92684 47003 142192 -103480
$$ packed form
1191B31941j95502j09070J64055N660o9705Q9420j26287m5139L19774j39554j579
1180A24014l65150J01244Q9502R0575m102K9846Q2500q9607J08998J0820J72320
1169C50960j74171j40857r761j06863J6436J96625K44687k24777l16737l2536
1159a96994K19320o5294p2613O9979R8492P1211l99416J36675K63118O4243K2230
1148B10951j91801k17079l2891k1487K14599L9932O9403j99787k07603J41854
1138a93909J7576J25682Q5620j86010j60481p1370Q4485K77956j27403q4165N2658
1127a79361K85977K96254j03936l31465j69743M07195k41778j65550L26658O4690
1117A88941j7080j98804K43152J64984M9288k12774l9552q5471m5681R5189k45672
$$ plain form
1106 -103480 -160355 -348971 -212801 -107749 -201753 -256486 -222121 -134078 -146699 -56861 -33861
1095 -33861 -64571 -45362 -240377 -403172 -426769 -39094 70798 -76785 110205 25888 -85008
1084 -85008 178634 59986 309407 405485 52538 43336 -58754 114550 201054 -261302 -229759
1073 -229759 -65995 -193532 -151464 -257475 118542 207446 -52672 87587 -190311 -244351
1063 -244351 -237532 -499567 -237651 -194789 -186937 -8186 -13203 -21064 -177695 -143793 169225
1052 169225 107694 203414 -41667 32364 180226 275566 290356 210753 38661 370443 112486
1041 112486 -266132 -82569 -176657 256566 126590 119284 -47758 23887 18722 -102743 182556
1030 182556 512052 365887 -66205 -335181 -71087 -96476 -174072 181386 245789 -165120
$$ packed form
1106a03480n6875j88616J36170J05052r4004n4733L4365Q8043j2621Q9838K3000
1095c3861l0710J9209j95015j62795k3597L87675J09892j47583J86990q4317j10896
1084h5008K63642j18648K49421R6078l52947r202j02090J73304Q6504m62356L1543
1073b29759J63764j27537M2068j06011L76017Q8904k60118J40259k77898n4040
1063b44351O819k62035K61916M2862P852J78751n017p861j56631L3902L13018
1052A69225o1531R5720k45081P4031J47862R5340J4790p9603j72092L31782k57957
1041A12486l78618J83563r4088M33223j29976p306j67042P1645n165j21465K85299
1030A82556L29496j46165m32092k68976K64094k5389p7596L55458O4403m10909
$$ plain form
1020 -165120 -330352 -83654 44731 -85568 -108526 -74198 -191814 -44483 165869 86862
1010 86862 -14869 86673 96412 179011 152101 65278 -159195 -163342 -162575 -280076 -369769 -237208
998 -237208 43409 44522 -100491 -77796 -166921 111530 -96093 -30530 -103522 -181190 -186531
987 -186531 -317447 -429072 -277420 -59775 -38043 -129642 -16626 -40561 89735 341710
977 341710 133731 7386 180352 210200 154025 508166 493333 295584 251929 356277 558483
966 558483 140737 -333862 -200930 -153081 90545 123 -116938 -127869 8930 -118497
956 -118497 -135464 -169409 -191097 -203890 20685 52625 -160577 3967 263764 246452 -1165
945 -1165 -179643 75961 87292 -205521 -150632 -74690 12325 28352 -60636 -94594 -24932 -129500
$$ packed form
1020a65120j65232K46698J28385j30299k2958L4328j17616J47331K10352p9007
1010H6862j01731J01542R739Q2599k6910q6823k24473m147P67j17501q9693J32561
998b37208K80617J113j45013K2695q9125K78451k07623O5563p2992p7668n341
987a86531j30916j11625J51652K17645K1732r1599J13016k3935J30296K51975
977C41710k07979j26345J72966K9848n6175L54141j4833j97749m3655J04348K02206
966E58483m17746m74599J32932M7849K43626r0422j17061j0931J36799j27427
956a18497j6967l3945k1688j2793K24575L1940k13202J64544K59797j7312k47617
945a165j78478K55604J1331k92813N4889P5942Q7015J6027q8988l3958O9662j04568
$$ plain form
933 -129500 -33187 53239 -133780 -14208 45420 -113549 -167890 206918 151832 202152 52252
922 52252 140195 150934 -145808 -179656 -78372 109163 172991 132227 -199656 -161055 -15676
911 -15676 -19132 -20367 -225671 21287 15624 -162124 -202692 87785 270949 -5243 -175541
900 -175541 -34091 -76044 53902 126597 -163388 -68833 -201116 -213679 -58105 -149002 -237592
889 -237592 -78816 -233098 -313684 14026 -94294 -2475 115538 24059 1286 -271441 -22677
878 -22677 12416 62395 267057 216018 412015 366461 122004 224548 13145 -82254 118370
867 118370 317927 192194 -28878 -3460 -35580 169327 253777 117872 15233 50683 64982
856 64982 64898 214895 112570 60316 112151 209401 275764 218293 -30950 33335 70174 20627
$$ packed form
933a29500R6313Q6426j87019J19572N9628j58969n4341L74808n5086N0320j49900
922E2252Q7943J0739k96742l3848J01284J87535O3828m0764l31883L8601J45379
911a5676l456j235k05304K46958n663j77748m0568K90477J83164k76192j70298
900a75541J41450m1953J29946P2695k89985R4555j32283j2563J55574r0897q8590
889b37592J58776j54282q0586L27710j08320R1819J18013r1479k2773k72727K48764
878b2677L5093M9979K04662n1039J95997m5554k44457J02544k11403r5399K00624
867A18370J99557j25733k21072K5418l2120K04907Q4450j35905j02639L5450J4299
856F4982q4J49997j02325n2254N1835R7250O6363n7471k49243O4285L6839m9547
$$ plain form
844 20627 -16108 28307 -83745 -159701 -262290 -35699 -6331 93668 -108712 -261744 -182126
833 -182126 143195 353111 395505 -87370 9437 323628 56353 334530 492088 89078
823 89078 76377 284496 153827 104443 141249 -67560 -263543 78412 215405 -25194 -64725
812 -64725 64782 -152762 -24404 -31118 121358 -10863 -128296 -60532 -200550 -107958 -8963
801 -8963 27286 27494 152391 174195 -70539 -254488 -97243 14204 158701 108558 -15209
790 -15209 -200569 -422080 -147994 12795 82685 148619 278198 160527 230757 -20468 -113134
779 -113134 136593 205687 -79478 140003 346108 175108 -31699 -164570 -281879 -26191
769 -26191 -176674 -132856 -20667 44314 191545 41473 -3805 185631 209727 254121 452674
$$ packed form
844B0627l6735M4415j12052p5956j02589K26591K9368R9999k02380j53032P9618
833a82126L25321K09916M2394m82875R6807L14191k67275K78177J57558m03010
823H9078j2701K08119j30669m9384L6806k08809j95983L41955J36993k40599l9531
812f4725J29507k17544J28358o714J52476j32221j17433O7764j40018R2592R8995
801h963L6249K08J24897K1804k44734j83949J57245J11447J44497n0143j23767
790a5209j85360k21511K74086J60789O9890O5934J29579j17671P0230k51225r2666
779a13134K49727O9094k85165K19481K06105j71000k06807j32871j17309K55688
769b6191j50483M3818J12189O4981J47231j50072m5278J89436K4096M4394J98553
$$ plain form
758 452674 454502 253131 315087 321743 134439 200319 112503 180531 57280 136486 89431 26703
746 26703 132287 134655 82035 144352 134994 34902 -288664 -169572 149825 63366 -98280
735 -98280 -318472 -336927 -386250 -488684 -282987 -254686 -216461 -121720 -217134 -357831 -134249
724 -134249 -78372 -253194 -16203 11001 280272 220744 13959 -3290 -56206 2268 -12690
713 -12690 -114892 -67529 253574 165711 163074 329571 464336 90367 330901 266370 335873
702 335873 328146 22085 -58055 -383254 -227165 -32155 -57051 9038 -67446 -289356 -181097
691 -181097 -82182 -82724 -238880 -95654 34668 -139752 -136823 -54425 -245592 -122778 -117463
680 -117463 -157563 -21639 38499 90862 70450 275574 140536 -188267 171733 235169 82149
$$ packed form
758D52674J828k01371O1956O656j87304O5880q7816O8028j23251P9206m7055o2728
746B6703J05584K368n2620O2317r358j00092l23566J19092L19397q6459j61646
735i8280k20192j8455m9323j02434K05697K8301L8225R4741r5414j40697K23582
724a34249N5877j74822K36991K7204K69271n9528k06785j7249n2916N8474j4958
713a2690j02202M7363L21103q7863k637J66497J34765l73969K40534o4531O9503
702C35873p727l06061q0140l25199J56089J95010k4896O6089p6484k21910J08259
691a81097R8915n42j56156J43226J30322j74420K929Q2398j91167J22814N315
680a17463m0100J35924O0138N2363k0412K05124j35038l28803L60000O3436j53020
$$ plain form
669 82149 50242 82398 -161366 -141614 118883 -5172 -149045 -164726 -100398 -73860 -266992
658 -266992 -108520 245008 222014 120741 33363 -3061 14659 102992 91826 191338 -203278
647 -203278 52300 239545 91669 118883 143713 199109 -3885 -86708 -156306 -321086 -297900
636 -297900 -98958 179619 286713 -51400 -64276 277114 379852 277326 164318 -35412
626 -35412 241284 82701 -98526 4674 -228436 -170795 440803 364118 151410 -72202
616 -72202 -204358 192314 83324 -69232 -389930 -179427 -26672 -3072 -87418 18720
606 18720 19238 -324188 -23189 -101872 285511 257324 118969 120318 61628 4637 -153475 261983
594 261983 232363 203362 19381 12924 3053 80495 163648 98685 146880 246436 176343 184813
$$ packed form
669H2149l1907L2156k43764J9752K60497j24055j43873j5681O4328K6538j93132
658b66992J58472L53528k2994j01273q7378l6424J7720Q8333j1166R9512l94616
647b03278K55578J87245j47876K7214K4830N5396k02994q2823o9598j64780K3186
636b97900J98942K78577J07094l38113j2876L41390J02738j02526j13008j99730
626c5412K76696j58583j81227J03200k33110N7641O11598p6685k12708k23612
616g2202j32156L96672j08990j52556l20698K10503J52755K3600q4346J06138
606A8720N18l43426L00999p8683L87383k8187j38355J349n8690n6991j58112M15458
594B61983k9620k9001j83981o457r871P7442Q3153o4963M8195R9556p0093Q470
$$ plain form
582 184813 70936 56316 -140724 -315382 -239971 -56911 150637 299563 113793 142991
572 142991 74061 21419 199460 -59695 -31696 153885 286425 409421 339159 293500 155281
561 155281 -59662 -73846 -132691 21603 -56338 143987 229283 48133 135390 48392 -173657
550 -173657 -276803 -42404 142706 -30238 101895 93516 340790 234678 -5011 -49973
540 -49973 212665 308436 -31216 22473 -170546 -17355 36142 -120804 -26584 14197 -193704
529 -193704 -387791 14264 58447 -102283 188400 262457 294939 17556 115598 170797 31647
518 31647 99367 45140 62766 200590 458684 423924 485061 171309 32611 -58985 176954
507 176954 347325 307357 216699 214275 212029 127300 67394 216101 137617 101391 85168 84306
$$ packed form
582A84813j13877j4620j97040j74658P5411J83060K07548J48926j85770K9198
572A42991o8930n2642J78041k59155K7999J85581J32540J22996p0262m5659j38219
561A55281k14943j4184n8845J54294p7941K00325Q5296j81150Q7257q6998k22049
550a73657j03146K34399J85110j72944J32133q379K47274j06112k39689m4962
540d9973K62638R5771l39652N3689j93019J53191N3497j56946R4220M0781k07901
529a93704j94087M02055M4183j60730K90683P4057L2482k77383R8042N5199j39150
518C1647O7720n4227J7626J37824K58094l4760O1137l13752j38698r1596K35939
507A76954J70371l9968r0658k424k246q4729n9906J48707p8484l6226j6223q62
$$ plain form
495 84306 -21800 -119919 92010 137240 161703 158298 20690 12530 241609 111294 75887
484 75887 89086 120761 4063 -169298 -159166 -74755 -28313 -17049 36537 -264834 51037
473 51037 64326 -11332 306137 260935 107057 93721 204432 350925 218297 125908 191119
462 191119 110421 177159 -90569 27040 -21703 211347 118127 204013 22925 20762 -29749
451 -29749 -53637 -18256 143007 15030 114773 -21931 -886 164271 191333 162290 -68879
440 -68879 -19792 -229183 -47578 -299425 -276547 -41673 -246900 -58818 -83174 -329763 -190310
429 -190310 -175839 -202701 -429027 -269247 8515 -17309 -222788 -179481 -274412 -279626 -271957
418 -271957 -351783 -113856 -41784 -263018 91425 371125 213480 208264 300442 163133 60934
$$ packed form
495H4306j06106r8119K11929M5230K4463l405j37608q160K29079j30315l5407
484G5887J3199L1675j16698j73361J0132Q4411M6442J1264N3586l01371L15871
473E1037J3289p5658L17469m5202j53878j3336J10711J46493j32628r2389O5211
462A91119q0698O6738k67728J17609m8743K33050r3220Q5886j81088k163n0511
451b9749k3888L5381J61263j27977R9743j36704K1045J65157K7062k9043k31169
440f8879M9087k09391J81605k51847K2878K34874k05227J88082k4356k46589J39453
429a90310J4471k6862k26326J59780K77762k5824k05479M3307r4931n214P669
418b71957p9826K37927P2072k21234L54443K79700j57645n216R2178j37309j02199
$$ plain form
407 60934 11924 68259 -181091 -72163 184200 -6235 -35250 7897 119676 -34249 -173888
396 -173888 -91335 42610 27572 127007 205193 19425 -103049 -268031 -217928 -43187 89594
385 89594 345817 -23925 -57609 -81834 -172511 -132724 29305 99634 3821 78523 59624
374 59624 182556 13582 267933 444721 311415 216326 160138 83436 76423 28901 283653
363 283653 201694 -28820 3137 -46944 42277 121360 -23578 -108980 57768 118160 224582
352 224582 2272 251141 284464 432123 157542 16899 192449 192299 240691 21287 -47541
341 -47541 -136592 69313 75497 50551 23235 -31590 -186403 -172480 -250327 -15943 -97188 80650
329 80650 160899 -85135 47411 116945 307932 404398 285144 196454 -37898 -87222 72052
$$ packed form
407F0934m9010N6335k49350J08928K56363j90435k9015M3147J11779j53925j39639
396a73888Q2553J33945j5038R9435P8186j85768j22474j64982N0103J74741J32781
385H9594K56223l69742l3684k4225r0677L9787J62029P0329r5813P4702j8899
374E9624J22932j68974K54351J76788j33306r5089n6188p6702p013m7522K54752
363B83653q1959k30514L1957n0081Q9221P9083j44938q5402J66748O0392J06422
352B24582k22310K48869L3323J47659k74581j40643J75550j50M8392k19404o8828
341d7541q9051K05905O184k4946k7316n4825j54813J3923p7847K34384q1245J77838
329H0650Q0249k46034J32546O9534J90987R6466j19254q8690k34352m9324J59274
$$ plain form
318 72052 -30184 -84499 62660 144011 -109044 -115788 -15383 -352298 -384675 -167004 61418
307 61418 48300 -8550 228849 60404 -224181 14355 170462 52114 34702 -3451 269116
296 269116 -117845 -361875 -308767 -361598 -122972 -247771 -163033 -203830 -243897 -199858 -130342
285 -130342 5439 -1424 -271624 -36947 150682 217497 394107 -14479 -1935 -152388 95334
274 95334 196728 260830 101269 58020 -67753 37683 412680 301180 -57642 -280453
264 -280453 -154032 35691 -1642 -23810 -119996 126491 165226 -88725 116807 20277 -23418
253 -23418 54499 145858 236761 222549 44623 193176 205277 176924 160255 17353 224517
242 224517 349077 213626 4191 28608 133857 -8690 -29928 -59653 -49896 125964 150454
$$ packed form
318G2052j02236n4315J47159Q1351k53055o744J00405l36915l2377K17671K28422
307F1418j3118n6850K37399j68445k84585K38536J56107j18348j7412l8153K72567
296B69116l86961k44030N3108n2831K38626j24799Q4738m0797m0067M4039O9516
285a30342J35781o863k70200K34677J87629O6815J76610m08586J2544j50453K47722
274I5334J01394O4102j59561m3249j25773J05436L74997j11500l58822k22811
264b80453J26421J89723l7333k2168r6186K46487L8735k53951K05532r6530m3695
253b3418P7917R1359R0903j4212j77926J48553J2101k8353j6669j42902K07164
242B24517J24560j35451k09435K4417J05249j42547k1238k9725R757J75860K4490
$$ plain form
231 150454 -54089 127076 219852 118949 154027 86229 19239 -16715 25999 113318 22497
220 22497 -146662 -56786 37514 142190 -64326 -97740 263213 111411 -69346 178786 242735
209 242735 224240 55197 137347 253440 173188 85584 121299 444293 203758 180997 183690
198 183690 45931 -7965 259767 471998 95344 136265 156508 160040 205274 180199 87635
187 87635 -146112 -189015 -257706 20095 -25663 -13814 182782 410427 228985 111433 -11833
176 -11833 59289 159379 133244 212084 205051 147104 -7359 -64642 -25454 -41955 -198146 112988
164 112988 180124 112066 58574 -115414 -169890 -210 -31258 -128572 -37519 -163621 -75740
153 -75740 -73706 -21480 88553 74979 22615 68954 111705 -146454 9661 54331 -62945
$$ packed form
231A50454k04543J81165R2776j00903L5078o7798o6990l5954M2714Q7319r0821
220B2497j69159Q9876R4300J04676k06516l3414L60953j51802j80757K48132O3949
209B42735j8495j69043Q2150J16093q0252q7604L5715L22994k40535k2761K693
198A83690j37759n3896K67732K12231l76654M0921K0243L532M5234k5075r2564
187H7635k33747m2903o8691K77801m5758J1849J96596K27645j81442j17552j23266
176a1833P1122J00090k6135P8840p033n7947j54463n7283L9188j6501j56191L11134
164A12988O7136o8058n3492j73988n4476J69680l1048r7314R1053j26102Q7881
153g5740K034N2226J10033j3574n2364M6339M2751k58159J56115M4670j17276
$$ plain form
142 -62945 -120137 -151060 -172996 -243354 -76696 -20461 40255 -18135 12621 -90473 -129892 54817
130 54817 187030 20074 -52803 47500 121658 189393 179318 129329 -95925 -281336 -253897
119 -253897 -8363 44376 -56746 -5029 -95604 -143315 -18667 -105852 -85766 -97412 -12471
108 -12471 110759 -25906 -165313 -99063 -84691 97263 106460 181507 240277 121907 221259
97 221259 250255 122851 263995 -19514 196758 275608 268552 368787 215641 2582 112305
86 112305 249649 71084 212332 206589 341116 121263 275920 294303 -36047 44226 76193
75 76193 121257 82100 147420 179389 99883 -75232 -37684 20248 57845 211024 -15056 -55696
63 -55696 -79660 -187922 10261 -51118 -77117 178056 270862 247738 300441 238183 279727 26019
$$ packed form
142f2945n7192l0923k1936p0358J66658N6235O0716n8390L0756j03094l9419J84709
130E4817J32213j66956p2877J00303P4158O7735j0075m9989k25254j85411K7439
119b53897K45534N2739j01122N1717r0575m7711J24648q7185K0086j1646Q4941
108a2471J23230j36665j39407O6250J4372J81954R197P5047N8770j18370R9352
97B21259K8996j27404J41144k83509K16272P8850p056J00235j53146k13059J09723
86A12305J37344j78565J41248n743J34527k19853J54657J8383l30350Q0273L1967
75G6193M5064l9157O5320L1969p9506j75115L7548N7932L7597J53179k26080m0640
63e5696k3964j08262J98183o1379k5999K55173R2806k3124N2703o2258M1544k53708
$$ plain form
51 26019 -101514 -116005 -176641 -150340 14320 69590 33209 2159 -98723 -57223 145280
40 145280 35196 -58367 -61801 -87184 15944 66782 174876 37742 97894 187506 164496
29 164496 134137 104425 -37500 2714 166512 162992 38686 183197 143948 46336 93296
18 93296 97376 185560 112765 78264 182306 87785 18189 -86343 30219 166461 80345 -104824
6 -104824 -172481 -59886 102427 270325 705 -90419
$$ packed form
51B6019j27533j4491o0636K6301J64660N5270l6381l1050j00882M1500K02503
40A45280j10084r3563l434k5383J03128N0838J08094j37134O0152Q9612k3010
29A64496l0359k9712j41925M0214J63798l520j24306J44511l9249r7612M6960
18I3296M080Q8184p2795l4501J04042r4521o9596j04532J16562J36242q6116j85169
6a04824o7657J12595J62313J67898k69620r1124
$$ [...]
##END NTUPLES=NMR SPECTRUM
##END=
