##TITLE=1H_DE-80H_X3
 200.13MHz, d2o
 8 sc
 
 19ns.26.2.2025
##JCAMPDX= 6.0         $$ Bruker NMR JCAMP-DX V2.0
##DATA TYPE= NMR SPECTRUM
##DATA CLASS= NTUPLES
##ORIGIN= UXNMR, Bruker Analytische Messtechnik GmbH
##OWNER= pz
$$ XWIN-NMR		Version 3.5
$$ Fri Jun 20 15:21:55 2025 Russian Standard Time (UT+4h)  Yarkov@DPX200
##.OBSERVE FREQUENCY= 200.1313
##.OBSERVE NUCLEUS= ^1H
##.ACQUISITION MODE= SIMULTANEOUS
##.ACQUISITION SCHEME= undefined
##.AVERAGES= 8
##.DIGITISER RES= 18
##SPECTROMETER/DATA SYSTEM= spect
##.PULSE SEQUENCE= zg30
##.SOLVENT NAME= CDCl3
##.SHIFT REFERENCE= (INTERNAL, CDCl3, 0, 15.434)
##AUDIT TRAIL= $$ (NUMBER, WHEN, WHO, WHERE, WHAT)
$$ ##TITLE= Audit trail, XWIN-NMR		Version 3.5
$$ ##JCAMPDX= 5.01
$$ ##ORIGIN= Bruker BioSpin GmbH
$$ ##OWNER= Yarkov
$$ C:/Bruker/XWIN-NMR/data/yarkov2/nmr/H-C/1/pdata/1/auditp.txt
$$ ##AUDIT TRAIL=  $$ (NUMBER, WHEN, WHO, WHERE, WHAT)
(   1,<2025-06-20 15:20:45.79 +0400>,<Yarkov>,<DPX200>,
      <created by zg, POWCHK disabled, PULCHK disabled
       configuration hash MD5:
       00 E9 B6 7A A2 85 ED C7 34 08 36 98 17 FE 4E 26
       data hash MD5: 16K
       DC FF 44 FB 4B 17 F9 1E 2A BA E4 0C DF 93 84 FD>)
(   2,<2025-06-20 15:20:51.46 +0400>,<Yarkov>,<DPX200>,
      <Start of raw data processing
       efp BC_mod = 2 LB = 0.25 FT_mod = 6 PKNL = 1 PHC0 = -1560.818 PHC1 = 35.76659 SI = 16K 
       data hash MD5: 16K
       00 21 C2 13 A8 21 BB 77 94 4E 24 7E 91 11 8B 1E>)
(   3,<2025-06-20 15:21:08.75 +0400>,<Yarkov>,<DPX200>,
      <pk PHC0 = -166.1578 PHC1 = 0 
       data hash MD5: 16K
       A1 A4 57 C2 7F 8F 0D 92 45 F6 33 FA 29 28 6C 12>)
(   4,<2025-06-20 15:21:13.65 +0400>,<Yarkov>,<DPX200>,
      <abs ABSG = 5 
       data hash MD5: 16K
       D3 33 33 43 1C 00 2C 65 CF D9 BB C2 C9 9A A3 60>)
(   5,<2025-06-20 15:21:28.90 +0400>,<Yarkov>,<DPX200>,
      <pk PHC0 = -4.481348 PHC1 = 0.4000003 
       data hash MD5: 16K
       71 FA BE F6 CF 81 BD 21 ED FD 31 FF 63 0F AE FF>)
(   6,<2025-06-20 15:21:32.12 +0400>,<Yarkov>,<DPX200>,
      <abs ABSG = 5 
       data hash MD5: 16K
       60 17 C0 AA 71 E7 9D E8 34 72 16 F9 CC EE DF 37>)
$$ ##END=
$$ 
$$ hash MD5
$$ 59 83 13 6C FE 4F A1 47 78 59 35 58 D6 9D 8C 03
##$RELAX= 
##$RELAX= 
##$RELAX= 
##$RELAX= 
##$RELAX= 
##$RELAX= 
$$ Bruker specific parameters
$$ --------------------------
##$DU= <C:/Bruker/XWIN-NMR>
##$EXPNO= 1
##$NAME= <H-C>
##$PROCNO= 1
##$TYPE= <nmr>
##$USER= <yarkov2>
##$AMP= (0..31)
100 100 100 100 100 100 100 100 100 100 100 100 100 100 100 100 100 100 
100 100 100 100 100 100 100 100 100 100 100 100 100 100 
##$AQSEQ= 0
##$AQ_mod= 1
##$AUNM= <au_zg>
##$AUTOPOS= <>
##$BF1= 200.13
##$BF2= 200.13
##$BF3= 200.13
##$BF4= 200.13
##$BF5= 200.13
##$BF6= 200.13
##$BF7= 200.13
##$BF8= 200.13
##$BYTORDA= 1
##$CFDGTYP= 0
##$CFRGTYP= 5
##$CHEMSTR= <none>
##$CNST= (0..31)
1 1 145 1 1 1 1 1 1 1 1 1 1 1 1 1 1 1 1 1 1 1 1 1 1 1 1 1 1 1 1 1 
##$CPDPRG= <>
##$CPDPRG1= <>
##$CPDPRG2= <>
##$CPDPRG3= <>
##$CPDPRG4= <mlev>
##$CPDPRG5= <mlev>
$$ [...]
##$SUBNAM3= <"">
##$SUBNAM4= <"">
##$SUBNAM5= <"">
##$SUBNAM6= <"">
##$SUBNAM7= <"">
##$SUBNAM8= <"">
##$SUBNAM9= <"">
##$SW= 18.0517328524113
##$SWIBOX= (0..15)
0 0 2 0 0 0 0 0 0 0 0 0 0 0 0 0 
##$SW_h= 3612.71676300578
##$TD= 16384
##$TD0= 1
##$TE= 0
##$TE2= 300
##$TE3= 300
##$TEG= 300
##$TL= (0..7)
0 120 120 120 120 120 120 120 
##$TP= (0..7)
150 150 150 150 150 150 150 150 
##$TP07= 0
##$TPNAME0= <>
##$TPNAME1= <>
##$TPNAME2= <>
##$TPNAME3= <>
##$TPNAME4= <>
##$TPNAME5= <>
##$TPNAME6= <>
##$TPNAME7= <>
##$TPOAL= (0..7)
0.5 0.5 0.5 0.5 0.5 0.5 0.5 0.5 
##$TPOFFS= (0..7)
0 0 0 0 0 0 0 0 
##$TUNHIN= 0
##$TUNHOUT= 0
##$TUNXOUT= 0
##$USERA1= <user>
##$USERA2= <user>
##$USERA3= <user>
##$USERA4= <user>
##$USERA5= <user>
##$V9= 5
##$VALIST= <valist>
##$VCLIST= <CCCCCCCCCCCCCCC>
##$VD= 0
##$VDLIST= <DDDDDDDDDDDDDDD>
##$VPLIST= <PPPPPPPPPPPPPPP>
##$VTLIST= <TTTTTTTTTTTTTTT>
##$WBST= 1024
##$WBSW= 4
##$XGAIN= (0..3)
0 0 0 0 
##$XL= 0
##$YL= 0
##$YMAX_a= 332393
##$YMIN_a= -232025
##$ZGOPTNS= <>
##$ZL1= 120
##$ZL2= 120
##$ZL3= 120
##$ZL4= 120
##$ABSF1= 15.43398
##$ABSF2= -2.617869
##$ABSG= 5
##$ABSL= 3
##$ALPHA= 0
##$AQORDER= 0
##$ASSFAC= 0
##$ASSFACI= 0
##$ASSFACX= 0
##$ASSWID= 0
##$AUNMP= <proc_1d>
##$AZFE= 0.1
##$AZFW= 0.1
##$BCFW= 0
##$BC_mod= 2
##$BYTORDP= 0
##$COROFFS= 0
##$CY= -3
##$DATMOD= 1
##$DC= 0
##$DFILT= <>
##$DTYPP= 0
##$F1P= 0
##$F2P= 0
##$FCOR= 1
##$FTSIZE= 16384
##$FT_mod= 6
##$GAMMA= 0
##$GB= 0
##$INTBC= 1
##$INTSCL= 3.241238e-09
##$ISEN= 128
##$LB= 0.25
##$LEV0= 0
##$LPBIN= 0
##$MAXI= 10000
##$MC2= 0
##$MEAN= 0
##$ME_mod= 0
##$MI= 1.114404
##$NCOEF= 0
##$NC_proc= -8
##$NLEV= 6
##$NOISF1= 3.799351
##$NOISF2= 2.8
##$NSP= 0
##$NTH_PI= 0
##$NZP= 0
##$OFFSET= 15.43398
##$PC= 1
##$PHC0= -1731.457
##$PHC1= 36.16659
##$PH_mod= 1
##$PKNL= yes
##$PPARMOD= 0
##$PSCAL= 0
##$PSIGN= 0
##$REVERSE= no
##$SF= 200.130017555954
##$SI= 16384
##$SIGF1= 3
##$SIGF2= 2
##$SINO= 0.751879
##$SIOLD= 32768
##$SREGLST= <19F.Aceton>
##$SSB= 0
##$STSI= 16384
##$STSR= 0
##$SW_p= 3612.71676300578
##$SYMM= 0
##$S_DEV= 0
##$TDeff= 16384
##$TDoff= 0
##$TI= <>
##$TILT= no
##$TM1= 0
##$TM2= 0
##$TOPLEV= 0
##$USERP1= <user>
##$USERP2= <user>
##$USERP3= <user>
##$USERP4= <user>
##$USERP5= <user>
##$WDW= 1
##$XDIM= 16384
##$YMAX_p= 373291976
##$YMIN_p= -3751363
$$ End of Bruker specific parameters
$$ ---------------------------------
##NTUPLES= NMR SPECTRUM
##VAR_NAME=  FREQUENCY,     SPECTRUM/REAL,   SPECTRUM/IMAG
##SYMBOL=    X,             R,               I
##VAR_TYPE=  INDEPENDENT,   DEPENDENT,       DEPENDENT
##VAR_FORM=  AFFN,          ASDF,            ASDF
##VAR_DIM=   16384,         16384,           16384
##UNITS=     HZ,            ARBITRARY UNITS, ARBITRARY UNITS
##FACTOR=    0.220516191357247, 1,           1
##FIRST=     3088.80268597632, 0,            0
##LAST=      -523.914077029456, 0,           0
##MIN=       -523.914077029456, -3751363,    0
##MAX=       3088.80268597632, 373291976,    0
$$ Real data points
##PAGE= N=1
##DATA TABLE= (X++(R..R)), XYDATA
$$ [...]
9574 3237282 3220330 3168956 3130912 3361968 3333716 3278179 3092587 3112048 3154779 3190990 3260471
9563 3260471 3368236 3220289 3022057 3217083 3093945 3356882 3298193 2918410 3339796 3121340
9553 3121340 3090640 3318990 3636654 3579021 3453504 3432208 3421202 3139807 3090725 3222569
9543 3222569 3163318 3424540 3322801 3213567 3142933 3339623 3683665 3614482 3552712 3511226
9533 3511226 3575981 3645304 3455148 3531575 4005855 4094996 3794992 3904552 4240069 4176339
9523 4176339 4131893 3969294 3866186 3712762 3701923 3888120 4071110 4212317 3882338 3808905
9513 3808905 3792847 3981814 4150850 4101631 4158721 3983488 3953575 3960091 4079582 4048440 4292515
9502 4292515 4325678 4302507 4548819 4308596 4328396 4568573 4687078 4538048 4284438 4574636
9492 4574636 4749365 4649908 4486668 4630259 5026166 5097782 5075014 4894636 4929790 5155663
9482 5155663 5291648 5260131 5176571 4987145 4780891 4846767 5052877 5133658 5291658 5355364
9472 5355364 5321017 5292913 5139100 5417900 5355164 5659310 5551379 5590205 5818648 5665565
9462 5665565 5701022 5618065 5639393 5686903 5545023 5795672 6202211 6218025 6062053 5930050
9452 5930050 5956424 6021970 6095365 6054662 6075646 6119816 6276987 6395637 6349455 6351291 6671453
9441 6671453 6724996 6817813 6736408 6818142 6844617 6591108 6840069 6853149 6766343 6956004 6996723
9430 6996723 7089627 7157585 7233107 7039825 7383059 7467695 7564532 7877736 8005312 7988760 7956521
9419 7956521 7939516 7948886 8157420 8253665 8375875 8333352 8427716 8356158 8478765 8509614 8734066
9408 8734066 8793062 9053528 9037815 8997269 9258447 9420128 9802023 9651847 9796367 9864974
9398 9864974 10029513 10009247 10132528 9879637 9834486 9921703 9828591 9960139 10140695 10185758
9388 10185758 10147740 10179994 10223412 10389047 10601021 10632738 10514154 10748482 10706974 10557051
9378 10557051 10831783 10916476 11027852 11260300 11374808 11605511 11506679 11458222 11583578 11378180
9368 11378180 11651361 12064119 12064105 12213590 12606095 12889409 12886344 12820503 12997137 13269421 13281099
9357 13281099 13312554 13182564 13469745 13545337 13625908 13771073 13752895 13811193 13944540 14327995
9347 14327995 14383119 14181045 14089981 14251766 14328713 14497669 14707305 14637490 14958857 14990236
9337 14990236 14862079 15110950 15336202 15429966 15625426 15644216 15562751 15594253 15910714 15961478
9327 15961478 16086330 16272830 16317571 16148492 16025709 15976567 16098248 15917723 15937098 16006507
9317 16006507 16132017 16057028 15590196 15751234 15786331 15718005 15690300 15727950 15550034 15354628
9307 15354628 15408161 15592254 15890941 16036089 16214429 16179797 16351314 16607542 16243828 16162066
9297 16162066 15953525 15901137 16085482 16120628 16011280 15672923 15877079 15989051 15954979 15815667
9287 15815667 15726126 16111833 16296629 16143782 16141021 16143662 16111444 16032775 15663713 15816059 16042257
9276 16042257 16019420 15784679 16043942 16133937 16204892 16450764 16508321 16644325 16765033 16681605
9266 16681605 16659317 16658917 16864952 17003774 17132584 17121898 17070159 17272377 17199872 17057922 17060068
9255 17060068 16813813 16858475 16989303 17027214 17148120 17301517 17251948 17027836 17180883 17148477
9245 17148477 17484230 17542605 17652296 17564892 17817296 18130155 17964376 17928290 18283561 18483411
9235 18483411 18494862 18739140 18728726 18842959 18911099 19063814 19334874 19521260 19330796 19312681
9225 19312681 19543124 19738652 19782085 19740850 19795810 20031709 20267363 20329007 20249991 20525615
9215 20525615 20846636 20950634 21122073 21319495 21219178 21557569 21636684 21686091 22057050 22126672
9205 22126672 22098120 21758375 21811668 22168445 22219756 22389442 22364681 22345299 22649133 22539890
9195 22539890 22549154 22683108 22869542 23200464 23321560 23544548 23439390 23693645 23824159 23844527
9185 23844527 23901687 23978816 24201402 24557369 25119310 25162421 25468112 25425222 25196513 25166498
9175 25166498 25326805 25671251 25765382 25773946 25637447 25900723 25962157 25901574 26287158 26237319
9165 26237319 26523828 26560044 26642592 26593566 26759391 26850358 26689062 26668599 26972878 27326521
9155 27326521 27323818 27413018 27516154 27474810 27909031 28109112 28271389 28595439 28701086 28427527
9145 28427527 28354721 28932829 28819181 28948427 29526477 29660122 29794673 29661484 29895050 29925375
9135 29925375 30159764 30762410 30650105 30707252 30771320 31055029 31424636 31889879 31992018 31909577
9125 31909577 32429134 32814994 33034871 33399166 33776259 34041000 34186736 34556045 35024942
9116 35024942 35096337 35378098 35930429 36372237 36926874 37328474 37578700 38141662 38601100 38973998
9106 38973998 39545832 40270500 41071597 41753160 42718940 43498875 44714776 45523875 46714248
9097 46714248 48041364 49165916 50371446 51622970 53117226 54391944 55581702 56985230
9089 56985230 58799211 60664142 62381759 64298613 66272519 68135605 69925759 71705327
9081 71705327 73149976 74328099 74881803 75206836 75304312 75385218 75285878 74998156 74584392 74023746
9071 74023746 73373931 72339738 71459402 70590508 69848346 69207914 68996065 68843765 69082566
9062 69082566 69120427 69449499 69801198 70355306 71097264 71765272 72840444 74292906 75827164
9053 75827164 77571083 79622994 81755300 83758676 85589379 87059957 87941039 88543634
9045 88543634 88633465 88111912 87402963 86336097 85089538 83362705 81575291 79232773 76346388
9036 76346388 73794015 71412332 69413587 67653466 66153503 64766948 63723384 62462824
9028 62462824 61451313 60888251 60037043 59073634 58424506 57578430 56974162 56250834 55769196
9019 55769196 55492037 55113213 55112102 54966534 54583330 54627872 54959728 54896949 55062057 55501179
9009 55501179 55583223 55845663 56439142 56972579 57678713 58061446 58661726 59456125 60065907 61190733
8999 61190733 62167529 62881422 63460513 64337993 65305695 65901240 66342090 66674723 66941660
8990 66941660 67258952 67786810 68324870 68900504 69146891 69065502 69690582 70864433 71727249
8981 71727249 72758828 74170401 75829195 77744209 79581842 81757958 83679135 85726877
8973 85726877 87643850 89258198 90517824 91610074 92556592 93081496 93384359 93305365 92775255
8964 92775255 92280919 92187127 92013694 92288341 92902378 93680331 94268690 95127809 96035327 96942987
8954 96942987 97735545 98661367 99739095 100925055 102525814 104663445 106569033 108117297
8946 108117297 110307407 113310456 116963221 120852407 125276878 130001955 134711806 139143054
8938 139143054 144104963 149134716 154298398 160120207 166548116 174063109 183789412 196655537
8930 196655537 213102727 229025940 241265282 255152623 268675598 270860893 253765493
8923 253765493 232461279 210318283 185297371 164329292 146478293 132713072 122587086
8916 122587086 114698677 108132571 102430799 97979276 94389747 91420480 89064859 86985629
8908 86985629 85358087 83882870 82547051 81832922 81231414 80611737 80312914 79816244 79540882
8899 79540882 79294011 79085656 78759083 78867586 78814377 78528208 78526335 78668498 78690447 78923960
8889 78923960 78768443 78960453 79293292 79603847 79486560 79493951 79857203 80261403 80873636 81581020
8879 81581020 82034656 82599021 83205147 83996982 84885489 85790259 86635284 87517842 88545277
8870 88545277 89710519 90409870 90974580 91280396 91253294 91423497 91043919 90814431 90357983
8861 90357983 89456169 88627974 87729333 87065909 86777722 86360439 86518785 86546186 86644964 86880666
8851 86880666 87215995 88202200 88772718 89396015 89999610 91078065 92663678 94309038 95905623
8842 95905623 97808736 99467686 101327691 102998812 104400585 105448194 105862706 105910190 105623614
8833 105623614 105193187 104639929 103899002 102783116 101312219 99867241 98524503 97279281
8825 97279281 96214342 95366371 94641959 94131866 93364600 92866736 92258837 91815273 91584100
8816 91584100 91672892 91936522 91999354 92365819 93262592 94478645 95905043 97613423 99479161
8807 99479161 101753727 104142492 106665601 109242674 111467252 113115997 114470770 115672340
8799 115672340 117326936 118753597 120207991 121207477 122355033 123296183 123661396 122805385 121562984
8790 121562984 120160353 119201145 117824769 116651715 114918280 112533369 109850307 107690202
8782 107690202 105328622 103057867 101087219 99784076 99063803 98371037 98137708 98042347 97899346
8773 97899346 98555010 99374385 100654161 101715005 102785040 104372048 106155795 108151514
8765 108151514 110220627 112522368 114489039 116354709 118061166 119321079 119769523 119307447
8757 119307447 118162208 117118710 115845622 114366326 112485373 110672618 108149724 105669239
8749 105669239 103288549 100754812 98387229 96555640 94710153 93143042 91228250 90034202
8741 90034202 89036612 87754878 86923733 86383022 85923525 85772736 85718919 85860359 85851668 85648650
8731 85648650 85766791 85323966 84685215 83826517 82926434 81854553 80377491 78845824 77584961
8722 77584961 76658287 75058694 73802601 72702483 71492322 70323196 68839810 67622118
8714 67622118 66381331 65009129 64049362 62714691 61477732 60527072 59743861 58583474 57952754
8705 57952754 56789230 55421779 54609234 53388238 52207928 51094788 50269079 49491677 48518832
8696 48518832 47601700 46651024 45842476 44917989 44215562 43825438 43478486 43313520 42846269
8687 42846269 42481728 41847978 41401899 40813538 40318022 39671199 39516959 39346030 38824428
8678 38824428 38536420 37963186 37437416 37141659 36969752 36832161 36604004 36028617 35853393
8669 35853393 35904047 35500669 35186044 35235590 35326047 35099379 34779761 34752251 34442314 34223428
8659 34223428 34087864 33986118 33800868 33672693 33464781 33428456 33010313 32860673 32814379 32625272
8649 32625272 32445202 32228649 32064985 31997193 32275297 32257578 32410792 32425742 32470659 32509130
8639 32509130 32489152 32569595 32394012 32521010 32331736 32021374 31940238 31773131 31786344 31988794
8629 31988794 32181937 31807865 31815861 31642814 31299507 31105519 31060142 30405181 30348288 30067345
8619 30067345 29852558 29259142 28920051 28810597 28719762 28485917 28207370 28087819 27916618 28013889
8609 28013889 27837933 27803775 28138124 27994816 27968356 28111148 28376785 28684237 28377076 28739044
8599 28739044 29167476 29226636 29584944 29973960 30151263 30129869 29861958 29460443 29050330 28900469
8589 28900469 28350623 27833771 27593959 27399839 26661480 26260099 25945273 25355248 25120328
8580 25120328 24297274 24100953 24783143 24431351 24303314 23913312 23538576 23777552 23822724 23973225
8570 23973225 24264341 24403757 24726967 24910455 25239149 25970311 26148341 26401206 26267347
8561 26267347 26733523 27056529 26877414 26685748 26065101 25649768 24946106 24030806 23496440
8552 23496440 22853836 21957026 21523229 20592943 20451867 20277235 19963056 19720955 19345680
8543 19345680 19098541 19083549 18873296 18578892 18622473 18878635 18600878 18458618 18764191 18879969
8533 18879969 18802794 18966081 18916238 19213356 19160956 19019707 19004259 18962261 19028024 18878239
8523 18878239 18851962 18183833 17987098 17866030 17544971 17409887 16863004 16431680 16608708 16467872
8513 16467872 16398902 16413202 16597491 16575147 16616017 16502861 16627375 16415615 16695819 16522926
8503 16522926 16224634 16003188 15878408 15873085 15917166 15452273 15256403 15276402 15139858 15266446
8493 15266446 15217050 15194630 15529593 15810249 16050838 15808082 15480527 15552340 15305558 15044314
8483 15044314 14613869 14518356 14446524 14069681 13800139 13620555 13145179 12726002 12738464 12656597
8473 12656597 12388311 12125937 11809586 12070918 11910428 11928227 11540510 11245664 11334358 11314848
8463 11314848 11207228 11303062 11401706 11365196 11140342 11132940 11233862 10884911 10526641 10797286
8453 10797286 10792390 10845117 11115942 11371013 11322591 11177497 10910270 11066742 11073572 10573029
8443 10573029 10377972 10170148 10362032 10581239 10652007 10651869 10705827 10502381 10426859 9905026
8433 9905026 9576381 9527216 9074927 8880788 8622771 8119984 7673178 7831334 7667577 7574237
8423 7574237 7424492 7338109 7387423 7274697 7065529 7069592 6893647 6796545 7026605 7186868
8413 7186868 7641353 7733394 7866635 7753605 7996770 8220564 8213542 8139334 7960169 7522327
8403 7522327 7211609 6962958 6584323 6147669 6057587 5739870 5324076 5100798 4581286 4573658
8393 4573658 4499392 4184479 4516585 4353527 3922471 3787481 3597513 3700436 3796673 3981455
8383 3981455 3792463 3434757 3395628 3485915 3350094 3339558 3386401 3349637 3199866 3283793 3050570
8372 3050570 3154291 3426253 3357358 3130341 3188414 3347898 3517329 3983284 3859427 3908486
8362 3908486 3983832 4194885 4341824 4618637 4911793 4751435 4858691 4877624 4774971 4688598
8352 4688598 4232386 4003363 3522317 3346176 2963053 2639583 2386995 1923352 1983900 1940346
8342 1940346 2021966 1911946 1519098 1305772 1111600 1305986 1187487 1114451 1001910 1098467
8332 1098467 1241444 1142402 1415858 1419279 1233618 1135266 1000491 927780 891324 627198 405172
8321 405172 548510 411659 404209 370189 596597 738227 377696 42385 156604 -98783
8311 -98783 -293790 74403 144876 9694 -129584 -500200 -492369 -127390 -135945 -212831 -154417
8300 -154417 -281569 -407930 -197404 -301625 -106040 56087 -12664 101494 71172 -345236
8290 -345236 -644881 -790335 -454322 -310234 -191043 -285918 -335200 -432641 -416757 -526497
8280 -526497 -464698 -504027 -485381 -474336 -439423 -202175 -247688 -593253 -963888 -1028459 -950126
8269 -950126 -1067702 -928609 -569368 -705276 -890321 -1077989 -1180497 -1264814 -944353 -879008
8259 -879008 -1078590 -1057745 -1079273 -1096770 -1144942 -918209 -1115427 -1155046 -1221610 -1229036 -1163451
8248 -1163451 -1378276 -1415763 -1333414 -1432944 -1307763 -1312618 -1351960 -1462860 -1684816 -1453812 -1662753
8237 -1662753 -1672977 -1771344 -1664827 -1393685 -1166799 -1501931 -1710034 -1719989 -1760306 -1785555 -1785455
8226 -1785455 -1815455 -2066437 -2037711 -1829189 -2002933 -2229816 -1919347 -2147493 -2138188 -2134319 -2076494
8215 -2076494 -2062540 -2026752 -2053201 -2168366 -2032222 -1760992 -1897938 -1953282 -2103782 -2458243
8205 -2458243 -2425095 -2296034 -2167062 -2217557 -1993630 -1764600 -1781584 -1839086 -2080287 -2401297
8195 -2401297 -2273618 -2245109 -2438512 -3435530 -3404923 -3203474 -3032303 -2766904 -2744282 -2625048
8185 -2625048 -2650941 -2707184 -2833195 -2598233 -2370302 -2561567 -2405361 -1970022 -2320676 -2615833
8175 -2615833 -2721857 -2684705 -2690108 -2893829 -2727437 -2767437 -2816536 -2441923 -2690178 -2836519
8165 -2836519 -2699025 -2743351 -2796395 -2593846 -2643484 -2794641 -2941916 -2720260 -2556255 -2964281
8155 -2964281 -2837660 -2767795 -2677616 -2766618 -2745772 -2698054 -2938947 -2892651 -3018743 -3027737 -2765372
8144 -2765372 -2646463 -2677208 -2982762 -3037671 -2883183 -3109077 -2872494 -3025283 -2958250 -3071754
8134 -3071754 -3108043 -2771769 -2594669 -2650124 -2860743 -2887723 -3112108 -3282276 -3165583 -3031744
8124 -3031744 -3365709 -3051042 -3016934 -3091063 -3065353 -3067788 -3044637 -3174693 -3275426 -3306114 -3332538
8113 -3332538 -3353477 -3322179 -3120524 -2889500 -3012988 -3241871 -3143499 -3036262 -2988659 -3379776
8103 -3379776 -3452269 -3280833 -3266481 -3195823 -3208527 -3444854 -3112869 -3069112 -3123967 -3128805 -3017938
8092 -3017938 -3001344 -3064083 -3015264 -3055847 -3065130 -3066725 -3179604 -3215973 -3135605 -3189256 -3082447
8081 -3082447 -3182394 -2998886 -3274531 -3296925 -3053849 -3223587 -3360214 -3007686 -3110881 -2844810
8071 -2844810 -2878039 -3461589 -3358158 -3250232 -3207236 -3244746 -3174644 -3166717 -3426343 -3255145 -3085069
8060 -3085069 -3159028 -3236482 -3262040 -3013531 -3137757 -3339728 -3301999 -3486624 -3245282 -3064811
8050 -3064811 -3130140 -2904994 -2703346 -2978907 -3259657 -3250349 -3071242 -3275089 -3298621 -3322651
8040 -3322651 -3245907 -3312620 -3260476 -3153331 -3177544 -3209604 -3429002 -3330549 -3093755 -3013122 -3362471
8029 -3362471 -3409097 -3558583 -3751363 -3437936 -3333030 -3539652 -3407450 -3202882 -3097783 -3247234
8019 -3247234 -3216382 -3142577 -3011201 -2857837 -3076370 -3288108 -3163821 -3296559 -3655864 -3408619
8009 -3408619 -3381920 -3395191 -3645926 -3538380 -3214065 -3106438 -3071062 -3158177 -3025292 -2936910
7999 -2936910 -3045843 -3159532 -3365230 -3310481 -3061648 -3020568 -3119924 -3164414 -3021174 -3040557
7989 -3040557 -2986800 -3063374 -3475976 -3748414 -3457488 -3203028 -3248052 -3381575 -3334244 -3136211
7979 -3136211 -3155894 -3143780 -3070497 -3139212 -2893499 -2743613 -2965888 -3162097 -3368364 -3131616
7969 -3131616 -2859538 -2700466 -2804371 -3016143 -3041080 -2848574 -2669381 -3170533 -3240895 -2930250
7959 -2930250 -2948105 -2874651 -2916045 -2992747 -2941060 -3252692 -3153458 -3074488 -3230092 -3336120 -3151859
7948 -3151859 -3110859 -3083358 -2987227 -2966451 -2890627 -2776040 -2752542 -2681270 -2893399 -3093804 -3260153
7937 -3260153 -3233492 -3230936 -3171728 -3120803 -3232131 -3320211 -2923956 -2848924 -2930533 -2815429 -3061861
7926 -3061861 -3010168 -3002180 -2690061 -2765390 -2830094 -2904702 -2738709 -2736264 -3001562 -2996718 -3036711
7915 -3036711 -2878394 -2654874 -2614784 -2547887 -2488573 -2806702 -2800112 -2716901 -2648226 -2820036 -2935141
7904 -2935141 -2757656 -2999331 -3079766 -3063017 -2954447 -3081880 -2838242 -2815573 -3003910 -2739678
7894 -2739678 -2788285 -2854205 -2689488 -2473544 -2514290 -2954403 -3127801 -2869135 -2496730 -2650207
7884 -2650207 -2676809 -2534056 -2882657 -2861096 -2698307 -2858940 -2721941 -2534157 -2495725 -2411869
7874 -2411869 -2631981 -2723170 -3036685 -2900998 -2655010 -2590915 -2552833 -2645333 -2512275 -2561689
7864 -2561689 -2665149 -2657980 -2338534 -2350625 -2568629 -2225827 -2325897 -2630937 -2623249 -2309100
7854 -2309100 -2232211 -2329298 -2249731 -2312946 -2392277 -2478668 -2443777 -2495490 -2145506 -2107944 -2260064
7843 -2260064 -2154937 -2163577 -2427602 -2257893 -2085984 -2213586 -2359815 -2195547 -2026725 -1979275
7833 -1979275 -1878512 -1829455 -1953613 -1940415 -1948419 -2024195 -1901357 -1795740 -1644327 -1986746
7823 -1986746 -2082230 -2009239 -1759013 -1650830 -1417335 -1499742 -1380677 -1495518 -1775917 -1903344
7813 -1903344 -1984877 -1937937 -1673791 -1627140 -1474236 -1606028 -1775378 -1831168 -1058713 -616343
7803 -616343 -1040392 -1209476 -1458629 -1437127 -1432563 -1207148 -1333089 -1131522 -1145690 -1097762 -977360
7792 -977360 -855030 -982357 -1045893 -1055819 -1056242 -1022661 -942384 -802565 -581559 -623316 -470246
7781 -470246 -621750 -784647 -567767 -426570 -513189 -650947 -584400 -460704 -615254 -783059
7771 -783059 -1013683 -807219 -564307 -507409 -578594 -805502 -578565 -400278 -344900 -337399 -317245
7760 -317245 -499500 -364285 -454012 -365439 -234827 -592087 -432550 -449577 -325397 -138492
7750 -138492 -309364 -380561 -269179 -338123 -81778 39400 -16564 -233405 -197761 -143354 -303940
7739 -303940 -69382 -70197 135142 234768 190951 298353 118197 30572 -39141 234793 450421
7728 450421 395572 603340 500795 457934 242512 409065 328187 381289 307246 305249 271108
7717 271108 80903 246373 251752 338858 518276 375531 496626 364799 247354 301118
7707 301118 156967 54420 216146 529722 725289 783699 881096 815540 686323 551076
7697 551076 586147 592992 680084 930732 742143 404411 536035 747267 563268 282994
7687 282994 372745 502599 583897 541912 609486 503063 757275 885233 765545 743357 682267
7676 682267 631684 647642 873682 1009647 1105484 875965 833489 1099753 1133904 1136695 1169288
7665 1169288 949100 1165345 1113582 1218888 1096721 906668 913175 1056160 1195191 1128918
7655 1128918 861666 1021772 944880 1050990 986443 1148485 1309910 1198584 1094027 932004
7645 932004 983236 901303 884923 807746 886335 904231 988035 827455 707278 838285 1166926
7634 1166926 843254 772756 749122 668254 810041 678818 702358 791741 595929 590808 755030
7623 755030 737413 668160 858583 687427 582175 634617 629031 1143740 1071220 773453 953285
7612 953285 1181723 982962 817128 793264 844193 828359 749582 773579 939514 1017000 938264
7601 938264 1022872 1178063 1067766 925018 869843 931954 1055777 1104596 1420622 1628594
7591 1628594 1446223 1418563 1656526 1670442 1764474 1986225 2108312 1986395 1717247 1891556
7581 1891556 1835653 1924997 1950809 1977891 2104886 2119822 2193263 2121081 2122988 2003505 2242223
7570 2242223 2649475 2643758 2871876 2815418 2757283 2789496 3192862 3501909 3285981 3077931
7560 3077931 3157778 3369830 3407992 3434243 3574101 3524214 3500717 3462118 3365696 3510563 3685923
7549 3685923 4001344 4073541 3948638 4008180 3846030 4074380 4475121 4626674 4615492 4777228
7539 4777228 5417444 5547647 5622520 6025627 6531587 6820314 7254609 7687322 8188418 8265992
7529 8265992 8839286 8936991 8946752 9161808 8871033 8740130 8319705 7918253 7646817 7076384
7519 7076384 6718685 6462709 6411550 6283272 6284122 6304548 6523539 6626356 6166994 6254231 6315758
7508 6315758 6284588 6223196 6509114 6365550 6125611 6163322 6184362 6145767 5754181 5556779
7498 5556779 5548013 5431381 5342630 5607255 5804243 5708564 5742067 5617338 5415397 5716889
7488 5716889 5874928 5829802 5741135 6125440 6217175 6224108 6298876 6656672 6776739 7003897 7298832
7477 7298832 7267278 7563037 7649581 7623696 7738225 8004724 7817002 7729581 7706748 8174212
7467 8174212 8160465 8199972 8187110 8532212 9085431 9118633 9341539 9739185 10200114 10537411
7457 10537411 10706647 11104379 11543034 11951632 12291243 12733591 13279869 13445917 13498533 13726957
7447 13726957 13710180 13469157 13394896 13006419 12834547 12660562 12110110 11772241 11671374 11213624
7437 11213624 11034925 11001015 10668125 10761768 10598338 10427446 10192336 10135846 9775423 9747536
7427 9747536 9777931 9537000 9577241 9741290 9963933 9923380 9768268 9758896 9783464 9809849 9928008
7416 9928008 9970987 9969520 10027504 10312559 10288705 10616072 10556624 10589663 10655306 10598473 10761949
7405 10761949 10631080 10655756 10726538 10909859 11102105 11341638 11390302 11470124 11826986 11885776
7395 11885776 11863231 12023426 12298732 12604504 12592283 12733259 13117277 13013837 13209413 13250622
7385 13250622 13146366 13240259 13329853 13193045 13086004 12963411 12868024 12535299 12319625 12529839
7375 12529839 12420442 12139065 12208657 12336040 12872996 12962909 12964015 12993096 13012027 12926723 13143662
7364 13143662 13254015 13194845 13215578 13449319 13560925 13492650 13493353 13478762 13662735 13824705 13957709
7353 13957709 14108743 14473678 14586502 14746235 14814102 14769489 15214112 15344908 15532077 15750226
7343 15750226 16137871 16361706 16534620 16451887 16359026 16629226 16367562 16200930 16112556 15992977
7333 15992977 15845253 15980961 15651457 15489627 15189144 15536440 15555470 15767177 15726041 15709947
7323 15709947 16085628 16217693 16194803 16273908 16136843 16400218 16710267 16379308 16465941 16550869
7313 16550869 16477185 16402977 16652910 16734362 16819698 16943079 16979529 17322806 17280254 17380742
7303 17380742 17374120 17775479 17976099 17962237 18139840 18309494 18359166 18210573 18057991 18354352
7293 18354352 18712678 18822122 19144135 19127127 19066930 19261614 19386664 19015540 18878420 18754181
7283 18754181 18698337 18518346 18385815 18466668 18449502 18937179 19311044 19662178 19427731 19152673
7273 19152673 19220156 19198557 18457802 17765158 17199033 16288185 15701905 15287396 14466267 13801641
7263 13801641 13259198 12701817 12674465 12579080 12602476 12354145 12069995 12215551 12103062 11987213
7253 11987213 11839138 11599240 11543862 11423744 11464940 11057223 10902709 10652557 10459420 10519979
7243 10519979 10519207 10247992 10179150 10031802 9994384 9956799 9764164 9782531 9783374 9718701 9788594
7232 9788594 9726432 9863587 9817645 9817666 9756617 9750138 9935136 9941738 9921270 9893042 10026622 10205762
7220 10205762 10376951 10500334 10629845 10739417 10943903 11159310 11230438 11403774 11721552 12168186
7210 12168186 12185792 12494345 12833345 13026023 13224565 13370664 13662622 14138694 14511529 15257594
7200 15257594 15890143 16668433 17504999 18256691 19027014 20023130 21451001 22902635 24235583
7191 24235583 25078286 25860747 26563680 26538118 26031548 25266179 24252957 22872152 21455436
7182 21455436 19916555 18581629 16937629 15939417 15087587 14441177 13662043 12947496 12024477
7173 12024477 11181662 10750501 10109644 10055198 9875885 9619863 9202229 9011245 8956959 9109829
7163 9109829 8554775 8236935 8247328 8182741 8002810 8102133 8349882 8645732 8695169 8881657
7153 8881657 9056311 9600748 9950024 10302677 10574522 10795748 11033841 11247196 11241149 10842192
7143 10842192 10668562 10217543 9321692 8946934 8459519 7852384 7386627 7233042 7004571
7134 7004571 6762109 6396174 6324767 5844900 5721064 5840874 5391169 5121189 5501900 5525328
7124 5525328 5321283 5354979 5365054 5159298 5027264 5043855 5301349 5628177 5544546 5100538
7114 5100538 4946907 5031676 5233872 5364712 5224294 5650136 5701999 5747186 6012245 6402958
7104 6402958 6435385 6671416 6991596 7329981 7728265 8254613 8720786 9338730 9479369 9695422
7094 9695422 9994035 9746704 9492294 9290534 8627376 7910547 7662268 7299818 6657303 5962685
7084 5962685 5727855 5650046 5458954 5170887 4995130 4588092 4293613 3969366 3783119 3923594
7074 3923594 3841346 3736498 3485865 3445565 3239903 2998171 3307411 3289141 3276387 3272516 3309473
7063 3309473 3139915 2876173 2770281 2651628 2576953 2661183 2635753 2575372 2693408 2539147
7053 2539147 2285029 2338996 2434767 2422031 2528432 2319719 2384177 1977018 1846028 1959080
7043 1959080 1917328 2095182 2329600 1976119 1799609 1890876 1856749 1837133 1670868 1775561
7033 1775561 1815544 1835965 1821170 1691645 1417597 1273494 1180989 1029842 1125786 1150207 1328407
7022 1328407 1478292 1384482 1250837 1257398 1171157 1050899 1070815 1401806 1637547 1421923
7012 1421923 1367938 1164708 1078522 1006419 1084660 1170071 1023265 1168880 1067336 1119072 1096501
7001 1096501 987634 1005056 838859 835781 869054 793922 728240 562492 370068 191802 389198
6990 389198 296857 360212 487065 399772 317842 561594 296155 294478 352402 125538 101306
6979 101306 -233545 -203704 -111482 23787 53472 164587 258389 54954 -143524 -83840 -77663
6968 -77663 -134546 -190879 -78146 26517 -39281 -13226 -139008 -36671 -72253 -30894 -110770
6957 -110770 144161 121392 22283 22108 -250404 -68226 -27933 166013 149735 63951 231231
6946 231231 169179 -22698 -32859 35282 290824 400051 469600 399492 278816 -31833 65035
6935 65035 -43302 247932 274618 45443 -122759 -232199 -74949 -23933 -107679 117949
6925 117949 15496 76536 225657 127005 -60556 10846 214723 267245 -12062 -179774
6915 -179774 -6495 25201 62422 153401 219239 3898 -10566 116790 -8518 -226423 -215524
6904 -215524 39178 -80956 -49016 -78418 -305365 -130258 -31469 69293 -211073 13141
6894 13141 -157248 -246386 -190662 -155106 -321328 -417344 -230407 -219394 -188238 -169732 -504444
6883 -504444 -482112 -502809 -598330 -417084 -395225 -480997 -353120 -102149 -266422 -632305 -621917
6872 -621917 -403611 -631074 -565768 -273668 -115408 -366537 -238458 -164586 -563339 -631723
6862 -631723 -537849 -292648 -557116 -677022 -539298 -525045 -372030 -359348 -17899 -421281
6852 -421281 -428143 -433310 -656846 -559163 -307305 -204015 -17498 -40386 -47806 -233020 -227114
6841 -227114 -339729 -536093 -349368 -129301 -339419 -453012 -496992 -657812 -408054 -499436
6831 -499436 -410980 -201226 -391988 -730984 -598691 -386360 -351300 -464448 -533202 -353186
6821 -353186 -225590 -384496 -439023 -513109 -330047 -115048 -110883 -450267 -536653 -249378 -91942
6810 -91942 -274758 -233450 -267330 -250162 -479887 -632206 -317176 -339819 -257228 -260861 -350112
6799 -350112 -298925 -143166 -106126 -26704 -182886 -315627 -266112 -325179 -356776 -447587 -142245
6788 -142245 -125395 -62985 26693 198533 151977 37039 57481 -71810 -154787 -156047 -432267
6777 -432267 -191224 -155607 -196416 49082 -160169 -469953 -289921 -50366 -36846 -3730
6767 -3730 -8882 36586 408706 306489 209333 388884 126738 -102333 -6826 -211364 -95564
6756 -95564 -58185 -187398 -317755 -148101 -61245 110265 170994 187950 153324 -19948 145409
6745 145409 155026 118625 221839 -22888 305062 285753 250018 465770 284351 362110 277488
6734 277488 305506 392827 575027 534357 428241 402648 337507 317794 406346 182195 301943
6723 301943 272824 218791 271813 423307 611560 470392 70111 111247 292041 657065
6713 657065 485933 371467 426991 230241 455401 399992 256736 429389 517306 673296
6703 673296 234474 237861 288791 369817 472548 382229 255917 502999 674599 975638 871217
6692 871217 637562 686176 1040841 732786 617200 599811 750958 940260 963197 1146253
6682 1146253 851840 898881 813826 954395 809216 827442 1113842 1127949 975523 856380
6672 856380 1029893 1238712 1365702 1072387 986532 1327197 1229700 1283090 1449925 1343076
6662 1343076 1476405 1531161 1450807 1145252 1283508 1481276 1448352 1376212 1623212 1580979
6652 1580979 1281798 1512658 1658441 1534094 1686283 1836730 1883546 1614979 1787271 1938253
6642 1938253 1850604 1856587 2034209 1954735 1774535 2101632 2091999 2276525 2431002 2674261 2590857
6631 2590857 2489190 2545077 2679882 2555894 2458004 2516963 2678102 2785622 3118117 3079874
6621 3079874 3047426 3208200 3374746 3412117 3636281 3904466 4010261 4112506 4265061 4335184
6611 4335184 4561531 4483061 4822069 5104268 5354269 5562917 5766609 5659385 6049749 6464019
6601 6464019 7023326 7539427 7978817 8738269 9484176 10285785 11031371 12069071 12994584
6592 12994584 13621202 14006974 14325101 14145706 13920064 13026500 12030102 11575347 11144061
6583 11144061 10703647 10480918 9993350 9978832 9874470 9935749 10199018 10192923 10182352 10331337
6573 10331337 10317992 10272889 10331006 10252623 9872269 9484058 9352622 8845754 8569935 8300328
6563 8300328 8735253 8497678 8223895 8156914 8104665 8365974 8571660 8321767 8322387 8339645 8125891
6552 8125891 8261894 8230009 8372239 8248486 8131278 8050400 7950299 7752039 7942181 8000054
6542 8000054 7952624 7891408 7723135 7723151 7777371 7923627 7935374 7620513 7463993 7539885 7242835
6531 7242835 7361482 7415666 7383660 7485123 7824866 7520109 7211211 7107711 7156435 7059883
6521 7059883 7093872 7080517 6852010 6713565 6471902 6625639 6632549 6812649 6551616 6415640
6511 6415640 6135175 6230389 6244253 6358701 6144330 6056743 5795206 5642591 5969335 5936560
6501 5936560 5939691 6000012 6079142 6228381 5992208 5927838 6029868 6076110 6200151 6383495 6281191
6490 6281191 6090644 6090328 5911379 6062729 6107923 6136530 6152058 6266309 6463153 6602262 6435830
6479 6435830 6529453 6375331 5981769 5979233 5957585 6282431 6445496 6526545 6372729 6318629 6327716
6468 6327716 6432903 6434001 6175495 6053241 6183379 6270388 6249355 6565889 6997737 6814740
6458 6814740 6624499 6375960 6594368 6594920 6658076 6699577 6752500 6801159 6780225 6938998 6986126
6447 6986126 7022957 7098034 7178997 7319883 7135262 7206501 7460926 7411780 7184759 7312327
6437 7312327 7483039 7453818 7767600 7841312 7985297 7830945 7963928 7824881 7797167 7833531
6427 7833531 8177629 7993812 7985307 8299739 8427855 8528687 8250824 8130560 8408842 8268320
6417 8268320 8166914 8312777 8523962 8620899 8670378 8742277 8589479 8665065 8621963 8988127
6407 8988127 9033438 8895898 9164824 9334585 9138688 9250891 9130194 9347276 9436017 9644769
6397 9644769 9786360 9590549 9945920 10106999 10091378 9967387 10263246 10324146 10166262 10212796
6387 10212796 10390113 10486309 10815370 11104458 10882344 10845190 11207464 11341991 11629383 11631897
6377 11631897 11841001 11791495 11801486 12178401 12302881 12317971 12320419 12378707 12597988 12731072 12940918
6366 12940918 12749479 12679385 12758647 12804458 12921859 13169375 13422840 13330925 13367246 13491138
6356 13491138 13632238 13879613 14057290 14334893 14466666 14642950 14836186 15056108 15342676
6347 15342676 15520689 15931507 16038145 15909902 15944282 16194793 16332955 16419955 16275307 16482584
6337 16482584 17134342 17361772 17285529 17378710 17439315 17485038 17841274 18114490 18445552 18926683
6327 18926683 19750026 20230820 20508554 20729704 21324786 21958290 22544129 22963797 23576217
6318 23576217 24445937 25258345 25712005 26163088 27299992 28163602 28654640 29496613 30536183
6309 30536183 31655506 32981259 34485635 35961118 37760998 40015997 42527777 45323010
6301 45323010 48930571 52759555 56478557 60376803 63614507 65332870 65104651 64523332
6293 64523332 63150854 62039797 61118423 61170914 61927450 63155205 64967105 67110096 69325059
6284 69325059 70695658 71674610 72572570 73845841 75454468 77367874 79554036 80684714
6276 80684714 80522392 79358705 77805282 76337864 75264316 74521312 74270712 74333298 74496810
6267 74496810 73526382 72130785 70796270 69487901 68674626 68433466 68940498 70146437 71845384
6258 71845384 73649232 74584920 73621922 70886947 67299494 63070143 59050958 55414585
6250 55414585 52280230 49655971 47495050 45684886 44189164 42915675 41943181 40906691
6242 40906691 39938865 38671240 37513314 36597580 35758694 34744071 34085985 33511401 32802564
6233 32802564 32501757 32045599 31499729 31438293 31189911 30782074 30785663 30597842 30536385 30337408
6223 30337408 30159163 30155001 30429587 30435868 30340734 30239132 30236011 30417027 30608520 30942738 30991140
6212 30991140 30932682 31467701 31491422 31988599 32460772 32661585 32846745 33236304 33498477 34197070
6202 34197070 34833895 35561548 36048011 36726117 37525973 38242568 38893371 39708126 40983048
6193 40983048 41869741 42876027 44067939 45260293 46661436 48343115 50047101 51559923
6185 51559923 53349294 55408784 57674756 60284399 63227093 66065603 69131483 72521586
6177 72521586 75496961 77764091 79710188 81125383 82652637 83610107 84849008 86671198
6169 86671198 88865283 91662223 95197045 99049858 102808305 106650138 109553434 111195812
6161 111195812 112144832 112757112 113732679 115827432 118597722 122613480 127402758 132857901
6153 132857901 138687022 143709872 147295236 148573722 147879503 145868820 142792073 139966448
6145 139966448 137111204 133947130 130306911 126869942 123395915 120083329 117735745 116136882
6137 116136882 114914237 114663311 114420404 113725988 112641112 111952463 111739381 112197746 113562940
6128 113562940 115290667 117078937 118480042 119120231 118319077 115387085 110285336 104045733
6120 104045733 97614064 90927420 84478474 78765287 73631914 69447831 65577173 62504989
6112 62504989 59989633 57474028 55098920 53162471 51506393 49736552 48185496 46842543
6104 46842543 45872552 44908583 44045331 43348070 42386468 41805075 40929652 39873004 39449477
6095 39449477 38733023 38107793 37562754 37100792 36907278 36207783 35590999 35486194 35090408
6086 35090408 34667839 34577973 34137147 33777966 33403256 33189042 33227901 33107561 32893814 32526116
6076 32526116 32276648 32341136 32192791 31948186 31917161 31666117 31484514 31490545 31684221 31635081
6066 31635081 31769069 31885317 31828549 31909503 31871288 32113569 32365210 32629805 32736397 32758745
6056 32758745 32892757 33111843 33337996 33412305 33516363 33894651 34150179 34087464 34051425 33982340
6046 33982340 33850118 33489787 33196331 32767478 32534013 32582107 32363882 32254139 32280990 31917192
6036 31917192 32070027 32309758 32474749 32959419 33317942 33541091 33911243 34270448 34817364
6027 34817364 35064717 34941870 34715824 34733233 34190766 33805101 33294884 33230132 33041870 33119356
6017 33119356 33069277 32877708 32743986 32286982 32073689 31529597 31560694 31405619 31330596 30969684
6007 30969684 30842466 30752206 30867141 30878712 30858119 30687012 30537073 30316270 30176154 29952266
5997 29952266 30005467 29724552 29279208 28824184 28626812 28479624 28305900 28334551 28146352 27804785
5987 27804785 27928041 28151041 28173773 28100832 27860009 27637143 27540319 27555681 27721535 27639904
5977 27639904 27401384 27207521 27124989 26771152 26633808 26592790 26557745 26648108 26511146 26437179
5967 26437179 26152570 26162771 26078472 25855619 25664624 25809899 25724729 25890304 25709084 25578847
5957 25578847 25450415 25361712 25623293 25441633 25470773 25359197 25261100 25314144 25203715 24885678
5947 24885678 24847330 24896433 25170888 25142436 24924615 24761601 24536087 24730339 24639644 24574007
5937 24574007 24681272 24683753 24794407 24928728 24698630 24521505 24622480 24659862 24434903 24121627
5927 24121627 23937444 24074496 24005548 23991802 23829532 24081057 23729024 23508178 23716156 23816486
5917 23816486 23581933 23635121 23421264 23292053 23677332 23740182 23854202 23652634 23660101 23773620
5907 23773620 23640294 23386972 23438207 23538990 23596769 23622656 23693190 23608140 23793765 23927049
5897 23927049 23930555 23693079 23899741 24133014 23922947 23961982 24007386 24327473 24688957 24670935
5887 24670935 24857680 25045083 25175985 25139602 25156971 25137923 25237481 25333317 25416655 25532379
5877 25532379 25373752 25447093 25716974 25717406 25459666 25583731 25750891 26085839 26272589 26253707
5867 26253707 26357028 26465163 26590636 26500907 26666205 26950419 27302884 27428389 27562252 27394879
5857 27394879 27498676 27515451 27591587 27667228 27850345 28160854 28598721 28706707 28610015 29010880
5847 29010880 28998740 29388088 29681052 29829609 30077237 30022276 30215601 30415828 30608162 30962266
5837 30962266 30975494 30986748 31166096 31301108 31483038 31899682 31837014 31826052 31863886 32185466
5827 32185466 32645548 32817699 33018031 33252539 33595725 34048807 33976437 34021366 34379841 34847246
5817 34847246 35191703 35366867 35465773 35703621 36161746 36893910 37434266 37425283 37924597 38697658
5807 38697658 39176920 39442239 39917433 40497234 41091299 41500123 42002610 42536824 42934533
5798 42934533 43684930 44706879 45608691 46211009 46611982 47331870 47969039 48488293 48896435
5789 48896435 49471807 50023746 50525347 51555414 52262937 53118352 53702449 54548517 55549557
5780 55549557 56573102 57911199 58820792 59855317 61194773 62802129 64386914 65942910
5772 65942910 67652441 69382467 71184588 72806502 74266901 75618394 77152848 79145342
5764 79145342 80765323 82843428 85182834 87620427 90501561 93713276 97483428 101964647
5756 101964647 107139781 113240087 120965838 129096268 137520891 146261344 153953509 159114976
5748 159114976 162587891 165265479 166536738 166690803 165717413 164277267 162903336 161186551
5740 161186551 159883267 158617061 157210778 156480988 156449613 157543701 159992886 164049261
5732 164049261 168691480 173283773 177984035 182080748 185427696 188947394 193014069 197870334
5724 197870334 202650633 206692083 209142365 208805327 205737722 200381262 193682631 187032217
5716 187032217 181412586 176660719 172791401 170618431 169389550 168549935 167412024 165221427
5708 165221427 162510225 160131605 158235662 156699613 155882696 155640532 155711491 155970246 156502989
5699 156502989 157066115 158059124 158891145 159785683 159843238 159535223 159194319 158309486 157455520
5690 157455520 156785194 156424187 156748298 157368847 158173273 158937719 160099001 161823643 164301353
5681 164301353 167052870 170113903 173842374 177663719 182007020 186815515 191722206 196329544
5673 196329544 201047948 205362363 209033864 211686230 213786613 214615725 213902899 211960372
5665 211960372 208717713 204646932 199666635 193985581 187672349 180549205 173405084 166299034
5657 166299034 159457203 152889212 146665067 140879057 135953433 131233072 127087248 123118160
5649 123118160 120389798 118192711 115654864 113378700 111621696 109936015 108058562 106327824
5641 106327824 104634398 102816765 100864791 98904809 97204601 95348212 93663412 92484376
5633 92484376 91060055 89988849 89058857 88205899 86719251 84925365 83340101 81849154
5625 81849154 80759812 79932774 78935317 77974154 77500836 77174401 76340774 75873847 75586703
5616 75586703 75196503 74811421 74483280 74022109 73912598 73660899 73758745 73960440 73709419 73540335
5606 73540335 73543798 73502923 73759878 73799991 73964689 74016550 74147409 74537484 74937680 75160320
5596 75160320 75228535 75627626 75681805 76417522 76911931 77076977 77819609 78383904 78630163 78783906
5586 78783906 78975567 79014985 78999736 79433921 80129164 80691132 81773327 82819817 83708471
5577 83708471 85239645 87015792 89093226 91440798 94288334 97730674 101592571 105508294
5569 105508294 109183431 112495865 114961467 115937228 115653325 114406666 112794576 112070831
5561 112070831 111379911 110870922 111077401 111504234 112615735 113642643 114335872 114850745 114728681
5552 114728681 115169307 116240313 117934550 119742272 121549050 123423161 123859063 123416962
5544 123416962 122353144 120077649 118040770 116330042 114222570 112330821 110027930 107403777
5536 107403777 105109938 103150048 101561700 100405578 99937031 99820093 100016186 100107276 100621589
5527 100621589 100332944 98610788 96047631 92692938 89133480 85730201 82599563 79419122
5519 79419122 76603409 74028715 71955464 69940133 67942499 66185912 64710793 63298553
5511 63298553 61668147 60317387 59250013 58298456 57388622 56951024 56300009 55645548 55182743
5502 55182743 54561650 54091490 53796072 53882054 53431738 53071386 52656150 52315903 51965615 51297534
5492 51297534 50940400 50800878 50569505 50338776 49712697 49443821 49172947 49065951 49064186 49007065
5482 49007065 48733349 48270140 48228002 48042610 47778374 47369238 47238749 47162476 46943317 46608949
5472 46608949 46428511 46027980 45457607 45240739 45080826 44686064 44365791 44103515 43943678
5463 43943678 43627549 43422286 43351779 43029393 43034887 42494781 42146625 42030549 41734120 41351724
5453 41351724 41049906 40649683 40232224 39994154 39750623 39418698 39192919 39016191 38575622
5444 38575622 38510820 38097283 38048411 37686766 37449384 37475762 37136430 36806382 36465089 36201309
5434 36201309 36087658 36125218 36039852 35721643 35202082 34813703 34512356 34487766 34335438 34461577
5424 34461577 34189465 34094836 34059193 33704821 33663634 33586048 33403617 33270847 33090866 32908732
5414 32908732 33122575 33052837 32816521 32608355 32697885 32524442 32582064 32378799 32037117 31982109
5404 31982109 32271062 32106139 31878657 31912864 31939722 31496152 31046989 31110166 30972546 30920194
5394 30920194 30570685 30270294 29922013 29559858 29319867 29144531 28979580 28530831 28375469
5385 28375469 28379862 28328203 28319773 28440955 28149034 27730667 27747045 27729935 27579004 27479055 27493017
5374 27493017 27520729 27439519 27326578 27188455 27105153 27293233 27140806 27079331 26707171 26426501
5364 26426501 26156264 26396256 26286894 26252369 26475816 26298571 25811250 25876755 25789145 25465305
5354 25465305 25418043 25351553 25440497 25515027 25344984 25166992 25176890 25241208 25064987 24794559 24847838
5343 24847838 24725532 24939623 24778323 24748957 24973390 24680311 24531565 24495092 24581613 24418793
5333 24418793 24348076 24271313 24206595 24127298 24215803 24425678 24451844 24307662 24177110 24227724 24306789
5322 24306789 24343012 24165394 23955179 24050842 24263800 24207459 24331439 23975441 23957683 23829131
5312 23829131 23718383 23714221 23763435 23868107 23980245 23982765 23890389 23705406 23917904 24099837
5302 24099837 23893995 23766491 23957248 24006250 24070926 23900568 24015968 23936918 23738242 23771505
5292 23771505 23654750 23705647 23650573 23595358 23419464 23305337 23563284 23639984 23520756 23590681
5282 23590681 23666456 23461808 23559792 23763920 23902654 23832390 23881811 23892399 23870098 23559907
5272 23559907 23495332 23723776 23630732 23420417 23287625 23545362 23748780 23818778 23490880 23277606
5262 23277606 23367078 23560218 23311141 23309043 23493678 23604987 23927975 23967159 23841189 23689353
5252 23689353 23531407 23602727 23484777 23520488 23439150 23514049 23678802 23461765 23239805 23280476
5242 23280476 23274245 23660455 23753588 23625167 23752732 23613811 23902182 24118504 24305180 24350578
5232 24350578 24121978 24244376 24545305 24408064 24313282 24327094 24262163 24500516 24475056 24358061
5222 24358061 24198624 24639359 24673299 24414541 24432872 24731254 24671469 24909827 25023516 25134373
5212 25134373 25273278 25208002 25592028 25488700 25366595 25487441 25618101 25744537 26036427 26145442
5202 26145442 25996971 26206533 26212710 26286503 26137826 26220341 26347194 26414168 26549336 26844394
5192 26844394 27083518 26880694 26573940 26968894 27045897 27029303 27371487 27418584 27402031 27600869
5182 27600869 27627663 27912643 27948829 28155693 28332003 28602221 28831011 28964749 29106744 29024409
5172 29024409 29130289 29270449 29654464 29512138 29769416 29721343 29941015 30022963 29782219 29932485
5162 29932485 30336806 30315244 30654334 30679472 30706871 30805545 31233834 31721413 31916258 31983354
5152 31983354 32157231 32367346 33066156 33422570 33472341 33954860 34458988 34904271 35393704 35889309
5142 35889309 36082081 36407069 36687891 37089348 37454574 37774866 38068037 38433195 38943048
5133 38943048 39375771 40096714 40841509 41633234 42260975 42645534 43454089 44508415 45640358
5124 45640358 46580510 47672229 48961512 50695023 52659300 54774402 57644797 60221654
5116 60221654 61906427 63014464 64703653 66829950 69512432 71838798 74385197 77503943
5108 77503943 81451207 85745111 90607131 96593769 103846539 113165550 125292196 140089174
5100 140089174 159517478 181414963 202469579 224391827 244926750 250117042 237727058
5093 237727058 218854194 196224967 173814612 154724485 137876353 123416849 112240761
5086 112240761 103224843 96170829 90476156 85355196 80993580 77539791 74475139 71837284
5078 71837284 69439668 67214382 65389571 63773861 62260687 61488389 60860957 60951702 60542585
5069 60542585 60200819 59864479 59671173 59374467 59266966 59112316 59015510 58896728 58728239 58751469
5059 58751469 58810548 59079807 59265962 59386838 59570659 59865348 60133123 60323189 59850517 59832367
5049 59832367 59760415 59552112 59389843 59075345 58793134 58383621 58227078 57979093 57800550 57928000
5039 57928000 58189722 58306666 58197461 58182499 58216163 58431834 58491740 58415903 58648325 58981283
5029 58981283 59304613 59632741 59989245 60248027 60302044 60746229 61241550 61711036 62157868 62516316
5019 62516316 63032702 63627541 63850978 64294908 65008863 65469722 66122731 66412263 66882854
5010 66882854 67155065 67584256 68642103 69704291 70505724 71277657 72031534 72852974 73848748
5001 73848748 74493433 75373282 76758989 77995266 79192399 80933192 82451585 84049854
4993 84049854 85340760 86720848 88279677 89897951 91700876 93802248 95621606 97296162
4985 97296162 99554077 101474462 102917698 104352877 105690079 107471970 109985001 112415080
4977 112415080 115620387 119161883 122831003 127036765 131260115 135123606 138060829 139929766
4969 139929766 141728673 143241646 144829843 146160356 147038747 148268573 149316982 150709336
4961 150709336 152059813 153591472 155585674 157791333 160235178 162493249 164988392 167583665
4953 167583665 170438404 173662632 176622801 179264022 181887451 184205267 186486488 188699940
4945 188699940 191333948 193409085 195156979 196231716 195787496 194741191 192812918 190099659
4937 190099659 186261461 181402917 176358360 171844936 167252807 163171613 160056438 157880232
4929 157880232 156248206 155357919 154780111 154271040 153536027 152106893 149803803 146739711 142878177
4920 142878177 138938946 135429919 131824073 128377663 125618628 123136293 120664119 118520841
4912 118520841 117021445 116153129 115165014 114519492 114755341 114925245 115059190 115472364 115856608
4903 115856608 116552511 116877373 117128429 117685872 118216573 118733975 119574295 120566657 121497849
4894 121497849 122653027 124128213 125459659 127021861 128983723 130984200 133812227 136767096
4886 136767096 140410533 144379277 149031602 154191557 159292309 163932412 168231192 172695872
4878 172695872 177322063 181645298 186019195 190180535 193909655 198083424 202183903 206819600
4870 206819600 212374656 219509956 228534001 240537087 255694525 275223318 297681256
4863 297681256 319623010 341936366 363918805 373291976 363053846 344475474 321868948
4856 321868948 297993998 276711777 257948492 242071612 229789744 220072430 212137843
4849 212137843 205937685 200546033 195298097 189882667 184940057 180004922 174895660 169838119
4841 169838119 165149979 161049087 157077376 153555965 150501667 147516909 144382740 140835440
4833 140835440 137730551 134360772 131038608 127894391 125272019 122897502 120628942 118751475
4825 118751475 116773433 115373000 114220403 113042034 112104252 111411205 110602452 109630580 109077265
4816 109077265 108084740 107294676 106364663 105889091 105002539 104096108 103466203 103033422 102838311
4807 102838311 102491965 102218259 102032465 101530087 100382459 99201124 98051676 96624057 95431310
4798 95431310 94404797 93461136 93193106 93370095 93589431 93864019 94225172 95035090 95131212
4789 95131212 93818292 92017075 90265263 88298445 86097916 84400235 82940420 82018475
4781 82018475 81156051 80063285 79433979 78710469 77925989 76816241 75942509 74895388 74006375
4772 74006375 73052158 72540918 71892433 71415391 70971088 70407882 70257688 69667166 69066699
4763 69066699 68434561 68449950 68284286 68006270 68151579 67982510 67875617 67773481 67464411 67136466
4753 67136466 66880282 66329122 66095107 66031505 65746936 65367583 65185718 64742037 64539298 64581603
4743 64581603 64159754 63976603 63792047 63842902 63424428 63441964 63194222 63365905 63057680 63225350
4733 63225350 63406114 63466041 63393665 63423755 63763800 63940073 64075522 64326250 64476683 64724639
4723 64724639 65110992 65322532 65569115 65856489 66353126 66753513 67017779 67549102 68375632
4714 68375632 69270798 69796147 70351036 70748739 71431371 72035223 72770386 73180622 73491590
4705 73491590 74215479 75119925 75848191 77047541 77984676 79040444 80110629 81224973 82680072
4696 82680072 84241429 85554115 87248874 89236435 91170600 93212759 95871663 98760851
4688 98760851 101115523 104065307 106425729 109335304 112904327 117017745 121429034 126434464
4680 126434464 132175025 138843260 146587860 154627429 163434704 173622633 184413488 195918111
4672 195918111 208136598 222091117 237392280 253174306 268210002 281698577 293540783
4665 293540783 300802842 301305081 295178856 284077544 270178074 255154280 240466083 227086966
4657 227086966 215090384 204086422 194844531 186556780 179381067 172739060 166822851 161660138
4649 161660138 157251471 153486512 151117731 149193011 147695930 147060993 147331928 147952560
4641 147952560 148426678 148776552 149241902 149053216 148253598 147201759 145484813 143698733 142671589
4632 142671589 141590487 140466271 139669440 139230716 139241556 139458834 140303005 141194236 142106796
4623 142106796 143260959 144299913 144563863 144132809 142500879 139983416 136629649 132601996
4615 132601996 128061294 123655650 119479199 115772619 112233140 108597586 105517499 103090370
4607 103090370 100355297 98000090 95735132 93503744 91850485 90215757 88722972 87421560
4599 87421560 86258498 85396317 84343664 83168560 81929301 80486934 79764973 78657629
4591 78657629 77750642 76598545 75962464 75598309 74931757 74060961 73338412 72797960 72056035
4582 72056035 71764622 71160595 70626270 70316676 70187979 69734504 69081819 68828079 68878632 69017232
4572 69017232 68806944 68909423 68983417 69118253 69783970 70201012 70498211 70991535 71367475 71938821
4562 71938821 72651072 73560450 74490991 75803887 77345226 78376457 79362656 79795124 80423505
4553 80423505 80492771 79900052 78998222 78271379 77020468 76089192 75073920 74582840 74155946
4544 74155946 73773810 73422407 73399556 73215230 72721062 72672807 72345004 72136979 72041557 71613205
4534 71613205 71253729 70978161 70326669 69833738 69081856 68159938 67503047 66815105 66207758
4525 66207758 65627684 65187357 64554659 63783147 63179641 62495125 62010078 61336579 60679472
4516 60679472 60154151 59953197 59163855 58284751 57682186 56880747 55676479 54477706 53479022
4507 53479022 52234495 50841019 49632970 48187123 47142550 46404115 45489067 44781186 44020442
4498 44020442 43150158 42501576 42174228 41567671 41015073 40764756 40295628 39617124 39388947
4489 39388947 38989428 38714933 38499695 38262219 38109965 38071317 37716876 37540667 37284027 37180176
4479 37180176 37462898 37349790 36952790 36743567 36846135 36562924 36366860 36280418 36055703 36096929
4469 36096929 36283475 36196875 36145515 36176896 36181958 35991699 35919918 35908818 36059244 35969172 36379852
4458 36379852 36535137 36832961 36719470 36687325 37041463 37268357 37780149 38094591 38634795 39420898
4448 39420898 39632910 39693536 40362413 40750232 41319974 42246972 42953945 43753659 44434331 45280292
4438 45280292 46477196 48117082 49606104 51006585 52896070 55711295 59228846 64082137
4430 64082137 70396125 77034175 83394171 89835684 96462002 101406334 101089493 96224769
4422 96224769 90395255 83109416 75745358 69279535 64137272 60032981 56921137 54475546
4414 54475546 52136065 50395614 48652524 47167486 45732950 44609312 43554999 42609477
4406 42609477 41676446 41250974 40848137 40267017 39805399 39725549 39446098 38771236 38232823 37947068
4396 37947068 37867783 37437292 37315763 36978304 36773578 36572838 36513451 36346819 36104737 35738056
4386 35738056 35383160 35293482 34793624 34770843 35053209 34845401 34616317 34462310 34572888 34528322
4376 34528322 34479998 34562560 34644008 34280721 34473529 34730412 34493436 34602318 34464409 34571177
4366 34571177 34913643 35161730 35415433 35406503 35731272 36079316 36497980 36626639 36441460 36559617
4356 36559617 36759674 36949250 37562282 37658623 37684681 37898780 38188278 38589943 38848890 39060220
4346 39060220 39348549 39723389 40095980 40503347 40864709 41069916 40787457 40739980 41006265 41031815
4336 41031815 40864977 40815226 40381722 40031385 39722560 39351832 39131948 38819779 38442850 37833181
4326 37833181 37272889 36766728 36689309 36609257 36023548 35810713 35458036 35080197 34870366 34702844
4316 34702844 34638374 34259245 33984924 34122407 33841188 33543279 33407516 33226882 32936345 32621094
4306 32621094 32164058 31766758 31371119 31066048 30952947 30648174 30555423 30322771 30082356 30079572
4296 30079572 29773019 29336050 29267054 29207973 28950555 28917854 28726789 28456943 28381255 28658571
4286 28658571 28135661 27688458 27772449 27341327 27299201 26925145 26699875 26493705 26348982 26141911
4276 26141911 26052594 25977952 25870828 25781450 25345832 24953295 24642025 24421485 24252232 24351475
4266 24351475 24112051 24081399 23908652 23617269 23378992 23223199 23169385 23148902 22961487 22926345
4256 22926345 22653122 22440272 22316214 22272419 22135526 22050032 22066992 22172852 22150083 21781609
4246 21781609 21747353 21710374 21428889 21326276 21344003 21297948 21084274 20808696 20920868 21056890
4236 21056890 20876078 20666454 20538690 20322572 20391651 20265650 20286595 20025998 20177952 20172252
4226 20172252 20004254 20003506 19864787 19829965 19737226 19658131 19485121 19262682 19217414 19110686 18794794
4215 18794794 18724639 18505045 18217167 18076879 17990793 17983560 18104115 18005178 17680871 17485046
4205 17485046 17667621 17725433 17486978 17106885 17193227 17317606 17341321 17153733 16628285 16881087
4195 16881087 17032062 16959588 16763067 16774705 16575164 16674600 16747397 16492885 16181106 15985179
4185 15985179 16009811 16133625 16206685 16221207 16005340 15978637 15940609 15868595 15890454 15791828 15522831
4174 15522831 15567792 15447156 15380234 15404410 15378192 15582246 15569904 15557204 15333296 15265812 15565417
4163 15565417 15602644 15431573 15296614 15189905 15011167 14963775 15162884 15031902 15069082 14893887
4153 14893887 14643334 14544836 14544004 14423990 14522870 14437491 14566531 14617256 14521207 14491907 14332701
4142 14332701 13983631 14152738 14077505 14225901 14117750 13900105 14058496 13994226 14102092 14317601
4132 14317601 14360206 14150616 13797227 13954655 13941775 13889813 13548681 13575482 13738639 14033213
4122 14033213 13873126 13932125 13921748 13938342 13989402 13821696 13638053 13467649 13638421 13647489
4112 13647489 13469500 13275797 13261611 13342738 13346147 13351500 13267142 12976541 12918169 12964310 13272457
4101 13272457 13185549 12863400 12476404 12884075 13084063 13307703 12916377 12767144 12679677 12721645
4091 12721645 12827489 13205030 13137060 13107334 13189722 13114495 13102366 12964422 12839420 12743267
4081 12743267 12534656 12883975 12961773 12841302 12967061 12991399 12815570 12747512 12818215 12995914
4071 12995914 12973760 12875665 12509305 12743006 12906910 12967084 12925025 12895545 13092729 13231413
4061 13231413 13541722 13623311 13540809 13302889 13341352 13387708 13500089 13355642 13242357 13198514
4051 13198514 13283978 13150788 13135733 13370908 13331871 13262077 13146640 13095902 13322352 13350331
4041 13350331 13156349 13091342 13385711 13215873 13243852 13374375 13510691 13766602 13521563 13455408
4031 13455408 13832117 13647527 13532816 13752335 13707744 13528863 13474356 13526977 13182907 13131957
4021 13131957 13232804 13203813 13053331 13176658 13373781 12898300 12949303 13111267 12988030 12643901
4011 12643901 12586686 12306164 12448413 12565416 12409799 12303564 12265652 11834870 11972705 12042314
4001 12042314 11918013 12101508 12251165 12180564 11980141 11933364 11862492 11616620 11661344 11894902
3991 11894902 12039248 11860916 11798033 11820815 11861548 11609557 11454144 11563514 11212469 11211594
3981 11211594 11172542 11121080 10925803 10779582 11070206 11066505 11016538 10727587 10642715 10864345
3971 10864345 10961726 10960573 10971474 10683094 10840501 10931547 10497331 10540675 10559778 10527960 10349922
3960 10349922 10300379 10338205 10366773 10161536 10067194 10269706 10184543 9988117 10268739 10336274
3950 10336274 10380856 10317479 10250102 10105779 10038601 10187830 10073889 10077027 10217771 10380261
3940 10380261 10556789 10359008 10332039 10381313 10272887 10067785 9802534 9680737 9984049 9810515
3930 9810515 9877718 9852391 10161285 10161995 10089451 10123139 10140313 10004754 9967615 9995288 10221571
3919 10221571 10276023 10158352 9868687 9902742 9975335 9769589 9850287 9828652 9860583 9704120
3909 9704120 9886740 10060523 10052846 10118528 9968982 9697298 9742149 10040728 10244262 10191916
3899 10191916 10074964 9865115 9668497 9880153 10053341 9676900 9696432 9654374 9678159 9598546
3889 9598546 9842779 9919408 9864229 9994357 9829386 9882813 9856599 9861450 9686005 9727315 9570193
3878 9570193 9539576 9721061 9705615 9742883 9875008 9783060 9552438 9507842 9612964 9859089
3868 9859089 9874222 10007271 10016184 10015559 9888942 9883457 10016448 10111790 10163658 10452759 10251213
3857 10251213 9891066 9920902 10072090 9949953 9982929 10044602 10097514 10057584 10053476 9958089 10169984
3846 10169984 10181730 10237500 10427017 10297702 10301603 10200172 10528679 10497249 10088793 10130614
3836 10130614 10276207 10331159 10154243 10356441 10372995 10174873 10274432 10143134 10289077 10209346
3826 10209346 10313247 10660104 10740260 10832025 10933747 10690745 10519441 10756055 10473793 10510720
3816 10510720 10659748 10547369 10643900 10529824 10749034 10688836 10615374 10704039 10644592 10999873
3806 10999873 10985234 10952357 11061807 10818623 10756426 10811380 10822696 10842776 10741725 10860813
3796 10860813 11158145 11104215 11090689 11271622 10975278 11067376 11001324 10945357 11310401 11147386
3786 11147386 11111624 11114951 11263109 11433913 11505455 11622329 11425065 11255743 11285625 11327521
3776 11327521 11230901 11170767 11407502 11265401 11177944 11069606 11296787 11544711 11574973 11747477
3766 11747477 11876050 11610553 11439072 11549480 11307467 11451008 11559944 11802082 11990183
3757 11990183 11896984 12309326 11989841 12029673 12218678 12095125 12014010 12181766 12321145 12264121
3747 12264121 12369233 12420805 12102984 12003302 12073752 11912317 11931147 12159869 12234808 12149620
3737 12149620 12324134 12281226 12237795 12526420 12370967 12220622 12247625 12024214 12239333 12265888
3727 12265888 12219855 12320046 12358023 12560344 12535664 12083116 12110470 12307675 12480628 12756451
3717 12756451 12991768 12692391 12634319 12524576 12749814 12832244 12771427 12631804 12445908 12510298
3707 12510298 12442573 12480619 12456923 12531574 12411739 12466940 12545948 12248242 12418508 12625924
3697 12625924 12397778 12336712 12416183 12299104 12237320 12315366 12396768 12414574 12707783 12823130
3687 12823130 12556825 12534781 12474946 12392194 12759403 13048736 12863157 12828270 12698071 12823880
3677 12823880 12885444 12822521 12752078 12861428 12817013 12900335 12754271 12721616 12813128 12679473 12524355
3666 12524355 12644870 12639797 12578625 12609227 12836202 12741363 12562153 12892387 12866460 13171478
3656 13171478 13196629 12964842 13115806 13310691 13210904 13285617 13442430 13549856 13609499 13357101
3646 13357101 13150139 13349151 13402426 13303931 13151754 13321995 13681112 13565980 13535089 13557243
3636 13557243 13467702 13441687 13852965 14104476 13846527 13735173 13869648 13731674 13682250 14000149
3626 14000149 14150435 14331950 14506550 14528929 14896027 15115754 14775237 14739141 14729908 14895991
3616 14895991 15150540 15010550 15057250 15139167 15432201 15716561 15698545 15484406 15240248 15199812
3606 15199812 15403553 15538292 15576305 15545190 15614883 15629967 16033399 16033108 16026031 16073474 16157985
3595 16157985 16232015 16510568 16612283 16580609 16982476 17069196 17099286 17160811 17265512 17255805 17382838
3584 17382838 17396547 17584894 17268075 17469039 17765333 17791692 17805969 18097016 18170086 18372573
3574 18372573 18327365 18532384 18606436 18647399 18864130 19007372 19279791 19634972 19813750 20016787
3564 20016787 20468099 21022979 21467842 21491714 21593716 21492503 21146265 20946513 20950238 20631776
3554 20631776 20512764 20337672 20241973 20085384 20099048 20286791 20475548 20526880 20557839 20589017
3544 20589017 20662883 20741123 21155858 21149746 21178632 21559875 21678376 21860915 22379223 22855740
3534 22855740 23470339 24055821 24542605 25246065 25856619 26361107 26384564 26230726 25828384 25290874
3524 25290874 24473623 24020009 23574701 23108890 22814383 22910688 23029268 22686772 22762318 22780928
3514 22780928 22829168 22956729 22972466 22880149 23001818 23280389 23253637 23414752 23519367 23257960
3504 23257960 23484886 23642793 23793392 24293848 24846042 25281848 25816849 26056720 25959018 26226428
3494 26226428 25997795 25809868 25438678 25147427 24829799 24352898 24333139 23945440 23798192 23543950
3484 23543950 23169548 23003573 22863997 22443803 22257897 22319629 22451028 22380754 22025768 21926173
3474 21926173 21717627 21694244 22114771 22093480 21880557 21967751 21936240 21768897 21602202 21699314
3464 21699314 21935266 21948911 22147472 22331555 22088315 22011085 22362022 22945832 23400167 23895370
3454 23895370 24329207 24628539 25204943 25400424 25268677 25056196 24551304 23984916 23625738
3445 23625738 23375800 22944217 22624984 22412334 22347453 22619107 22487744 22096575 22395648 22215664
3435 22215664 22300059 22562624 22602316 22620414 22741917 23095226 23286418 23469157 23940077 24483902
3425 24483902 24864147 25360901 26196554 27027086 27963626 29009446 29339701 29034404 27991383
3416 27991383 26936419 26077396 25256352 24435973 23754909 23424974 23025913 22771700 22310978
3407 22310978 21948339 21946848 22038095 22084837 21533125 21519824 21531322 21735410 21766953 21815583 21731545
3396 21731545 21927093 22091429 22136845 22541013 22660867 22807432 23369941 23681643 23799350 23850630
3386 23850630 23691808 23353220 22754353 22137999 21816484 21323930 20802704 20533224 20657690
3377 20657690 20466987 19993687 19973912 19817338 19939892 19813132 19758993 19585479 19404409 19324434
3367 19324434 19519029 19493394 19347536 19406423 19326146 19163931 18998602 19074225 19268626 19053878
3357 19053878 18783121 18350074 18276604 18202113 17956011 18151330 18003973 17921500 18076611 17953186
3347 17953186 17923838 17814567 17755121 17510035 17877587 17810619 17779529 17622910 17400918 17599240
3337 17599240 17544844 17367919 16985851 17161125 17234786 17115863 17007108 16827303 16661717 16538938
3327 16538938 16658377 16840085 16630008 16393060 16575529 16422722 16389759 16229423 16358526 16132803
3317 16132803 15997190 16158895 16233045 16247653 15914713 15850390 16084601 15935834 15983889 16209313
3307 16209313 15864848 15492179 15391044 15333923 15548851 15751437 15353868 15380502 15514821 15659612
3297 15659612 15167359 14873767 14882897 15089817 14920059 14706961 14780799 14666474 14653154 14675290
3287 14675290 14620136 14437712 14364098 14315798 14427409 14700152 14655647 14742784 14706116 14637087 14403058
3276 14403058 14277801 14224437 14212452 14247151 14371341 14298894 14273330 14197759 14219771 14424482 14468106
3265 14468106 14458801 14582791 14575757 14299469 14184015 13945000 14039193 14132222 13880058 13952284 14064807
3254 14064807 14225500 14180961 14058730 14047506 14094580 14311278 14246989 14053464 14090701 14230903
3244 14230903 14224964 14242849 14291909 14463666 14461388 14585276 14530576 14231237 14175232 14147639 14229686
3233 14229686 14380939 14572469 14666720 14539417 14795237 15054225 15011435 14669354 14611318 15003634
3223 15003634 15152991 15160804 15092216 15255720 15496354 15387546 15266831 15656094 15652695 15566557
3213 15566557 15792769 15867454 16009121 16161813 16313840 16578701 16674173 16858601 17481255 17607746
3203 17607746 17812423 18148256 18303440 18771888 19096131 19356335 19467524 19865289 19480863
3194 19480863 19556144 19842195 19721587 19720129 19984820 20235033 20272708 20290479 20102685 20214101
3184 20214101 20465875 21001911 21099495 20849810 20845692 20763478 20850473 21255145 21645699 22039466
3174 22039466 21916225 21840127 22177988 22405733 22852074 23284684 23286386 23819143 24153792 24531050
3164 24531050 24582666 24668650 24800032 24556284 24404750 24067692 23834081 23961855 23937343 23946081
3154 23946081 23815736 23825379 23623114 23414424 22977478 22887936 22850403 22505059 22359081 22061238
3144 22061238 22106167 22029101 21699193 21618158 21668618 21689076 21670791 21848062 21709766 21657887 21603047
3133 21603047 21688503 21704061 21508843 21374257 21317348 21571677 21181967 20920373 20902465 20598789
3123 20598789 20519786 20396330 20019707 19978960 19942638 19939208 19549611 19487319 19323585 19140218
3113 19140218 19180676 19170179 19210517 19112048 18900834 18688780 18857084 18623988 18796047 18590285
3103 18590285 18269549 18194020 18046953 17813184 17781256 17630935 17663064 17690025 17395770 17617943
3093 17617943 17702926 17716765 17888783 18018588 17733434 17549204 17536957 17237356 16932549 16876945
3083 16876945 16918017 16796665 16691385 16798559 16684409 16694086 16663155 16769217 16624536 16436768
3073 16436768 16410638 16187632 16042143 16000539 15818510 15774255 15989711 15932199 15819448 15813971
3063 15813971 15531873 15359459 15431219 15475701 15389748 15260490 15190844 15264666 15047446 14719976
3053 14719976 14977831 14978984 14919079 14708477 14509721 14485533 14163903 14140357 14292901 14242961
3043 14242961 13851922 13929895 13942945 13771417 13969687 14102521 13817660 13785070 13484924 13493841
3033 13493841 13394463 13282919 13317032 13028018 12833156 12819054 12568488 12341640 12123649 12446012
3023 12446012 12520647 12809019 12500438 12356940 12364235 12104278 12114458 12005919 11971952 12014771
3013 12014771 11966281 11721617 11636163 11458321 11434173 11213686 11091638 10965304 11120893 11112750
3003 11112750 10878736 10951606 10798159 10909440 10830499 10452252 10382733 10581341 10511121 10175336
2993 10175336 10281192 10013886 10122250 10211798 10097810 9803273 9830638 9729027 9666454 9765524
2983 9765524 10020995 9818604 9767981 9613118 9268553 9177973 9376410 9363314 9425267 9187685
2973 9187685 9160381 9253304 8976518 8978020 8967198 8870667 8576237 8688612 8598850 8329668 8215373
2962 8215373 7981805 8319765 8205942 7971884 7995713 7981439 7946073 7621043 7420981 7530770
2952 7530770 7440600 7544554 7541172 7389696 7453186 7218594 7254004 7095254 7340574 7101563
2942 7101563 6844093 7029056 6944346 6815166 6910331 6847599 6733605 6710685 6535455 6529303 6285085
2931 6285085 6053830 5913691 5881289 6077445 5960567 5801886 5824489 5973763 6108145 5762684
2921 5762684 5729782 5791165 5611501 5550684 5868033 5632016 5140329 5248797 5453333 5381630
2911 5381630 5533263 5691584 5543055 5224221 5181983 5261724 5340900 5333848 5089575 4729119
2901 4729119 4661294 5014434 5094949 4696550 4655435 4847180 4999131 4736555 4623285 4795188
2891 4795188 4835458 4576302 4431454 4505321 4599071 4644840 4767100 4795970 4548598 4443572
2881 4443572 4164851 4351495 4255504 3903546 3801145 4057824 3996519 3964887 3761354 3761629 3894145
2870 3894145 3803726 3878018 3816932 3588192 3782366 3936199 4034092 3594764 3453847 3592078
2860 3592078 3593478 3356618 3357088 3301627 3243057 3391564 3372406 3169019 3047244 2911865 3069316
2849 3069316 3061122 2954658 2860486 3150328 3225754 2998287 3008775 2894633 3046994 2935154
2839 2935154 3063121 2950777 2851928 2686509 2714410 2773434 2681490 2789842 2692477 2523046
2829 2523046 2623938 2769835 2734184 2380234 2500138 2770239 2638830 2433175 2421141 2260142
2819 2260142 2330244 2349068 2458616 2485940 1765729 1596810 2006948 2096865 2045736 2281058
2809 2281058 2162454 2027635 2059640 2089422 1808060 1747915 1610110 1845814 1966233 1858634
2799 1858634 1800376 1968747 1863808 1700321 1561618 1673139 1717893 1603953 1559883 1440289
2789 1440289 1739877 1722670 1657858 1889633 2059478 1825394 1708755 1859781 2025396 1770442
2779 1770442 1384219 1486179 1727633 1603094 1691649 1711230 1670440 1598251 1497924 1375372
2769 1375372 1310628 1216515 1557694 1395358 1201700 1212093 1280669 1324508 1351122 1259382 934335
2758 934335 1074425 1349847 1116795 1062652 1214767 1304970 1261659 1251415 1324805 1174324 755534
2747 755534 996856 1372223 1043752 706716 928123 1077755 1043946 1087345 1126659 1041477
2737 1041477 1174408 738539 896434 931115 996511 1142448 1068165 1032584 984265 1175010
2727 1175010 1070832 1105303 1105735 905266 732772 748242 748851 945281 1085513 1086805 954752
2716 954752 1180636 937518 895201 775987 1180195 1144284 754754 1083460 1203369 1302533
2706 1302533 1233451 1148519 814692 751939 950604 556054 530903 738054 642130 858310
2696 858310 714484 600876 616688 708081 684147 690547 750626 558107 464134 500791 440680
2685 440680 673791 662848 735443 776616 775722 781360 674061 686126 473406 353472 158760
2674 158760 459083 737090 656636 543015 583714 553698 646182 693172 670284 619123 989939
2663 989939 856522 696557 557935 786773 810653 803041 628355 369367 328769 502383
2653 502383 667185 654144 438337 496322 573502 510819 380421 338482 546455 516902 651724
2642 651724 488994 380093 588042 440821 368216 390956 554607 641442 497129 416322
2632 416322 455122 703461 942654 1108610 960479 684706 616520 569567 1069269 1330696
2622 1330696 1174864 1237497 1001421 987761 1087863 814421 802395 1019425 1041454 769259
2612 769259 686659 704639 483302 401032 617226 1019781 1030583 1051640 943328 556963 433977
2601 433977 615369 320050 317805 478442 594214 659564 610489 619441 608622 573482 633057
2590 633057 671375 609992 623549 424202 376732 502827 490549 751873 918167 1012632 740688
2579 740688 836276 750939 729920 585163 639249 729801 729715 791279 831968 814626 1003170 770559
2567 770559 445846 364276 412404 757674 732472 596611 713065 631531 479875 545459 888053
2556 888053 780771 507960 639505 803318 1118453 949651 764562 691988 666187 791248
2546 791248 649203 340901 301049 628425 599500 551749 405077 315676 463549 532770 645733
2535 645733 529757 622459 781740 640000 695141 689619 711130 539481 399337 574157 655470
2524 655470 717225 434703 630693 562135 565456 692129 655590 460962 518949 491969 418066
2513 418066 635357 723787 601049 840659 695604 702190 854592 908514 1082667 1006730 717681
2502 717681 789231 704847 387280 775707 965553 779726 797962 1033527 881260 675945
2492 675945 853898 889449 918196 648408 457191 870257 893988 781988 1188160 1267362
2482 1267362 1178012 1271114 1228419 1002871 870232 1121780 1117241 833964 691357 713018 649380
2471 649380 611975 1046680 1096801 1067718 1209530 1167762 1231860 1241673 1238794 1213329 1422727
2460 1422727 1466254 1452761 1289965 1071074 1190029 1351221 1312245 1215767 1353999 1221063
2450 1221063 1323457 1126851 1202203 1340684 1425324 1587224 1674890 1550503 1315126 1456425
2440 1456425 1434678 1346577 1395826 1501281 1563350 1625334 1478487 1621956 1600529 1647694 1694123
2429 1694123 1433557 1502946 1891167 1672309 1448268 1509137 1426822 1478504 1582951 1632466
2419 1632466 1727137 1925819 1935233 1825395 1694410 1654016 1897040 1952590 2151662 2408004
2409 2408004 2275460 2217919 2527528 2615092 2642568 2784251 2657349 2853079 3048444 3072643
2399 3072643 3630704 3723245 3795631 4037210 4203554 4263747 4238817 4212046 4478394 4681199
2389 4681199 4840660 5314152 5731974 6074526 6483029 6874335 7400207 8076364 8619613 8803301
2379 8803301 8909290 9434832 10039767 10999013 11984643 12781302 13469967 14415947 15535350
2370 15535350 16352517 17602071 18965838 20356726 22576745 25386273 28988986 34435954
2362 34435954 41916405 49642257 55789565 62699107 70534216 75663062 74968655 70238291
2354 70238291 64390274 56160743 47669395 40647160 34741809 30574135 27335671 24546090
2346 24546090 21921425 19507559 17624518 16297770 15117745 13882149 12381743 11317287
2338 11317287 10271548 9427835 8714348 8231408 7904755 7340519 7035808 6484534 6072245
2329 6072245 5668138 5726181 5231789 4983984 4823721 4527532 4182754 3990167 3842517 3609595
2319 3609595 3519358 3364299 3160236 3052157 2800124 2866642 2873488 2706283 2411746 2371329
2309 2371329 2234156 2049354 1846634 1744698 2033257 1833711 1791733 1868910 1797274 1681863
2299 1681863 1714391 1741588 1664517 1633938 1396454 1521832 1703182 1577487 1329656 1180314
2289 1180314 1172105 1084405 1255541 1304983 1243151 1097829 1032953 1050416 1144529 1043919 884698
2278 884698 806833 876789 811178 689586 825569 670424 755409 674988 539212 721827 734648
2267 734648 412863 268293 472783 157087 59826 455286 587301 362441 408676 385465
2257 385465 293483 269370 428672 435790 225671 133624 200828 256733 298643 221513 -43106
2246 -43106 109845 105586 -103900 5446 162103 294407 379063 298003 135369 346074 182344
2235 182344 -6785 221811 352240 361722 304582 113185 57617 -127468 -124166 -118671 354569
2224 354569 391602 235197 125698 -186771 97826 166747 163663 -81011 110289 169029 -293696
2213 -293696 -229430 -4124 -312972 -208979 -243049 -439522 -177712 -336734 -437227 -307418
2203 -307418 -327349 -434498 -318468 -253151 -94019 -234996 -472048 -315036 -68325 -79587
2193 -79587 -215831 -226378 -171334 -185215 -82294 -77368 -160384 -434958 -542219 -388279 -320687
2182 -320687 -242008 -246457 -340189 -315656 -266310 -97878 -376736 -480962 -395094 -348754 -135036
2171 -135036 -320932 -95237 -98854 -132539 -330191 -235751 -321870 7894 -89961 -1332 138236
2160 138236 -10853 24967 -190963 -254729 -114798 156769 71305 -148610 -281668 -188216
2150 -188216 -108510 -136221 65741 108229 61334 62768 -40828 -134297 -89337 54118 -35584
2139 -35584 -164726 -225455 -349837 -427153 -286766 -179999 79254 95859 -120390 -200262 -182764
2128 -182764 -320966 -143077 160256 -70015 -180626 -527872 -444112 -487025 -391252 -347124
2118 -347124 -261278 -148982 -139477 -110432 20049 39626 -98404 95043 41970 -12176 -86540
2107 -86540 -190298 -397148 -223775 -314732 -188459 -82244 -262503 -268872 -233481 -228896 -240824
2096 -240824 -527917 -293924 15150 -63594 292606 376873 191683 142393 29497 -228129
2086 -228129 -187907 119288 -72744 41604 -80316 -54825 -67416 -160902 -144183 -145561 -200769
2075 -200769 -156581 94235 95604 -192641 -417137 2397 -104101 -79203 64639 -197700
2065 -197700 -301483 -169442 49049 -66702 -325434 -476655 -475352 -372815 -247890 -298980
2055 -298980 -402950 -444688 -315451 -248836 -98122 -125571 -279378 -395472 -246254 -66674
2045 -66674 -92905 10874 -123979 -53775 -21730 61544 -361218 -423976 -433439 -543116 -374762
2034 -374762 -214777 -209650 -331515 -353652 -494777 -499049 -368606 -145763 -329249 -365231 -295324
2023 -295324 -407030 -262073 -62013 -37196 2037 -96915 -399350 -374548 -212315 -149502 -366122
2012 -366122 -719789 -52069 -130027 -122040 12239 143900 63264 -327955 -568201 -353785
2002 -353785 -304039 -568142 -647430 -866140 -625074 -540611 -454751 -326870 -108309 54784
1992 54784 -148782 -259958 -242747 -411736 -216322 -380416 -444261 -355290 -232032 -125806
1982 -125806 -264178 -310940 -258248 -387353 -531248 -364286 -559960 -436190 -121360 18843
1972 18843 -81202 -97740 32498 -108095 -222936 -322471 -292373 -519814 -381508 -738570
1962 -738570 -734634 -422684 -312730 -215531 -147041 -143224 -343714 -472562 -654676 -685248 -387296
1951 -387296 -619839 -534901 -256062 -298012 -272409 -106072 -422472 -368944 -279611 -312127 -314616
1940 -314616 -454982 -177620 -167062 -158846 -345218 -296909 -354722 -458863 -599711 -713433 -552120
1929 -552120 -525984 -593559 -394849 -579376 -764144 -577266 -243650 -310153 -347175 -373584 -373384
1918 -373384 -219320 -309045 -306646 -497299 -652332 -505433 -228241 -605752 -374442 -462119
1908 -462119 -472161 -283820 -224825 -356125 -593044 -316971 -309069 -353018 -431472 -469241 -447440
1897 -447440 -315535 -530864 -701403 -619670 -623488 -286043 -233116 -579296 -501885 -333367 -58484
1886 -58484 -198159 -412901 -355577 -375562 -329391 -90922 -346792 -213915 -412886 -716929
1876 -716929 -709211 -411307 -390035 -215582 -422138 -504071 -484672 -252691 -323390 -390856 -226924
1865 -226924 -563662 -537023 -222346 -385242 -458787 -203618 -469442 -478496 -429327 -590206 -435778
1854 -435778 -48520 -112006 -241173 -387247 -193701 -280282 -524155 -559219 -615435 -615266 -515131
1843 -515131 -383912 -508404 -426861 -225813 -326481 -332958 -401567 -301013 -290740 -341392 -450851
1832 -450851 -337234 -369986 -436901 -470516 -253117 -440396 -656468 -372071 -456054 -335108
1822 -335108 -349585 -280309 -636352 -507930 -438476 -461197 -380138 -544908 -147328 -216066 -174777
1811 -174777 -280034 -87507 -244752 -322256 -238858 -335058 -244245 -71069 77776 -174383
1801 -174383 -156431 -248000 -172931 -344489 -380938 -405891 -434402 -547812 -569457 -263247 -270145
1790 -270145 -370653 -384129 -550019 -532524 -367212 -184718 -267520 -368718 -316907 -240350 -58359
1779 -58359 -210960 -398444 -209556 -257275 -353852 -342646 -398451 -263759 -224470 -241147 -304234
1768 -304234 -142663 -256441 -344000 -452654 -415211 -318551 -381071 -527056 -319141 -159211
1758 -159211 -194709 -267211 61543 -267766 -538151 -679716 -569718 -589294 -726520 -393262
1748 -393262 -315746 -480941 -612138 -527081 -348832 -356542 -114913 -241148 -508826 -249544
1738 -249544 -49741 -131808 -184575 -191527 -362555 -238409 -134177 -158061 -414716 -210740 13234
1727 13234 67193 -92905 -44305 -5895 -157473 -225733 -461323 -593800 -703890 -299177 -11521
1716 -11521 -274225 -603768 -533514 -363316 -331829 -471570 -365806 -226177 -361443 -292542
1706 -292542 -416479 73571 -97537 -100732 6234 -70183 -138633 -179410 -337198 -249005 -151064
1695 -151064 -215359 -214967 -324100 -362879 -245199 -234612 -538481 -660034 -502836 -278050 -421848
1684 -421848 -489182 -473851 -303458 -238436 -337071 -231855 -356667 -448957 -201904 -181668 -68542
1673 -68542 -169952 -129417 -68235 -416537 -185186 -132643 -14932 -14477 -19342 -231023 -375164
1662 -375164 -597670 -615229 -257415 -129097 -335995 -297581 -110801 -56999 -209676 -294056
1652 -294056 -297526 -172000 -203980 -388549 -444768 -220047 -138193 -320873 -436759 -372241 -402993
1641 -402993 -282045 62337 -175316 -160718 -427182 -497959 -434551 -711111 -687008 -629223 -647773
1630 -647773 -304991 -143056 -361674 -456600 -389120 -452691 -365459 -466833 -343110 -85977
1620 -85977 -83831 -214822 -401770 -382085 -185952 -356346 -550075 -282726 -386103 -229358
1610 -229358 -123592 -168105 -333230 -439163 -342889 -405983 -507951 -575958 -494625 -468552 -196572
1599 -196572 -228075 -302003 -377802 -389014 -596697 -419024 -358408 -464446 -401592 -327002 -239544
1588 -239544 -88426 -105279 -207738 -271319 74407 39478 -141626 -474044 -343271 -225292
1578 -225292 -231103 -351163 -319945 -332871 -247357 -244549 -249876 -463396 -427251 -174677 -308525
1567 -308525 -220119 -12734 -20135 50460 7078 -116645 27817 24740 26203 70788 8578 -27937
1555 -27937 -64043 -59097 6396 -100925 -150186 -251264 -357580 -520232 -313133 -173979 34377
1544 34377 -85620 38450 -389195 -720699 -478896 -472484 -165783 -95810 -288717 -122825
1534 -122825 -318254 -519241 -180017 -50488 -232840 -186826 -92993 -231020 -384543 -269415
1524 -269415 -478033 -340538 -158470 -182122 -306551 -245849 -157994 -113515 -418884 -483353 -571212
1513 -571212 -405433 -412247 -453124 -284516 -219655 -344609 -220670 -213293 -263772 -92628 -17215
1502 -17215 -325667 -186751 -73528 -315994 -131185 -97370 -160108 -212920 -215922 -214641 -237246
1491 -237246 -354710 -318084 -377165 -485565 -331353 -131154 -67110 -128215 -441817 -475683 -290610
1480 -290610 -316165 -337984 -195056 -290509 -368993 -279474 -240017 -404543 -347978 -281084 -411683
1469 -411683 -290462 -92069 -100510 -282794 -204024 -469132 -293960 -343689 -220671 -74114
1459 -74114 -125911 -79505 -172814 -404713 -485962 -375301 -361005 -206229 -155087 -217435 -401066
1448 -401066 -269132 -355922 -202113 -396232 -235044 -374754 -276967 -267392 -212613 -258456 -384025
1437 -384025 -306055 -142336 -9160 -151473 -322693 -259657 -329058 -413888 -503863 -178256 -83132
1426 -83132 -165474 -290490 -209227 -177176 -507382 -224898 -142678 -109021 -60101 -28161 -88343
1415 -88343 -66059 -193220 -215919 -51859 -200752 -155807 -202198 -55066 -190959 -160835 -208259
1404 -208259 -185805 -235795 -266875 -443000 -226658 -187281 -364380 -347724 -120509 -65871 -130284
1393 -130284 -195145 -204551 -229440 -78900 -120167 -285969 -48958 -3795 -153547 -406762 -437312
1382 -437312 -428747 -136344 -200903 75785 -92290 36999 -154177 46909 209557 205385 28659
1371 28659 -207421 -178547 -77844 -47497 -48978 -154167 -76768 -140701 5221 121120 2246
1360 2246 -93775 -163723 93664 118610 -2972 -216326 -181481 40585 -180986 -198998 -291214
1349 -291214 -328037 -243767 -156627 -246204 -344037 -145575 7050 217943 20533 -201262 62939
1338 62939 45026 -76494 -160614 52767 -110168 -80697 27275 -201243 -225163 -137128 -37269
1327 -37269 -205311 1549 -81361 -155958 -91404 169318 158130 -269464 -427862 -129474 -310101
1316 -310101 -307208 -168409 -144323 21832 -20545 -186952 -67785 -122142 -350552 -327016 -308263
1305 -308263 -229228 -29599 89160 -10441 -31144 -33101 42750 -25126 -182145 26388 -15758
1294 -15758 -143540 -79483 36762 -276276 -227819 64564 147679 128136 -309764 -245330 -383753
1283 -383753 -370735 -338402 -473743 -296561 -97463 83313 -13483 -158368 -68478 -70434 -57725
1272 -57725 73452 -66334 34495 -184854 -277138 -57370 -105850 -150463 -160712 -324802 -402756
1261 -402756 -167708 56936 -95748 -195880 -194210 -148547 122177 14285 -283559 -616717
1251 -616717 -417415 -161984 110651 205211 -77985 -113072 -252598 -262071 -285018 -363151 -215649
1240 -215649 -279875 -108619 -281815 -264378 -49121 -109906 -210526 -299934 5535 44502 -139606
1229 -139606 -380016 -271971 -392286 -150659 -60113 -98498 -231271 -198849 -228945 -88597
1219 -88597 104771 45521 4100 -317506 -364457 -370149 -394519 -438229 -485990 -330533 -87898
1208 -87898 -334244 -311989 -123295 -123560 16948 -2549 10240 -159700 -389070 -24908 131461
1197 131461 56573 -96911 -47596 159967 -89498 -111992 -144860 -78635 93612 215396 78509
1186 78509 5786 -107876 -129115 -230502 -153207 -273064 -365418 -145944 -342170 -7184 87636
1175 87636 13061 -323551 -253903 -52658 20715 110975 -24260 -250406 -50538 -137066 -283715
1164 -283715 -283645 -70628 -48737 12619 80036 -18637 -242854 -260402 -308341 -16863 227412
1153 227412 -31721 -372992 -341229 -183329 24658 374005 -7072 -93125 31664 26213
1143 26213 55450 -73840 -248241 168904 269741 95761 -47673 -166597 55764 89965
1133 89965 -94469 288464 343873 211551 415665 336837 91934 -187705 -169000 206300
1123 206300 66019 45166 -149938 16872 74425 -34874 87477 138996 94236 75718 -50227
1112 -50227 -327965 -95780 296626 305180 138639 -35169 -199161 -524355 -674687 -478967
1102 -478967 -304521 -182478 44036 100462 166086 72084 -163590 -290606 -261480 -344755 -86205
1091 -86205 -91326 -79828 123182 64643 20993 -175851 -23651 -75092 -214000 -149645 -193221
1080 -193221 -256500 49279 -19686 -327398 -125505 -28474 -292979 -114446 120275 263187
1070 263187 87607 108503 89121 136098 17301 -221548 -304983 -314526 -217311 143269 -17919
1059 -17919 -127640 -302270 -155102 -128254 -125110 -93640 135038 120594 -26618 131522 47876
1048 47876 -44158 -202634 54727 39080 -95023 -141952 -190762 -245924 -258148 -234740 76682
1037 76682 -54388 15214 127003 -24580 176433 82565 -47829 51757 -20917 210651 256512
1026 256512 29862 105250 172468 313874 130498 -191465 -124186 11694 137648 117143
1016 117143 114416 156044 1975 41921 264744 262122 362075 113813 -154765 -6723 30378
1005 30378 -118646 -239475 2959 68225 120593 77039 -105807 -92197 -181528 -131340 -138414
994 -138414 -33527 149856 201017 -3480 -32318 41454 121236 -261098 -268637 -145472 92686
983 92686 321305 104343 5341 90265 192215 32525 -194883 -15500 143188 160916 91511
972 91511 -64965 126152 106425 258972 17056 14968 45992 165882 358276 244862 -84306
961 -84306 88279 -193963 -182834 26814 160527 479133 -20318 102623 107327 163221 -22150
950 -22150 -113900 6379 166705 119518 331741 124020 49681 5427 -189621 -173791 -206428
939 -206428 149096 43507 150662 182186 34298 69056 149331 166234 134299 -6145 -50551
928 -50551 41450 92824 -130506 -88967 -213984 -236691 -31023 78827 240948 119504 263797
917 263797 -40356 124843 -168689 -132144 140843 260846 82080 -82913 148365 52714
907 52714 69062 74781 237816 373912 369147 306500 285626 116823 1145 -159822 -138511
896 -138511 -6094 -39367 -178414 -330279 -186082 220394 194408 234133 119156 -23574
886 -23574 -154628 -59880 -72994 -63722 -98235 -128512 -97549 130421 209538 148132 89482 -79581
874 -79581 229931 180414 -63065 112950 111623 36679 48258 83502 229263 28198 -90719
863 -90719 -131392 54610 158859 -39922 242953 324822 211635 261681 203695 10636 287969
852 287969 78959 284989 352137 169881 160842 12026 63560 35177 5287 11894 262480
841 262480 168162 -195701 -165696 -16640 21251 -13836 1729 -264566 103672 53040 -62240
830 -62240 22821 60941 63889 -4337 63243 201669 171197 158616 265838 179746 245424 214001
818 214001 400523 18057 -121329 83169 472926 518948 191764 223640 134894 269765
808 269765 -72995 -277544 152955 105590 264225 303788 170337 173214 217219 204318 69201
797 69201 -54493 117111 251829 322104 269017 263207 448429 396626 160542 161436 63016 77854
785 77854 -54820 -96402 100171 100969 280302 5098 -63450 77741 -148909 -227858 -141399
774 -141399 12322 -187595 68760 213953 378662 186569 261493 466485 372853 152641
764 152641 245164 202774 260494 253103 39438 -106611 396880 328455 241851 145166 342481
753 342481 294004 -22824 20954 -162831 135692 348227 131294 98025 -24469 -13159 198714
742 198714 170804 314472 27717 84105 244817 184007 61630 317644 208062 396656
732 396656 480457 110734 -91704 261910 209713 92813 311552 456756 378326 294744 171878
721 171878 108595 201209 138980 95555 -177367 48220 98729 245134 237849 215824 99539
710 99539 -55254 38452 28482 157548 215408 102911 40346 219439 172500 -64782 -160786
699 -160786 -27546 -57020 -100359 -13064 55684 142308 372016 163500 263608 210722 63861
688 63861 194603 438343 -197561 91119 402831 218585 161300 -88528 -261961 -133971
678 -133971 95095 -103981 -34254 343812 71312 32647 191068 164234 306081 390866 151766
667 151766 390991 228419 346687 342005 49763 -79758 -185425 -22055 80209 162141
657 162141 15560 193417 270592 228196 231694 378510 240009 138958 -74238 -2927 34647
646 34647 162407 67416 -45915 369888 471323 303115 431414 354996 377415 475230 305037
635 305037 273801 352875 271729 27014 135268 177013 230101 78277 -20919 206489 77688
624 77688 186151 67676 149387 27077 189984 246884 176508 163261 112650 240863 200805
613 200805 38053 397181 382940 -74973 -5283 129266 75303 96715 394635 205228 197536
602 197536 -602 89955 8017 9774 -4899 -97137 107306 261338 327085 176277 62667
591 62667 92870 324447 287361 317411 434667 458244 119855 222702 300650 262762 -10890
580 -10890 -107456 46588 342962 317538 30086 84111 118118 250939 139027 72422 -122923
569 -122923 -20482 229151 214550 394766 209494 223269 133620 174634 142716 195834 440206
558 440206 247429 -36184 251496 -8577 322374 522222 385144 570471 613096 299830
548 299830 265066 372945 179630 289770 218255 205153 364551 424293 429610 136456 37104
537 37104 246069 332742 263155 13042 65549 409672 178624 75522 393735 223362 473082
526 473082 524217 583720 428932 286108 206111 283517 300126 569125 575354 381025 431546
515 431546 514297 246044 223552 330325 404394 281937 240048 495056 573856 559408 129953
504 129953 118588 170875 159623 84167 300223 273921 375811 499910 204049 212113 95870
493 95870 114409 -35193 -101339 20557 347193 420682 508237 167723 342222 183557 110025
482 110025 92570 258324 494538 416141 366312 89309 358799 462393 472841 449370 160060
471 160060 -10364 27925 187020 87685 -105589 -96035 70007 63150 103659 345744 327299
460 327299 265892 279384 86742 240629 322817 58047 543 17087 -8113 204594 182008
449 182008 381188 441557 238943 172450 193720 337282 316395 46436 291249 373962 420327
438 420327 506406 277930 387003 365359 387495 358715 582831 432008 191868 263812 528216
427 528216 546267 502364 534556 627741 388045 501753 286312 295917 297842 327600 403595 445977
415 445977 361470 75179 203959 291099 161347 221553 152583 149347 456262 396803 408874
404 408874 633863 503559 319704 293195 335074 309666 271442 268121 474346 516892 316106
393 316106 223750 212359 187086 150474 118003 266608 452288 352790 263814 412424 353105
382 353105 248813 364975 254428 295764 407199 287525 308979 107170 -18546 79796
372 79796 286514 355781 452966 687324 419502 307226 162309 349349 510725 289162
362 289162 376084 589106 634222 532483 403981 178901 501728 565472 493276 450891 290370
351 290370 213883 247457 325511 240743 246792 513524 530904 200316 91045 24654 -61894
340 -61894 309887 320995 113749 146386 127380 363946 146418 356311 629499 592926 566682
329 566682 597735 522622 306661 434624 175085 109192 408597 509447 680329 643467 549199
318 549199 336460 152504 364954 358615 236471 409291 424683 372030 356341 342738 330210
307 330210 537935 491108 450175 338305 202884 101337 208458 634075 545378 301210
297 301210 412432 315274 177092 326319 287660 38924 134085 218421 369762 415201 388960
286 388960 655049 632070 430632 435234 355628 253485 325474 410610 373339 362492 301713
275 301713 65171 66778 137524 291398 378412 446687 345752 347475 684147 363568 335807
264 335807 434242 271169 301383 463573 491169 406977 412332 434292 256924 319679 465077
253 465077 313136 470491 436691 628090 745390 627941 550823 299166 277820 131493
243 131493 270880 521715 703508 487791 290838 269018 312685 278800 341912 533399 644644
232 644644 501591 311526 252543 441545 558922 540559 531755 540662 479637 389137 236567
221 236567 123357 186992 212699 114387 235108 437688 436690 255993 293236 -5741 75517
210 75517 357206 239906 156960 24984 199667 207281 257182 74470 228407 214183 294751
199 294751 321619 516111 469439 363975 394052 641173 558727 647416 648788 656461 684134 477135
187 477135 335956 341097 417975 423629 365198 275636 356782 416080 270319 327912 400601 310223
175 310223 257809 618449 342315 391245 320584 412049 293542 472663 431079 506913 597425
164 597425 401206 481210 301037 630175 589081 590399 457431 404002 -4048 205274 389090
153 389090 258003 277872 315360 331893 279383 169255 400490 316921 221089 292695 482090
142 482090 457078 298933 213431 398081 485502 554268 511523 385673 390383 558521 710072
131 710072 912421 896554 471504 607173 445239 407913 548466 747193 446588 419726
121 419726 573155 386572 648143 646118 386871 432289 628532 511357 469019 435490 443850
110 443850 433965 463547 369880 292560 231876 315932 449488 465068 680023 681820 556956 853510
98 853510 649431 469773 263152 475462 486596 422454 499954 364598 378987 352519 159598
87 159598 164105 312408 158105 371019 604910 473753 392403 300290 269014 209270 412036
76 412036 455068 229178 471140 440903 218129 153880 321996 316062 382402 290961 401358
65 401358 321815 264443 218480 269560 355340 255925 173390 231331 385261 405069 492808 439129
53 439129 324137 403178 516196 580450 619950 584485 443657 477661 671350 534963 458533
42 458533 389665 439628 484463 413769 370301 212592 377282 570796 432475 546808 556935
31 556935 630692 498929 523828 537933 522414 478644 410158 352740 444056 436139 615584 908545
19 908545 640870 444381 318690 427423 479783 602402 511475 389012 415016 292071 421693
8 421693 568398 482102 493577 610884 525200 182737 190435 306996
0 306996
$$ Imaginary data points
##PAGE= N=2
##DATA TABLE= (X++(I..I)), XYDATA
16383 -2258165 -2289069 -2141002 -2054268 -1990597 -1981536 -2058621 -1958254 -1853414 -1706258 -1639727 -1629990
16372 -1629990 -1725889 -1738455 -1542647 -1400849 -1246341 -1095654 -1150590 -1267877 -1268508 -945649
16362 -945649 -942216 -822697 -745853 -754084 -631284 -436429 -360632 -356925 -191519 -68242 -121980
16351 -121980 -157780 13678 164650 159029 43303 248824 129616 277102 519262 507056
16341 507056 533090 394152 594562 659761 612563 810310 853848 923852 1022529 1131986 1275558
16330 1275558 1325649 1341244 1261547 1137817 1466163 1401376 1465767 1703497 1808824 1703735
16320 1703735 1793831 2052340 2091064 2058256 2056742 2079078 2228718 2113453 2192916 2218170 2268086
16309 2268086 2390710 2498940 2352385 2631531 2810244 2802249 2808559 2642602 2793411 2695062
16299 2695062 2966117 3007720 3337273 3407279 3218889 3378350 3371933 3618586 3923294 3725426
16289 3725426 3591837 3643370 3561298 3491270 3652606 3678460 3642148 3775911 3887956 4122156
16279 4122156 4180205 3990458 4320656 4330077 4277088 4294218 4421304 4362516 4377060 4343974 4319048
16268 4319048 4343397 4392105 4694789 4669959 4890883 4934734 5129673 5037065 4982961 5338202
$$ [...]
##END NTUPLES=NMR SPECTRUM
##END=
