##TITLE=1H_DE-80H_X3
 200.13MHz, d2o
 8 sc
 
 19ns.26.2.2025
##JCAMPDX= 6.0         $$ Bruker NMR JCAMP-DX V2.0
##DATA TYPE= NMR SPECTRUM
##DATA CLASS= NTUPLES
##ORIGIN= UXNMR, Bruker Analytische Messtechnik GmbH
##OWNER= pz
$$ XWIN-NMR		Version 3.5
$$ Fri Jul  4 11:57:33 2025 Russian Standard Time (UT+4h)  Yarkov@DPX200
##.OBSERVE FREQUENCY= 200.1313
##.OBSERVE NUCLEUS= ^1H
##.ACQUISITION MODE= SIMULTANEOUS
##.ACQUISITION SCHEME= undefined
##.AVERAGES= 8
##.DIGITISER RES= 18
##SPECTROMETER/DATA SYSTEM= spect
##.PULSE SEQUENCE= zg30
##.SOLVENT NAME= CDCl3
##.SHIFT REFERENCE= (INTERNAL, CDCl3, 0, 15.4637)
##AUDIT TRAIL= $$ (NUMBER, WHEN, WHO, WHERE, WHAT)
$$ ##TITLE= Audit trail, XWIN-NMR		Version 3.5
$$ ##JCAMPDX= 5.01
$$ ##ORIGIN= Bruker BioSpin GmbH
$$ ##OWNER= Yarkov
$$ C:/Bruker/XWIN-NMR/data/yarkov2/nmr/H-C/1/pdata/1/auditp.txt
$$ ##AUDIT TRAIL=  $$ (NUMBER, WHEN, WHO, WHERE, WHAT)
(   1,<2025-07-04 11:56:49.00 +0400>,<Yarkov>,<DPX200>,
      <created by zg, POWCHK disabled, PULCHK disabled
       configuration hash MD5:
       00 E9 B6 7A A2 85 ED C7 34 08 36 98 17 FE 4E 26
       data hash MD5: 16K
       AE 7E 1B 6E 74 24 2B 0B 78 11 10 04 48 C8 22 BD>)
(   2,<2025-07-04 11:56:55.15 +0400>,<Yarkov>,<DPX200>,
      <Start of raw data processing
       efp BC_mod = 2 LB = 0.25 FT_mod = 6 PKNL = 1 PHC0 = -1365.687 PHC1 = 16.24948 SI = 16K 
       data hash MD5: 16K
       4D 07 C6 42 1B 3D 1B 32 50 5F C2 3B AA C6 54 9E>)
(   3,<2025-07-04 11:57:00.87 +0400>,<Yarkov>,<DPX200>,
      <abs ABSG = 5 
       data hash MD5: 16K
       DA 34 82 53 B2 8C B9 62 E3 B4 9F F7 E0 B1 1A 15>)
$$ ##END=
$$ 
$$ hash MD5
$$ 84 3B 93 B5 C1 8A 5A 34 B2 33 D2 CE 79 E0 F8 3A
##$RELAX= 
##$RELAX= 
##$RELAX= 
##$RELAX= 
##$RELAX= 
##$RELAX= 
$$ Bruker specific parameters
$$ --------------------------
##$DU= <C:/Bruker/XWIN-NMR>
##$EXPNO= 1
##$NAME= <H-C>
##$PROCNO= 1
##$TYPE= <nmr>
##$USER= <yarkov2>
##$AMP= (0..31)
100 100 100 100 100 100 100 100 100 100 100 100 100 100 100 100 100 100 
100 100 100 100 100 100 100 100 100 100 100 100 100 100 
##$AQSEQ= 0
##$AQ_mod= 1
##$AUNM= <au_zg>
##$AUTOPOS= <>
##$BF1= 200.13
##$BF2= 200.13
##$BF3= 200.13
##$BF4= 200.13
##$BF5= 200.13
##$BF6= 200.13
##$BF7= 200.13
##$BF8= 200.13
##$BYTORDA= 1
##$CFDGTYP= 0
##$CFRGTYP= 5
##$CHEMSTR= <none>
##$CNST= (0..31)
1 1 145 1 1 1 1 1 1 1 1 1 1 1 1 1 1 1 1 1 1 1 1 1 1 1 1 1 1 1 1 1 
##$CPDPRG= <>
##$CPDPRG1= <>
##$CPDPRG2= <>
##$CPDPRG3= <>
##$CPDPRG4= <mlev>
##$CPDPRG5= <mlev>
##$CPDPRG6= <mlev>
##$CPDPRG7= <mlev>
##$CPDPRG8= <mlev>
##$CPDPRGB= <>
##$CPDPRGT= <>
##$D= (0..31)
0 0.7 0 0 0 0 0 0 0 0 0 0.03 0 0 0 0 0 0 0 0 0 0 0 0 0 0 0 0 0 0 0 0 
##$DATE= 1751615808
##$DBL= (0..7)
120 120 120 120 120 120 120 120 
##$DBP= (0..7)
150 150 150 150 150 150 150 150 
##$DBP07= 0
##$DBPNAM0= <>
##$DBPNAM1= <>
##$DBPNAM2= <>
##$DBPNAM3= <>
##$DBPNAM4= <>
##$DBPNAM5= <>
##$DBPNAM6= <>
##$DBPNAM7= <>
##$DBPOAL= (0..7)
0.5 0.5 0.5 0.5 0.5 0.5 0.5 0.5 
##$DBPOFFS= (0..7)
0 0 0 0 0 0 0 0 
##$DE= 6
$$ [...]
##$SUBNAM3= <"">
##$SUBNAM4= <"">
##$SUBNAM5= <"">
##$SUBNAM6= <"">
##$SUBNAM7= <"">
##$SUBNAM8= <"">
##$SUBNAM9= <"">
##$SW= 18.0517328524113
##$SWIBOX= (0..15)
0 0 2 0 0 0 0 0 0 0 0 0 0 0 0 0 
##$SW_h= 3612.71676300578
##$TD= 16384
##$TD0= 1
##$TE= 0
##$TE2= 300
##$TE3= 300
##$TEG= 300
##$TL= (0..7)
0 120 120 120 120 120 120 120 
##$TP= (0..7)
150 150 150 150 150 150 150 150 
##$TP07= 0
##$TPNAME0= <>
##$TPNAME1= <>
##$TPNAME2= <>
##$TPNAME3= <>
##$TPNAME4= <>
##$TPNAME5= <>
##$TPNAME6= <>
##$TPNAME7= <>
##$TPOAL= (0..7)
0.5 0.5 0.5 0.5 0.5 0.5 0.5 0.5 
##$TPOFFS= (0..7)
0 0 0 0 0 0 0 0 
##$TUNHIN= 0
##$TUNHOUT= 0
##$TUNXOUT= 0
##$USERA1= <user>
##$USERA2= <user>
##$USERA3= <user>
##$USERA4= <user>
##$USERA5= <user>
##$V9= 5
##$VALIST= <valist>
##$VCLIST= <CCCCCCCCCCCCCCC>
##$VD= 0
##$VDLIST= <DDDDDDDDDDDDDDD>
##$VPLIST= <PPPPPPPPPPPPPPP>
##$VTLIST= <TTTTTTTTTTTTTTT>
##$WBST= 1024
##$WBSW= 4
##$XGAIN= (0..3)
0 0 0 0 
##$XL= 0
##$YL= 0
##$YMAX_a= 75110
##$YMIN_a= -54507
##$ZGOPTNS= <>
##$ZL1= 120
##$ZL2= 120
##$ZL3= 120
##$ZL4= 120
##$ABSF1= 15.44389
##$ABSF2= -2.60796
##$ABSG= 5
##$ABSL= 3
##$ALPHA= 0
##$AQORDER= 0
##$ASSFAC= 0
##$ASSFACI= 0
##$ASSFACX= 0
##$ASSWID= 0
##$AUNMP= <proc_1d>
##$AZFE= 0.1
##$AZFW= 0.1
##$BCFW= 0
##$BC_mod= 2
##$BYTORDP= 0
##$COROFFS= 0
##$CY= -3
##$DATMOD= 1
##$DC= 0
##$DFILT= <>
##$DTYPP= 0
##$F1P= 0
##$F2P= 0
##$FCOR= 1
##$FTSIZE= 16384
##$FT_mod= 6
##$GAMMA= 0
##$GB= 0
##$INTBC= 1
##$INTSCL= 3.241238e-09
##$ISEN= 128
##$LB= 0.25
##$LEV0= 0
##$LPBIN= 0
##$MAXI= 10000
##$MC2= 0
##$MEAN= 0
##$ME_mod= 0
##$MI= 1.114404
##$NCOEF= 0
##$NC_proc= -10
##$NLEV= 6
##$NOISF1= 3.799351
##$NOISF2= 2.8
##$NSP= 0
##$NTH_PI= 0
##$NZP= 0
##$OFFSET= 15.46373
##$PC= 1
##$PHC0= -1365.687
##$PHC1= 16.24948
##$PH_mod= 1
##$PKNL= yes
##$PPARMOD= 0
##$PSCAL= 0
##$PSIGN= 0
##$REVERSE= no
##$SF= 200.130011602545
##$SI= 16384
##$SIGF1= 3
##$SIGF2= 2
##$SINO= 0.751879
##$SIOLD= 32768
##$SREGLST= <19F.Aceton>
##$SSB= 0
##$STSI= 16384
##$STSR= 0
##$SW_p= 3612.71676300578
##$SYMM= 0
##$S_DEV= 0
##$TDeff= 16384
##$TDoff= 0
##$TI= <>
##$TILT= no
##$TM1= 0
##$TM2= 0
##$TOPLEV= 0
##$USERP1= <user>
##$USERP2= <user>
##$USERP3= <user>
##$USERP4= <user>
##$USERP5= <user>
##$WDW= 1
##$XDIM= 16384
##$YMAX_p= 419712746
##$YMIN_p= -14751486
$$ End of Bruker specific parameters
$$ ---------------------------------
##NTUPLES= NMR SPECTRUM
##VAR_NAME=  FREQUENCY,     SPECTRUM/REAL,   SPECTRUM/IMAG
##SYMBOL=    X,             R,               I
##VAR_TYPE=  INDEPENDENT,   DEPENDENT,       DEPENDENT
##VAR_FORM=  AFFN,          ASDF,            ASDF
##VAR_DIM=   16384,         16384,           16384
##UNITS=     HZ,            ARBITRARY UNITS, ARBITRARY UNITS
##FACTOR=    0.220516191357247, 1,           1
##FIRST=     3094.7564359799, 0,             0
##LAST=      -517.960327025879, 0,           0
##MIN=       -517.960327025879, -14751486,   0
##MAX=       3094.7564359799, 419712746,     0
$$ Real data points
##PAGE= N=1
##DATA TABLE= (X++(R..R)), XYDATA
$$ [...]
$$ plain form
7300 39317976 40508993 42203181 44733449 47783637 50855993 52804450 55347119 58212506
7292 58212506 60627795 60325130 60539243 59717667 57392090 55736163 52030307 49793732 47529074
7283 47529074 44776899 43467345 40696341 37624661 37036859 35751597 33451332 31997198
7275 31997198 31216125 30396818 28862427 28163878 26932987 25003963 25931888 25081814 23695947
7266 23695947 22881439 21562104 20613506 20014995 20017448 20079246 20191607 19258987 18140130 18210260
7256 18210260 18696512 19247155 18332242 17881852 18668847 17926049 17127876 16975464 17350178
7247 17350178 16269701 15639719 16303361 17196601 17048547 17043690 16267984 16836528 16870094 17246480
7237 17246480 16835555 15915539 16166255 16741780 17618434 17372542 17607696 18095928 18378109
$$ packed form
7300C9317976J191017J694188K530268L050188L072356J948457K542669K865387
7292E8212506K415289l02665K14113q21576k325577j655927l705856k236575k264658
7283D7529074k752175j309554k771004l071680n87802j285262k300265j454134
7275C1997198p81073q19307j534391o98549j230891j929024R27925q50074j385867
7266B3695947q14508j319335r48598n98511K453O1798J12361r32620j118857P0130
7256A8210260M86252N50643r14913m50390P86995p42798p98173j52412L74714
7247A7350178j080477o29982O63642Q93240j48054m857p75706N68544L3566L76386
7237A7246480m10925r20016K50716N75525Q76654k45892K35154M88232K82181
$$ plain form
7228 18378109 18904876 18706524 18604299 17938147 16916640 16211881 15948934 15875544 16850616
7219 16850616 16552772 15948890 15021716 14166223 15613287 16341087 16230387 16216516 17114990
7210 17114990 16750789 17539998 18338829 19454668 20558737 20456695 22045781 25017265 26684632
7201 26684632 27233502 28335145 30031514 31808897 31606889 31097764 30633129 29262122 28081288
7192 28081288 27459312 24968750 23520370 22635648 21464619 20131807 19221877 17446578 16786016
7183 16786016 17478450 16413923 14596561 13790007 11573793 11084272 11664985 10960202 10782248
7174 10782248 10531652 10386609 10734138 11221749 10448188 10394490 9707243 10061567 9310400 8855040
7164 8855040 8867894 8919370 8600463 8654678 8196103 7775393 6771452 6750742 9108344 9660390
$$ packed form
7228A8378109N26767j98352j02225o66152j021507p04759k62947p3390R75072
7219A6850616k97844o03882r27174q55493J447064P27800j10700j3871Q98474
7210A7114990l64201P89209P98831J115839J104069j02042J589086K971484J667367
7201B6684632N48870J101643J696369J777383k02008n09125m64635j371007j180834
7192B8081288o21976k490562j448380q84722j171029j332812r09930j775299o60562
7183A6786016O92434j064527j817362q06554k216214m89521N80713p04783j77954
7174A0782248k50596j45043L47529M87611p73561n3698o87247L54324p51167m55360
7164H855040J2854N1476l18907N4215m58575m20710j003941k0710K357602N52046
$$ plain form
7154 9660390 8088227 7021382 6926318 6548649 7081863 5690298 6160912 6754636 6539616
7145 6539616 6042076 5373861 5804078 5765984 6289089 6842872 6402213 5582228 5969041 5676243
7135 5676243 5641917 6524966 7057304 5720250 5290319 4670295 5106386 4770846 5255387 4906217
7125 4906217 4900156 6319177 5342525 5316530 4798833 4561729 3898762 4091295 3880514 4632003
7115 4632003 5010546 5004223 5141566 4902644 5286282 5400586 4871628 5193228 4081976 3201331
7105 3201331 3473788 4384344 4651747 3018041 2388398 2828193 3042454 3347007 3372315 3973351
7095 3973351 4440219 4632878 4282456 4464324 4717188 4576063 4548264 3805330 2892967 3090324
7085 3090324 2530171 1899904 1650989 2122808 2718234 2469722 2559179 2987547 3359607 2629389
$$ packed form
7154I660390j572163j066845r5064l77669N33214j391565M70614N93724k15020
7145F539616m97540o68215M30217l8094N23105N53783m40659q19985L86813k92798
7135E676243l4326Q83049N32338j337054m29931o20024M36091l35540M84541l49170
7125D906217o061J419021r76652k5995n17697k37104o62967J92533k10781P51489
7115D632003L78543o323J37343k38922L83638J14304n28958L21600j111252q80645
7105C201331K72457R10556K67403j633706o29643M39795K14261L04553K5308O01036
7095C973351M66868J92659l50422J81868K52864j41125k7799p42934r12363J97357
7085C090324n60153o30267k48915M71819N95426k48512Q9457M28368L72060p30218
$$ plain form
7075 2629389 3188547 3670568 2970242 2746594 3134684 3513389 3203744 2537081 2671842 2406305
7065 2406305 3068808 3193272 3183335 3140308 3001716 2041673 2436978 1784518 1133828 1060952
7055 1060952 421494 -60269 1252920 1862185 2388528 1249785 1219643 2206646 2912332
7046 2912332 2068162 3375194 3286399 2056101 2375811 2376709 3992381 3089795 2667566 1924846
7036 1924846 1471297 2545702 1454088 1832548 2037119 1464247 1738012 2127480 1296704
7027 1296704 1644028 1832741 1235899 1515178 1211519 1088787 1583982 840020 559953 1174845
7017 1174845 2712293 2455318 2305750 2862672 2920466 2421205 1447868 2409889 1414074 1794473
7007 1794473 1431365 1485927 2212084 2259203 1974583 1760529 1897120 1529981 1908588 2328135
$$ packed form
7075B629389N59158M82021p00326k23648L88090L78705l09645o66663J34761k65537
7065B406305O62503J24464r937m3027j38592r60043L95305o52460o50690p2876
7055A060952o39458m81763J313189O09265N26343j138743l0142R87003P05686
7046B912332q44170J307032q8795j230298L19710Q98J615672r02586m22229p42720
7036A924846m53549J074405j091614L78460K04571n72872K73765L89468q30776
7027A296704L47324J88713n96842K79279l03659j22732M95195p43962k80067O14892
7017A174845J537448k56975j49568N56922N7794m99261r73337R62021r95815L80399
7007A794473l63108N4562P26157M7119k84620k14054J36591l67139L78607M19547
$$ plain form
6997 2328135 1516310 2290452 1268763 2164950 1345010 1748379 1817388 1459935 343048
6988 343048 865895 1652155 2453725 2457688 690943 272079 1073249 794753 896078 1076948
6978 1076948 1842662 2340996 1363217 1425080 2356918 2689498 2289971 2135593 2750791 2358427
6968 2358427 2091065 2272235 2556985 2523877 1749177 1441227 1904624 1779080 2142214 1915354
6958 1915354 1866791 2008799 1857335 1891111 1726462 1271471 921799 1212091 2202306 1444906
6948 1444906 1464141 2461136 2964925 2427010 2392784 3237286 2388922 2302581 2888958 2709895
6938 2709895 2687481 3375244 3141951 3794576 3604911 4467564 3537775 2841365 3526266 4731169
6928 4731169 3549877 4384539 5546882 5826890 5859964 6325056 5371694 5498311 5214896
$$ packed form
6997B328135q11825P74142j021689Q96187q19940M03369O9009l57453j116887
6988C43048N22847P86260Q01570L963j766745m18864Q01170k78496J01325J80870
6978A076948P65714M98334r77779O1863R31838L32580l99527j54378O15198l92364
6968B358427k67362J81170K84750l3108p74700l07950M63397j25544L63134k26860
6958A915354m8563J42008j51464L3776j64649m54991l49672K90292R90215p57400
6948A444906J9235R96995N03789n37915l4226Q44502q48364q6341N86377j79063
6938B709895k2414O87763k33293O52625j89665Q62653r29789o96410O84901J204903
6928D731169j181292Q34662J162343K80008L3074M65092r53362J26617k83415
$$ plain form
6919 5214896 4857531 3950863 3869928 4074923 4587559 5325443 4922324 3943659 3386199 4169577
6909 4169577 3396880 2569726 3294601 2870862 3230796 3784756 3962674 3765630 3837357 4164875
6899 4164875 4118510 3417773 3208677 3931761 3554794 3136559 2136180 2572306 3381834 2983925
6889 2983925 2967558 2799407 3088680 2043031 2498419 3271805 3263905 3301330 3483433 1953097
6879 1953097 2714690 2091133 1816639 2950982 3004137 2989811 2703127 2989980 2685650 2184248
6869 2184248 1606383 2030404 2099470 2729344 2075218 1703121 2902523 2263719 1609583 2094370
6859 2094370 1130552 1823254 2986576 3568240 2549190 1906171 1303465 713814 50460
6850 50460 1184576 2038361 2012240 1218754 1818196 1298645 343172 185361 -697902 -147161
$$ packed form
6919E214896l57365r06668q0935K04995N12636P37884m03119r78665n57460P83378
6909D169577p72697q27154P24875m23739L59934N53960J77918j97044P1727L27518
6899D164875m6365p00737k09096P23084l76967m18235j000379M36126Q09528l97909
6889B983925j6367j68151K89273j045649M55388P73386p900L7425J82103j530336
6879A953097P61593o23557k74494J134343N3155j4326k86684K86853l04330n01402
6869B184248n77865M24021O9066O29874o54126l72097J199402o38804o54136M84787
6859B094370r63818O92702J163322N81664j019050o43019o02706n89651o63354
6850E0460J134116Q53785k6121p93486N99442n19551r55473j57811q83263N50741
$$ plain form
6840 -147161 971043 1675026 1576211 964215 585284 788510 2009281 896750 349476
6831 349476 1529107 1552827 1449456 1824350 3363373 2464952 2489353 2271134 1390486 2340987
6821 2340987 2113098 1895205 2864254 3203140 1684380 1405516 752863 1739867 646592
6812 646592 738929 1718548 1475859 730676 937278 1969681 2084983 1688015 2400804 1943188
6802 1943188 1868677 1534088 1881797 2375407 3012931 3058742 2488095 2690861 1995670 1904656
6792 1904656 3020850 2217987 1054662 1356142 379253 1126227 1484605 968844 1470690
6783 1470690 2014670 1666438 2232246 2748718 2232642 1582850 1667726 1497917 2011530 1858232
6773 1858232 1001206 619007 1139050 648904 1246859 2153135 2704278 2377764 1755933 1896464
$$ packed form
6840a47161J118204P03983r8815o11996l78931K03226J220771j112531n47274
6831C49476J179631K3720j03371L74894J539023q98421K4401k18219q80648R50501
6821B340987k27889k17893R69049L38886j518760k78864o52653R87004j093275
6812F46592R2337R79619k42689p45183K06602J032403J15302l96968P12789m57616
6802A943188p4511l34589L47709M93610O37524M5811n70647K02766o95191r1014
6792A904656J116194q02863j163325L01480r76889P46974L58378n15761N01846
6783A470690N43980l48232N65808N16472n16076o49792Q4876j69809N13613j53298
6773A858232q57026l82199N20043m90146N97955R06276N51143l26514o21831J40531
$$ plain form
6763 1896464 1306404 2807056 2979494 3126898 1848869 769473 2223351 888651 -83413
6754 -83413 466086 1815212 2073473 2891714 3321899 2305964 1225010 1824996 2394157
6745 2394157 1626927 560853 2066188 3005536 3285058 3006678 2880715 3458191 2566159
6736 2566159 2081173 2017799 2221765 2962103 2888861 2864406 3015792 3060520 3566386 2283407
6726 2283407 2102665 2920689 3013026 2823429 2807918 1635046 2268828 3216643 2002502 1617315
6716 1617315 2417050 2082806 2187066 3193998 2613096 2730865 3008416 3127779 2268560
6707 2268560 1679537 2322917 1428755 1436134 1572479 1174548 2771652 3686608 3592836 2725941
6697 2725941 3654883 3565342 3611759 2114847 2866430 4033689 3515502 2898315 2870174 2641374
$$ packed form
6763A896464n90060J500652J72438J47404j278029j079396J453878j334700r72064
6754h3413N49499J349126K58261Q18241M30185j015935j080954N99986N69161
6745B394157p67230j066074J505335R39348K79522k78380j25963N77476q92032
6736B566159m84986o3374K03966P40338p3242k4455J51386M4728N05866j282979
6726B283407j80742Q18024R2337j89597j5511j172872O33782R47815j214141l85187
6716A617315P99735l34244J04260J006932n80902J17769K77551J19363q59219
6707B268560n89023O43380q94162P379J36345l97931J597104R14956r3772q66895
6697B725941R28942q9541M6417j496912P51583J167259n18187o17187k8141k28800
$$ plain form
6687 2641374 2692992 2385785 2648617 2652236 2685405 3031452 2660194 2507229 2767572 2039008
6677 2039008 1805581 3095840 2552446 3317859 3942519 3765947 3527102 2846445 3026338
6668 3026338 2535736 2499105 2436491 2839199 3039690 3080731 3959751 3645148 3393501 3703525
6658 3703525 5210999 4369867 4661812 4758207 3405538 3030928 3278997 3271914 4120421 4065307
6648 4065307 3782998 3944926 4822193 5379761 5110020 4753293 4942205 4876604 5954313 5595991
6638 5595991 5082967 5504329 5739712 5407178 5305902 5328040 5839280 6102667 6087660 5188314
6628 5188314 4805795 5456128 5998973 6471403 6497874 6838970 7116146 7222751 7349174 8207412
6618 8207412 7416968 7427164 8123137 8192533 7691516 7281843 8465013 8683798 8975305 8786300
$$ packed form
6687B641374N1618l07207K62832L619L3169L46047l71258j52965K60343p28564
6677B039008k33427J290259n43394P65413O24660j76572k38845o80657J79893
6668C026338m90602l6631o2614M02708K00491M1041Q79020l14603k51647L10024
6658C703525J507474q41132K91945R6395j352669l74610K48069p083Q48507n5114
6648D065307k82309J61928Q77267N57568k69741l56727J88912o5601J077709l58322
6638E595991n13024M21362K35383l32534j01276K2138N11240K63387j5007q99346
6628E188314l82519O50333N42845M72430K6471L41096K77176J06605J26423Q58238
6618H207412p90444J0196O95973O9396n01017m09673J183170K18785K91507j89005
$$ plain form
6608 8786300 8310357 10311618 11248053 11632102 12662829 12642925 13314068 13575949 13551057 13966284
6598 13966284 13960237 14902797 16403892 17360372 17289239 17846479 17498753 16680918 19466634 20816748
6588 20816748 22308239 24186486 25986867 28223154 31294845 33555062 34827300 36731224
6580 36731224 37417744 36645031 35923104 35870385 36045186 34140784 33550810 33786033 32738176
6571 32738176 31479981 32524070 33812054 33230609 33805337 35841737 37390987 39817344
6563 39817344 40538608 42249965 45789724 48630639 52947257 57185844 62025166 66431922
6555 66431922 69283807 72266759 73576280 74000582 72736654 69755532 68765322 66371080
6547 66371080 64705838 62829591 59001157 56189761 53788503 49933639 48196326 45034043
$$ packed form
6608H786300m75943K001261R36435L84049J030727j9904O71143K61881k4892M15227
6598A3966284o047R42560J501095R56480p1133N57240l47726q17835K785716J350114
6588B0816748J491491J878247J800381K236287L071691K260217J272238J903924
6580C6731224O86520p72713p21927n2719J74801j904402n89974K35223j047857
6571C2738176j258195J044089J287984n81445N74728K036400J549250K426357
6563C9817344P21264J711357L539759K840915M316618M238587M839322M406756
6555F6431922K851885K982952J309521M24302j263928k981122r90210k394242
6547F6371080j665242j876247l828434k811396k401258l854864j737313l162283
$$ plain form
6539 45034043 42126682 38987742 35636923 33104166 31748473 29668866 29167784 26932244
6531 26932244 25683255 24590148 23834881 23035619 22027269 22012241 21292609 19845122 18293888
6522 18293888 17705494 17564813 17456932 16950362 17132678 17165175 16459193 15876667 15328874 14519684
6512 14519684 13839621 12801295 11944209 12857089 13606273 13107562 13363302 13228716 13379170
6503 13379170 11683355 10989851 11304834 10837302 10919471 10764461 11214492 11115920 9285189
6494 9285189 9075334 9115250 9136925 8883201 8368516 8578140 8247001 8694759 8979010 8778124
6484 8778124 8324841 7593815 7418789 7109748 6458707 6733116 6387700 6494847 6820891 6590179
6474 6590179 6656302 6338159 6244714 6724258 6661597 6636118 5875607 6521650 7007994 7464484
$$ packed form
6539D5034043k907361l138940l350819k532757j355693k079607n01082k235540
6531B6932244j248989j093107p55267p99262j008350j5028p19632j447487j551234
6522A8293888n88394j40681j07881n06570J82316L2497p05982n82526n47793q09190
6512A4519684o80063j038326q57086R12880P49184m98711K55740j34586J50454
6503A3379170j695815o93504L14983m67532Q2169j55010M50031r8572j830731
6494I285189k09855L9916K1675k53724n14685K09624l31139M47758K84251k00886
6484H778124m53283p31026j75026l09041o51041K74409l45416J07147L26044k30712
6474F590179O6123l18143r3445M79544o2661k5479p60511O46043M86344M56490
$$ plain form
6464 7464484 6932192 6826505 7243564 7447926 7853053 7046537 6069004 5681789 6456312 7292157
6454 7292157 7386057 6701958 6785850 7006200 6177750 5996155 5591581 5891123 6714931 5824329
6444 5824329 6807850 6359285 7463201 7949015 7987290 6952852 6616251 7007094 6933851 6678792
6434 6678792 6419777 6510041 5915968 6224506 6175980 6155544 6423540 6714759 6556640 7365603
6424 7365603 7302970 7115567 6094249 5985595 6798131 6261030 6567135 6082404 6578533 6228155
6414 6228155 6456871 6530659 7426021 6394347 5062551 5783005 7133517 7517283 7519015 6580649
6404 6580649 5755311 5671078 6150037 6502088 5515957 5266040 5313281 6015850 5884354 6377681
6394 6377681 6204998 6382098 5826208 6211847 6059800 4615025 5266911 5572486 6106406
$$ packed form
6464G464484n32292j05687M17059K04362M05127q06516r77533l87215P74523Q35845
6454G292157R3900o84099Q3892K20350q28450j81595m04574K99542Q23808q90602
6444E824329R83521m48565J103916M85814L8275j034438l36601L90843p3243k55059
6434F678792k59015R0264n94073L08538m8526k0436K67996K91219j58119Q08963
6424G365603o2633j87403j021318j08654Q12536n37101L06105m84731M96129l50378
6414F228155K28716P3788Q95362j031674j331796P20454J350512L83766J732r38366
6404F580649q25338q4233M78959L52051r86131k49917M7241P02569j31496M93327
6394F377681j72683J77100n55890L85639j52047j444775O51886L05575N33920
$$ plain form
6385 6106406 5166099 5307733 5229441 5863450 5934429 5874532 6211552 4254007 4984735 5264871
6375 5264871 4960265 4606789 5570058 5719067 6336844 7651129 6828251 6849570 6874664 6177496
6365 6177496 6160462 6031013 5470594 6062092 6532299 6451871 7117384 7540344 7700449 8344207
6355 8344207 7397577 6904380 7105555 6178499 6352449 7017726 7121249 7799579 6791278
6346 6791278 6443975 7160742 6580087 6798532 7295752 7481959 7366285 7041103 6450125 6894863
6336 6894863 7909659 7920832 6880689 6707007 7403612 7929281 8449785 8821588 7839200
6327 7839200 8170938 7593123 7711540 8679762 9177870 9706097 9272002 9425281 8043772
6318 8043772 7929265 8150303 8630084 9563409 10137984 10582316 10951373 11526443 11003640 11261410
$$ packed form
6385F106406r40307J41634p8292O34009P0979n9897L37020j957545P30728K80136
6375E264871l04606l53476R63269J49009O17777J314285q22878K1319K5094o97168
6365F177496j7034j29449n60419N91498M70207q0428O65513M22960J60105O43758
6355H344207r46630m93197K01175r27056J73950O65277J03523O78330j008301
6346F791278l47303P16767n80655K18445M97220J86207j15674l25182n90978M44738
6336F894863J014796J1173j040143j73682O96605N25669N20504L71803r82388
6327G839200L31738n77815J18417R68222M98108N28227m34095J53279j381509
6318H043772j14507K21038M79781R33325N74575M44332L69057N75070n22803K57770
$$ plain form
6308 11261410 11651235 11717564 12414572 13010209 12767373 11831305 13250669 13578721 12967735
6299 12967735 13464038 13399324 14235131 13880778 13456346 14117919 14297775 13697659 13691266 13440728
6289 13440728 13551269 13503297 12462088 14164768 14276532 13486734 14396544 14188142 14348240
6280 14348240 15460467 16139827 16511391 16424392 16689162 16195648 16261810 16926665 17628497 17838055
6270 17838055 16294363 17271091 18294073 18176217 16927678 17666144 16943025 17818905 17334717
6261 17334717 17255490 17416827 16784084 16601358 18051836 18720522 18406912 18622503 17878566
6252 17878566 17407446 17682584 18345387 18545264 18381750 18438039 19301844 17973422 17362697
6243 17362697 16365193 15781661 17650835 17420270 17413703 17753684 18006926 17197173 16809046 17034394
$$ packed form
6308A1261410L89825O6329O97008N95637k42836r36068J419364L28052o10986
6299A2967735M96303o4714Q35807l54353m24432O61573J79856o00116o393k50538
6289A3440728J10541m7972j041209J702680J11764p89798R09810k08402J60098
6280A4348240J112227O79360L71564q6999K64770m93514O6162O64855P01832K09558
6270A7838055j543692R76728J022982j17856j248539P38466p23119Q75880m84188
6261A7334717p9227J61337o32743j82726J450478O68686l13610K15591p43937
6252A7878566m71120K75138O62803J99877j63514N6289Q63805j328422o10725
6243A7362697r97504n83532J869174k30565o567L39981K53242q09753l88127K25348
$$ plain form
6233 17034394 17339485 17732963 17435844 17731764 18015557 17711790 16573920 16337379 16009903
6224 16009903 16209726 16649975 16459318 16977237 17078263 16700524 16933031 16745668 16855502
6215 16855502 15918361 16191466 16172966 15912151 16723264 16796593 15831361 15599568 16245110 16272043
6205 16272043 16031047 16966179 16413019 16793377 16376023 17234212 16429381 17441493 17505188
6196 17505188 16937088 17592873 18524839 18377294 18468699 19089877 19356648 19688758 18602603
6187 18602603 18565927 19145100 18204260 17547405 19238244 19577232 20872421 20523467 19814939
6178 19814939 19616202 20248073 20624878 20864204 21802893 22013656 23375078 23078698 23194453
6169 23194453 23096681 22875846 22782987 23440898 23859123 24005055 23959255 24487143 23715040 23362597
$$ packed form
6233A7034394L05091L93478k97119K95920K83793l03767j137870k36541l27476
6224A6009903J99823M40249j90657N17919J01026l77739K32507j87363J09834
6215A6855502r37141K73105j8500k60815Q11113P3329r65232k31793O45542K6933
6205A6272043k40996R35132n53160L80358m17354Q58189q04831J012112O3695
6196A7505188n68100O55785R31966j47545R1405O21178K66771L32110j086155
6187A8602603l6676N79173r40840o56855J690839L38988J295189l48954p08528
6178A9814939j98737O31871L76805K39326R38689K10763J361422k96380J15755
6169B3194453r7772k20835r2859O57911M18225J45932m5800N27888p72103l52443
$$ plain form
6159 23362597 24758923 24207373 23296110 24863969 25644075 25220762 24434023 25104385 26324215
6150 26324215 26192746 25651638 26488712 26912606 26558127 26810240 27122501 27484712 27297899
6141 27297899 26959344 27595094 27948425 28873708 29278271 28612341 28141942 27047526 27884851
6132 27884851 27050846 25718878 26014994 25164206 24189859 25233517 25950138 25244783 24272083
6123 24272083 24454097 24845541 26085764 25877249 26279623 25412838 26173057 26909265 26765572
6114 26765572 27193073 27744307 27090017 27566663 26719656 27491883 27854548 26890991 27480340
6105 27480340 27204399 27222045 27171224 27023949 27985562 27741927 27688504 27035811 26717270 27286171
6095 27286171 28470602 28916536 29520453 30768332 31611240 33202336 35120577 36522899 38698701
$$ packed form
6159B3362597J396326n51550r11263J567859P80106m23313p86739O70362J219830
6150B6324215j31469n41108Q37074M23894l54479K52113L12261L62211j86813
6141B7297899l38555O35750L53331R25283M04563o65930m70399j094416Q37325
6132B7884851q34005j331968K96116q50788r74347J043658P16621p05355r72700
6123B4272083J82014L91444J240223k08515M02374q66785P60219P36208j43693
6114B6765572M27501N51234o54290M76646q47007P72227L62665r63557N89349
6105B7480340k75941J7646n0821j47275R61613k43635n3423o52693l18541N68901
6095B7286171J184431M45934O03917J247879Q42908J591096J918241J402322K175802
$$ plain form
6086 38698701 41378468 42490097 45033094 46998924 48247089 48788682 48466750 48068910 48216671
6077 48216671 49077376 49399862 48494318 48850037 51110150 52574664 54962446 58135227 60292300
6068 60292300 62711517 65957977 67672479 68768004 68485425 67116075 64957851 62346916
6060 62346916 61414427 58835358 54358568 51649152 48709493 46438146 43932626 41110920
6052 41110920 39887973 39679769 37037173 34379385 34460026 33191729 33437720 32745898 32008915
6043 32008915 32725663 32943182 33577111 33876336 33868689 34877292 35404983 35446934 34319029 34288209
6033 34288209 32880725 31792368 30850856 29333182 26870185 25852864 24387880 23919443
6025 23919443 23606788 23698842 23216876 22141004 21303006 21138089 21959169 20996368 21382232
$$ packed form
6086C8698701K679767J111629K542997J965830J248165N41593l21932l97840J47761
6077D8216671Q60705L22486r05544L55719K260113J464514K387782L172781K157073
6068F0292300K419217L246460J714502J095525k82579j369350k158224k610935
6060F2346916r32489k579069m476790k709416k939659k271347k505520k821706
6052D1110920j222947k08204k642596k657788Q0641j268297K45991o91822p36983
6043C2008915P16748K17519O33929K99225p647J008603N27691M1951j127905l0820
6033C4288209j407484j088357r41512j517674k462997j017321j464984m68437
6025B3919443l12655R2054m81966j075872q37998j64917Q21080r62801L85864
$$ plain form
6016 21382232 21489402 22479862 22735448 22464363 23475441 23928971 24196716 23777816 23433007
6007 23433007 23310837 22454514 21005733 20427746 20366679 19919728 19213135 18103090 18537354
5998 18537354 17392691 16712494 16526643 16583493 15814724 16315894 15390827 15401700 15007809 13535013
5988 13535013 13882583 14141248 14366424 14312333 14803761 14669289 13649266 13672244 14631132 13527710
5978 13527710 13063254 12266615 12636254 12580254 12759854 12199050 12375503 13605727 13493381
5969 13493381 11883893 11952104 12123106 12589462 12390433 12415876 11768991 11983167 12633095 11997087
5959 11997087 11720317 11677263 11356067 10766782 10904917 11552428 11036272 11742193 11664926 11742054
5949 11742054 11700431 11557280 12040608 10779341 10662810 11242746 11705374 12175633 12624415
$$ packed form
6016B1382232J07170R90460K55586k71085J011078M53530K67745m18900l44809
6007B3433007j22170q56323j448781n77987o1067m46951p06593j110045M34264
5998A8537354j144663o80197j85851N6850p68769N01170r25067J0873l93891j472796
5988A3535013L47570K58665K25176n4091M91428j34472j020023K2978R58888j103422
5978A3527710m64456p96639L69639n6000J79600n60804J76453J230224j12346
5969A3493381j609488O8211J71002M66356j99029K5443o46885K14176O49928o36008
5959A1997087k76770m3054l21196n89285J38135O47511n16156P05921p7267P7128
5949A1742054m1623j43151M83328j261267j16531N79936M62628M70259M48782
$$ plain form
5940 12624415 11922026 11471554 11578911 11976403 11424355 11108671 11705929 11617224 11061626 11397528
5930 11397528 11409036 11746995 11899733 12098453 12037330 12216504 12121096 11847395 11856484 10880341
5920 10880341 9829547 10154593 10614755 10667831 10544751 11882474 12155538 10538875 9074582
5911 9074582 10088787 10067638 10798722 10870098 10603145 12204370 12948267 11585723 10615979
5902 10615979 10846517 10902870 11819282 11193874 10796417 10945589 10237601 10218909 10259141 10665074
5892 10665074 10850161 10923254 11392950 11711474 11302530 11072531 10756126 11043973 10166832 10913918
5882 10913918 12161966 11407830 11537678 11728464 10842766 10026785 9971366 10217088 9769792
5873 9769792 10509866 11517723 11551650 11856220 12306581 12079762 11888436 11284992 10335759 11032715
$$ packed form
5940A2624415p02389m50472J07357L97492n52048l15684N97258q8705n55598L35902
5930A1397528J1508L37959J52738J98720o1123J79174r5408k73701R089r76143
5920A0880341j050794L25046M60162N3076j23080J337723K73064j616663j464293
5911I074582J014205k1149P31084P1376k66953J601225P43897j362544r69744
5902A0615979K30538N6353R16412o25408l97457J49172p07988j8692M0232M05933
5892A0665074J85087P3093M69696L18524m08944k29999l16405K87847q77141P47086
5882A0913918J248048p54136J29848J90786q85698q15981n5419K45722m47296
5873I769792P40074J007857L3927L04570M50361k26819j91326o03444r49233O96956
$$ plain form
5863 11032715 12037618 11475072 10949154 12017898 11646761 10443817 10365034 11288547 11590489
5854 11590489 11796387 12828439 12964675 13165222 12968013 13361243 13834366 12925027 13367227
5845 13367227 12675643 13767968 13667230 12405292 13453746 13587655 12915348 13444117 13708762
5836 13708762 14305591 14428193 15016425 14027772 14194794 14210658 14563821 14699562 14351934 14149758
5826 14149758 14592825 15429838 15251199 15171340 15838266 15396056 13897795 14232826 15128241
5817 15128241 16048368 15470761 16073662 15718705 15164069 15526292 15140945 15138157 16411709 16570299
5807 16570299 16991066 17191252 17326580 17978308 17020673 16817132 17519979 17889305 18838034
5798 18838034 19519899 19214852 19839186 20794373 21235900 21065358 21786364 22449392 22499070 22053593
$$ packed form
5863A1032715J004903n62546n25918J068744l71137j202944p8783R23513L01942
5854A1590489K05898J032052J36236K00547j97209L93230M73123r09339M42200
5845A3367227o91584J092325j00738j261938J048454J33909o72307N28769K64645
5836A3708762N96829J22602N88232r88653J67022J5864L53163J35741l47628k02176
5826A4149758M43067Q37013j78639p9859O66926m42210j498261L35031Q95415
5817A5128241R20127n77607O02901l54957n54636L62223l85347k788J273552J58590
5807A6570299M20767K00186J35328O51728r57635k03541P02847L69326R48729
5798A8838034O81865l05047O24334R55187M41527j70542P21006O63028M9678m45477
$$ plain form
5788 22053593 21793163 22876789 22663948 23233062 23475544 24129352 24309515 23857115 23817128
5779 23817128 24192775 25566840 27208076 27960422 27977464 28090887 27687948 28188279 27955309
5770 27955309 28409825 29875239 30367350 30257878 30646529 31228245 31270737 32219212 32670671
5761 32670671 32677878 33220807 33922784 34178039 34785550 35102467 35927132 36209271 36935304 37268204
5751 37268204 37258156 37653616 39166993 39873196 40811248 40533503 40540308 41970866 42227849 43068779
5741 43068779 44947059 46171464 46877867 47036623 47561086 48471717 48924530 49361384 49002765
5732 49002765 51019210 51097326 51820054 52072947 53856745 54382263 55077206 56146359 57884059
5723 57884059 59630527 61204132 63811784 64726254 65348148 67036431 69310561 71002710
$$ packed form
5788B2053593k60430J083626k12841N69114K42482O53808J80163m52400l9987
5779B3817128L75647J374065J641236P52346J7042J13423m02939N00331k32970
5770B7955309M54516J465414M92111j09472L88651N81716M2492R48475M51459
5761C2670671P207N42929P01977K55255O07511L16917Q24665K82139P26033L32900
5751C7268204j0048L95460J513377P06203R38052k77745O805J430558K56983Q40930
5741D3068779J878280J224405P06403J58756N24463R10631M52813M36854l58619
5732D9002765K016445P8116P22728K52893J783798N25518O94943J069153J737700
5723E7884059J746468J573605K607652R14470O21894J688283K274130J692149
$$ plain form
5715 71002710 72577071 74818382 77439851 79648144 83202932 84565077 86925792 89745463
5707 89745463 90850888 92678314 94293885 96513999 99179739 101757914 103956234 107500440
5699 107500440 110101135 113336797 117399062 120815941 124114910 129637970 132516331 135597229
5691 135597229 140912482 146442280 152609803 160560276 167744324 173999721 183156727 192087976
5683 192087976 201612148 210244366 219248572 230162323 238947466 244988713 248575407 248202003
5675 248202003 245745879 240111955 235206214 228105664 220302449 211518816 203160997 195142088
5667 195142088 186263877 175920949 166270466 157986368 149693461 143347333 138969004 133731921
5659 133731921 130000577 125440539 120677622 119241411 117155831 114942081 113152373 110763287
$$ packed form
5715G1002710J574361K241311K621469K208293L554788J362145K360715K819671
5707H9745463J105425J827426J615571K220114K665740K578175K198320L544206
5699A07500440K600695L235662M062265L416879L298969N523060K878361L080898
5691A35597229N315253N529798O167523P950473P184048O255397R157006Q931249
5683A92087976R524172Q632218R004206J0913751Q785143O041247L586694l73404
5675B48202003k456124n633924m905741p100550p803215q783633q357819q018909
5667A95142088q878211j0342928r650483q284098q292907o346128m378329n237083
5659A33731921l731344m560038m762917j436211k085580k213750j789708k389086
$$ plain form
5651 110763287 108766505 107366155 105115759 104108067 102668712 101933038 100207008 100039982
5643 100039982 98136498 96218565 94400058 93318368 90955803 88842668 88201056 85768873
5635 85768873 85010337 84431320 83857618 82166234 82442435 81598803 80110007 79535688 78296632
5626 78296632 76927330 76973065 77508692 78097818 78577247 78088657 78121290 78153344 78790505 77978645
5616 77978645 77334098 77580382 77587748 78261237 78785276 78504050 79169416 78970594 79236674 79572375
5606 79572375 78992058 79207045 78281201 77925759 78158560 79088927 79117152 81479946 82442109
5597 82442109 83298363 83120058 84285163 84462037 84242163 84158029 83577994 83102579 82041590
5588 82041590 81370329 82761359 83274878 82487570 82632759 83007276 84081911 83792073 83997550
$$ packed form
5651A10763287j996782j400350k250396j007692j439355p35674j726030j67026
5643A00039982j903484j917933j818507j081690k362565k113135o41612k432183
5635H5768873p58536n79017n73702j691384K76201q43632j488796n74319j239056
5626G8296632j369302M5735N35627N89126M79429m88590L2633L2054O37161q11860
5616G7978645o44547K46284P366O73489N24039k81226O65366j98822K66080L35701
5606G9572375n80317K14987r25844l55442K32801R30367K8225K362794R62163
5597H2442109Q56254j78305J165105J76874k19874q4134n80035m75415j060989
5588H2041590o71261J391030N13519p87308J45189L74517J074635k89838K05477
$$ plain form
5579 83997550 84129025 83569361 82952432 83138466 82033651 81454716 80479290 79474733 78231418
5570 78231418 76812412 75839336 74453650 73440603 73926795 72392598 70408191 70209464 69496915
5561 69496915 67858059 66787739 67479125 67092885 66785019 67307568 66488150 66638435 66697864
5552 66697864 67474579 67217568 65841316 64984683 63477131 61522115 57991275 57686601 57605146
5543 57605146 57004205 55904641 54619601 52907914 52370402 51525442 51217128 51549411 50900962
5534 50900962 50104327 49245272 49845469 48436289 48336187 48248092 49462524 49387474 48579953
5525 48579953 48109541 49053870 47986593 47587460 48315278 46635106 46642223 44387226 42580582
5516 42580582 42077199 41251085 42835638 42122284 40106180 39705144 40167069 40003656 40214358
$$ packed form
5579H3997550J31475n59664o16929J86034j104815n78935r75426j004557j243315
5570G8231418j419006r73076j385686j013047M86192j534197j984407j98727p12549
5561F9496915j638856j070320O91386l86240l07866N22549q19418J50285N9429
5552F6697864P76715k57011j376252q56633j507552j955016l530840l04674q1455
5543E7605146o00941j099564j285040j711687n37512q44960l08314L32283o48449
5534E0900962p96635q59055O00197j409180j00102q8095J214432p5050q07521
5525D8579953m70412R44329j067277l99133P27818j680172P117k254997j806644
5516D2580582n03383q26114J584553p13354k016104m01036M61925j63413K10702
$$ plain form
5507 40214358 39892131 39947260 38002000 38339524 38324735 37482369 38302885 38662963 38966513 38510363
5497 38510363 38077456 38642708 38876909 38428325 37493879 36970047 37390526 37997262 37360368
5488 37360368 36499399 36678157 37298019 37356412 36332038 35655881 36382939 36566190 36005499
5479 36005499 36314225 36726213 37768763 38286133 38282104 37648350 37110384 37524738 38012879 36990366
5469 36990366 37180702 37372298 36831109 38302966 38785240 38952345 39044110 39028916 38616090 38118533
5459 38118533 38924034 38023730 36571967 36046320 37399625 36200805 35144466 34831695 34937887
5450 34937887 35648709 35649982 35334756 36346482 36532806 36592572 37213263 37507835 37360499 36893404
5440 36893404 36076926 35182128 35185947 35166196 34660693 35645700 35240474 34907524 33997310 33703895
$$ packed form
5507D0214358l22227N5129j945260L37524j4789q42366Q20516L60078L03550m56150
5497C8510363m32907N65252K34201m48584r34446n23832M20479O06736o36894
5488C7360368q60969J78758O19862N8393j024374o76157P27058J83251n60691
5479C6005499L08726M11988J042550N17370m029o33754n37966M14354M88141j022513
5469C6990366J90336J91596n41189J471857M82274J67105R1765j5194m12826m97557
5459C8118533Q05501r00304j451763n25647J353305j198820j056339l12771J06192
5450C4937887P10822J273l15226J011726J86324N9766O20691K94572j47336m67095
5440C6893404q16478q94798L819j9751n05503R85007m05226l32950r10214k93415
$$ plain form
5430 33703895 33960711 34008504 34024125 34801244 34709096 34828868 33905551 33656041 34027971 33173506
5420 33173506 32889189 32297312 31883425 33271626 34762401 34751015 34071031 32833049 32835690
5411 32835690 32690277 32240683 32099078 32092766 32534949 32759684 32022585 31447545 31551936 32447676
5401 32447676 31561559 31803370 32375719 31763915 31749789 30567684 29172611 29411685 28933209
5392 28933209 29775038 29872583 30077295 29943706 29922787 29018500 29389317 29610239 28359723 28420066
5382 28420066 27986434 27397578 28270000 28298224 27514835 26958847 27847108 28385864 28682921 29102020
5372 29102020 29254855 31129576 32096976 31706971 32096703 33166221 32740442 33166779 32711635
5363 32711635 31992752 31608584 31075615 29753916 28618048 27709314 26912149 27343880 27597969
$$ packed form
5430C3703895K56816M7793J5621P77119r2148J19772r23317k49510L71930q54465
5420C3173506k84317n91877m13887J388201J490775j1386o79984j237982K641
5411C2835690j45413m49594j41605o312M42183K24735p37099n75040J04391Q95740
5401C2447676q86117K41811N72349o11804j4126j182105j395073K39074m78476
5392B8933209Q41829R7545K04712j33589k0919r04287L70817K20922j250516O0343
5382B8420066m33632n88856Q72422K8224p83389n55988Q88261N38756K97057M19099
5372B9102020J52835J874721R67400l90005L89732J069518m25779M26337m55144
5363C2711635p18883l84168n32969j321699j135868r08734p97165M31731K54089
$$ plain form
5354 27597969 27329399 27499209 26876390 27234363 27438386 27409074 28248480 27840417 26620626
5345 26620626 26077938 27279777 28389057 27296445 27498842 27094812 26356076 25932759 26320624
5336 26320624 26699629 26851504 26577803 26993707 26654500 26737594 25304112 25006846 25222030
5327 25222030 25386310 27016466 26612705 26777512 26454735 26781620 26808402 25255259 24698602
5318 24698602 26194499 26876439 27921390 26851727 27477442 27079824 26692101 26328683 26711259
5309 26711259 26727049 26225422 25370967 26835452 27164890 26371789 25743764 26255442 27604562
5300 27604562 28356619 28966548 28635523 29526587 29966202 31179438 31857416 31393524 31076634
5291 31076634 31877063 32397894 31185987 32443751 32625639 31891318 33673454 33685825 33948275
$$ packed form
5354B7597969k68570J69810o22819L57973K04023k9312Q39406m08063j219791
5345B6620626n42688J201839J109280j092612K02397m04030p38736m23317L87865
5336B6320624L79005J51875k73701M15904l39207Q3094j433482k97266K15184
5327B5222030J64280J630156m03761J64807l22777L26885K6782j553143n56657
5318B4698602J495897O81940J044951j069663O25715l97618l87723l63418L82576
5309B6711259J5790n01627q54455J464485L29438p93101o28025N11678J349120
5300B7604562P52057O09929l31025Q91064M39615J213236O77978m63892l16890
5291C1076634Q00429N20831j211907J257764J81888p34321J782136J2371K62450
$$ plain form
5282 33948275 35635109 36915205 37534915 38914932 39791565 40588354 41183961 42005688 42360553
5273 42360553 42800707 43051006 43889731 43708432 43871994 44357725 43482169 42784878 43162486
5264 43162486 43680217 43299549 43242670 42690433 43154408 42940934 43271221 42957305 42981953 43595092
5254 43595092 43754683 44375688 45072095 44596641 43957160 44717720 44420322 43399423 43484859
5245 43484859 43509864 43918561 43394492 43063869 43256564 43912358 43661429 43218289 42174228
5236 42174228 40958821 39568538 38910587 39217175 38622333 36736711 34500722 33910428 32214462
5227 32214462 32106951 32202512 31042877 30721036 31096405 30618033 31017515 31604516 30803314
5218 30803314 29373042 28565828 27946687 29712439 29798983 28781991 28109119 28244053 27795010
$$ packed form
5282C3948275J686834J280096O19710J380017Q76633P96789N95607Q21727L54865
5273D2360553M40154K50299Q38725j81299J63562M85731q75556o97291L77608
5264D3162486N17731l80668n6879n52237M63975k13474L30287l13916K4648O13139
5254D3595092J59591O21005O96407m75454o39481P60560k97398j020899Q5436
5245D3484859K5005M08697n24069l30623J92695O55794k50929m43140j044061
5236D2174228j215407j390283o57951L06588n94842j885622k235989n90294j695966
5227C2214462j07511R5561j159635l21841L75369m78372L99482N87001q01202
5218C0803314j430272q07214o19141J765752Q6544j016992o72872J34934m49043
$$ plain form
5209 27795010 27760433 28186936 28403789 27467941 26875970 27138690 27057466 26850174 27515851 27337807
5199 27337807 26446408 26438627 26294069 26036772 25317451 26905383 27242212 26927860 27294061 27241806
5189 27241806 28059806 28228686 28082503 28254093 27466162 26935428 26745676 26800281 26271921 25822310
5179 25822310 25678332 26046617 27078462 25267201 25798209 26713769 26680494 26421268 26901352
5170 26901352 25048710 25023265 25514785 24739187 24701789 24515165 24841599 25035396 25790091 25736427
5160 25736427 26096342 25711448 24865277 24783825 24785328 24563480 24925934 25630165 25281840 25157036
5150 25157036 25652654 24848954 26114888 26778625 25698579 25902040 26217261 25380399 25317637
5141 25317637 25304990 24752391 25757618 26463713 25757449 26947384 26674403 25937048 25875097
$$ packed form
5209B7795010l4577M26503K16853r35848n91971K62720q1224k07292O65677j78044
5199B7337807q91399p781j44558k57297p19321J587932L36829l14352L66201n2255
5189B7241806Q18000J68880j46183J71590p87931n30734j89752N4605n28360m49611
5179B5822310j43978L68285J031845j811261N31008R15560l3275k59226M80084
5170B6901352j852642k5445M91520p75598l7398j86624L26434J93797P54695n3664
5160B5736427L59915l84894q46171q1452J503k21848L62454P04231l48325j24804
5150B5157036M95618q03700J265934O63737j080046K03461L15221q36862o2762
5141B5317637j2647n52599J005227P06095p06264J189935k72981p37355o1951
$$ plain form
5132 25875097 26791196 28088783 27481626 26862406 27968031 29441078 29680873 30637047 30253991
5123 30253991 29700215 30505025 31465202 32171611 31600471 32944722 31610588 31044111 32847890
5114 32847890 32265806 32609036 33445555 33877747 32830760 32580615 32578677 31088429 30970611
5105 30970611 30503603 31114160 31932201 32460658 31895894 32263878 32790573 33084766 33250654
5096 33250654 32959760 33696998 35554639 35204561 35574368 35953303 36524163 36748024 37555391
5087 37555391 38725435 39620096 40429161 41344552 43746603 44543686 44302600 44553149 44336026
5078 44336026 43351157 43012367 42679841 42856957 42483002 42069880 41841021 42268802 42070279
5069 42070279 43121724 43495257 42226537 41813991 41559742 42508478 43380406 44430658 45400410
$$ packed form
5132B5875097R16099J297587o07157o19220J105625J473047K39795R56174l83056
5123C0253991n53776Q04810R60177P06409n71140J344251j334134n66477J803779
5114C2847890n82084L43230Q36519M32192j046987k50145j938j490248j17818
5105C0970611m67008O10557Q18041N28457n64764L67984N26695K94193J65888
5096C3250654k90894P37238J857641l50078L69807L78935N70860K23861Q07367
5087C7555391J170044Q94661Q09065R15391K402051P97083k41086K50549k17123
5078D4336026r84869l38790l32526J77116l73955m13122k28859M27781j98523
5069D2070279J051445L73533j268720m12546k54249R48736Q71928J050252R69752
$$ plain form
5060 45400410 45961407 45657498 46087987 47724682 47531975 48479604 48512859 48122263 49176085
5051 49176085 48604834 48041773 48280227 50834734 50586787 50057609 50922434 51633890 51462783
5042 51462783 51763950 53359404 52307201 52542629 52014615 52948786 52540774 53122507 53403778
5033 53403778 52548856 51394205 51426915 52756309 53420223 53744663 54071052 54302909 54639859
5024 54639859 55658712 55811599 55672635 57008929 58788713 60037711 59885487 60478544 61150598
5015 61150598 61657324 61870565 63178983 62490680 62845891 64083014 64619689 65385016 65630280
5006 65630280 66601415 67930870 68809890 70630047 71833237 72242188 73096110 74030229 74598073
4997 74598073 74638999 76089796 77134944 77087570 77549620 79399014 79984300 80839024 82002507
$$ packed form
5060D5400410N60997l03909M30489J636695j92707R47629L3255l90596J053822
5051D9176085n71251n63061K38454K554507k47947n29178Q64825P11456j71107
5042E1462783L01167J595454j052203K35428n28014R34171m08012N81733K81271
5033E3403778q54922j154651L2710J329394O63914L24440L26389K31857L36950
5024E4639859J018853J52887j38964J336294J779784J248998j52224N93057O72054
5015F1150598N06726K13241J308418o88303L55211J237123N36675P65327K45264
5006F5630280R71135J329455Q79020J820157J203190M08951Q53922R34119N67844
4997G4598073M0926J450797J045148m7374M62050J849394N85286Q54724J163483
$$ plain form
4988 82002507 83988721 84987977 87428323 89496808 91945807 94426116 95708458 97253224
4980 97253224 99347845 101721999 104465598 106269310 108201902 110735056 113440631 115105964
4972 115105964 117000773 118976322 121533355 122723531 124438876 126086015 127979076 129542189
4964 129542189 131883195 133108224 135514424 138217166 141494653 145895771 148860956 153530584
4956 153530584 158572152 163258103 167755996 172273045 178385671 184607738 189264888 194544574
4948 194544574 199304465 203836443 205973551 207441569 207597977 207331716 207657626 206496657
4940 206496657 205942682 206483765 207550825 209651408 212892912 216581444 220886492 225518005
4932 225518005 228433812 232752284 234632278 234697770 233060714 231724661 228728739 225811905
$$ packed form
4988H2002507J986214R99256K440346K068485K448999K480309J282342J544766
4980I7253224K094621K374154K743599J803712J932592K533154K705575J665333
4972A15105964J894809J975549K557033J190176J715345J647139J893061J563113
4964A29542189K341006J225029K406200K702742L277487M401118K965185M669628
4956A53530584N041568M685951M497893M517049O112626O222067M657150N279686
4948A94544574M759891M531978K137108J468018J56408k66261L25910j160969
4940B06496657n53975N41083J067060K100583L241504L688532M305048M631513
4932B25518005K915807M318472J879994O5492j637056j336053k995922k916834
$$ plain form
4924 225811905 223238455 221384745 219383257 218276631 217534406 219832398 223569579 227320235
4916 227320235 232180925 239613226 246833516 254916128 262137451 268250251 271069621 272233125
4908 272233125 272671163 269526153 265852083 260108846 252447920 243420482 236819627 229833648
4900 229833648 223331005 219384960 217097561 215532750 215153919 212331931 208522322 205103881
4892 205103881 201960947 197287234 190982493 184056904 179142718 174418206 169390274 164723165
4884 164723165 161477465 159891461 159741222 159740095 160121551 161528394 162254019 164997220 168711118
4875 168711118 169762551 171331023 173649136 174595762 174499489 176842750 177836096 177727107 176706651
4866 176706651 176277459 176783292 176592979 176874957 175941842 176074860 177565599 178040291 176965722
$$ packed form
4924B25811905k573450j853710k001488j106626p42225K297992L737181L750656
4916B27320235M860690P432301P220290Q082612P221323O112800K819370J163504
4908B72233125M38038l145010l674070n743237p660926r027438o600855o985979
4900B29833648o502643l946045k287399j564811l78831k821988l809609l418441
4892B05103881l142934m673713o304741o925589m914186m724512n027932m667109
4884A64723165l245700j586004j50239j127L81456J406843P25625K743201L713898
4875A68711118J051433J568472K318113R46626r6273K343261R93346j08989j020456
4866A76706651m29192N05833j90313K81978r33115J33018J490739M74692j074569
$$ plain form
4857 176965722 175950545 175918045 174724893 173269344 171230303 169901237 168435529 165076382
4849 165076382 161027976 158615979 155328633 152332050 150168546 148952340 147411680 145901836
4841 145901836 145253091 144915176 143392936 144079858 143161270 143233790 144712875 144471964 142235782
4832 142235782 140260488 138918101 136043664 133504117 131410964 130558262 127777701 126224819
4824 126224819 122988550 121509219 120153511 117571577 116237872 117752195 117148212 116617098
4816 116617098 117404351 116448890 115887996 117029211 117433806 117458698 117401402 117317439 116952221 116666155
4806 116666155 115636157 114469783 113076685 112099487 110426930 108495373 107804330 107079852
4798 107079852 106763187 104959710 102673506 102197762 100501022 99940013 98381791 96773513
$$ packed form
4857A76965722j015177l2500j193152j455549k039041j329066j465708l359147
4849A65076382m048406k411997l287346k996583k163504j216206j540660j509844
4841A45901836o48745l37915j522240O86922r18588P2520J479085k40911k236182
4832A42235782j975294j342387k874437k539547k093153q52702k780561j552882
4824A26224819l236269j479331j355708k581934j333705J514323o03983n31114
4816A16617098P87253r55461n60894J141215M04595K4892n7296q3963l65218k86066
4806A16666155j029998j166374j393098r77198j672557j931557o91043p24478
4798A07079852l16665j803477k286204m75744j696740n61009j558222j608278
$$ plain form
4790 96773513 97023156 95555805 94669697 93568291 93105037 91979483 90367483 90376242 90546342
4781 90546342 90961354 89785616 89942501 89511734 87789943 87755327 86891490 86313104 85764689
4772 85764689 84667331 84117483 84402292 84568603 84557383 84360043 83621236 84514159 86217764
4763 86217764 86530057 86908650 87861711 89402418 90024297 90768687 92913708 93498523 93615258
4754 93615258 94205183 94761778 95594238 95939904 96336198 97457863 96514540 95498608 96390323
4745 96390323 96828144 96928037 96799528 97868113 98202780 98514037 99477690 101406510 102260389
4736 102260389 102583296 104198124 104384863 104461886 105548765 104525502 104748091 104785826 104533997
4727 104533997 103791652 104001395 103856170 103508418 102280774 102504441 103645429 104213072 104044646
$$ packed form
4790I6773513K49643j467351q86108j101406m63254j125554j612000Q759J70100
4781I0546342M15012j175738J56885m30767j721791l4616q63837n78386n48415
4772H5764689j097358n49848K84809J66311j1220j97340p38807Q92923J703605
4763H6217764L12293L78593R53061J540707O21879P44390K145021N84815J16735
4754I3615258N89925N56595Q32460L45666L96294J121665r43323j015932Q91715
4745I6390323M37821R9893j28509J068585L34667L11257R63653J928820Q53879
4736A02260389L22907J614828J86739P7023J086879j023263K22589L7735k51829
4727A04533997p42345K09743j45225l47752j227644K23667J140988N67643j68426
$$ plain form
4718 104044646 105151415 106978744 107778049 110407810 111615850 113224145 113115579 114057789
4710 114057789 115864578 116921441 117868697 119753515 120404141 119198668 117966033 118384430
4702 118384430 117328496 118012698 117544755 118537986 120859721 121436120 123078781 124014145 125053440
4693 125053440 125812170 127786415 129078964 129966156 131417964 133154090 135666805 138485694
4685 138485694 140056365 143396191 147995509 152622985 158052725 163560975 171934311 182076914
4677 182076914 191893693 204274529 218235849 235557917 260183750 287464855 317770349
4670 317770349 347536058 375182914 395620401 408611743 418608592 419712746 405291671
4663 405291671 384011054 363621705 343791082 322306392 300864290 282410525 265315271
$$ packed form
4718A04044646J106769J827329P99305K629761J208040J608295j08566R42210
4710A14057789J806789J056863R47256J884818O50626j205473j232635M18397
4702A18384430j055934O84202m67943R93231K321735N76399J642661R35364J039295
4693A25053440P58730J974245J292549Q87192J451808J736126K512715K818889
4685A38485694J570671L339826M599318M627476N429740N508250Q373336J0142603
4677A82076914R816779J2380836J3961320J7322068K4625833K7281105L0305494
4670C17770349K9765709K7646856K0437487J2991342R996849J104154j4421075
4663D05291671k1280617k0389349j9830623k1484690k1442102j8453765j7095254
$$ plain form
4656 265315271 250808878 239174255 228790423 219285702 211336936 204485144 200555264 196960630
4648 196960630 196970268 195660038 193519005 193253926 193344172 194282517 196694377 200251355 203654360
4639 203654360 207711791 212874537 218609537 226516866 233922062 241738731 247454870 251655913
4631 251655913 252264994 250354890 246052254 242676493 238627972 233389584 227954939 221490977
4623 221490977 214022456 208071480 203253661 195973973 190672488 187734167 184565569 182071677
4615 182071677 180357422 180148362 182008436 184735137 188914858 194522258 200539902 203841754
4607 203841754 203569462 201019784 198542625 194263597 190024817 185446094 179522433 172818590
4599 172818590 166712065 160820893 157074500 152351689 148421206 144632287 141058559 139225739
$$ packed form
4656B65315271j4506393j1634623j0383832r504721p948766o851792l929880l594634
4648A96960630R638j310230k141033k65079R0246R38345K411860L556978L403005
4639B03654360M057431N162746N735000P907329P405196P816669N716139M201043
4631B51655913O09081j910104m302636l375761m048521n238388n434645o463962
4623B21490977p468521n950976m817819p279688n301485k938321l168598k493892
4615A82071677j714255k09060J860074K726701M179721N607400O017644L301852
4607B03841754k72292k549678k477159m279028m238780m578723n923661o703843
4599A72818590o106525n891172l746393m722811l930483l788919l573728j832820
$$ plain form
4591 139225739 138149840 137702397 139043867 140097143 142015278 144376779 147027719 152671791
4583 152671791 159291577 167886764 177477424 186611949 195025073 203146344 211504884 219492469
4575 219492469 229255926 239657540 249676819 259601918 267632374 272294056 272361313 267820890
4567 267820890 259645537 246843637 232469427 216689457 200957159 188771066 178407244
4560 178407244 171060011 166723811 162215563 163200877 165532917 167686508 172885154 177770848
4552 177770848 179477389 180104569 179002138 176196666 172154035 167643234 163121771 158584638
4544 158584638 156198105 154295576 156366765 159544582 162829639 165869744 166473264 164166246
4536 164166246 159539629 152837403 144407088 135012208 126012439 116996654 110182044 103377557
$$ packed form
4591A39225739j075899m47443J341470J053276J918135K361501K650940N644072
4583A52671791O619786Q595187R590660R134525Q413124Q121271Q358540P987585
4575B19492469R763457J0401614J0019279R925099Q030456M661682O7257m540423
4567B67820890q175353j2801900j4374210j5779970j5732298j2186093j0363822
4560A78407244p347233m336200m508248R85314K332040K153591N198646M885694
4552A77770848J706541O27180j102431k805472m042631m510801m521463m537133
4544A58584638k386533j902529K071189L177817L285057L040105O03520k307018
4536A64166246m626617o702226q430315r394880q999769r015785o814610o804487
$$ plain form
4528 103377557 98212305 93979866 89153767 86286597 83799649 81120712 78104463 76124527
4520 76124527 73608666 71405986 69835854 66952579 64883248 63847639 62195415 61322597
4512 61322597 60337180 58676155 58331212 57714556 57575437 57203804 55358488 54649101 53924293
4503 53924293 52916411 53278795 52396819 52667829 51063396 49788821 50165152 49964590 49344822
4494 49344822 48565731 48683413 47989715 47370363 47495174 46043679 45014015 45379845 45516199
4485 45516199 44541778 45283088 45313968 44957237 44737813 44059360 43838121 43424047 42672063 42399522
4475 42399522 42744615 42638891 42614120 43155776 42765148 41515432 41183651 41750929 41730391 40233007
4465 40233007 40231154 40131269 40671080 40545806 40325539 39834100 39317924 38696284 38853505 39307783
$$ packed form
4528A03377557n165252m232439m826099k867170k486948k678937l016249j979936
4520G6124527k515861k202680j570132k883275k069331j035609j652224q72818
4512F1322597r85417j661025l44943o16656j39119l71633j845316p09387p24808
4503E3924293j007882L62384q81976K71010j604433j274575L76331k00562o19768
4494D9344822p79091J17682o93698o19352J24811j451495j029664L65830J36354
4485D5516199r74421P41310L0880l56731k19424o78453k21239m14074p51984k72541
4475D2399522L45093j05724k4771N41656l90628j249716l31781N67278k0538j497384
4465D0233007j853r9885N39811j25274k20267m91439n16176o21640J57221M54278
$$ plain form
4455 39307783 39788263 40316500 40728996 40796860 41072538 40976260 41699692 41507147 41397489 40857718
4445 40857718 41243477 42138622 42470472 42346667 42477878 42509562 42658880 41939690 42890769 43266176
4435 43266176 43061551 43792926 44559800 44129232 44885006 45687231 45618873 45298847 44906050 45477311
4425 45477311 45204382 46063749 46494788 48406258 49177542 49020094 50148926 50658416 51444590
4416 51444590 54401939 56122459 58085294 58915855 59134608 61247625 65234737 67368347
4408 67368347 70184628 73322746 78426712 83088347 85703249 87267496 87957510 88139427
4400 88139427 86455858 83483162 79401463 76658898 74504262 72214503 70364982 68527632
4392 68527632 68545849 68921160 68560400 67925113 69211957 70866034 72045987 74426154 77781788
$$ packed form
4455C9307783M80480N28237M12496O7864K75678r6278P23432j92545j09658n39771
4445D0857718L85759Q95145L31850j23805J31211L1684J49318p19190R51079L75407
4435D3266176k04625P31375P66874m30568P55774Q02225o8358l20026l92797N71261
4425D5477311k72929Q59367M31039J911470P71284j57448J128832N09490P86174
4416E1444590K957349J720520J962835Q30561K18753K113017L987112K133610
4408F7368347K816281L138118N103966M661635K614902J564247O90014J81917
4400H8139427j683569k972696m081699k742565k154636k289759j849521j837350
4392F8527632J8217L75311l60760o35287J286844J654077J179953K380167L355634
$$ plain form
4383 77781788 81998383 86338800 88245585 86900766 85279175 83962905 82350703 78870513
4375 78870513 76628389 73946190 72354750 71367394 69457429 68763426 67349507 66610918 65030497
4366 65030497 64443852 63365204 62492655 62198645 61333374 60592401 60005166 59242538 57996605
4357 57996605 57403731 56867151 55949930 55218448 55038690 53555071 52337079 51322749 50470829
4348 50470829 50513471 51615059 52625734 51779391 52449042 52977781 52674904 52891464 53399901
4339 53399901 53170369 53045006 52494385 52493022 52889383 51312791 51156056 50586119 49917466 49169657
4329 49169657 48292305 47780225 47348686 45557122 44790141 44609293 43365681 42741529 41965582
4320 41965582 41451597 41411012 39949892 39452367 40211152 40178942 38972502 37347813 35942896
$$ packed form
4383G7781788M216595M340417J906785j344819j621591j316270j612202l480190
4375G8870513k242124k682199j591440r87356j909965o94003j413919p38589j580421
4366F5030497n86645j078648q72549k94010q65271p40973n87235p62628j245933
4357E7996605n92874n36580r17221p31482j79758j483619j217992j014330q51920
4348E0470829M2642J101588J010675q46343O69651N28739l02877K16560N08437
4339E3399901k29532j25363n50621j363L96361j576592j56735n69937o68653p47809
4329D9169657q77352n12080m31539j791564p66981j80848j243612o24152p75947
4320D1965582n13985m0585j461120m97525P58785l2210j206440j624689j404917
$$ plain form
4311 35942896 36496126 36685133 36688627 36348656 36134297 35117958 34969211 34249883 33569821 32854981
4301 32854981 32689072 31975099 30961885 31783301 31503253 30775685 29977333 30975562 30986316
4292 30986316 29850213 29368594 28395756 27667408 29256227 29113562 28715461 30382620 31038043
4283 31038043 30887489 31431403 31757524 32564381 33025336 33377187 33456170 31976451 32686350
4274 32686350 32213973 30491968 30482979 29119177 28809541 27350567 26833548 26297570 25515348
4265 25515348 25506516 24145220 23662081 22937092 21391227 20899455 21397300 21338274 21974752 21567826
4255 21567826 20874614 20663099 21117364 21145322 19573269 18980899 19193569 18673320 18495208
4246 18495208 19127707 19162002 19153935 19210400 18711598 18333907 17847222 17546116 16999519 17804302
$$ packed form
4311C5942896N53230J89007L494l39971k14359j016339j48747p19328o80062p14840
4301C2854981j65909p13973j013214Q21416k80048p27568p98352R98229J0754
4292C0986316j136103m81619r72838p28348J588819j42665l98101J667159O55423
4283C1038043j50554N43914L26121Q06857M60955L51851P8983j479719P09899
4274C2686350m72377j722005q989j363802l09636j458974n17019n35978p82222
4265B5515348q832j361296m83139p24989j545865m91772M97845n9026O36478m06926
4255B1567826o93212k11515M54265K7958j572053n92370K12670n20249j78112
4246A8495208O32499L4295q067N6465m98802l77691m86685l01106n46597Q04783
$$ plain form
4236 17804302 18263795 17538730 18272647 17949288 17590622 16586811 17064816 18002336 17960563
4227 17960563 18486461 18735372 18053741 18060419 17696321 17750262 18165678 18354788 17580702 17745023
4217 17745023 17624080 17231672 16753077 16706578 18135643 16280252 16009785 15962114 15609309
4208 15609309 15564591 15343450 14943206 14841252 14918942 15608555 16048672 16277264 15310781 15811103
4198 15811103 15300937 14865027 15857794 15903943 15456017 15510741 16349283 16040943 16456793 15844937
4188 15844937 15119393 14433102 13819732 15015321 15807333 15305851 15427008 15037037 15234176
4179 15234176 14728721 14392319 14171621 14226555 14198061 13791954 14221450 14697599 14670113 14857886
4169 14857886 14792519 14868429 14439710 13353879 13373883 14159218 14373328 15520473 14988389 14121710
$$ packed form
4236A7804302M59493p25065P33917l23359l58666j003811M78005R37520m1773
4227A7960563N25898K48911o81631O678l64098N3941M15416J89110p74086J64321
4217A7745023j20943l92408m78595m6499J429065j855391k70467m7671l52805
4208A5609309m4718k21141m00244j01954P7690O89613M40117K28592r66483N00322
4198A5811103n10166m35910R92767M6149m47926N4724Q38542l08340M15850o11856
4188A5844937p25544o86291o13370J195589P92012n01482J21157l89971J97139
4179A5234176n05455l36402k20698N4934k8494m06107M29496M76149k7486J87773
4169A4857886o5367P5910m28719j085831K0004P85335K14110J147145n32084q66679
$$ plain form
4159 14121710 14550746 13781518 14253231 14209384 13694450 14187715 14627707 13718306 13105317 13353918
4149 13353918 13408593 13642043 13156199 13374447 14010506 13454880 13545175 13810010 13103861 12864853
4139 12864853 11969287 13484518 14117049 14048647 13072835 13436193 13721778 12866370 12459564
4130 12459564 12481792 13699842 13608699 13971106 14871515 15316697 13472001 12955729 13078775
4121 13078775 14045899 13672379 13526415 13656439 13385432 14679065 14307601 14619304 14476102
4112 14476102 14789024 14120934 13517428 13909048 14074677 15238019 14392213 15676904 15832060
4103 15832060 15734794 16248808 16892119 16822864 16517663 17771981 18834532 18824943 17865195 17781286
4093 17781286 17954928 16942464 17869090 18539524 18549762 18940316 19619258 19460555 18881136
$$ packed form
4159A4121710M29036p69228M71713m3847n14934M93265M39992r09401o12989K48601
4149A3353918N4675K33450m85844K18248O36059n55626R0295K64835p06149k39008
4139A2864853q95566J515231O32531o8402r75812L63358K85585q55408m06806
4130A2459564K2228J218050r1143L62407R00409M45182j844696n16272J23046
4121A3078775R67124l73520j45964J30024k71007J293633l71464L11703j43202
4112A4476102L12922o68090o03506L91620J65629J163342q45806J284691J55156
4103A5832060r7266N14014O43311o9255l05201J254318J062551r589r59748q3909
4093A7781286J73642j012464R26626O70434J0238L90554O78942j58703n79419
$$ plain form
4084 18881136 18440172 18614477 20117090 21131961 21868548 22973052 23249659 22078785 23126020
4075 23126020 24049190 25271935 26395721 26137396 27781691 27787449 29840694 31280744 32541901
4066 32541901 33121133 34375978 35832078 36941941 38245862 38998533 40045632 39267690 38143277
4057 38143277 38848134 39369770 39264553 39087692 39148169 40412989 39188074 38781894 39226556
4048 39226556 40423766 41294274 40555888 41183441 42087144 41399042 40784246 39276110 39345512
4039 39345512 40340885 40391257 39545477 39065376 38160604 39817952 40040280 39950324 39248988 38899926
4029 38899926 36994399 36454274 38292044 38091859 38245891 38422749 38701214 37548877 35946295
4020 35946295 35391017 33858589 32920916 32128251 31216879 29153090 27154499 26877149 25215598
$$ packed form
4084A8881136m40964J74305J502613J014871P36587J104504K76607j170874J047235
4075B3126020R23170J222745J123786k58325J644295N758K053245J440050J261157
4066C2541901N79232J254845J456100J109863J303921P52671J047099p77942j124413
4057C8143277P04857N21636j05217j76861O0477J264820j224915m06180M44662
4048C9226556J197210Q70508p38386O27553R03703o88102o14796j508136O9402
4039C9345512R95373N0372q45780m80101r04772J657348K22328q9956p01336l49062
4029C8899926j905527n40125J837770k00185J54032J76858K78465j152337j602582
4020C5946295n55278j532428r37673p92665r11372k063789j998591k77350j661551
$$ plain form
4011 25215598 25270205 25307687 24361027 24137555 24477409 23626194 23206158 22915610 23313738 23262748
4001 23262748 22663193 22980363 21793749 21734932 21080204 21017910 21413412 20383584 18938759
3992 18938759 19056033 19510846 18642291 17598781 17873746 18205104 17364955 16574090 15294313
3983 15294313 15297815 15431746 15044154 15296713 14852055 14429280 14467994 14671035 14987888 14597317
3973 14597317 13881282 14193258 13167771 12721511 12989061 11224951 11098697 11633261 12062637
3964 12062637 12698334 12194587 11750625 11957419 11290862 11881547 11965489 12101723 13463674
3955 13463674 12818560 12350622 12612455 12712960 13019092 12874922 12571490 11761960 11107366
3946 11107366 10583437 11843399 10781103 10918402 12283679 11920028 11214845 11780234 12228629
$$ packed form
4011B5215598N4607L7482r46660k23472L39854q51215m20036k90548L98128n0990
4001B3262748n99555L17170j186614n8817o54728o2294L95502j029828j444825
3992A8938759J17274M54813q68555j043510K74965L31358q40149p90865j279777
3983A5294313L502J33931l87592K52559m44658m22775L8714K03041L16853l90571
3973A4597317p16035L11976j025487m46260K67550j764110j26254N34564M29376
3964A2062637O35697n03747m43962K06794o66557N90685Q3942J36234J361951
3955A3463674o45114m67938K61833J00505L06132j44170l03432q09530o54594
3946A1107366n23929J259962j062296J37299J365277l63651p05183N65389M48395
$$ plain form
3937 12228629 11692170 11305329 11499139 12098006 11268861 10983704 11794369 12270267 12619025
3928 12619025 12453526 12138711 11366392 12435652 12383726 12520891 13640713 13676272 13418216
3919 13418216 13114895 12992299 13302564 14411279 14747273 15398319 15727223 15594016 15160197
3910 15160197 15399919 15855254 16958249 17922127 17881932 18251249 17801914 18039298 19955965
3901 19955965 20324443 21165866 22317907 24107583 26309384 28233682 30891146 33226356
3893 33226356 36250841 38649504 41751411 47083023 52326149 57140608 62884473 69311189
3885 69311189 74590255 78136183 79294968 77761976 74678719 70095604 65332648 60137168
3877 60137168 54104380 48801054 44945836 42016777 39128394 38029013 35137164 34068828
$$ packed form
3937A2228629n36459l86841J93810N98867q29145k85157Q10665M75898L48758
3928A2619025j65499l14815p72319J069260n1926J37165J119822L5559k58056
3919A3418216l03321j22596L10265J108715L35994O51046L28904j33207m33819
3910A5160197K39722M55335J102995R63878m0195L69317m49335K37384J916667
3901A9955965L68478Q41423J152041J789676K201801J924298K657464K335210
3893C3226356L024485K398663L101907N331612N243126M814459N743865O426716
3885F9311189N279066L545928J158785j532992l083257m583115m762956n195480
3877F0137168o032788n303326l855218k929059k888383j099381k891849j068336
$$ plain form
3869 34068828 33394970 31564847 30464793 28713754 26943433 25370545 24044267 23077224
3861 23077224 22890279 22859193 22097922 21202015 20220485 19468531 18615959 17740099 17783957 18689347
3851 18689347 18401012 17452297 15991399 16467840 16578967 16786813 16164170 15664088 15092296
3842 15092296 13839642 14497527 14148293 14131251 13630062 13990435 14472209 14191593 14277875 14428434
3832 14428434 14071553 13895622 12933369 12300643 12560344 12612300 12681629 13224876 12391619 13034961
3822 13034961 13220258 12362812 12332557 12640147 12904876 12767673 13216692 12618818 12191277 13043620
3812 13043620 13458921 13459833 13650902 13258266 12992028 12668808 13267733 13757490 12978928 13449600
3802 13449600 13744131 13815183 13724447 13928044 13726430 13375412 12922860 13897273 13741349 13868025
$$ packed form
3869C4068828o73858j830123j100054j751039j770321j572888j326278r67043
3861B3077224j86945l1086p61271q95907r81530p51954q52572q75860M3858R05390
3851A8689347k88335r48715j460898M76441J11127K07846o22643n00082n71792
3842A5092296j252654O57885l49234j7042n01189L60373M81774k80616Q6282J50559
3832A4428434l56881j75931r62253o32726K59701N1956O9329N43247q33257O43342
3822A3034961J85297q57446l0255L07590K64729j37203M49019n97874m27541Q52343
3812A3043620M15301R12J91069l92636k66238l23220N98925M89757p78562M70672
3802A3449600K94531P1052r0736K03597k01614l51018m52552R74413j55924J26676
$$ plain form
3792 13868025 14574024 14116982 13865642 14032290 14550527 14147763 13175494 12008544 13210617
3783 13210617 14069280 15167252 14505683 14297940 14671573 14249132 14073243 14559244 14567886 14548191
3773 14548191 14439203 14539538 15248415 14050058 13346029 14115615 13870344 13606570 14161865
3764 14161865 13880774 13968648 14431230 13827436 14199989 15157240 15449127 14424918 13844178
3755 13844178 14372178 15478839 15397141 15050009 14838530 13348503 13920349 14616771 15298243
3746 15298243 14112348 13770333 14163371 14490435 15165206 15725377 16020689 15643464 15255765
3737 15255765 15362181 15535386 15899999 15605381 14731692 14629243 15998817 15455901 15672106
3728 15672106 16994832 16807252 17691570 16697797 15971234 16809845 16801656 16335723 16574229 16418161
$$ packed form
3792A3868025P05999m57042k51340J66648N18237m02764r72269j166950J202073
3783A3210617Q58663J097972o61569k07743L73633m22441j75889M86001Q642j9695
3773A4548191j08988J00335P08877j198357p04029P69586k45271k63774N55295
3764A4161865k81091Q7874M62582o03794L72553R57251K91887j024209n80740
3755A3844178N28000J106661q1698l47132k11479j490027N71846O96422O81472
3746A5298243j185895l42015L93038L27064O74771N60171K95312l77225l87699
3737A5255765J06416J73205L64613k94618q73689j02449J369574n42916K16205
3728A5672106J322726j87580Q84318r93773p26563Q38611q189m65933K38506j56068
$$ plain form
3718 16418161 16697484 15935591 16600668 18202803 18442779 17764950 17179485 16594475 17111280
3709 17111280 18511669 19006540 19090970 18949355 18828250 19134420 19547204 20186962 20495043
3700 20495043 19794650 20516480 19625605 19567213 18977152 18987280 20384461 20862909 21173815 20704210
3690 20704210 20835175 21336285 21080619 21180214 21818929 23554512 23653791 23285460 22985726 23252945
3680 23252945 23831008 24170035 25241268 25877738 25535532 25429048 25368760 25182325 26247065
3671 26247065 27714332 28350012 28667987 29454854 30310603 31196219 31538468 32434869 33504159
3662 33504159 33699889 34091791 35705888 35386270 36073295 37126659 36749868 36380780 35953619
3653 35953619 36600774 37263097 36526850 35915967 36031053 37405501 37526321 37240095 37492826
$$ packed form
3718A6418161K79323p61893O65077J602135K39976o77829n85465n85010N16805
3709A7111280J400389M94871Q4430j41615j21105L06170M12784O39758L08081
3700B0495043p00393P21830q90875n8392n90061J0128J397181M78448L10906m69605
3690B0704210J30965N01110k55666R9595O38715J735583R9279l68331k99734K67219
3680B3252945N78063L39027J071233O36470l42206j06484o0288j86435J064740
3671B6247065J467267O35680L17975P86867Q55749Q85616L42249Q96401J069290
3662C3504159J95730L91902J614097l19618O87025J053364l76791l69088m27161
3653C5953619O47155O62323p36247o10883J15086J374448J20820k86226K52731
$$ plain form
3644 37492826 36554523 36753622 37614648 38198057 38311045 37707206 39283808 39771907 40115154
3635 40115154 40373806 40954585 41442633 42009716 41439077 41522119 43181767 43173626 43913303 43446507
3625 43446507 43736815 44544003 44793700 44945711 44145500 44556283 45134308 45548643 45878806
3616 45878806 45821197 44948357 45169923 45648249 45591057 45641329 45646864 46420091 47148209 47019026
3606 47019026 46550441 48298144 49370589 49146546 48714244 49166700 48434204 47702779 47582459
3597 47582459 47040742 48055933 47637890 47421468 48919434 49524360 49170454 47625303 47433966
3588 47433966 48886989 48791171 47928836 48095708 47669033 47456839 47935005 49955804 50452768
3579 50452768 49366087 47731211 46783505 48332471 48124397 47137511 46659984 46477142 45665997
$$ packed form
3644C7492826r38303J99099Q61026N83409J12988o03839J576602M88099L43247
3635D0115154K58652N80779M88048N67083n70639Q3042J659648q141P39677m66796
3625D3446507K90308Q07188K49697J52011q00211M10783N78025M14335L30163
3616D5878806n7609q72840K21566M78326n7192N0272N535P73227P28118j29183
3606D7019026m68585J747703J072445k24043m32302M52456p32496p31425j20320
3597D7582459n41717J015191m18043k16422J497966O04926l53906j545151j91337
3588D7433966J453023r5818q62335J66872m26675k12194M78166K020799M96964
3579E0452768j086681j634876r47706J548966k08074r86886m77527j82842q11145
$$ plain form
3570 45665997 43927879 43896837 44701591 43497596 41823585 41276212 41423434 42504937 42695533
3561 42695533 41805145 42391664 41707310 41502630 41543599 41286809 40136716 41027599 42297319
3552 42297319 43217958 44960025 44136606 43705453 42903293 43101744 43313141 43602377 43701838
3543 43701838 43827400 43987429 42724489 41698828 41647870 42710813 42432115 41062452 41154074
3534 41154074 42067548 43433749 43257372 41517246 41407305 42360626 42861248 42562470 44205691
3525 44205691 44609556 44323986 44097460 44718501 45413384 45218132 45752567 46397141 47372013
3516 47372013 47432238 47779196 47700050 47512686 47283750 48687476 49407567 48224950 46780147
3507 46780147 48040442 48698627 49144041 50273570 51462212 52591175 54036055 54944396 56087362
$$ packed form
3570D5665997j738118l1042Q04754j203995j674011n47373J47222J081503J90596
3561D2695533q90388N86519o84354k04680M0969k56790j150093Q90883J269720
3552D2297319R20639J742067q23419m31153q02160J98451K11397K89236R9461
3543D3701838J25562J60029j262940j025661n0958J062943k78698j369663R1622
3534D1154074R13474J366201j76377j740126j09941R53321N00622k98778J643221
3525D4205691M03865k85570k26526O21041O94883j95252N34435O44574R74872
3516D7372013O0225L46958p9146j87364k28936J403726P20091j182617j444803
3507D6780147J260295O58185M45414J129529J188642J128963J444880R08341J142966
$$ plain form
3498 56087362 57408446 58932371 60949786 62726670 64662773 67244497 70032467 72836957
3490 72836957 74357223 76667597 79439237 81984999 82340108 82906987 82903298 80411892 77267973
3481 77267973 74349820 72091584 68512462 66328758 63420233 61900361 60292872 59486683
3473 59486683 57604163 55688794 55108264 53826394 53420718 52157872 50536805 49194373
3465 49194373 49006432 48599764 46749902 46266310 46545198 46068658 45407748 44724042 45717578
3456 45717578 46475769 46619065 48304384 49892978 48789912 47779083 47177914 45436738 43105410
3447 43105410 40939458 39527979 38065371 36421972 35320856 35325669 34084665 33999466 33634679
3438 33634679 32231367 31332532 30840198 30438365 30388871 29749331 30529849 30508658 29995491 29335173
$$ packed form
3498E6087362J321084J523925K017415J776884J936103K581724K787970K804490
3490G2836957J520266K310374K771640K545762L55109N66879l689k491406l143919
3481G7267973k918153k258236l579122k183704k908525j519872j607489q06189
3473E9486683j882520j915369n80530j281870m05676j262846j621067j342432
3465D9194373j87941m06668j849862m83592K78888m76540o60910o83706R93536
3456D5717578P58191J43296J685319J588594j103066j010829o01169j741176k331328
3447D3105410k165952j411479j462608j643399j101116M813j241004q5199l64787
3438C3634679j403312q98835m92334m01833m9494o39540P80518k1191n13167o60318
$$ plain form
3428 29335173 28833957 29055092 29189339 30240816 30124291 30615242 32171724 32246319 31831380
3419 31831380 29899736 28485950 28509058 28668750 27825982 26994655 26998605 26547039 25021720
3410 25021720 25437273 26028855 25710109 24473795 23646725 23935004 23856995 23550235 24283228
3401 24283228 23526895 24356352 24789749 24170845 23912336 24707122 25003190 23332595 23659097
3392 23659097 23526759 23888288 23311538 23420817 22899411 22710046 22840748 22965437 22614078
3383 22614078 23006123 22565573 22704944 23045969 23069239 23109353 22614441 23536810 23474124 23194378
3373 23194378 23605296 24939310 24423614 23784753 23997039 23918598 24274169 24244029 23557122 24496270
3363 24496270 24861873 25209953 26274619 27106932 28091559 29267649 29395532 29367243 30390557
$$ packed form
3428B9335173n01216K21135J34247J051477j16525M90951J556482P4595m14939
3419C1831380j931644j413786K3108J59692q42768q31327L950m51566j525319
3410B5021720M15553N91582l18746j236314q27070K88279p8009l06760P32993
3401B4283228p56333Q29457M33397o18904k58509P94786K96068j670595L26502
3392B3659097j32338L61529n76750J09279n21406j89365J30702J24689l51359
3383B2614078L92045m40550J39371L41025K3270M0114m94912R22369o2686k79746
3373B3194378M10918J334014n15696o38861K12286p8441L55571l0140o86907R39148
3363B4496270L65603L48080J064666Q32313R84627J176090J27883k8289J023314
$$ plain form
3354 30390557 29089021 28027121 27375646 26832021 24269131 24209165 24853230 23855050 23144627
3345 23144627 23828985 23572292 23206315 23389606 23136953 22631115 22827674 22548261 21677943
3336 21677943 22254429 24027054 25710279 25963405 26507813 27569022 28003578 28732645 31286065
3327 31286065 33496923 33788578 34836667 35268467 34464076 33157079 31453817 30914910 29744648
3318 29744648 28251219 26831066 25390254 25017431 25204043 24703306 23883823 23164824 22819913
3309 22819913 21631005 20964396 21748127 21563527 20778998 21179723 21564138 20943822 21223435
3300 21223435 22020690 21772465 20839787 20928063 21012573 22131072 22092228 22116527 22362701 23193422
3290 23193422 23162422 21434823 19939791 19855778 19895911 19032638 18588314 18687968 18694615 17418356
$$ packed form
3354C0390557j301536j061900o51475n43625k562890n9966O44065r98180p10423
3345B3144627O84358k56693l65977J83291k52653n05838J96559k79413q70318
3336B1677943N76486J772625J683225K53126N44408J061209M34556P29067K553420
3327C1286065K210858K91655J048089M31800q04391j306997j703262n38907j170262
3318B9744648j493429j420153j440812l72823J86612n00737q19483p18999l44911
3309B2819913j188908o66609P83731j84600p84529M00725L84415o20316K79613
3300B1223435P97255k48225r32678Q8276Q4510J118499l8844K4299K46174Q30721
3290B3193422l1000j727599j495032q4013M0133q63273m44324R9654O647j276259
$$ plain form
3280 17418356 18158205 17898604 17265738 18047313 19135050 19500609 18824754 18676584 19381252
3271 19381252 19306142 18373312 17205480 16965120 16327620 15618104 16526970 16074828 15586836
3262 15586836 15085834 14228254 13360155 14041530 13537353 13939060 14876047 14684635 14737409 14995213
3252 14995213 16443805 15841214 14826442 14150141 14182370 14336577 15101268 15074689 15381433
3243 15381433 15907813 17271914 16331376 16849296 16124877 17256717 16544674 16216966 17189989
3234 17189989 15698395 15440631 15718786 15881825 15254277 14938544 15934094 16352177 16008105
3225 16008105 16181598 16019263 16650860 16983018 17366998 18130856 18516458 18829398 18589175
3216 18589175 18658044 19108978 19056596 19618874 19301765 20583702 20921643 20735390 20910082 21021583
$$ packed form
3280A7418356P39849k59601o32866P81575J087737L65559o75855j48170P04668
3271A9381252p5110r32830j167832k40360o37500p09516R08866m52142m87992
3262A5586836n01002q57580q68099O81375n04177M01707R36987j91412N2774K57804
3252A4995213J448592o02591j014772o76301L2229J54207P64691k6579L06744
3243A5381433N26380J364101r40538N17920p24419J131840p12043l27708R73023
3234A7189989j491594k57764K78155J63039o27548l15733R95550M18083l44072
3225A6008105J73493j62335O31597L32158L83980P63858L85602L12940k40223
3216A8589175O8869M50934n2382N62278l17109J281937L37941j86253J74692J11501
$$ plain form
3206 21021583 21258051 21826100 22291707 22410038 22496770 23720061 25387388 25648439 27147171
3197 27147171 27855979 26957697 27747646 29253888 30172355 32477938 33662909 35092447 37183924
3188 37183924 39101150 41318325 43505588 46622485 47504934 48879729 49200599 48963597 48570213
3179 48570213 47608342 47628556 48810992 47733369 47813280 47512590 47248109 46679455 47043370
3170 47043370 46637601 45596594 46243260 46673132 47893570 49530714 49865837 49795559 51351663
3161 51351663 51884831 52000960 52878594 54704133 57145282 59946232 64250989 68218666 70397747
3152 70397747 72099068 72586976 73884359 74155164 72954197 70476680 69093090 66719468
3144 66719468 64841448 62113937 59942270 58389878 57082740 55388779 53525936 53030122
$$ packed form
3206B1021583K36468N68049M65607J18331Q6732J223291J667327K61051J498732
3197B7147171P08808q98282P89949J506242R18467K305583J184971J429538K091477
3188C7183924J917226K217175K187263L116897Q82449J374795L20870k37002l93384
3179D8570213r61871K0214J182436j077623P9911l00690k64481n68654L63915
3170D7043370m05769j041007O46666M29872J220438J637144L35123p0278J556104
3161E1351663N33168J16129Q77634J825539K441149K800950M304757L967677K179081
3152G0397747J701321M87908J297383K70805j200967k477517j383590k373622
3144F6719468j878020k727511k171667j552392j307138j693961j862843m95814
$$ plain form
3136 53030122 51860780 50466884 49159910 48667335 48555201 48225423 47041547 47056037 47086733
3127 47086733 47649932 48204488 49034127 48325632 49402661 49805427 49536661 49964223 49819382
3118 49819382 49095101 47013044 46088038 44370592 42498060 42358834 40450142 38764580 37978626
3109 37978626 37074788 35977043 34562053 34338414 34090417 33571633 33149938 32269493 31882802
3100 31882802 32555385 32112183 32559546 31774261 31622192 31932575 31787992 32637263 32757944
3091 32757944 32540018 32625567 31438403 31044770 29805177 29073634 27938578 26056646 24327244
3082 24327244 24132103 22506592 21991398 21443661 20569411 20725013 20571770 21088499 20018682
3073 20018682 18916553 19362545 20180365 19153924 18198650 17109635 18760703 17668010 16164470
$$ packed form
3136E3030122j169342j393896j306974m92575j12134l29778j183876J4490L0696
3127D7086733N63199N54556Q29639p08495J077029M02766k68766M27562j44841
3118D9819382p24281k082057r25006j717446j872532j39226j908692j685562p85954
3109C7978626r03838j097745j414990k23639k47997n18784m21695q80445l86691
3100C1882802O72583m43202M47363p85285j52069L10383j44583Q49271J20681
3091C2757944k17926Q5549j187164l93633j239593p31543j135056j881932j729402
3082B4327244j95141j625511n15194n47737q74250J55602j53243N16729j069817
3073B0018682j102129M45992Q17820j026441r55274j089015J651068j092693j503540
$$ plain form
3064 16164470 16142362 15086017 14928422 16038020 15296241 14889692 15115407 15951061 15028748
3055 15028748 13937068 14161097 13116612 11936650 11456684 11971232 12659174 13078973 12224667
3046 12224667 11819172 12473059 12880042 12840696 12869280 12068766 11052401 12390905 12688578
3037 12688578 12166386 12450767 10486375 9142259 9633602 10101117 10598443 9941705 10465100
3028 10465100 10845107 9663737 9327320 8831088 8531569 8002342 8037831 8374169 8989951
3019 8989951 8528945 8013445 7361858 7401959 6662507 6961075 8286097 8459059 7946942 7375798
3009 7375798 7137380 5678989 6308918 6991650 6688224 6649248 6589566 6317712 5793599 6008017
2999 6008017 6390640 6521967 6491161 5282737 4719590 5668533 5605185 4797186 4971724 4369395
$$ packed form
3064A6164470k2108j056345j57595J109598p41779m06549K25715Q35654r22313
3055A5028748j091680K24029j044485j179962m79966N14548O87942M19799q54306
3046A2224667m05495O53887M06983l9346K8584q00514j016365J338504K97673
3037A2688578n22192K84381j964392j344116M91343M67515M97326o56738N23395
3028A0465100L80007j181370l36417m96232k99519n29227L5489L36338O15782
3019H989951m61006n15500o51587M0101p39452K98568J325022J72962n12117n71144
3009G375798k38418j458391O29929O82732l03426l8976n9682k71854n24113K14418
2999F008017L82623J31327l0806j208424n63147R48943o3348q07999J74538o02329
$$ plain form
2989 4369395 4627496 5330825 5396572 4609448 4558434 5644324 4963312 4674166 4063606 3749885
2979 3749885 3839697 3888047 4268320 3725037 3986619 4306596 4918948 4821960 5220225 5578097
2969 5578097 4381705 4087619 3484444 3804973 4294051 4052329 3823057 3869788 3275140 2549621
2959 2549621 2820940 3645030 4049859 3300780 2380181 2525529 2804747 2659812 1975526 3115700
2949 3115700 3100707 2546881 2251447 2718735 2811025 3052274 2871774 2719879 3066128 2308062
2939 2308062 2133527 2618746 3090051 3675006 3358935 3387155 2933979 1868861 2856680 4006688
2929 4006688 3447201 2990343 3527356 2372928 1918466 1675912 2248624 2616277 2720552
2920 2720552 3360562 3201863 2940997 2746537 2824747 2715899 1818263 1276213 1764458 1286527
$$ packed form
2989D369395K58101P03329O5747p87124n1014J085890o81012k89146o10560l13721
2979C749885Q9812M8350L80273n43283K61582L19977O12352r6988L98265L57872
2969E578097j196392k94086o03175L20529M89078k41722k29272M6731n94648p25519
2959B549621K71319Q24090M04829p49079r20599J45348K79218j44935o84286J140174
2949C115700j4993n53826k95434M67288R2290K41249j80500j51895L46249p58066
2939B308062j74535M85219M71305N84955l16071K8220m53176j065118R87819J150008
2929D006688n59487m56858N37013j154428m54462k42554N72712L67653J04275
2920B720552O40010j58699k60866j94460P8210j08848q97636n42050M88245m77931
$$ plain form
2910 1286527 1219516 1873425 2330317 1245822 1033167 1988250 2024674 1179071 436622 1092961
2900 1092961 1281122 2228401 1816080 1212740 1217097 1251195 1781659 2323834 1791166 622086
2890 622086 1346867 2148169 1569555 2082258 1814472 1560273 1043143 1797177 2614851 2694305
2880 2694305 1016151 588635 1585096 1674487 2080419 2072121 1643694 1706796 3147553 2036973
2870 2036973 650050 1102775 2243624 1103574 935140 1628082 542839 358950 348404
2861 348404 467369 663062 2003821 2120230 1524158 1411335 1637374 1462934 1940133 1561979
2851 1561979 1142386 1282784 1055666 1529009 1924498 1002033 784165 1222350 900091 1517345
2841 1517345 812998 427723 82578 1440219 2141157 483637 915256 670664 1097587
$$ packed form
2910A286527o7011O53909M56892j084495k12655R55083L6424q45603p42449O56339
2900A092961J88161R47279m12321o03340M357L4098N30464N42175n32668j169080
2890F22086P24781Q01302n78614N12703k67786k54199n17130P54034Q17674P9454
2880B694305j678154m27516R96461Q9391M05932q298m28427O3102J440757j110580
2870B036973j386923M52725J140849j140050j68434O92942j085243j83889j0546
2861C48404J18965J95693J340759J16409n96072j12823K26039j74440M77199l78154
2851A561979m19593J40398k27118M73343L95489r22465k17868M38185l22259O17254
2841A517345p04347l85275l45145J357641P00938j657520M31619k44592M26923
$$ plain form
2832 1097587 1284084 -620670 -1113562 -296541 783434 611802 584779 977100 1161100
2823 1161100 405656 475020 285956 1264520 1880063 234334 -383543 1420666 1270723
2814 1270723 1334464 881081 549181 1305344 508459 -33027 -128769 -389132 698515 1389689
2804 1389689 232205 911885 1724592 1721402 567479 674123 574203 679765 76472 -375858
2794 -375858 773887 1029107 1232930 2701210 1742402 441944 -1230596 -774629 877712
2785 877712 1186550 1305231 443754 80829 -63207 -694215 -512286 -675130 -526843 827090
2775 827090 930489 -425648 15035 1316760 1518760 213071 -92151 334000 -47441
2766 -47441 531459 320577 406874 -536041 428875 191901 -84842 182604 -26168 189391
$$ packed form
2832A097587J86497j904754m92892Q17021J079975j71632k7023L92321J84000
2823A161100p55444O9364j89064R78564O15543j645729o17877J804209j49943
2814A270723O3741m53383l31900P56163p96885n41486r5742k60363J087647O91174
2804A389689j157484O79680Q12707l190j153923J06644r9920J05562o03293m52330
2794c75858J149745K55220K03823J468280r58808j300458j672540M55967J652341
2785H77712L08838J18681q61477l62925j44036o31008J81929j62844J48287J353933
2775H27090J03399j356137M40683J301725K02000j305689l05222M26151l81441
2766d7441N78900k10882Q6297r42915R64916k36974k76743K67446k08772K15559
$$ plain form
2756 189391 -215413 67598 -149457 -712740 -309219 350706 854929 1175746 493029 -483122
2746 -483122 683441 1031981 723516 179374 -398471 -338792 92863 173091 -114949 -169073
2736 -169073 -454424 607919 504331 -563589 -888686 -40878 570387 407934 -525259
2727 -525259 -231054 119891 -759026 442495 790087 670540 -877110 -624132 -423473
2718 -423473 -1090915 -172839 468354 -31566 35810 -688699 -848646 -166998 570224 1080772
2708 1080772 913326 531871 375410 -239786 -1263118 -570568 1109175 861229 -123502
2699 -123502 142165 -1126511 -1435540 -678877 756329 1502420 537002 -615258 -915545
2690 -915545 -1149412 -1415067 -410688 -128961 175935 229016 -548614 -1908191 -2414281 -2579681
$$ packed form
2756A89391m04804K83011k17055n63283M03521O59925N04223L20817o82717r76151
2746d83122J166563L48540l08465n44142n77845N9679M31655Q0228k88040n4124
2736a69073k85351J062343j03588j067920l25097Q47808O11265j62453r33193
2727e25259K94205L50945q78917J201521L47592j19547j547650K52978K00659
2718d23473o67442R18076O41193m99920O7376p24509j59947O81648P37222N10548
2708A080772j67446l81455j56461o15196j023332O92550J679743k47946r84731
2699a23502K65667j268676l09029P56663J435206P46091r65418j152260l00287
2690i15545k33867k65655J004379K81727L04896N3081p77630j359577n06090j65400
$$ plain form
2680 -2579681 -1412289 314079 1125212 464574 -267021 -97161 295042 1639702 435360
2671 435360 26873 -457532 147094 157850 -102183 518409 -2196 838580 681083 321572
2661 321572 699865 531894 542783 631518 1965731 1360612 1362981 66177 446487 698864
2651 698864 923869 1335329 330466 153320 -111408 221867 -688876 -587540 141221 -613071
2641 -613071 -242665 -574018 -587020 -296582 -1144027 -747634 -402194 -413798 -45714 -106153
2631 -106153 625288 187401 683150 1627216 1690265 308880 -391582 574576 1030028 774900
2621 774900 75391 443850 704772 509735 1176254 1963726 1931304 1563059 2193051 2787947
2611 2787947 1234127 448754 832856 334864 674433 604873 597344 665593 -606747 -295224
$$ packed form
2680b579681J167392J726368Q11133o60638p31595J69860L92203J344660j204342
2671D35360m08487m84405O04626J0756k60033O20592n20605Q40776j57497l59511
2661C21572L78293j67971J0889Q8735J334213o05119K369j296804L80310K52377
2651F98864K25005M11460j004863j77146k64728L33275r10743J01336P28761p54292
2641f13071L70406l31353j3002K90438q47445L96393L45440j1604L68084o0439
2631a06153P31441m37887M95749R44066O3049j381385p00462R66158M55452k55128
2621G74900o99509L68459K60922j95037O66519P87472l2422l68245O29992N94896
2611B787947j553820p85373L84102m97992L39569o9560p529O8249j272340L11523
$$ plain form
2601 -295224 742939 910019 824059 504113 176582 -11594 -908605 -937081 -1364593 -108935
2591 -108935 569122 -39371 132631 865564 896866 335550 -235633 212095 1041325 761469
2581 761469 1518894 2315398 1579953 531545 -960317 -21188 768668 838992 738815 -356752
2571 -356752 -418517 -467859 -485229 46156 74253 -19364 -315186 285563 497338 416831 154768
2560 154768 -97949 486749 -55262 232884 1241480 940383 1176025 229254 361571 -210164
2550 -210164 -1233886 -1066111 -21656 -87111 -1158738 -591735 -1662329 -1242417 42677
2541 42677 441093 212848 -721938 -168986 954526 457064 -159875 -356618 228953 582258
2531 582258 262902 414819 385595 637033 220946 530147 1107424 417133 -466373 326913
$$ packed form
2601b95224J038163J67080q5960l19946l27531j88176q97011k8476m27512J255658
2591a08935O78057o08493J72002P32933L1302n61316n71183M47728Q29230k79856
2581G61469P57425P96504p35445j048408j491862R39129P89856P0324j00177j095567
2571c56752o1765m9342j7370N31385K8097r3617k95822O00749K11775q0507k62063
2560A54768k52717N84698n42011K88146J008596l01097K35642r46771J32317n71735
2550b10164j023722J67775J044455o5455j071627N67003j070594M19912J285094
2541D2677L98416k28245r34786N52952J123512m97462o16939j96743N85571L53305
2531E82258l19356J51917k9224K51438m16087L09201N77277o90291q83506P93286
$$ plain form
2521 326913 730155 943453 735677 -52475 745026 1054717 686343 638202 324281 195516
2511 195516 -632274 -292851 -558922 -441466 -1113911 -596617 922555 424536 -322510 37357
2501 37357 162601 120609 -218379 508829 1616020 1168796 907865 857936 1088214 274957
2491 274957 1730422 1567012 744203 475439 1513346 868919 386441 -9217 -540209
2482 -540209 185444 1304038 641021 415316 1105645 1059949 1348099 719513 30466 -252898
2472 -252898 966361 1410199 667211 77600 148219 191166 435938 885174 464518 578029
2462 578029 1496671 1432734 1499768 928193 547856 740806 789044 485784 124939 914277
2452 914277 824690 535107 204785 1207176 1510892 1110205 1624868 1878653 2103589 806914
$$ packed form
2521C26913M03242K13298k07776p88152P97501L09691l68374m8141l13921j28765
2511A95516q27790L39423k66071J17456o72445N17294J519172m98019p47046L59867
2501C7357J25244m1992l38988P27208J107191m47224k60931m9929K30278q13257
2491B74957J455465j63410q22809k68764J037907o44427m82478l95658n30992
2482e40209P25653J118594o63017k25705O90329m5696K88150o28586o89047k83364
2472b52898J219259M43838p42988n89611P0619M2947K44772M49236m20656J13511
2462E78029R18642o3937O7034n71575l80337J92950M8238l03260l60845P89338
2452I14277q9587k89583l30322J002391L03716m00687N14663K53785K24936j296675
$$ plain form
2442 806914 263596 317004 377183 1349349 854824 2236054 1971449 1521320 1426262 1293735
2432 1293735 659702 674037 1916920 1821164 1372638 589479 219068 714966 1215153 1718254
2422 1718254 1218596 2206101 2498776 1850235 1601526 1662488 1744512 1750232 1547401 2915763
2412 2915763 3159669 1705815 1785714 2760632 2959698 2523718 2439314 2581823 2971678 1784575
2402 1784575 948240 787123 3849497 2973760 2331537 2509165 2402255 2128141 2959949
2393 2959949 3278937 2784297 3371140 4669356 4960946 3968651 4357668 4485583 4923958
2384 4923958 5634267 6168559 7572173 8551795 8372766 8737850 7833517 8107658 8932571
2375 8932571 9393890 9974132 9600170 10681319 11861121 12156470 12996079 14241057 16126795
$$ packed form
2442H06914n43318N3408O0179R72166m94525J381230k64605m50129r5058j32527
2432A293735o34033J4335J242883r5756m48526p83159l70411M95898N00187N03101
2422A718254m99658R87505K92675o48541k48709O0962Q2024N720k02831J368362
2412B915763K43906j453854P9899R74918J99066m35980q4404J42509L89855j187103
2402A784575q36335j61117L062374q75737o42223J77628j06910k74114Q31808
2393B959949L18988m94640N86843J298216K91590r92295L89017J27915M38375
2384D923958P10309N34292J403614R79622j79029L65084r04333K74141Q24913
2375H932571M61319N80242l73962J081149J179802K95349Q39609J244978J885738
$$ plain form
2366 16126795 18083200 19626842 21417882 24212160 25772391 27592961 31803240 36022000
2358 36022000 39142186 44504672 51212192 60105750 73469586 92646697 117962381 147509887
2350 147509887 176521001 201006654 202395963 179507930 164068352 155100230 131658868
2343 131658868 103411242 85046430 72349475 62652955 55201205 49315926 45798682 43629729
2335 43629729 39675784 37463725 34674420 33000655 31658570 29442869 25810479 24149545
2327 24149545 22991698 20579740 18115210 17018767 16380753 15119261 15257034 14497834 13337084
2318 13337084 12350867 11651010 10676717 10196194 9780094 9537416 8933687 8795524 8338605
2309 8338605 7520989 7068486 7849224 8487707 7408708 7388526 7771761 8270833 7009438
$$ packed form
2366A6126795J956405J543642J791040K794278J560231J820570M210279M218760
2358C6022000L120186N362486O707520Q893558J3363836J9177111K5315684K9547506
2350A47509887K9011114K4485653J389309k2888033j5439578q968122k3441362
2343A31658868k8247626j8364812j2696955r696520p451750n885279l517244k168953
2335D3629729l953945k212059k789305j673765j342085k215701l632390j660934
2327B4149545j157847k411958k464530j096443o38014j261492J37773p59200j160750
2318A3337084r86217o99857r74293m80523m16100k42678o03729j38163m56919
2309H338605q17616m52503P80738O38483j078999k0182L83235M99072j261395
$$ plain form
2300 7009438 5468492 5412480 5895425 5654804 5594547 5291879 4434856 4806326 4457351 4151067
2290 4151067 4523155 3653704 3526770 3255816 2414525 3125626 3247649 4240980 3368275 2275117
2280 2275117 1548550 2629733 3670517 4002312 3120325 1682213 2633491 2585519 2286286
2271 2286286 1547313 1498246 2751446 3194245 2925324 2519181 2384493 2350538 2038752 2310419
2261 2310419 1528217 875569 1386849 1911155 916030 1150595 1858513 967185 2168987
2252 2168987 1120757 1174300 2135922 2242920 967649 755160 2161487 1890862 1741095
2243 1741095 1241953 1191445 1356084 874258 743079 734881 77756 1073834 2720469 1741228
2233 1741228 1759410 602009 905041 833029 1507624 2722423 1654470 1223413 1583503
$$ packed form
2300G009438j540946n6012M82945k40621o0257l02668q57023L71470l48975l06284
2290D151067L72088q69451j26934k70954q41291P11101J22023R93331q72705j093158
2280B275117p26567J081183J040784L31795q81987j438112R51278m7972k99233
2271B286286p38973m9067J253200M42799k68921m06143j34688l3955l11786K71667
2261B310419p82202o52648N11280N24306r95125K34565P07918q91328J201802
2252B168987j048230N3543R61622J06998j275271k12489J406327k70625j49767
2243A741095m99142n0508J64639m81826j31179q198o57125R96078J646635r79241
2233A741228J8182j157401L03032p2012O74595J214799j067953m31057L60090
$$ plain form
2224 1583503 1866571 1439180 1066751 2028421 830650 -1293684 82094 1563079 1056744
2215 1056744 1559427 2363199 1213498 1648589 1689282 555599 370683 823618 309668
2206 309668 505438 -192183 -261270 -80860 47818 914348 926764 -66639 507216 753807
2196 753807 1733360 1819385 1179003 265059 262506 356161 -217509 -451819 -328994 -474826
2186 -474826 -688282 -779568 -674274 -265759 -445589 -302502 277550 740154 1367694 1185230
2176 1185230 694553 848604 256144 -220127 23260 -391289 -1034560 -694848 -621533 -219110
2166 -219110 514647 726883 -286324 -676498 -1211002 142794 37965 -906109 626370
2157 626370 646619 707313 -467378 -1943686 -668830 97770 -947970 91031 828164
$$ packed form
2224A583503K83068m27391l72429R61670j197771k124334J375778J480985n06335
2215A056744N02683Q03772j149701M35091M0693j133683j84916M52935n13950
2206C09668J95770o97621o9087J80410J28678Q66530J2416r93403N73855K46591
2196G53807R79553Q6025o40382r13944k553R3655n73670k34310J22825j45832
2186d74826k13456r1286J05294M08515j79830J43087N80052M62604O27540j82464
2176A185230m90677J54051n92460m76271K43387m14549o43271L39712P3315M02423
2166b19110P33757K12236j013207l90174n34504J353796j04829r44074J532479
2157F26370K0249O0694j174691j476308J274856P66600j045740J039001P37133
$$ plain form
2148 828164 -506338 406137 805801 1031410 166456 296774 1867241 1251010 -76132
2139 -76132 -927301 -471434 700544 59649 -871144 -1738021 -1206565 -627293 -1012016 -837954
2129 -837954 -487003 -59855 -148596 36295 -103466 672391 979028 -46122 -148592 -180759
2119 -180759 -55602 -560447 -120833 -230597 403908 1530787 1357439 1581887 1284404 -298893
2109 -298893 -906396 -459649 -398991 -638814 -1199300 -1204034 -817824 -878019 -642424 -358228
2099 -358228 -633302 543093 775217 816257 199067 -925183 -141083 223746 352075 707756
2089 707756 884277 -160242 -1011514 15145 358938 251839 -221227 421722 846385
2080 846385 935007 346499 140712 -23740 1258277 631861 1009668 1160641 -197559 -207979
$$ packed form
2148H28164j334502R12475L99664K25609q64954J30318J570467o16231j327142
2139g6132q51169M55867J171978o40895r30793q66877N31456N79272l84723J74062
2129h37954L50951M27148q8741J84891j39761P75857L06637j025150j02470l2167
2119a80759J25157n04845M39614j09764O34505J126879j73348K24448k97483j583297
2109b98893o07503M46747O0658k39823n60486m734L86210o0195K35595K84196
2099c58228k75074J176395K32124M1040o17190j124250P84100L64829J28329L55681
2089G07756J76521j044519q51272J026659L43793j07099m73066O42949M24663
2080H46385Q8622n88508k05787j64452J282017o26416L77807J50973j358200j0420
$$ plain form
2070 -207979 -396046 140877 -94353 210642 125177 -592382 -783513 443597 279640 -428759
2060 -428759 221580 -242778 -126141 1431 288771 -1199010 -1763295 -1477749 707389
2051 707389 1706187 931576 1530176 938154 746410 384420 -848355 -931764 -640965 273589
2041 273589 -717604 -888320 -800238 -1448333 -784506 -829731 204502 -932924 -1065908 250870
2031 250870 162827 -195272 -201401 -715240 -418187 49158 421724 105838 -9604 -166154
2021 -166154 -717483 56990 481988 47250 64099 535852 -715356 -1195066 -341483 -114828
2011 -114828 -142528 -362225 252669 -175181 -402721 -687531 625786 928720 476409 -92540
2001 -92540 852434 848763 257804 286181 -257946 -489178 -887272 154384 -1209923 -849113
$$ packed form
2070b07979j88067N36923k35230L04995q5465p17559j91131J227110j63957p08399
2060d28759O50339m64358J16637J27572K87340j487781n64285K85546K185138
2051G07389R98798p74611N98600n92022j91744l61990j232775q3409K90799R14554
2041B73589r91193j70716Q8082o48095O63827m5225J034233j137426j32984J316778
2031B50870q8043l58099o129n13839K97053M67345L72566l15886j15442j56550
2021a66154n51329P74473M24998m34738J6849M71753j251208m79710Q53583K26655
2011a14828k7700k19697O14894m27850k27540k84810J313317L02934m52311n68949
2001i2540R44974l671n90959K8377n44127k31232l98094J041656j364307L60810
$$ [...]
##END NTUPLES=NMR SPECTRUM
##END=
