##TITLE=1H_DE-80H_X3
 200.13MHz, d2o
 8 sc
 
 19ns.26.2.2025
##JCAMPDX= 6.0         $$ Bruker NMR JCAMP-DX V2.0
##DATA TYPE= NMR SPECTRUM
##DATA CLASS= NTUPLES
##ORIGIN= UXNMR, Bruker Analytische Messtechnik GmbH
##OWNER= pz
$$ XWIN-NMR		Version 3.5
$$ Fri Jul  4 11:51:47 2025 Russian Standard Time (UT+4h)  Yarkov@DPX200
##.OBSERVE FREQUENCY= 200.1313
##.OBSERVE NUCLEUS= ^1H
##.ACQUISITION MODE= SIMULTANEOUS
##.ACQUISITION SCHEME= undefined
##.AVERAGES= 8
##.DIGITISER RES= 18
##SPECTROMETER/DATA SYSTEM= spect
##.PULSE SEQUENCE= zg30
##.SOLVENT NAME= CDCl3
##.SHIFT REFERENCE= (INTERNAL, CDCl3, 0, 15.4439)
##AUDIT TRAIL= $$ (NUMBER, WHEN, WHO, WHERE, WHAT)
$$ ##TITLE= Audit trail, XWIN-NMR		Version 3.5
$$ ##JCAMPDX= 5.01
$$ ##ORIGIN= Bruker BioSpin GmbH
$$ ##OWNER= Yarkov
$$ C:/Bruker/XWIN-NMR/data/yarkov2/nmr/H-C/1/pdata/1/auditp.txt
$$ ##AUDIT TRAIL=  $$ (NUMBER, WHEN, WHO, WHERE, WHAT)
(   1,<2025-07-04 11:50:14.48 +0400>,<Yarkov>,<DPX200>,
      <created by zg, POWCHK disabled, PULCHK disabled
       configuration hash MD5:
       00 E9 B6 7A A2 85 ED C7 34 08 36 98 17 FE 4E 26
       data hash MD5: 16K
       98 5F 9F 63 41 EC 87 77 FC 72 F7 A5 63 E0 56 74>)
(   2,<2025-07-04 11:50:25.82 +0400>,<Yarkov>,<DPX200>,
      <Start of raw data processing
       efp BC_mod = 2 LB = 0.25 FT_mod = 6 PKNL = 1 PHC0 = -1365.687 PHC1 = 16.24948 SI = 16K 
       data hash MD5: 16K
       12 30 76 EC 2F 55 62 AF A6 EC B9 B8 1F 14 F2 CC>)
(   3,<2025-07-04 11:50:31.68 +0400>,<Yarkov>,<DPX200>,
      <abs ABSG = 5 
       data hash MD5: 16K
       7C 22 1D 3E 30 84 69 9B 86 6F CF 44 6B 82 B1 E4>)
$$ ##END=
$$ 
$$ hash MD5
$$ 35 B8 DD F9 78 F7 3F 89 AA F7 23 98 C9 35 F2 B7
##$RELAX= 
##$RELAX= 
##$RELAX= 
##$RELAX= 
##$RELAX= 
##$RELAX= 
$$ Bruker specific parameters
$$ --------------------------
##$DU= <C:/Bruker/XWIN-NMR>
##$EXPNO= 1
##$NAME= <H-C>
##$PROCNO= 1
##$TYPE= <nmr>
##$USER= <yarkov2>
##$AMP= (0..31)
100 100 100 100 100 100 100 100 100 100 100 100 100 100 100 100 100 100 
100 100 100 100 100 100 100 100 100 100 100 100 100 100 
##$AQSEQ= 0
##$AQ_mod= 1
##$AUNM= <au_zg>
##$AUTOPOS= <>
##$BF1= 200.13
##$BF2= 200.13
##$BF3= 200.13
##$BF4= 200.13
##$BF5= 200.13
##$BF6= 200.13
##$BF7= 200.13
##$BF8= 200.13
##$BYTORDA= 1
##$CFDGTYP= 0
##$CFRGTYP= 5
##$CHEMSTR= <none>
##$CNST= (0..31)
1 1 145 1 1 1 1 1 1 1 1 1 1 1 1 1 1 1 1 1 1 1 1 1 1 1 1 1 1 1 1 1 
##$CPDPRG= <>
##$CPDPRG1= <>
##$CPDPRG2= <>
##$CPDPRG3= <>
##$CPDPRG4= <mlev>
##$CPDPRG5= <mlev>
##$CPDPRG6= <mlev>
##$CPDPRG7= <mlev>
##$CPDPRG8= <mlev>
##$CPDPRGB= <>
##$CPDPRGT= <>
##$D= (0..31)
0 0.7 0 0 0 0 0 0 0 0 0 0.03 0 0 0 0 0 0 0 0 0 0 0 0 0 0 0 0 0 0 0 0 
##$DATE= 1751615413
##$DBL= (0..7)
120 120 120 120 120 120 120 120 
##$DBP= (0..7)
150 150 150 150 150 150 150 150 
##$DBP07= 0
##$DBPNAM0= <>
##$DBPNAM1= <>
##$DBPNAM2= <>
##$DBPNAM3= <>
##$DBPNAM4= <>
##$DBPNAM5= <>
##$DBPNAM6= <>
##$DBPNAM7= <>
##$DBPOAL= (0..7)
0.5 0.5 0.5 0.5 0.5 0.5 0.5 0.5 
##$DBPOFFS= (0..7)
0 0 0 0 0 0 0 0 
##$DE= 6
$$ [...]
##$SUBNAM3= <"">
##$SUBNAM4= <"">
##$SUBNAM5= <"">
##$SUBNAM6= <"">
##$SUBNAM7= <"">
##$SUBNAM8= <"">
##$SUBNAM9= <"">
##$SW= 18.0517328524113
##$SWIBOX= (0..15)
0 0 2 0 0 0 0 0 0 0 0 0 0 0 0 0 
##$SW_h= 3612.71676300578
##$TD= 16384
##$TD0= 1
##$TE= 0
##$TE2= 300
##$TE3= 300
##$TEG= 300
##$TL= (0..7)
0 120 120 120 120 120 120 120 
##$TP= (0..7)
150 150 150 150 150 150 150 150 
##$TP07= 0
##$TPNAME0= <>
##$TPNAME1= <>
##$TPNAME2= <>
##$TPNAME3= <>
##$TPNAME4= <>
##$TPNAME5= <>
##$TPNAME6= <>
##$TPNAME7= <>
##$TPOAL= (0..7)
0.5 0.5 0.5 0.5 0.5 0.5 0.5 0.5 
##$TPOFFS= (0..7)
0 0 0 0 0 0 0 0 
##$TUNHIN= 0
##$TUNHOUT= 0
##$TUNXOUT= 0
##$USERA1= <user>
##$USERA2= <user>
##$USERA3= <user>
##$USERA4= <user>
##$USERA5= <user>
##$V9= 5
##$VALIST= <valist>
##$VCLIST= <CCCCCCCCCCCCCCC>
##$VD= 0
##$VDLIST= <DDDDDDDDDDDDDDD>
##$VPLIST= <PPPPPPPPPPPPPPP>
##$VTLIST= <TTTTTTTTTTTTTTT>
##$WBST= 1024
##$WBSW= 4
##$XGAIN= (0..3)
0 0 0 0 
##$XL= 0
##$YL= 0
##$YMAX_a= 331427
##$YMIN_a= -264560
##$ZGOPTNS= <>
##$ZL1= 120
##$ZL2= 120
##$ZL3= 120
##$ZL4= 120
##$ABSF1= 15.49899
##$ABSF2= -2.552859
##$ABSG= 5
##$ABSL= 3
##$ALPHA= 0
##$AQORDER= 0
##$ASSFAC= 0
##$ASSFACI= 0
##$ASSFACX= 0
##$ASSWID= 0
##$AUNMP= <proc_1d>
##$AZFE= 0.1
##$AZFW= 0.1
##$BCFW= 0
##$BC_mod= 2
##$BYTORDP= 0
##$COROFFS= 0
##$CY= -3
##$DATMOD= 1
##$DC= 0
##$DFILT= <>
##$DTYPP= 0
##$F1P= 0
##$F2P= 0
##$FCOR= 1
##$FTSIZE= 16384
##$FT_mod= 6
##$GAMMA= 0
##$GB= 0
##$INTBC= 1
##$INTSCL= 3.241238e-09
##$ISEN= 128
##$LB= 0.25
##$LEV0= 0
##$LPBIN= 0
##$MAXI= 10000
##$MC2= 0
##$MEAN= 0
##$ME_mod= 0
##$MI= 1.114404
##$NCOEF= 0
##$NC_proc= -8
##$NLEV= 6
##$NOISF1= 3.799351
##$NOISF2= 2.8
##$NSP= 0
##$NTH_PI= 0
##$NZP= 0
##$OFFSET= 15.44389
##$PC= 1
##$PHC0= -1365.687
##$PHC1= 16.24948
##$PH_mod= 1
##$PKNL= yes
##$PPARMOD= 0
##$PSCAL= 0
##$PSIGN= 0
##$REVERSE= no
##$SF= 200.130015572521
##$SI= 16384
##$SIGF1= 3
##$SIGF2= 2
##$SINO= 0.751879
##$SIOLD= 32768
##$SREGLST= <19F.Aceton>
##$SSB= 0
##$STSI= 16384
##$STSR= 0
##$SW_p= 3612.71676300578
##$SYMM= 0
##$S_DEV= 0
##$TDeff= 16384
##$TDoff= 0
##$TI= <>
##$TILT= no
##$TM1= 0
##$TM2= 0
##$TOPLEV= 0
##$USERP1= <user>
##$USERP2= <user>
##$USERP3= <user>
##$USERP4= <user>
##$USERP5= <user>
##$WDW= 1
##$XDIM= 16384
##$YMAX_p= 487710891
##$YMIN_p= -894192
$$ End of Bruker specific parameters
$$ ---------------------------------
##NTUPLES= NMR SPECTRUM
##VAR_NAME=  FREQUENCY,     SPECTRUM/REAL,   SPECTRUM/IMAG
##SYMBOL=    X,             R,               I
##VAR_TYPE=  INDEPENDENT,   DEPENDENT,       DEPENDENT
##VAR_FORM=  AFFN,          ASDF,            ASDF
##VAR_DIM=   16384,         16384,           16384
##UNITS=     HZ,            ARBITRARY UNITS, ARBITRARY UNITS
##FACTOR=    0.220516191357247, 1,           1
##FIRST=     3090.78586973461, 0,            0
##LAST=      -521.930893271171, 0,           0
##MIN=       -521.930893271171, -894192,     0
##MAX=       3090.78586973461, 487710891,    0
$$ Real data points
##PAGE= N=1
##DATA TABLE= (X++(R..R)), XYDATA
$$ [...]
7533A1560075O97141R28728J033129R56266J312757J514139J343765J406253J764296
7524B2516549P92352P11358J2764p90230o92105j306675j875665j613063j411163
7515A6344122q29739r98199o35425o80706n68494m85388j66342k82696q20401
7506A0876732l72877k56144n10215n9783r3094m06829n3808n6106k24305l59378
7496H484193N1038j21155J05259K6111k7272k07236m7808M38807K34572K52053
7486I188562K3139K4744J85409j44083J28281K67501J50381K9578K60285N0057
7476A0163854L07004J20952M74661K41717J34124K43444L97742K42542r3629M00348
7466A2632759L80470J72877K97062J79052m1125L35822K26408L43167O04847N84079
$$ plain form
7533 11560075 12257216 13185944 14219073 15175339 16488096 18002235 19346000 20752253 22516549
7524 22516549 23308901 24020259 24033023 23242793 22550688 21244013 19368348 17755285 16344122
7515 16344122 15514383 14516184 13880759 13200053 12631559 12146171 11979829 11697133 10876732
7506 10876732 10503855 10247711 9737496 9677713 9584619 9177790 9123982 9067876 8843571 8484193
7496 8484193 8535231 8414076 8519335 8545446 8518174 8310938 8263130 8701937 8936509 9188562
7486 9188562 9211701 9236445 9421854 9277771 9406052 9673553 9823934 9853512 10113797 10163854
7476 10163854 10470858 10591810 11066471 11308188 11442312 11685756 12083498 12326040 12232411 12632759
7466 12632759 13013229 13186106 13483168 13662220 13621095 13956917 14183325 14526492 15131339 15715418
7456A5715418N67009N62648N03875N21068Q60177J080641J149015J063155J581707
7447B3604713J671102J043512J246898J188220P68913J04231q11372r41698j163031
7438B6711488j131125j219130q53085j222433j003184m88034p74771k61163l98497
7429A9360066n82976m57996k84553O581l93893J8931p3148m05610j35110J10996
7419A7163288r684J09216N3850K65503M24110J38846o608J59006K35481R7298
7409A8630306J78465L221K80813m4564q4836j34220o5242j11727k06780J33391
7399A8578827L5549j6128L72959k135L86875L21075o7235l0797K20463J43275
7389A9942728J11123j00264L11480k26610j83363Q3073k63172j88632l01099l04479
$$ plain form
7456 15715418 16282427 16845075 17348950 17870018 18730195 19810836 20959851 22023006 23604713
7447 23604713 25275815 26319327 27566225 28754445 29523358 29627589 28816217 27874519 26711488
7438 26711488 25580363 24361233 23508148 22285715 21282531 20794497 20019726 19758563 19360066
7429 19360066 18777090 18319094 18034541 18041122 17647229 17666160 17593012 17187402 17052292 17163288
7419 17163288 17153604 17262820 17316670 17582173 18006283 18145129 18138521 18297527 18533008 18630306
7409 18630306 18808771 18811992 19092805 19048241 18963405 18829185 18763943 18652216 18445436 18578827
7399 18578827 18614376 18598248 18971207 18969072 19355947 19677022 19609787 19578990 19799453 19942728
7389 19942728 20053851 19953587 20265067 20038457 19855094 19938167 19674995 19486363 19185264 18880785
7379A8880785k15753k84402R1959j07269K0419L35960n1043K4156J60714p9660
7369A8775866P7946M14119K91994K12483l2801R5933j76231J59391J53108Q7946
7359B0059754O0116L6770O898J55078J51798K53495K36965K67701K49955M00692
7349B1879222L51184K93882N00533O35300N62749N42492M02043L98647N32854
7340B6098906J11168L50382N03225k5763P3493K58365M1074m7504J74327M08556
7330B7946229o3189J82891J11534n7558j05405L00866K54961q0111p30802j25794
7320B7633622j33080j52871l30322m63201l37060l15302j15684J36280J02923
7311B6025305l58092K0754K9676l12370o6283k46192K52203J55028k06613K71166
$$ plain form
7379 18880785 18665032 18380630 18472589 18365320 18385739 18721699 18670656 18694812 18855526 18775866
7369 18775866 18853812 19267931 19559925 19772408 19739607 19835540 19659309 19818700 19971808 20059754
7359 20059754 20119870 20156640 20163538 20318616 20470414 20723909 20960874 21228575 21478530 21879222
7349 21879222 22230406 22524288 23024821 23660121 24222870 24765362 25167405 25566052 26098906
7340 26098906 26210074 26560456 27063681 27037918 27111411 27369776 27410850 27363346 27537673 27946229
7330 27946229 27883040 28065931 28177465 28119907 28014502 28315368 28570329 28490218 27759416 27633622
7320 27633622 27500542 27347671 27017349 26554148 26217088 25901786 25786102 25922382 26025305
7311 26025305 25667213 25687967 25717643 25405273 25338990 25092798 25345001 25500029 25293416 25564582
7301B5564582J80406J86191O4901K87651l0188M21630O4897q7461n824m6140k95944
7290B6304701K6222j28832K5925O4113J97898l43428n18882J34650J43561m14005
7280B5491923n86399j82476r373K469l4669l17223l62607m54549n27553m04865
7270B2614678n05529o08740k69434k00054k13356j76276l76397l2288J27121o417
7260B0353308j04781j32868O258L84535o655K4557k79174m6511j59771n08396
7250A9530502n6413k16878J08015k26609m02667k15248j4385l12729j88849j03013
7240A7901726r5321j14869J53777R7669j07735N9517j19059r3841K43475J55342
7230A8080681K23221L98586K68678L30458L61535J78276j77515K61836K33737
$$ plain form
7301 25564582 25744988 25931179 25996080 26283731 26253543 26675173 26740070 26652609 26646785 26600645 26304701
7290 26304701 26330923 26202091 26228016 26292129 26490027 26146599 25627717 25762367 25905928 25491923
7280 25491923 24905524 24723048 24713675 24716144 24681475 24364252 24001645 23547096 23019543 22614678
7270 22614678 22109149 21500409 21230975 21030921 20817565 20641289 20264892 20232604 20359725 20353308
7260 20353308 20248527 20115659 20121917 20506452 20499797 20524354 20245180 20198669 20038898 19530502
7250 19530502 19474089 19257211 19365226 19138617 18735950 18520702 18506317 18193588 18004739 17901726
7240 17901726 17806405 17691536 17845313 17942982 17835247 17894764 17775705 17681864 17925339 18080681
7230 18080681 18303902 18702488 18971166 19301624 19663159 19841435 19663920 19925756 20159493
7221B0159493M01661J73678K96982L59519L02064K10168J17976K08950K33253
7212B2463744J57632L18935L09212N04891M12955L22312O05077N80144R46077
7203B6620979J040467Q24392J292284J309358J381811J666643K018567K026051
7195C8180552K242518K680400L394614L737710M427745M888754N018497N578977
7187G0149767N105772M102497K837823Q67259o46855k100761k794119l374615
7179G4146768l490684m047935m382686m422486m781319l928392l441540l512622
7171D2139104k790906k449633k097682j721541j525038j149806j335570j392772
7163B7676156j123888n89647o22852m39659m50330k48891K08277M4544k10947
$$ plain form
7221 20159493 20561154 20734832 21031814 21391333 21693397 21903565 22021541 22230491 22463744
7212 22463744 22621376 22940311 23249523 23754414 24167369 24489681 25094758 25674902 26620979
7203 26620979 27661446 28485838 29778122 31087480 32469291 34135934 36154501 38180552
7195 38180552 40423070 43103470 46498084 50235794 54663539 59552293 64570790 70149767
7187 70149767 75255539 79358036 82195859 83063118 82416263 80315502 77521383 74146768
7179 74146768 70656084 66608149 62225463 57802977 53021658 49093266 45651726 42139104
7171 42139104 39348198 36898565 34800883 33079342 31554304 30404498 29068928 27676156
7163 27676156 26552268 25962621 25339769 24900110 24449780 24200889 24409166 24453710 24242763
7154B4242763K83531L19821P07584N29564R30470J248424J526752J218413J270067
7145C2277389R05537L08590l1633p85412j366345j417268j368093j741360j713955
7136B5067450j234216j274664j044684p67437j021098r32724n91551n77399m82759
7127A7140918m85119l42857m36262n27859k94025o46554l64913j76602k98579
7118A3568148k262R6080m7480J57615l91015j33790Q5616J00582p7004J8740K95325
7107A3670555J52418K83227N06181M24587O35604P97149J049814R20217J103898
7098A9543650J438161J470548J433187J371602J171700M95881L46057l97957r13666
7089B5959163j284751j372506j315238j474660j328262j260212j073988r01053
$$ plain form
7154 24242763 24526294 24846115 25553699 26083263 27013733 28262157 29788909 31007322 32277389
7145 32277389 33182926 33491516 33459883 32674471 31308126 29890858 28522765 26781405 25067450
7136 25067450 23833234 22558570 21513886 20746449 19725351 18792627 18201076 17623677 17140918
7127 17140918 16655799 16312942 15876680 15348821 15054796 14408242 14043329 13866727 13568148
7118 13568148 13565886 13661966 13614486 13772101 13381086 13247296 13332912 13433494 13356490 13375230 13670555
7107 13670555 13822973 14106200 14612381 15036968 15672572 16469721 17519535 18439752 19543650
7098 19543650 20981811 22452359 23885546 25257148 26428848 26924729 27270786 26872829 25959163
7089 25959163 24674412 23301906 21986668 20512008 19183746 17923534 16849546 15948493
7081A5948493p27548o15806o11497m76958j78463j99522p3142m92330l5623p2860
7071A2464744l08076J40771k22262j95892q9742P1648l75378k95790l98563l69227
7061A0422233K23980m05545k51702o2252l83797m08806n49722j42588l86282j01913
7051G953606j07218O7302L4938m09905l76356m7851M5976m55524J7785J83300
7041F906053j52797J35519l5151n95002k2040k93767j48435p3506j48139L3021
7031E605756k12311J10577r0593j5676m10438k00520j89437j23296K17075p5113
7021D616024j56234j05987m8739j07678K18880K37923k17097N5910j06030j1442
7011D375530N3647k34282K0798J24560j09687k59374O3907M2261J86030q5071
$$ plain form
7081 15948493 15220945 14605139 13993642 13516684 13338221 13138699 13065557 12573227 12537604 12464744
7071 12464744 12156668 12297439 12075177 11879285 11789543 11861191 11485813 11190023 10791460 10422233
7061 10422233 10646213 10240668 9988966 9926714 9542917 9134111 8584389 8441801 8055519 7953606
7051 7953606 7846388 7913690 7948628 7538723 7162367 7114516 7160492 6704968 6722753 6906053
7041 6906053 6753256 6888775 6853624 6258622 6236582 5942815 5794380 5720874 5572735 5605756
7031 5605756 5393445 5504022 5413429 5397753 4987315 4786795 4597358 4474062 4691137 4616024
7021 4616024 4459790 4353803 4305064 4197386 4416266 4654189 4437092 4493002 4386972 4375530
7011 4375530 4429177 4194895 4215693 4340253 4230566 3971192 4035099 4077360 4263390 4178319
7001D178319k7591j64549j60269j65015j34798j07380r1757J13456n4224J4107
6991C400299k8166n2763K94459Q5380m91550N3838K80271j47284q2867J25603
6981C437220n0408q3688j37011O8483j42096r559J71976L9906j46725j53146J88811
6970C183763Q212J56011l1130J9023p7951J74112K07184J4446R5595n9489j24090
6959C565686r433r2201j71927P6698J10544O2737l73267O0271K86488j72721N6829
6948C399704K62694L43371n0478p5819q41m5168J35633M57544n9891m7081n2579
6937D267089J4814o4499J50569K89557P0888Q5698j66805k56081p278K82869J91051
6926D857872n9993J81101N264L4488J7043R6133P3795n5566L0337K4035L63747
$$ plain form
7001 4178319 4150728 3986179 3825910 3660895 3526097 3418717 3326960 3440416 3386192 3400299
6991 3400299 3372133 3319370 3613829 3699209 3207659 3261497 3541768 3394484 3311617 3437220
6981 3437220 3386812 3303124 3166113 3234596 3092500 3082941 3254917 3294823 3148098 2994952 3183763
6970 3183763 3191975 3347986 3316856 3335879 3257928 3432040 3639224 3653670 3749265 3689776 3565686
6959 3565686 3556253 3464052 3292125 3368823 3479367 3542104 3168837 3229108 3515596 3342875 3399704
6948 3399704 3662398 4005769 3955291 3879472 3878631 3833463 3969096 4426640 4366749 4319668 4267089
6937 4267089 4281903 4217404 4367973 4657530 4728418 4814116 4647311 4391230 4383952 4666821 4857872
6926 4857872 4797879 4978980 4984244 5018732 5035775 5131908 5205703 5150137 5180474 5204509 5568256
6915E568256j70455j53329r2521j30352k46902j93459O7174L60089k86935k14725
6905D506841J0596k94296k4286j3984j21794j65174n5311J24795p9460k36246
6895C651681l77424P1088k04521K42818o545j1466J50916l10858M65192J17638
6885C788519k73528j44753j97067k25047Q3210K09722J29374j25981P2447j62962
6875C153934J27339L3378N3022K19775j40070K09018n8877K359k71039N6266l12926
6864C072179j35724j63046j00966K69004Q2524j76315N8585R7126n3049l5383
6854B914935m2403M6008k0573l12859K62396N6911l14998j27775q7308J04531
6844B478865J52363R2897k81335K21112J53442O1467l78807j98667J54889K2037
$$ plain form
6915 5568256 5397801 5244472 5151951 5021599 4774697 4581238 4648412 5008501 4721566 4506841
6905 4506841 4517437 4223141 4198855 4184871 4063077 3897903 3842592 3967387 3887927 3651681
6895 3651681 3274257 3345345 3140824 3383642 3377097 3365631 3516547 3205689 3670881 3788519
6885 3788519 3514991 3370238 3173171 2948124 3031334 3241056 3370430 3244449 3316896 3153934
6875 3153934 3281273 3314651 3367673 3587448 3447378 3656396 3597519 3599878 3328839 3385105 3072179
6864 3072179 2936455 2773409 2672443 2941447 3023971 2847656 2906241 3003367 2950318 2914935
6854 2914935 2872532 2918540 2897967 2585108 2847504 2904415 2589417 2461642 2374334 2478865
6844 2478865 2631228 2724125 2442790 2663902 2817344 2878811 2500004 2301337 2456226 2478263
6834B478263j77077l0557J08599K28582J31218J04961k40127q6526q0616k9615
6824B407105J83017J31519o1097j49668M2342J88239j11346J05673l1219K87865
6814B992430k4464k59420Q6909K39549K9216l70452j24601J64932N8489q3714
6804B708874j6095r3894K16035p4770k22772O236j10607k91054J43492M03529
6794B668974k80974j46485L23884k41550j84211R4028R7457K81392K8312R5953
6784B736780q9905k9926l8214r7040K17594L831j40119q3748K19074k0865o5796
6773B611666l093k0272l3746J51542J69748K8815k33125n381q9555K19813J91975
6762B988387j19780J14504J45200j25903q3638J93347M3897J9891M4563P1499
$$ plain form
6834 2478263 2301186 2270629 2379228 2607810 2739028 2843989 2603862 2517336 2436720 2407105
6824 2407105 2590122 2721641 2660544 2510876 2553218 2741457 2630111 2735784 2704565 2992430
6814 2992430 2967966 2708546 2795455 3035004 3064220 2693768 2569167 2734099 2792588 2708874
6804 2708874 2692779 2598885 2814920 2740150 2517378 2523614 2413007 2121953 2265445 2668974
6794 2668974 2388000 2241515 2565399 2323849 2139638 2233666 2331123 2612515 2640827 2736780
6784 2736780 2646875 2616949 2578735 2481695 2699289 2703120 2563001 2479253 2698327 2677462 2611666
6773 2611666 2608573 2588301 2554555 2706097 2875845 2904660 2671535 2666154 2576599 2796412 2988387
6762 2988387 2868607 2983111 3128311 3002408 2918770 3112117 3156014 3175905 3220468 3291967
6752C291967K4586j90999j88902q4313J15452m9974J9880J15714q4891O703k6894
6741B948329J85185K00658j21867k50583N3220P4257p6561R838J8090J58860K933
6730C202359J52534N544l07103k54270K83133J5009R1998m4748k39330J94557
6720C099683K24855J39689k49659J38044p8345P8903l58242m3039R6142J30988
6710C179019J7438j20374O2284J2013j25255J78336K50477J23456L5773l28710
6700C284457o207J5553k51965N8456L07870K87013O249Q9539j20518j32201J6770
6689C555016N1899L01931j30210k877o1708P3301l1306j27830J30055J35247j06995
6678C786523J63948J67874j36250J57985J66427j81978K71275j25445N7264L14634
$$ plain form
6752 3291967 3316553 3125554 2936652 2852339 2967791 2917817 2937697 3053411 2968520 2975223 2948329
6741 2948329 3133514 3334172 3212305 2961722 3014942 3089199 3012638 3022476 3040566 3199426 3202359
6730 3202359 3354893 3360437 3053334 2799064 3082197 3097206 3189204 3144456 2905126 3099683
6720 3099683 3324538 3464227 3214568 3352612 3274267 3353170 2994928 2951889 3048031 3179019
6710 3179019 3196457 3076083 3138367 3150380 3025125 3203461 3453938 3577394 3613167 3284457
6700 3284457 3278250 3293803 3041838 3100294 3408164 3695177 3701426 3790965 3670447 3538246 3555016
6689 3555016 3606915 3908846 3778636 3775759 3714051 3787352 3756046 3628216 3758271 3893518 3786523
6678 3786523 3950471 4118345 3982095 4140080 4306507 4124529 4395804 4270359 4327623 4642257
6668D642257o3322r4236k15090J56030K05808K95671L6984j28910l03831L6096
6658D567457K16111k09653j22791J20868J74877J01035K94134J25548J03840k3917
6648E347509k824j98994L37642J56470J24066J92932J9450K3590J00218J41203
6638F241262N9538Q7320K25538L96177L99254o4779O1059M2104j16991K8902O4255
6627G423639J62201J00816M39447J95321J69444J23010L14056K96185J71273K30475
6617I625867N32627n422P7124P09009N88245M80568N20902L09840M69656M27564
6607A3735980O45870P47440P51778P80571J012844J154382J147577J112290J618357
6598B2707089J706207J942435K183412K357244K499292K330372J774683J502083
$$ plain form
6668 4642257 4578935 4484699 4269609 4425639 4631447 4927118 4964102 4835192 4531361 4567457
6658 4567457 4783568 4573915 4451124 4571992 4746869 4847904 5142038 5267586 5371426 5347509
6648 5347509 5344685 5145691 5483333 5639803 5763869 5956801 5976251 5999841 6100059 6241262
6638 6241262 6300800 6388120 6613658 7009835 7409089 7344310 7405369 7447473 7330482 7359384 7423639
6627 7423639 7585840 7686656 8126103 8321424 8490868 8613878 8927934 9224119 9395392 9625867
6617 9625867 10158494 10153072 10230196 10939205 11527450 12008018 12528920 12838760 13308416 13735980
6607 13735980 14381850 15129290 15881068 16661639 17674483 18828865 19976442 21088732 22707089
6598 22707089 24413296 26355731 28539143 30896387 33395679 35726051 37500734 39002817
6590C9002817J148017L93184j73731n99792m99411p44315p30232m60865Q0523
6581C7416195k92252M88734P96937R72968Q57183J021121Q12534M70667m4972
6572D2499115l23060q44294j141206j126595j264890q57227p94192r75172r11466
6563C4261013j54283o38404l41093k55090k08917j83637n19880q5132o3053m78515
6553C1333009m00076o21393m2216k82685n03457l80345j44866J21340j50582K12024
6543B9140753J4974l8411j03821m42635l19509l06634p11366m88740m66098m93431
6533B5785082m99420m80825n92923n95407o26583o09008q26572q23361o65323
6524B0065660o62935p71014r64277n38833m40097n32497p19794n76225k39831
$$ plain form
6590 39002817 40150834 40544018 40370287 39770495 39271084 38526769 37796537 37335672 37416195
6581 37416195 37123943 37612677 38409614 39382582 40239765 41260886 42073420 42544087 42499115
6572 42499115 42176055 41331761 40190555 39063960 37799070 36941843 36147651 35172479 34261013
6563 34261013 34106730 33468326 33127233 32872143 32663226 32479589 31959709 31874577 31811524 31333009
6553 31333009 30932933 30311540 30269324 29986639 29483182 29102837 28957971 29079311 28928729 29140753
6543 29140753 29155727 29117316 29013495 28570860 28251351 27944717 27233351 26744611 26278513 25785082
6533 25785082 25285662 24804837 24211914 23616507 22989924 22380916 21554344 20730983 20065660
6524 20065660 19402725 18631711 17667434 17128601 16688504 16156007 15436213 14859988 14620157
6515A4620157m25617o08179n55629k96192M9093l44521J52552k31944m74697r3207
6505A1791816j52378k69126k70686k67072M2926m907R156k24128o5617m5502k74916
6494A0269566l26043j0983J03346j87603K26543J62255k6418k99795j11108J44876
6484I944636l539k07459j23871k98847j52580j4589j6199j9741l75922k952j22439
6473H606498k15547n6426q1286L7886m7336r1388l4699K92929M5989k05586n3610
6462H197424j03806J92392K17900K0502L5401l16735m1116k06604n0098Q3513
6452H028773L6149m342K02453k18075k82834k05157R2877J99226j21966j72264
6442G554840J41374n6289K4406k06114N4374q2408P430J29944j37774j8239p5382
$$ plain form
6515 14620157 14194540 13586361 13030732 12734540 12783633 12439112 12591664 12359720 11885023 11791816
6505 11791816 11639438 11370312 11099626 10832554 10875480 10870573 10879729 10655601 10589984 10544482 10269566
6494 10269566 9943523 9932540 10035886 9848283 10074826 10237081 10210663 9910868 9799760 9944636
6484 9944636 9941097 9733638 9609767 9310920 9158340 9143751 9127552 9107811 8731889 8728937 8606498
6473 8606498 8390951 8334525 8253239 8291125 8243789 8152401 8117702 8410631 8456620 8251034 8197424
6462 8197424 8093618 8286010 8503910 8524412 8559813 8243078 8201962 7995358 7945260 8028773
6452 8028773 8064922 8060580 8263033 8044958 7762124 7556967 7649844 7849070 7727104 7554840
6442 7554840 7696214 7639925 7664331 7458217 7512591 7430183 7437613 7567557 7429783 7411544 7336162
6431G336162j12844j08014k3259r4917K13641j30493r6916L09797m2740m3880
6421G206537L6168k52318J8906p4622r1235J20720J13187j02466k21163n9489
6411F694225P8069K1784N9206m122O5195K16847j82532J28674l4459j48724L7192
6400F931355L53210q5177N2154j55291j33276J98597j17322P1296K58581M7170
6390G421297l23841J48053j68971K87682K03847j78669Q0904L65351P9999L0571
6380G946223m08991j84628R2993L79299K59062K25811k81304J08401J08041P7347
6370H322254P7928J17598J71083N5668j36331r0119Q5052j26566M7593M62890
6360H987050j93881j60304J40073m1050J08819Q1615L41807P4124o0366J86571
$$ plain form
6431 7336162 7223318 7115304 7092045 6997128 7210769 7080276 6983360 7293157 7250417 7206537
6421 7206537 7242705 6990387 7009293 6934671 6843436 6964156 7077343 6974877 6753714 6694225
6411 6694225 6772294 6794078 6853284 6849162 6914357 7131204 6948672 7077346 7042887 6894163 6931355
6400 6931355 7284565 7199388 7251542 7096251 6962975 7161572 7044250 7115546 7374127 7421297
6390 7421297 7097456 7245509 7076538 7364220 7568067 7389398 7470302 7835653 7915652 7946223
6380 7946223 7537232 7352604 7445597 7824896 8083958 8309769 8028465 8136866 8244907 8322254
6370 8322254 8400182 8517780 8688863 8744531 8608200 8518081 8603133 8476567 8524160 8987050
6360 8987050 8793169 8632865 8772938 8731888 8840707 8922322 9264129 9338253 9277887 9464458
6350I464458J02573K83226L56871o1617M6935J32417M24842P0706j93828m4265
6340A0582318K37859J36543l25220J18494L61144J93023K38591l9882R2138J3422
6330A1608430L50997O4702K49141L72564J92251J64957J47876L85175J67826l3952
6320A3669967n4148K54330O03660J23061J06435M5520J9505M20554K33704K30387
6310A5652975J17584j7943L87747N74411J84036N31199M90456N81005N70131N58097
6300A9629698O91308M44286N99896Q68241Q15799L91802N27393Q9015K01705K28154
6290B4487297K87639L36732J48029N80338L71952J50134K02875M42015L90683
6281B7397694J95517P07817O85150M60048N69253N29354M06344N33586K76134
$$ plain form
6350 9464458 9567031 9850257 10207128 10145511 10192446 10324863 10749705 10820411 10626583 10582318
6340 10582318 10820177 10956720 10631500 10749994 11111138 11304161 11542752 11502870 11595008 11608430
6330 11608430 11959427 12024129 12273270 12645834 12838085 13003042 13150918 13536093 13703919 13669967
6320 13669967 13615819 13870149 14473809 14596870 14703305 14748825 14768330 15188884 15422588 15652975
6310 15652975 15770559 15752616 16140363 16714774 16898810 17430009 17920465 18501470 19071601 19629698
6300 19629698 20321006 20765292 21365188 22233429 23049228 23441030 23968423 24057438 24259143 24487297
6290 24487297 24774936 25111668 25259697 25840035 26211987 26362121 26564996 27007011 27397694
6281 27397694 27593211 28301028 28986178 29446226 30015479 30544833 30951177 31484763 31760897
6272C1760897K64392K38325O5095L43284L70857J28802Q6325K47389j0500j67178
6262C3327688O3523M8968L93141J08905n3002L49054N88173L55305j25851n1383
6252C5004521l43439j3459p7284k91710k6351m51924k78210k48447k89827l26117
6242C2657753l34226l26296l87403l301k62633j77925l34194j88187J56236K46218
6232C1046042J29103n23070j34913l5715o9167J58963J23772o8789K15751L20782
6222C1162759K09997k14234N0806K95854N1056J61695K02383J29566L47333J69917
6212C2567132o7870M10128J33898J92815K08840L59832O03670N75976N25244N36332
6202C6045997O35921Q90706O57237N44003L64891P00732N05110N71274Q56877
$$ plain form
6272 31760897 32025289 32263614 32328709 32671993 33042850 33171652 33257977 33505366 33494866 33327688
6262 33327688 33391211 33440179 33833320 33942225 33889223 34238277 34826450 35181755 35055904 35004521
6252 35004521 34661082 34647623 34570339 34278629 34252278 33800354 33522144 33273697 32983870 32657753
6242 32657753 32323527 31997231 31609828 31606527 31343894 31165969 30831775 30643588 30799824 31046042
6232 31046042 31175145 30652075 30517162 30481447 30412280 30571243 30695015 30626226 30841977 31162759
6222 31162759 31372756 31158522 31209328 31505182 31556238 31717933 31920316 32049882 32397215 32567132
6212 32567132 32499262 32909390 33043288 33236103 33444943 33804775 34408445 34984421 35509665 36045997
6202 36045997 36681918 37572624 38229861 38773864 39138755 39839487 40344597 40915871 41772748
6193D1772748J061776Q92314J102748J372624J438673J440558J449771J576811
6185E2108023J965373K069439K294694K647892K821036L146887L254959M173617
6177G4481920M650162M961317M660959M532951L963731L213901L006034L419509
6169A06890484L329256L748819M550574N293732M410692K829909J905600R44527
6161A33903593O96253J082357J067972J273554J648741L079765M878813O161604
6153A53792652P440953P790538P720191P138442O549794M807908L002476N22603
6145A98765557k256539m328963o007798o382639o394885o071444m771236m205646
6137A58346407k995519k988614k716567k416581k551773j441535o46210L41022
$$ plain form
6193 41772748 42834524 43726838 44829586 46202210 47640883 49081441 50531212 52108023
6185 52108023 54073396 56142835 58437529 61085421 63906457 67053344 70308303 74481920
6177 74481920 79132082 84093399 88754358 93287309 97251040 100464941 103470975 106890484
6169 106890484 110219740 113968559 118519133 123812865 128223557 131053466 132959066 133903593
6161 133903593 134599846 135682203 136750175 138023729 139672470 142752235 147631048 153792652
6153 153792652 161233605 169024143 176744334 183882776 190432570 195240478 198242954 198765557
6145 198765557 196509018 192180055 186172257 179789618 173394733 167323289 162552053 158346407
6137 158346407 155350888 152362274 149645707 147229126 144677353 143235818 142589608 142930630
6129A42930630J402534K488011M375886M867717L891537K068343j236129m344408
6121A56444121n741823o859285p833966p969305q466185q469796p768731o723788
6113I6611242n450802m798800m251875l750285k879393k421272k232480k122263
6105F8704072j985397j845653j538895j467001j455481r88433j000765q38344
6097E7584103r41614r33161o02470l71502q47723j268080p96001n11112p24883
6088E0587557o42352p35830o19705m63944m12754q36238p96334p62072l60252
6079D4958076p34299o34140p69233p37343m34183k84708m79250k72476k00824
6070D0411620k93206j7654l44704m46736l00484j51868k48034l52009j56999p5065
$$ plain form
6129 142930630 144333164 146821175 151197061 156064778 159956315 162024658 160788529 156444121
6121 156444121 150702298 143843013 136009047 128039742 119573557 111103761 103335030 96611242
6113 96611242 91160440 86361640 82109765 78359480 75480087 73058815 70826335 68704072
6105 68704072 66718675 64873022 63334127 61867126 60411645 59423212 58422447 57584103
6097 57584103 56642489 55709328 55106858 54735356 53887633 52619553 51823552 51312440 50587557
6088 50587557 49945205 49209375 48589670 48125726 47712972 46876734 46080400 45318328 44958076
6079 44958076 44223777 43589637 42820404 42083061 41648878 41364170 40884920 40612444 40411620
6070 40411620 40118414 40100760 39756056 39309320 39008836 38856968 38608934 38256925 38099926 38024861
6060C8024861l19984l55281j18133K825J72188J35573J70837K33215M4395R8601
6050C8089097j5341n6846K20917j64835l20841n47388k68184n72441o45149k92850
6040C5426139j75113m20640n35694k9112m25024k06372j46258k2290P5067J864
6030C3542567r7349J676j06219j54515j09833R6666r1719J28445k61518j27892
6020C2820309m134j27667L59288J97684k26069k32271k25475k38129j08722n84892
6010C1629922n6332J20246k19392l70780l55784R5740k0076n9628j75249K45391
6000C0834058n36443k82781J59362k34747l1696N8151r581P7811K16975k9358
5990C0221751J05519L21391j05362j7818N48328K74709j57787J90457M05787R1762
$$ plain form
6060 38024861 37704877 37349596 37231463 37234288 37406476 37542049 37712886 37946101 37990496 38089097
6050 38089097 38073756 38016910 38237827 38072992 37752151 37204763 36936579 36364138 35718989 35426139
6040 35426139 35251026 34830386 34294692 34265580 33840556 33634184 33487926 33465636 33540703 33542567
6030 33542567 33445218 33446894 33340675 33186160 33076327 33172993 33081274 33209719 32948201 32820309
6020 32820309 32816175 32688508 33047796 33245480 33019411 32787140 32561665 32323536 32214814 31629922
6010 31629922 31573590 31693836 31474444 31103664 30747880 30843620 30823544 30763916 30588667 30834058
6000 30834058 30297615 30014834 30174196 29939449 29907753 29965904 29956323 30034134 30251109 30221751
5990 30221751 30327270 30648661 30543299 30525481 31073809 31348518 31190731 31381188 31786975 31878737
5980C1878737Q667l6748o9486r0495L1182l3716k89402j47540m16274j59219k36598
5969C0439108m40432m61304j30964l73567j11173k58039l24873k55054j74975
5960B7908727m71607k22710q3196m09808R67J17513R669J15614J83658j70505
5950B6978322r5437j02587j99660j66677N3996l6985q9041n29612n16751k64347
5940B5031221j73179j91310k82770n12689o3152l73587k7631k32108j69589j7509
5930B2987697q8554l29123j74822q8719L3513l51105o5111o3925l07010l69950
5920B1182891k7311j75618J65459J0335r3033j28054j56510n29999j69201J68161
5910B0247120l27252p5107j91006l80624m02557k447k65035j76211j54717j09073
$$ plain form
5980 31878737 31887404 31850656 31781170 31690675 31721857 31688141 31398739 31251199 30834925 30675706 30439108
5969 30439108 29998676 29537372 29406408 29032841 28921668 28663629 28338756 28083702 27908727
5960 27908727 27437120 27214410 27131214 26721406 26722373 26839886 26849555 26965169 27148827 26978322
5950 26978322 26882885 26780298 26580638 26413961 26467957 26430972 26341931 25812319 25295568 25031221
5940 25031221 24858042 24666732 24383962 23871273 23808121 23434534 23406903 23174795 23005206 22987697
5930 22987697 22899143 22570020 22395198 22306479 22339992 21988887 21923776 21859851 21552841 21182891
5920 21182891 21155580 20979962 21145421 21155756 21062723 20934669 20778159 20248160 20078959 20247120
5910 20247120 19919868 19844761 19653755 19273131 18870574 18868127 18603092 18426881 18272164 18163091
5900A8163091k35727j60335k23656j45197j89283j12198k36324j24818J08582
5891A6844135r4456q8949l3793l2395L53207k4483k64973j68547O5417L93950
5881A6949113J30746j06898k12144j11438K89377J1439k9597J79465r0993R9296
5871A7108366j29476m5871L72275r7377j37887J25618K29978J85278n6681L4226
5861A7588449L65605m7060j92656m2452p1478n8146n7327J35824q6269J66124
5851A7700614j05573j33671M6080K98423M0451j3733M64753j32114l0966J4078
5841A8148342P1349L196k8925j6354K48542k07399n8063K81837K96987J98753
5831A8938265J74667P588j67125j45846J86443K03487J29037L47280J19566R978
$$ plain form
5900 18163091 17927364 17767029 17543373 17398176 17208893 17096695 16860371 16735553 16844135
5891 16844135 16749679 16660730 16626937 16594542 16947749 16923266 16658293 16489746 16555163 16949113
5881 16949113 17079859 16972961 16760817 16649379 16938756 16950195 16920598 17100063 17009070 17108366
5871 17108366 16978890 16933019 17305294 17207917 17070030 17195648 17425626 17610904 17554223 17588449
5861 17588449 17954054 17906994 17714338 17671886 17600408 17542262 17484935 17620759 17534490 17700614
5851 17700614 17595041 17461370 17507450 17805873 17846324 17832591 18297344 18165230 18134264 18148342
5841 18148342 18219691 18222887 18193962 18177608 18426150 18218751 18160688 18442525 18739512 18938265
5831 18938265 19112932 19120520 18953395 18807549 18993992 19197479 19326516 19673796 19793362 19803340
5821A9803340L31513M2415K91623J95183M27689L7566J20777M35185L47957Q8405
5811B2121653K88947J17555J77707N43363L48784J98761K85268L67012O79736
5802B5128786M12856K66036N86839N13190M84579N29410M08410J72994K71939
5793B8775039N32285J47893L31810M81430L88290Q62222L90428P34500K80460
5784C2924357O66879Q14006R71087L81973M18675O25896Q31350P20133O42701
5775C8997057O90880Q38110P85775Q21038Q06296J191595J173321P17160R77302
5766D6998534J245082J070551J022511J234881J560066J606878J655379K007612
5758E8401494K153144K621908K440478K801118K852823L202989L738566M261720
$$ plain form
5821 19803340 20134853 20177268 20468891 20664074 21091763 21129329 21250106 21685291 22033248 22121653
5811 22121653 22410600 22528155 22705862 23249225 23598009 23796770 24082038 24449050 25128786
5802 25128786 25541642 25807678 26394517 26907707 27392286 27921696 28330106 28503100 28775039
5793 28775039 29307324 29455217 29787027 30268457 30656747 31518969 31909397 32643897 32924357
5784 32924357 33591236 34405242 35376329 35758302 36176977 36802873 37634223 38354356 38997057
5775 38997057 39687937 40526047 41311822 42132860 42939156 44130751 45304072 46021232 46998534
5766 46998534 48243616 49314167 50336678 51571559 53131625 54738503 56393882 58401494
5758 58401494 60554638 63176546 65617024 68418142 71270965 74473954 78212520 82474240
5750H2474240M580844N179525N349595N065670M493329K777328J364744J05710
5742A11390985p40890j223643j422160j452051j330856j371264n04284k3095N73255
5733A03895997J171208J716369K042213L051847L776970M842188N470580O284735
5725A32252107P172491Q303110Q284349P699369O445516M039415J398385j175366
5717A74419376k975200l909765m185685m430965m152059l552695k677840j449383
5709A47085784j27924O18111J619690K586802K734739L364103M291101M743195
5701A66915601N599912O159735O391961O508676O729586O082151N244106M194846
5693B13826574L744824K846572K342842K815895K955796L166772L726193M547344
$$ plain form
5750 82474240 87055084 92234609 97584204 102649874 107143203 109920531 111285275 111390985
5742 111390985 110650095 109426452 108004292 106552241 105221385 103850121 103345837 103322742 103895997
5733 103895997 105067205 106783574 108825787 111877634 115654604 120496792 125967372 132252107
5725 132252107 139424598 147727708 156012057 163711426 170156942 174196357 175594742 174419376
5717 174419376 171444176 167534411 163348726 158917761 154765702 151213007 148535167 147085784
5709 147085784 146957860 147575971 149195661 151782463 154517202 157881305 162172406 166915601
5701 166915601 172515513 178675248 185067209 191575885 198305471 204387622 209631728 213826574
5693 213826574 217571398 220417970 222760812 225576707 228532503 231699275 235425468 239972812
5685B39972812N641803N897073O431484O581458O660871O195437N737739N014507
5677B88133184L603567J497529l91031l113382n031456o428011p558895q533117
5669B62178388r132436r814681r729716j0201249r961276r077067q556343p486990
5661A88218630o907058o171698n800124n252982m635918m594289m522816l799170
5653A46534575m139102m053504l680859l149700l140331l089191l016479k271728
5645A19993681k333874k435454k288994j891468j650540j822074j560309j406253
5637A04604715j071484r85763r24979o01333p87215o73994j95181k91690j15437
5628I8957639K33310K12362L1196m760j48693p6654k47828n56904n76538q49342
$$ plain form
5685 239972812 245614615 251511688 257943172 264524630 271185501 277380938 283118677 288133184
5677 288133184 291736751 293234280 292843249 289729867 284698411 278270400 270711505 262178388
5669 262178388 253045952 243231271 233501555 223300306 213339030 204261963 195705620 188218630
5661 188218630 181311572 175139874 169339750 164086768 159450850 154856561 150333745 146534575
5653 146534575 142395473 138341969 134661110 131511410 128371079 125281888 122265409 119993681
5645 119993681 117659807 115224353 112935359 111043891 109393351 107571277 106010968 104604715
5637 104604715 103533231 102547468 101622489 101021156 100233941 99559947 99364766 99073076 98957639
5628 98957639 99190949 99403311 99434507 99429747 99281054 99204400 98956572 98399668 97823130 96973788
5618I6973788p15199o27615p79751j018409r84182o12515n11108p26182o32650
5609I0366177m73520k72251o03011l42074N0220m74899Q0226l01568m4846k66112
5599H7718342K44971J9002k86905J3841L8147j00392j69301J29428k26603j8452
5589H7362078L55792L93948K93055K87370L22125M28702L75430N58094R72260
5580I1348854N32351O48608Q25701R82360J217433J362767J910562K508028K996470
5571A04333134L870582M625350N289519O222876O262104N919363L922706J812894
5563A42258528K19922n07295q89863o97957n68688q99755m10149L70841J158291
5554A40033875J376537Q31003M01823O85329J400845K554207L140505L001035
$$ plain form
5618 96973788 96258589 95630974 94851223 93832814 92848632 92236117 91725009 90998827 90366177
5609 90366177 89892657 89620406 89017395 88675321 88725541 88250642 88330868 88029300 87984454 87718342
5599 87718342 87963313 87982315 87695410 87709251 87747398 87647006 87477705 87607133 87380530 87362078
5589 87362078 87717870 88111818 88404873 88692243 89014368 89443070 89818500 90376594 91348854
5580 91348854 91881205 92529813 93355514 94337874 95555307 96918074 98828636 101336664 104333134
5571 104333134 108203716 112829066 118118585 124341461 130603565 136522928 140445634 142258528
5563 142258528 142478450 141971155 141081292 140383335 139814647 138914892 138504743 138875584 140033875
5554 140033875 141410412 142241415 142643238 143328567 144729412 147283619 150424124 153425159
5546A53425159K608698J864451N85330j033768j220310j211501q91801q51045
5538A53275213j101231j751588k522446k696403k686668k113767j571626j324574
5530A37506910j063214o48549O10118J007793P82946m11485k013456l236452l644625
5521A28889986m085749m369290m468467m374778m765385m595748m145134l502636
5513I4582799l224454k913721k497999k295985j969524j549912j384384j458100
5505G7288720j192290o50622r51705r17495p59715l83125k06484p36673p66102
5496G0724509o17469p56052q02145m09246o33150o56053o82878n44767o02686
5487F5020063p11862o43299n31230n23627q96019n19576o33719o12233k56075
$$ plain form
5546 153425159 156033857 157898308 158483638 157449870 156229560 155018059 154126258 153275213
5538 153275213 152173982 150422394 147899948 145203545 142516877 140403110 138831484 137506910
5530 137506910 136443696 135795147 136405265 137413058 138196004 137784519 135771063 132534611 128889986
5521 128889986 124804237 120434947 115966480 111591702 106826317 102230569 98085435 94582799
5513 94582799 91358345 88444624 85946625 83650640 81681116 80131204 78746820 77288720
5505 77288720 76096430 75445808 74494103 73576608 72816893 72433768 72227284 71490611 70724509
5496 70724509 70107040 69350988 68548843 68139597 67506447 66850394 66167516 65622749 65020063
5487 65020063 64308201 63664902 63133672 62610045 61714026 61194450 60560731 59948498 59692423
5478E9692423k20221o18612p02300m75925m83154l21988l71169k70854m09053
5469E5819147k48594l53539l69149k68062k72902k93791J9408k01014l13864n29773
5459E2987867n44299j46349k21071p66363l34692l46073m77894k38303m17346
5450D9495477k74734M5370n07223m9544o13754m56810m17288p8582k39619o50984
5440D6252309o28765l33854m62155l76650k93765n43529m59907k7025m05780l17565
5430D2403314k55090m76831l15371j97663l6642l26145L2520L1569l14378l38404
5420D0206879k34276j76090r2633m7811j40200m63826k84328J59018k07839j00394
5410C8618500p8780m03086j41397j20506l83910j14152J98197M8065j25699j9012
$$ plain form
5478 59692423 59472202 58853590 58151290 57675365 57192211 56870223 56499054 56228200 55819147
5469 55819147 55570553 55217014 54847865 54579803 54306901 54013110 54032518 53831504 53517640 52987867
5459 52987867 52443568 52297219 52076148 51309785 50975093 50629020 50151126 49912823 49495477
5450 49495477 49220743 49266113 48758890 48709346 48095592 47638782 47221494 47142912 46903293 46252309
5440 46252309 45623544 45289690 44827535 44450885 44157120 43613591 43153684 43126659 42720879 42403314
5430 42403314 42148224 41671393 41356022 41158359 41121717 40795572 40828092 40859661 40545283 40206879
5420 40206879 39972603 39796513 39703880 39656069 39515869 39052043 38767715 38926733 38718894 38618500
5410 38618500 38539720 38136634 37995237 37874731 37490821 37376669 37574866 37622931 37497232 37478220
5400C7478220k07603j41798L11211k363j09714j85817J81189K2549R8166j42987
5390C7301053k16920l74604k31246l04671m50582O9199L313l25686j96645k41725
5380C5031486l92808k41479j23492m26301j14424j30265j39685m02233l34100
5371C2726699o1213k44140q6536j52287j12268j62063j41663k37481l49189M1779
5361C1221638k53028k43755k82613j24815k38558m21199k46773N9272l88987k49324
5351B8831858k26615j29333K9195n20413j85214l3385r7432j93636j38946j42999
5341B7193080k78395k18027j30192Q5448J2288l66839o3990p0503k73738j87799
5331B5701333P9676p0664m11974l10573n7786j59029j89181k76506k01546r2876
$$ plain form
5400 37478220 37270617 37128819 37440030 37437667 37327953 37142136 37323325 37345874 37444040 37301053
5390 37301053 37084133 36709529 36478283 36173612 35723030 35792229 35795542 35469856 35273211 35031486
5380 35031486 34638678 34397199 34273707 33847406 33732982 33602717 33463032 33060799 32726699
5371 32726699 32665486 32421346 32334810 32182523 32070255 31908192 31766529 31529048 31179859 31221638
5361 31221638 30968610 30724855 30442242 30317427 30078869 29657670 29410897 29470169 29081182 28831858
5351 28831858 28605243 28475910 28505105 27984692 27799478 27766093 27668661 27475025 27336079 27193080
5341 27193080 26914685 26696658 26566466 26651914 26664202 26297363 26233373 26162870 25889132 25701333
5331 25701333 25781009 25710345 25298371 24987798 24930012 24770983 24581802 24305296 24103750 24010874
5321B4010874k84198j44752N6379m1426k54393k3418k2668l08200J68323j0188
5311B3146333j55716J15987O2592n7385j13671L8059N8702L12116J30528L12154
5301B3849699J6785R3170K2757K94806k71807K4708l9199k29963J37772J16238
5291B4014966n1082p9993n6904J62698P762j21178j27693j76795J24405J37847
5281B3834033J20923j85363O6109n8420k1305L22681k29076K308K0042r6901K9267
5270B3804298J28444m0056k6700N16653J8923j38547J45597o896k21922K01249
5260B4381043m5076o0238j78293R1871P7189J21112M3978n8917j76064K21644
5250B4418249k49965P0465K56525P0987J03746l9548k7905J13790q3343J18307
$$ plain form
5321 24010874 23726676 23581924 23638303 23596877 23342484 23319066 23296398 22988198 23156521 23146333
5311 23146333 22990617 23106604 23169196 23111811 22998140 23036199 23094901 23407017 23537545 23849699
5301 23849699 23866484 23959654 23982411 24277217 24005410 24030118 23990919 23760956 23898728 24014966
5291 24014966 23963884 23883891 23826987 23989685 23997447 23876269 23748576 23571781 23696186 23834033
5281 23834033 23954956 23769593 23835702 23777282 23755977 24078658 23849582 23851890 23871932 23775031 23804298
5270 23804298 23932742 23892686 23865986 24382639 24401562 24263015 24408612 24401716 24179794 24381043
5260 24381043 24335967 24275729 24097436 24189307 24266496 24387608 24431586 24372669 24196605 24418249
5250 24418249 24168284 24238749 24495274 24566261 24670007 24630459 24602554 24716344 24633001 24751308
5240B4751308P166k79J43840J99288k85801P0582K19053J22423p5123L2388r4267
5229B5090578j45332j19198K28641K15562p9755k41799m5072J42873j58284m0489
5219B4847725M3660R7977r5729J42152q3302M9744j8366j80369K04783L62971
5209B5371246n1081n8995Q071j5828L3044L39305J30077j57892n580K65631P936
5198B5865934L24634P9895k9357R211k63702K37962L258l1307K52863L03122J55492
5187B6908005k4580K82070L09124m9483K21655L27415J65132J56004L03779L04519
5177B8903640M09862J24245P5097J36054j61846R8965n3503J10546J6374K88224
5167B9947658O3740L03501K58268L57963L39879J11224N24316J13271k0226J65529
$$ plain form
5240 24751308 24758474 24758195 24902035 25101323 24815522 24886104 25105157 25227580 25152457 25184845 25090578
5229 25090578 24945246 24826048 25054689 25270251 25190496 24948697 24903625 25046498 24888214 24847725
5219 24847725 24891385 24989362 24893633 25035785 24952483 25002227 24983861 24803492 25008275 25371246
5209 25371246 25320165 25261170 25269241 25253413 25286457 25625762 25755839 25597947 25592367 25857998 25865934
5198 25865934 26190568 26270463 26241106 26250317 25986615 26224577 26227835 26196528 26449391 26752513 26908005
5187 26908005 26883425 27165495 27474619 27425136 27646791 27974206 28139338 28295342 28599121 28903640
5177 28903640 29313502 29437747 29512844 29648898 29487052 29586017 29532514 29643060 29659434 29947658
5167 29947658 30011398 30314899 30573167 30931130 31271009 31382233 31906549 32019820 31999594 32165123
5157C2165123j28801j11823J72610j50314o534o9743j07800j2322j02437J16895
5147C1764854O0187K5678Q6125K72932j00623j81514L57610N08904N9642K83994
5137C3137789M59960K42698N86952R9482K02987M54766L59379L83585n6687P8397
5127C5949308N19946K23862j4275K17985J19622K74811N99483O73487K82630O84292
5117C9531151P34606M87789J95751K62883K27922K71200J15125L02435L86471
5108D2515333M46046N98705N65767R81173J049233J377384J607325J487160K291668
5099E2919794K705131K874716L705904L066950J919296P06745m55880n88547q21436
5090F6032673j002525j081310j861723j866058j508469j293764o94010p69278
$$ plain form
5157 32165123 32036322 31924499 32097109 31946795 31940261 31870518 31762718 31750396 31647959 31764854
5147 31764854 31825041 31850719 31936844 32209776 32109153 31927639 32285249 32794153 32853795 33137789
5137 33137789 33597749 33840447 34427399 34526881 34729868 35184634 35544013 35927598 35870911 35949308
5127 35949308 36469254 36693116 36678841 36896826 37016448 37291259 37890742 38564229 38846859 39531151
5117 39531151 40265757 40753546 40949297 41212180 41440102 41711302 41826427 42128862 42515333
5108 42515333 42961379 43560084 44125851 45107024 46156257 47533641 49140966 50628126 52919794
5099 52919794 55624925 58499641 62205545 65272495 67191791 67898536 67442656 66854109 66032673
5090 66032673 65030148 63948838 62087115 60221057 58712588 57418824 56724814 55955536
5082E5955536j89736k94226j36295J43559K48850L59616O8832P13253Q25115P31985
5072E8426489O34329O67069J043228Q38369K13165P19900Q20709O38819Q74984
5063F4877061J088271R47267Q82668R60980J070003R33748P96948M79229j06271
5054G1929904l75059l64046l84996j84810j66304k65232L5778J48927j3973J16137
5044G0476326n01857j43802J19627K7530j22121J47878K31806o2494J52808K33188
5034G0558889K01941L64365M52455L37832O49313L35043J26539L63785L25713
5025G3715875N80262N46189K11405J05583M62220M09846N85446N50190N97027
5016G7764043R27732P30003J058172P56941R29637J426239J399355R53043Q61668
$$ plain form
5082 55955536 55765800 55471574 55335279 55478838 55727688 56087304 56156136 56869389 57694504 58426489
5072 58426489 59060818 59727887 60771115 61609484 61822649 62542549 63363258 64002077 64877061
5063 64877061 65965332 66912599 67795267 68756247 69826250 70759998 71556946 72036175 71929904
5054 71929904 71554845 71190799 70805803 70620993 70454689 70189457 70225235 70374162 70360189 70476326
5044 70476326 69974469 69830667 69950294 69977824 69855703 70003581 70235387 70172893 70325701 70558889
5034 70558889 70760830 71125195 71577650 71915482 72564795 72899838 73026377 73390162 73715875
5025 73715875 74296137 74842326 75053731 75159314 75621534 76031380 76616826 77167016 77764043
5016 77764043 78691775 79421778 80479950 81236891 82166528 83592767 84992122 85945165 86806833
5007H6806833J305871J349214J311308J612824J914456J604589J717871J452999
4999I9075965R68591J122737R76548R71974P93981P71929J120156J512742J395487
4990A08710110J438938J964825K350545K243591K320089L036532L400704L697354
4982A29162688L713273M246242N061760N166998N415639N173887N896820O429896
4974A70267203O069797N657009N208708M204286L370796L051251K433356J879416
4966B02141822J693804K133231K322806L165937L518859L950988M519822N058137
4958B28505406N229710M994928N134264N260633N211269M976364M515416M225013
4950B68053003L962865L052742J880084N03407j184805k650110m355123n350647
$$ plain form
5007 86806833 88112704 89461918 90773226 92386050 94300506 95905095 97622966 99075965
4999 99075965 100044556 101167293 102143841 103115815 103909796 104681725 105801881 107314623 108710110
4990 108710110 110149048 112113873 114464418 116708009 119028098 122064630 125465334 129162688
4982 129162688 132875961 137122203 142183963 147350961 152766600 157940487 163837307 170267203
4974 170267203 176337000 181994009 187202717 191407003 194777799 197829050 200262406 202141822
4966 202141822 203835626 205968857 208291663 211457600 214976459 218927447 223447269 228505406
4958 228505406 233735116 238730044 243864308 249124941 254336210 259312574 263827990 268053003
4950 268053003 272015868 275068610 276948694 277452101 276267296 273617186 269262063 263911416
4942B63911416n952659n815040n753656n175322l851483k419935j356670j08446
4934B33478205J25383n78783r24277k224729l617667n086759n894138n833887
4926B09443348n596435n271293m762686m508942m320204l622762l324540l051082
4918A74985404k494054k098520k112569j669397j192782j072445p39089n49034
4910A63057514p06007p82079n12181o44382l72225n84677m29983J92682M16202
4901A59634864P54430J302810J594653J455988J456603J777183K009373K923686
4893A72909590K660521L238481M504332N809266O875955P772206Q019217O529446
4885B18319014M529217J929589j161289k722488l770980m063818l101093j449657
$$ plain form
4942 263911416 257958757 252143717 246390061 241214739 237363256 234943321 233586651 233478205
4934 233478205 233603588 233024805 232100528 229875799 226258132 221171373 215277235 209443348
4926 209443348 203846913 198575620 193812934 189303992 184983788 181361026 178036486 174985404
4918 174985404 172491350 170392830 168280261 166610864 165418082 164345637 163606548 163057514
4910 163057514 162351507 161569428 161057247 160412865 160040640 159455963 159025980 159218662 159634864
4901 159634864 160389294 161692104 163286757 164742745 166199348 167976531 169985904 172909590
4893 172909590 175570111 178808592 183312924 189122190 195998145 203770351 211789568 218319014
4885 218319014 222848231 224777820 223616531 220894043 217123063 213059245 209958152 208508495
4877B08508495K85157J670594K927542M021405N501963P346991R578229J2555162
4869B52395538J6567739K0747738K4675383L0215316L7209285M3575894L7791695
4862D63178588K2693660J838643j4612978j7600146j5830349j5042288k1297646
4855D03327484k5826682k0661822j4168382r633922o983881o106017o034367o374787
4847C07537624p324389q665781r287439j0119960j0790570j0882466j0371592
4840B40095427r903970q967458q403407p412385o529314n805267n022966m131754
4832A83918906l832308l108176k444727j505741j063968n11972N30357Q02176
4824A72784547K85416r427j361909j882790k047131j995122j645757k200577k697492
$$ plain form
4877 208508495 208793652 210464246 213391788 217413193 222915156 230262147 239840376 252395538
4869 252395538 268963277 289711015 314386398 344601714 381810999 425386893 463178588
4862 463178588 485872248 487710891 473097913 455497767 439667418 424625130 403327484
4855 403327484 377500802 356838980 342670598 333036676 326052795 319946778 313912411 307537624
4847 307537624 300213235 291547454 282260015 272140055 261349485 250467019 240095427
4840 240095427 230191457 221223999 212820592 205408207 198878893 193073626 188050660 183918906
4832 183918906 180086598 176978422 174533695 173027954 171963986 171452014 171982371 172784547
4824 172784547 173069963 173060536 171698627 169815837 167768706 165773584 164127827 161927250 159229758
4815A59229758l010115k723034k505534k719769k773023k462364k504510k481853
4807A38049556k466047k457881k711390k527226k382044k437790k195120k070003
4799A18802055j652810j908922j439068j186633r60198q44103n90405p00329j335723
4790A08183864j533898j118705j047128j433854j421285j289165j019287j188206
4782I8132336j185830r19760q91660q63756r14605q15009q36238j272967q26201
4773H9606310m71361p30031q52291n19595n72342p18549k96236m73888k55176
4764H4716841j60181m07475m58671j79405n5931l07643l63103j46074n46317j37599
4754H1954442n97716k27249j70384k9920l421j37683k18738m2067r5810n8588
$$ plain form
4815 159229758 156219643 153496609 150991075 148271306 145498283 143035919 140531409 138049556
4807 138049556 135583509 133125628 130414238 127887012 125504968 123067178 120872058 118802055
4799 118802055 117149245 115240323 113801255 112614622 111654424 110810321 110219916 109519587 108183864
4790 108183864 106649966 105531261 104484133 103050279 101628994 100339829 99320542 98132336
4782 98132336 96946506 96026746 95135086 94271330 93356725 92541716 91705478 90432511 89606310
4773 89606310 89134949 88404918 87552627 87033032 86460690 85742141 85445905 84972017 84716841
4764 84716841 84556660 84149185 83690514 83511109 83455178 83147535 82784432 82638358 82092041 81954442
4754 81954442 81356726 81129477 80959093 80929173 80925752 80788069 80569331 80527264 80431454 80372866
4744H0372866K5611m31753m0935m22611j90220j68670l97416j28530l74400l20228
4734G7923714m9847j52547K49866L9818K68608J81563L43864K08456M26952K94757
4724G9735204M84628N06110L45383L85949O73074M52815M99418O91878P85884
4715H4560343R89280J007801J001350J092774J008342J398820R53089J288816
4707I3300615J169598J228518J186874J254402J227091J537885J675982J540908
4699A04121873K134497K095101K257084K590390K860955L140190L757114M265696
4691A27222900N167565N508469N987903O805301P094822P652174Q624945R724265
4683A83788344J0817034J2374827J3760631J5576264J7162611J8762396K1296128
$$ plain form
4744 80372866 80398477 79966724 79925789 79503178 79312958 79144288 78746872 78618342 78243942 77923714
4734 77923714 77873867 77721320 77971186 78011004 78279612 78461175 78805039 79013495 79440447 79735204
4724 79735204 80219832 80725942 81071325 81457274 82130348 82583163 83082581 83774459 84560343
4715 84560343 85549623 86557424 87558774 88651548 89659890 91058710 92011799 93300615
4707 93300615 94470213 95698731 96885605 98140007 99367098 100904983 102580965 104121873
4699 104121873 106256370 108351471 110608555 113198945 116059900 119200090 122957204 127222900
4691 127222900 132390465 137898934 143886837 150692138 157786960 165439134 174064079 183788344
4683 183788344 194605378 206980205 220740836 236317100 253479711 272242107 293538235
4676B93538235K3853546K6165158K6539902K4029753J7372067P354650l614429
4669D15238882j3797050k0854279k5096442k6690406k4545465k1252298j7795703
4662B65207239j4528964j1992039j0129964q408069o940390n816089m647052l459931
4654A99284741k770318j791334r06742l5605N51452J360908J795338J909556J937658
4645B01335654J766951J561143J656680J759182J745449K483750L304308L781418
4637B19394535M731251M958223N067242N083593M841428M733400M863252M982971
4629B58655895N478820N871700O434244N664082L665111J005337k438035n853142
4621B78484012q570900j0646242j1993275j2252698j1896363j0811388r946839
$$ plain form
4676 293538235 317391781 343556939 370096841 394126594 411498661 418853311 415238882
4669 415238882 401441832 380587553 355491111 328800705 304255240 283002942 265207239
4662 265207239 250678275 238686236 228556272 220148203 213207813 207391724 202744672 199284741
4654 199284741 196514423 194723089 193816347 193780742 194332194 195693102 197488440 199397996 201335654
4645 201335654 203102605 204663748 206320428 208079610 209825059 212308809 215613117 219394535
4637 219394535 224125786 229084009 234151251 239234844 244076272 248809672 253672924 258655895
4629 258655895 264134715 270006415 276440659 282104741 285769852 286775189 284337154 278484012
4621 278484012 269913112 259266870 247273595 235020897 223124534 212313146 202366307
4614B02366307q770244p610259o575403n661391m681318m324298l724273l560688
4606A57458433l201409l396454l532558l615273l508785k895440k840804k212753
4598A32254957j775087j431818j247854j152989j113020j142957j414771j923664
4590A21052797j911238k309233k868257k483103k261405j977507j989709j935481
4582A03316864j851812j738894j129423j341414j479942j467699q54276r42180
4574I2511224p78424o30511q47961q01326o85095o93443q17225j009120j330848
4565H4917271j219014j372582j751966j863200j745543j478334r21889j438252
4557G3126491j090619o82072p14324p12784j04095j86192l49633k22341k13963
$$ plain form
4614 202366307 193596063 185985804 179410401 173749010 169067692 164743394 161019121 157458433
4606 157458433 154257024 150860570 147328012 143712739 140203954 137308514 134467710 132254957
4598 132254957 130479870 129048052 127800198 126647209 125534189 124391232 122976461 121052797
4590 121052797 119141559 116832326 113964069 111480966 109219561 107242054 105252345 103316864
4582 103316864 101465052 99726158 98596735 97255321 95775379 94307680 93453404 92511224
4574 92511224 91732800 91102289 90254328 89453002 88767907 88074464 87257239 86248119 84917271
4565 84917271 83698257 82325675 80573709 78710509 76964966 75486632 74564743 73126491
4557 73126491 72035872 71353800 70639476 69926692 69822597 69636405 69286772 69064431 68850468
4548F8850468j95572l66277N6161n07706p25930o78666o89050r65935j196835
4539F3580658j041827o00929p24020p40172n23830m78127p36689p39628m31746
4530E7563690j14412o8974k00298k08883k01343k81603l09965j00940n47375m56568
4520E5073329j14083O4832k26643N7686Q3695k37408k39991k95515m24507l45140
4510E3396255l34806m35281p87054k61402k54484j66962r7173L9845M5628j02011
4500E1042555K9252J04864J11235j69805j15016j51082m94744n00896k15459m60564
4490D9180340m47078n13775o81523m42638l87933o34330o18335l01699n53147
4481D4599882l53624l06098n55231j99489J9215p4287n45164m83752j08609k50184
$$ plain form
4548 68850468 68654896 68288619 68344780 67837074 67111144 66432478 65743428 64777493 63580658
4539 63580658 62538831 61937902 61213882 60473710 59949880 59471753 58735064 57995436 57563690
4530 57563690 57449278 57380304 57180006 56971123 56769780 56488177 56178212 56077272 55529897 55073329
4520 55073329 54959246 55024078 54797435 54855121 54938816 54701408 54461417 54165902 53741395 53396255
4510 53396255 53061449 52626168 51839114 51577712 51323228 51156266 51059093 51098938 51144566 51042555
4500 51042555 51071807 51176671 51287906 51118101 51003085 50852003 50357259 49856363 49640904 49180340
4490 49180340 48733262 48219487 47537964 47095326 46707393 46073063 45454728 45153029 44599882
4481 44599882 44246258 43940160 43384929 43185440 43204655 43130368 42585204 42101452 41992843 41742659
4471D1742659m41717l77929j20656l54793l72258j28261j04414L5507L2931o0001
4461C9851068k52152J32434n8285L617J79755N40579L38864M65422O37666N21183
4451D2360151N46682J093319R40399O17562Q23854N61041M17581j61991o2985
4442D7135613k61829m54562k45587m95992l22147r6729J15547l9069L70360K15163
4432D5920768M21272M60304r5375j96955M2653R0537k1154K39222M72813M18309
4422D7752394R26824J042778J003561R73601J665898K009738J835693J949535
4414E9160022J640570J558745J529664P44975K46426j94495n21725o34625p85147
4405F2744410p25006j202909j132969j216121j109552j157654j453190j172684
$$ plain form
4471 41742659 41300942 40923013 40802357 40447564 40075306 39947045 39842631 39878138 39911069 39851068
4461 39851068 39598916 39731350 39673065 39676682 39856437 40397016 40735880 41201302 41838968 42360151
4451 42360151 42906833 44000152 44940551 45558113 46381967 46943008 47360589 47198598 47135613
4442 47135613 46873784 46419222 46173635 45677643 45355496 45258767 45374314 45335245 45705605 45920768
4432 45920768 46342040 46802344 46706969 46510014 46552667 46643204 46622050 46861272 47334085 47752394
4422 47752394 48679218 49721996 50725557 51699158 53365056 55374794 57210487 59160022
4414 59160022 60800592 62359337 63889001 64633976 64880402 64685907 64164182 63529557 62744410
4405 62744410 62019404 60816495 59683526 58467405 57357853 56200199 54747009 53574325
4397E3574325r01905p10567n49803n24681k78181j87145j99645l45931l50504
4388D9525963r5004m33226j51408m04533q35433q68552k57208p78844q23904k02887
4378D4674964r11120m98237n45574n70481k82228l79999r7228l17325l01220J85936
4368D0957488k96789j10128k03026j684p8848K67451k55738L3715L6116j05321
4358D0243236m6969j61756J33139J06426K1302J49361P1360O5438Q026K2523j35315
4347D0476771k01377k62071N2257K88675j72643k569o3580M6733q300L16999j11560
4336D0359335j40251k45060m58697m36041l26571o20089p97399l05493p99716
4327C6230018m38484m21731j84794l73771l96098m2225p8128k06415r3558k64277
$$ plain form
4397 53574325 52672420 51961853 51412050 50887369 50609188 50422043 50222398 49876467 49525963
4388 49525963 49430959 48997733 48846325 48441792 47606359 46737807 46480599 45701755 44877851 44674964
4378 44674964 43763844 43265607 42720033 42149552 41867324 41487325 41390097 41072772 40771552 40957488
4368 40957488 40660699 40550571 40347545 40345861 40267013 40534464 40278726 40312441 40348557 40243236
4358 40243236 40196267 40034511 40167650 40274076 40295378 40444739 40516099 40581537 40589563 40612086 40476771
4347 40476771 40275394 40013323 40065580 40354255 40181612 40179043 40115463 40162196 40153896 40470895 40359335
4336 40359335 40219084 39974024 39515327 39079286 38752715 38132626 37335227 37029734 36230018
4327 36230018 35791534 35369803 35185009 34811238 34415140 34372915 34294787 34088372 33994814 33730537
4317C3730537J5183j77590m12967R1340r9232J6173N6294n0172l38504j88935
4307C2642127l80730k85277p48692m88072m15981n17679n90330l90574k19231
4298B8605561j73840l19713l83697l16185n56244l33265l24272k20920o67467
4289B5309958l68481j10085j71291k47645j29351k30771J46842k71066l21261
4280B3606849j52615m27313l56699q7453k34562n18210l79434m39516j34510k92190
4270B0584347m7212k10420m86450l01759m6966k75658j76921j48781k05416m5525
4260A8639239j60093l72133l32038o6084R3570j08191k42310m5257k06803j47428
4250A7052472j09810K8387Q4147j80531k33223J32924K03374Q3212j51068l9594
$$ plain form
4317 33730537 33745720 33568130 33155163 33246503 33147271 33163444 33219738 33169566 32831062 32642127
4307 32642127 32261397 31976120 31227428 30739356 30323375 29805696 29215366 28824792 28605561
4298 28605561 28431721 28112008 27728311 27412126 26855882 26522617 26198345 25977425 25309958
4289 25309958 24941477 24831392 24660101 24412456 24283105 24052334 24199176 23928110 23606849
4280 23606849 23454234 23026921 22670222 22582769 22348207 21829997 21450563 21011047 20876537 20584347
4270 20584347 20537135 20326715 19840265 19538506 19491540 19215882 19038961 18890180 18684764 18639239
4260 18639239 18479146 18107013 17774975 17708891 17802461 17694270 17451960 17406703 17199900 17052472
4250 17052472 16942662 16971049 17055196 16874665 16641442 16774366 16977740 17060952 16909884 16870290
4240A6870290J29602m5504l7524K20678l6308j14396l6401K3100L8395j97583
4230A6814349J39314N324J77728k94749k01083J06864J0018l27329m1797J83047
4220A6571686r4361J6397K5855l31756n6386m64842K08918J71612k26991J57050
4210A5977182J13534j50876k25847P4638J02087P9566p4984r336K5433L3112m5991
4199A5898518O9325N7812J8036O909K73293j14260K91748O66626K86339r0406
4189A7363940O1874j16635j27422N127j08097o1274n93253k62404l65038p7537
4179A5719281n14112k53147j83364l42713j216k3569n5348O3802J54924l28143
4169A4236395k97626j05807k52370k84290N7477k20035j90542K99169n52030m18286
$$ plain form
4240 16870290 16999892 16954388 16916864 17137542 17101234 16986838 16950437 16973537 17011932 16814349
4230 16814349 16953663 16958987 17136715 16841966 16640883 16747747 16757765 16430436 16388639 16571686
4220 16571686 16477325 16493722 16519577 16187821 16131435 15666593 15875511 16047123 15820132 15977182
4210 15977182 16090716 15939840 15713993 15788631 15890718 15970284 15895300 15885964 15911397 15944509 15898518
4199 15898518 15967843 16025655 16043691 16050600 16323893 16209633 16501381 17168007 17454346 17363940
4189 17363940 17425814 17309179 17181757 17186884 17078787 17017513 16424260 16161856 15796818 15719281
4179 15719281 15205169 14952022 14768658 14425945 14424729 14401160 14345812 14409614 14564538 14236395
4169 14236395 13938769 13832962 13580592 13296302 13353779 13133744 12943202 13242371 12690341 12272055
4159A2272055N5808k38946j71910L05229m3178o92310o5529p8143J49788k41777
4149A1251087j60128l71605j5683L6448k13478J67457J14842M2308l7753l93953
4139A0419542L10054j51819m5934M5777Q1159p9719j00121N9958j34862q632J05469
4128A0500872L33951j98617K6984Q312k09182j75052R2634k29077O083j38602
4118A0018306j69194M1676N6106P9555r9120Q1101j24258m2360J26059K32087
4108A0199958k86825q5378l3027J33908J72128p9015k05989l5111k92148k38697
4098I249804k4402l5522K25636j15871J40764j16641k58494O1259M7831M7671
4088I222035k16232J48936J39727J37166N4739J21584q3587j50144K19052K07436
$$ plain form
4159 12272055 12327863 12088917 11917007 12222236 12179058 11486748 11421219 11343076 11492864 11251087
4149 11251087 11090959 10719354 10703671 10740119 10526641 10694098 10808940 10851248 10813495 10419542
4139 10419542 10729596 10577777 10531843 10577620 10658779 10579060 10478939 10538897 10404035 10395403 10500872
4128 10500872 10834823 10636206 10663190 10671502 10462320 10287268 10379902 10150825 10156908 10018306
4118 10018306 9849112 9890788 9946894 10026449 9927329 10008430 9884172 9841812 9967871 10199958
4108 10199958 9913133 9827755 9794728 9928636 10100764 10021749 9815760 9780649 9488501 9249804
4098 9249804 9225402 9189880 9415516 9299645 9440409 9323768 9065274 9126533 9174364 9222035
4088 9222035 9005803 9154739 9294466 9431632 9486371 9607955 9524368 9374224 9593276 9800712
4078I800712R131k5656P3458L23557o022k96700l6471K02872J2908n1613J63481
4067A0169657k67682q2547N8278k86901k94310r4763L05198L28926k46806N4451
4057I643501K5483r7980j88540K28664j84656R9416N6501j23095K02953K8297
4047I690544r0657q7645J3609j08447j13578j77068n7462K31077q1353L50751
4037I569771L1469j36937K5741K11129j70559q3389K17109j8903J16533J6039
4027I778003k14783l62782R3576K74468l39595k14109K69352J40974m94652l4746
4017H895706J80168j64983m2961J13178k67112J91159p5262j81451j50292K10336
4007H708486K62205k30196m3620j12803K73485J20776J23161j57386k22817m3408
$$ plain form
4078 9800712 9809843 9784187 9857645 10181202 10175180 9878480 9842009 10044881 10057789 10006176 10169657
4067 10169657 9901975 9819428 9877706 9590805 9296495 9201732 9506930 9835856 9589050 9643501
4057 9643501 9668984 9571004 9382464 9611128 9426472 9525888 9582389 9459294 9662247 9690544
4047 9690544 9599887 9512242 9525851 9417404 9303826 9126758 9069296 9300373 9219020 9569771
4037 9569771 9601240 9464303 9490044 9701173 9530614 9447225 9664334 9645431 9761964 9778003
4027 9778003 9563220 9200438 9294014 9568482 9228887 9014778 9284130 9425104 8930452 8895706
4017 8895706 9075874 8910891 8867930 8981108 8713996 8905155 8829893 8648442 8498150 8708486
4007 8708486 8970691 8740495 8696875 8584072 8857557 8978333 9101494 8944108 8721291 8677883
3997H677883J35487k48836j08263k05209K67014q0857j32895l2281J09627K4455
3987H406125m27166J33265J7891p3758R6676K0459q777k46120K75837j83903j73766
3976G836763o8270o107n5428N2470K5061M5293l7531j72109K12002p0653L7141
3965G798632J26624j57058m4120J85780j9760j78039j12673Q4989p7694p3065
3955G533616R860K18696J18874m117j55173J09467l1501J08543j83751l85441
3945G339073L4858L11165Q3499N840Q0969l17956q7567j7985J46798O4842O0609
3934G704145K08662J38753Q4478q0827J185k0390J66678Q6002o6889P1937j82705
3923H111029Q9260K5412L91067l1634j3924q3684J69901O3300j00695J42330O1682
$$ plain form
3997 8677883 8813370 8564534 8456271 8251062 8518076 8437219 8304324 8272043 8381670 8406125
3987 8406125 7978959 8112224 8130115 8056357 8153033 8173492 8164715 7918595 8194432 8010529 7836763
3976 7836763 7768493 7762386 7706958 7759428 7784489 7829782 7792251 7620142 7832144 7761491 7798632
3965 7798632 7925256 7768198 7724078 7909858 7890098 7712059 7599386 7684375 7606681 7533616
3955 7533616 7543476 7762172 7881046 7876929 7721756 7831223 7799722 7908265 7724514 7339073
3945 7339073 7373931 7685096 7768595 7774435 7855404 7537448 7449881 7431896 7578694 7643536 7704145
3934 7704145 7912807 8051560 8136038 8055211 8056396 8036006 8202684 8288686 8221797 8293734 8111029
3923 8111029 8200289 8225701 8616768 8585134 8571210 8487526 8657427 8720727 8620032 8762362 8824044
3912H824044j65818j12610K70720k40765Q780J90727J13903m39797J67933O8147
3902H685264k512n0841K66211J56827L8134m4794p6394L987j0856j76952N2605
3891H840679J62833o202r1578N1836m6924l51474O8469J64434k14356L6278K831
3880H616826K08640M2525l25725m7675K59120J25897k44946P4893l0126J18436
3870H797865M2701J73762J53767j90751j14503K67984K06458j78658r4178M9920
3860I114367q2048J93336K2072k13578p4374K66052r7800J0409q4066K01723Q1569
3849I337662k44497j61223O4228L91109J97840j85576j6297O7753N9350m1376
3839I468973k18017l3983O9420N8574J23869J51300j30933Q0218K96222k57609
$$ plain form
3912 8824044 8658226 8545616 8816336 8575571 8584351 8775078 8888981 8449184 8617117 8685264
3902 8685264 8682752 8631911 8898122 9054949 9093083 9048289 8971895 8975882 8965026 8788074 8840679
3891 8840679 9003512 8997310 8905732 8957568 8910644 8559170 8627639 8792073 8577717 8613995 8616826
3880 8616826 8825466 8867991 8542266 8494591 8753711 8879608 8634662 8709555 8679429 8797865
3870 8797865 8840566 9014328 9168095 8977344 8862841 9130825 9337283 9158625 9064447 9114367
3860 9114367 9032319 9225655 9247727 9034149 8959775 9225827 9128027 9138436 9054370 9256093 9337662
3849 9337662 9093165 8931942 8996170 9387279 9585119 9399543 9383246 9450999 9510349 9468973
3839 9468973 9250956 9216973 9286393 9344967 9468836 9620136 9489203 9569421 9865643 9608034
3829I608034K06518L00407J80114j74465k90407K17768K21600R6183J9541k59431
3819A0125862R6823J31228J72676Q2183j57765q0719K61485q9807J52594P8610
3809A0773170o0048O9265k23140o3367J73897L85261j51555k39801J92806j2496
3799A0843992P4244j13371j27239K42575p5378Q0825l4748m6033k18090J16317
3789A0743094J4158K24931n031j7009J91853k3509j56579L14233L15938J15547
3779A1717626K92911m3754k11013K38703m143Q1688N4105J58932J15313Q3395
3769A2483763l9306J95745j19365O0938R3015j5673j55145J05227J48296r3299
3759A2664196k07334j56760J03367J77020j5785k54548K43229N640j26103J95936
$$ plain form
3829 9608034 9814552 10114959 10295073 10120608 9830201 10047969 10269569 10365752 10385293 10125862
3819 10125862 10222685 10353913 10526589 10608772 10451007 10370288 10631773 10541966 10694560 10773170
3809 10773170 10713122 10782387 10559247 10495880 10669777 11055038 10903483 10663682 10856488 10843992
3799 10843992 10918236 10804865 10677626 10920201 10844823 10925648 10890900 10844867 10626777 10743094
3789 10743094 10757252 10982183 10977152 10960143 11151996 11128487 10971908 11286141 11602079 11717626
3779 11717626 12010537 11966783 11755770 11994473 11990330 12072018 12126123 12285055 12400368 12483763
3769 12483763 12444457 12640202 12520837 12581775 12674790 12659117 12503972 12609199 12757495 12664196
3759 12664196 12456862 12300102 12403469 12580489 12564704 12310156 12553385 12559025 12432922 12628858
3749A2628858J12990L6316k14615j43647K30296J16540M1653K5146p4758n2222
3739A2706557l0211r0271L19816j90510k11949N6244P8420j08950n845K19119
3729A2742420J9778R2587j6757l5100q1221J14949j4375R0026K06910m9256J05541
3718A3175502o4632o6178j36613o8358J80856L52040K46186k08330Q1567q1182
3708A3410858j2294k1707m04169J38379K91384j69721o615J41199J33492j13877
3698A3386929p4933K93058K6733J55745l40698m41285L42479M00032j07430m3120
3688A3597510J12848O2051R8824J82608k56037P5920J28645O3574J2362K36860
3678A4315165J10583k72422m4582J81882J13520K83911M8373j43236m2419O7804
$$ plain form
3749 12628858 12741848 12778164 12563549 12419902 12650198 12766738 12808391 12833537 12758779 12706557
3739 12706557 12676346 12586075 12905891 12715381 12503432 12559676 12638096 12529146 12523301 12742420
3729 12742420 12762198 12854785 12838028 12802928 12721707 12836656 12822281 12912307 13119217 13069961 13175502
3718 13175502 13110870 13044692 12908079 12839721 13020577 13372617 13618803 13410473 13492040 13410858
3708 13410858 13398564 13376857 12972688 13111067 13402451 13232730 13226115 13367314 13500806 13386929
3698 13386929 13311996 13605054 13631787 13787532 13446834 13005549 13348028 13748060 13640630 13597510
3688 13597510 13710358 13772409 13871233 14053841 13797804 13873724 14002369 14065943 14078305 14315165
3678 14315165 14425748 14153326 14108744 14290626 14404146 14688057 14736430 14593194 14550775 14618579
3668A4618579l3916J13038m7950j62290K48040K46943p0788j98252J17014J07198
3658A4937616M42255N00097m0209K43697j6817q6771J67376j40389j5921j4895
3648A5976039K46110L92620K34325J6045j05785j19935P0290K38182L27829J71674
3638A7447394n4559J42481r4986N2980J71589j75329j9495M44716L36050k143
3628A8248698K56663J81900j28617K37381K65597J05588K64643L9756o1687K31123
3618A9641045M87735L40380P7887j92169J62263L88235m29899n1455M23584P7485
3608B0925091J51748K58558K4012K99695p931j37119L03289J11992J65019N1324
3598B2145678K45399R4677L09111L42374p9248J78644O5448J71520K7478K35888
$$ plain form
3668 14618579 14584663 14697701 14649751 14487461 14735501 14982444 14911656 14713404 14830418 14937616
3658 14937616 15379871 15879968 15839759 16083456 16066639 15979868 16147244 16006855 15990934 15976039
3648 15976039 16222149 16614769 16849094 16865139 16759354 16639419 16709709 16947891 17275720 17447394
3638 17447394 17392835 17535316 17440330 17493310 17664899 17489570 17470075 17914791 18250841 18248698
3628 18248698 18505361 18687261 18558644 18796025 19061622 19167210 19431853 19471609 19409922 19641045
3618 19641045 20128780 20469160 20547047 20354878 20517141 20905376 20475477 20424022 20847606 20925091
3608 20925091 21076839 21335397 21359409 21659104 21651173 21514054 21817343 21929335 22094354 22145678
3598 22145678 22391077 22485754 22794865 23137239 23057991 23236635 23302083 23473603 23501081 23736969
3588B3736969n3843P8252K61611J62986K47446M86697M25107R541L76056Q9260
3578B5820082J91079J79019K89742K14770M12601L65354M14944N84017L80353
3569B8851961O21212O13447M77904M63953k60231m9884l09423j71112n5994l19798
3559B9862035k24866l77517O9491J22975K68340k9481m4130K08345N8267J34291
3549C0047750L12057L17641j0965N08881K16362K62006N49535N53927M02870O53772
3539C3813836O21639Q07817P50110J115708Q52770K12031j75734k24759l84349
3530C7389069q04470n05693l07540l88620m76562l87874J92296N7619J48261R6967
3520C5013453J99797R4275J44205L60043M29313N08389M26521P60301M64425Q64644
$$ plain form
3588 23736969 23683126 23761378 24022989 24185975 24433421 24920118 25345225 25354766 25730822 25820082
3578 25820082 26011161 26190180 26479922 26694692 27107293 27472647 27887591 28471608 28851961
3569 28851961 29473173 30086620 30564524 31028477 30768246 30718362 30408939 30237827 30181833 29862035
3559 29862035 29637169 29259652 29329143 29452118 29720458 29690977 29646847 29855192 29913459 30047750
3549 30047750 30359807 30677448 30666483 31175364 31391726 31653732 32203267 32757194 33160064 33813836
3539 33813836 34435475 35243292 35993402 37109110 37961880 38173911 37998177 37773418 37389069
3530 37389069 36584599 36078906 35771366 35382746 34906184 34518310 34710606 34768225 34916486 35013453
3520 35013453 35213250 35307525 35451730 35811773 36241086 36749475 37175996 37936297 38400722 39265366
3510C9265366P37717Q41894N7374M34902J27843L9979j23105k68979m91920m32587
3500D0188484p11351j115266o42724o38405r58788o20078m07131m69376m16699
3491C4208666k18031O9598m30823k64569k92290p51683o87438o49600n72671o81306
3481B9729853l48303l59222n05710m48737q6699j56514J7003j63257k63959k10165
3471B7204290m26865l04692l73487j15955l06282j88060l52406L6251j37569n36528
3461B4498697n07851J10895o5032l60896k02646p0589j0445k37889j7818O0307
3451B3196733j98311j52385n4331M5357Q9932R218k19937l73682p7402j38694
3441B2126498J26036m86121m10639k04605l51594k88324k30684m5648k90965k27763
$$ plain form
3510 39265366 40003083 40844977 40902351 41337253 41465096 41505075 41381970 41112991 40621071 40188484
3500 40188484 39477133 38361867 37719143 37080738 36121950 35501872 35094741 34625365 34208666
3491 34208666 33990635 34060233 33629410 33364841 33072551 32320868 31633430 30983830 30411159 29729853
3481 29729853 29381550 29022328 28516618 28067881 27981182 27824668 27841671 27678414 27414455 27204290
3471 27204290 26777425 26472733 26099246 25983291 25677009 25488949 25136543 25172794 25035225 24498697
3461 24498697 23990846 24101741 24036709 23675813 23473167 23402578 23392133 23154244 23136426 23196733
3451 23196733 22998422 22846037 22791706 22837063 22926995 22936213 22716276 22342594 22265192 22126498
3441 22126498 22252534 21766413 21355774 21151169 20799575 20511251 20280567 20234919 19943954 19716191
3431A9716191j4505q1606k99611J53290R2025k56494q9874O7939P4144J67685
3421A9529184K50678J45812k97946m20367p1508p4313K13720k39846n8450r9796
3411A8877168k95345l76836n0603k53846j88880r1036l07751j51673k02013L8684
3401A6997869m40024k10724j73712k93776K7289l732n8335K64016k37714j04390
3391A5766767L83966J92799n9821j58891k55357r623o8600k71723N5299q6409
3381A5488407O38Q4121l69931j51863J26602k11704p0974K1962p9977J94637j41916
3370A4890002k16176r8855l23392j30289r1625k80222k24870k43407r842j66832
3360A3104492P7819k07812m16227K06328k26400l30055O8216l3856p1591j00623
$$ plain form
3431 19716191 19701686 19620080 19320469 19473759 19565784 19309290 19219416 19287355 19361499 19529184
3421 19529184 19779862 19925674 19627728 19207361 19135853 19061540 19275260 19035414 18976964 18877168
3411 18877168 18581823 18204987 18154384 17900538 17711658 17620622 17312871 17161198 16959185 16997869
3401 16997869 16557845 16347121 16173409 15879633 15906922 15903190 15844855 16108871 15871157 15766767
3391 15766767 16150733 16343532 16283711 16124820 15869463 15859840 15791240 15519517 15574816 15488407
3381 15488407 15489045 15573166 15203235 15051372 15177974 14966270 14895296 14917258 14837281 15031918 14890002
3370 14890002 14673826 14574971 14251579 14121290 14029665 13749443 13524573 13281166 13271324 13104492
3360 13104492 13182311 12974499 12558272 12764600 12538200 12208145 12276361 12242505 12170914 12070291
3350A2070291M8770k90077m37989J20037N8336k5189p2724r3344o8553r1856q300
3339A1209402L7477Q4048l37034j68151l19921k01881J13382j04069r4780j78470
3329A0040003K1321P2327K0205j18276j52373r4362k3907l54314j26859K1764
3319I305529j52855k9673l10023j13028J81621L72878r1162j78992J02110N3158
3309I139563K09422l00734l43858R1992K70059j71970r9953J76468p3672J1956
3299H909273M07678k7244j04857J20579m7486l6275m1823k0474J13901r7934J58873
3288I334211K03509o7338O4442L41973Q6723p1395j83221J54080N2548p7819J33746
3277I971459m6695L0668q8575K54367R5899J2013J1544K5904K8311L32797K17551
$$ plain form
3350 12070291 12119061 11828984 11390995 11511032 11569368 11544179 11471455 11378111 11309558 11217702 11209402
3339 11209402 11246879 11330927 10993893 10825742 10505821 10303940 10417322 10313253 10218473 10040003
3329 10040003 10061324 10133651 10153856 10035580 9883207 9788845 9764938 9410624 9283765 9305529
3319 9305529 9152674 9123001 8812978 8699950 8881571 9254449 9163287 8984295 9086405 9139563
3309 9139563 9348985 9048251 8704393 8796385 9066444 8894474 8794521 8970989 8897317 8909273
3299 8909273 9316951 9289707 9184850 9305429 9257943 9221668 9179845 9159371 9273272 9175338 9334211
3288 9334211 9537720 9470382 9534824 9876797 9963520 9892125 9708904 9862984 9915532 9837713 9971459
3277 9971459 9924764 9955432 9866857 10121224 10217123 10229136 10240680 10266584 10294895 10627692 10845243
3266A0845243J66520J14779K65026J68245K94475l0340L9191J49486K26073J59597
3256A2398295j0299l2262k275K72530K05700K21652P3924M43945K86584j42967
3246A3714827J64575N00318J72685N0136j00711K73239L02758K36614N29048M1594
3236A5885083J25188k77473K4029M59185J63121K94153J61975O4828M60812L55397
3226A7716298p7049L24124N32500J75119M0031L31544L43019N01390L43731N40504
3216B0771211L73325M03075M11120P19396P04457Q89371N45004K00021N49218
3207B5566198M24786K33761K08017J68728J51257L36412J77505L48315L94453
3198B8009432N51271j7195K19476r1287J54538J95670N7495M56749q8797Q7483
$$ plain form
3266 10845243 11011763 11126542 11391568 11559813 11854288 11823948 11863139 12012625 12238698 12398295
3256 12398295 12387996 12355734 12353459 12625989 12831689 13053341 13127265 13571210 13857794 13714827
3246 13714827 13879402 14379720 14552405 14602541 14501830 14775069 15077827 15314441 15843489 15885083
3236 15885083 16010271 15732798 15756827 16216012 16379133 16673286 16835261 16900089 17360901 17716298
3226 17716298 17639249 17963373 18495873 18670992 18711023 19042567 19385586 19886976 20230707 20771211
3216 20771211 21144536 21547611 21958731 22678127 23382584 24271955 24816959 25016980 25566198
3207 25566198 25990984 26224745 26432762 26601490 26752747 27089159 27266664 27614979 28009432
3198 28009432 28560703 28543508 28762984 28671697 28826235 29021905 29079400 29536149 29447352 29534835
3188B9534835J24844M55030K41893K08873K62980j33941L74926P45469O57134
3179C2472043M72248M52871K79086Q7966M84167J71843K84938K95130K01372J09052
3169C5310716M5989K02866J82086p8932r0476l2179l54359l32244k53618m96706
3159C4103143k45616j66467n45845n50715k55520m78743o20279m23839j17854
3150C0698265K00052l7014k28928l32113J35355j00507j17530J9831j47399k42983
3140B9847029j78352J05923m56056j44933j70709l26733k57287j95547l39510
3131B7883825k84380m59223k91227k14915m98052o69650n20979j75911j81810
3122B4587678k83606m76923p36408m01391l94260j93369l85430n00009j50183
$$ plain form
3188 29534835 29659679 30114709 30356602 30565475 30828455 30694514 31069440 31814909 32472043
3179 32472043 32944291 33397162 33676248 33764214 34248381 34420224 34705162 35000292 35201664 35310716
3169 35310716 35356705 35559571 35741657 35662725 35572249 35540070 35185711 34853467 34599849 34103143
3159 34103143 33857527 33691060 33145215 32594500 32338980 31860237 31239958 30816119 30698265
3150 30698265 30898317 30861303 30632375 30300262 30435617 30335110 30217580 30237411 30090012 29847029
3140 29847029 29668677 29774600 29318544 29173611 29002902 28676169 28418882 28223335 27883825
3131 27883825 27599445 27140222 26848995 26634080 26136028 25466378 24945399 24769488 24587678
3122 24587678 24304072 23827149 23090741 22689350 22295090 22101721 21716291 21216282 21066099
3113B1066099n16430l58592l26934k54863l20866k23333m86740m24879k8481j74157
3103A7950824m47518k55551l91581J0492j83016m89066j19933j73767r6776k68394
3093A5535714n24769k51168m0288k5975n58487j74439l72853k7141l48824l90807
3083A2820963k10260j05658o5151J06396m57981j66455l37265j58593k63184j89621
3073A0973191N0191j36849J44553m09187k64220j11628j10204k04530j97393k42811
3063I491113k28340j37370O1736k12416l12481j06251j3124j60847R251j1380
3053H379891m7253k78753r2281j83425K71511j74899k77695k20262j40769k61684
3043F974381J37626N0100J2361l29242J4687r6299j13773J16231j73020k17096
$$ plain form
3113 21066099 20549669 20191077 19864143 19609280 19288414 19065081 18578341 18153462 18124981 17950824
3103 17950824 17503306 17247755 16856174 16866666 16683650 16194584 16074651 15900884 15804108 15535714
3093 15535714 15010945 14759777 14719489 14693514 14135027 13960588 13587735 13560594 13211770 12820963
3083 12820963 12610703 12505045 12439894 12546290 12088309 11921854 11584589 11425996 11162812 10973191
3073 10973191 11023382 10886533 11031086 10621899 10357679 10246051 10135847 9931317 9733924 9491113
3063 9491113 9262773 9125403 9187139 8974723 8662242 8555991 8542867 8382020 8391271 8379891
3053 8379891 8332638 8053885 7961604 7778179 8049690 7874791 7597096 7376834 7236065 6974381
3043 6974381 7112007 7162107 7174468 6845226 6859913 6763614 6649841 6766072 6593052 6375956
3033F375956m19017J14257K63311r2395k35000m43520l9480J75091l11638L5533
3023E423098o2354l43300O8355J45793l07977J42824p2348K4112K20780j38060
3013E100923j20650o9404j01833O729j26382J4688j21864r547k0916K43672k32191
3002D563225k66198m87052j6587j2583j26193N2044j11043n1115j11593K11187
2992C644092N5377l45125k24225j71453J04694L32639k58387K4840J33393j7282
2982C278563k44707p1306K3561r052J79516K28029j51870j39151n9870M2812m88286
2971B588239j48926L44051J19073j97032K34015q0465l93949k15823P0957J33442
2961B453582o9593o3091N6636o1708P2007l25661r6523K29100J14220K37676l83339
$$ plain form
3033 6375956 5956939 6071196 6334507 6242112 6007112 5563592 5524112 5699203 5387565 5423098
3023 5423098 5360744 5017444 5085799 5231592 4923615 5066439 4994091 5018203 5238983 5100923
3013 5100923 4980273 4910869 4809036 4815765 4689383 4704071 4582207 4572660 4551744 4795416 4563225
3002 4563225 4297027 3809975 3793388 3780805 3654612 3706656 3595613 3544498 3432905 3644092
2992 3644092 3699469 3354344 3130119 2958666 3063360 3395999 3137612 3162452 3295845 3278563
2982 3278563 3033856 2962550 2986111 2977059 3156575 3384604 3232734 3093583 3033713 3076525 2588239
2971 2588239 2439313 2783364 2902437 2705405 2939420 2858955 2465006 2249183 2320140 2453582
2961 2453582 2383989 2320898 2377534 2315826 2387833 2062172 1965649 2194749 2308969 2546645 2163306
2950B163306j12130P8058J60798k81702J37842M0916n0684K15639j27574r9030
2940B125439J3263j87356l65363M845n6621p8750K30512M48287k1088k24817j87335
2929A701016j02013J65917k27870M3124K47131m31137L0016J21158o4216p4349
2919A408777J6161j01729k6075J33638L94161q4969J62907n1594l63324n4261
2909A433692J22201k08656l27764J29904L57828J10276l86651Q5251J37393o9576
2899A383898k38094M13940l47382r4318K0546j85250J27016K82508J17680k49061
2889A231483J00796K3132k1829n4315j10019l259J97539j63297M8594J18846k9316
2878A338355k31545j26246j3523J41685L6295k53990q902J53862J47783l34481
$$ plain form
2950 2163306 2051176 2129234 2290032 2008330 2146172 2187088 2136404 2352043 2224469 2125439
2940 2125439 2138702 1951346 1585983 1590828 1534207 1455457 1685969 2134256 2113168 1888351 1701016
2929 1701016 1599003 1764920 1537050 1580174 1827305 1396168 1426184 1547342 1483126 1408777
2919 1408777 1424938 1323209 1297134 1430772 1824933 1739964 1902871 1851277 1487953 1433692
2909 1433692 1555893 1347237 1019473 1149377 1507205 1617481 1230830 1316081 1453474 1383898
2899 1383898 1145804 1559744 1212362 1118044 1138590 953340 1080356 1362864 1480544 1231483
2889 1231483 1332279 1355411 1333582 1279267 1169248 1165989 1363528 1200231 1248825 1367671 1338355
2878 1338355 1106810 980564 967041 1108726 1145021 891031 882129 1035991 1183774 849293
2868H49293N3666P5296j54167l14974L01901n6542J38311R6111n317n3209j54292
2857G76077L03261o5911k32066J6594j23069L4558k16884P3676J32027j67314
2847E30949L29264L48286j08112l25106r7138K7474P197P9495k9676r8454J5570
2836F79749m8929k8897J08963j98778L6103l6580r3581L19643j32317p6577L37717
2825H66516J14364j87775j79692L2823J38798k65613j27646O9914O3620P2131
2815E97440J55521R095q3515n4987R3512j53650o7980m6004J03679j99045j56523
2804A97543J85684K53353j73148p9201J14832K00830J026k08837j12593j66253
2794B13236k6545k1177L36616o4186j07403j09592M47220l1497l75178P749Q8450
$$ plain form
2868 849293 902959 978255 824088 509114 811015 754473 892784 988895 983578 930369 776077
2857 776077 1079338 1013427 781361 797955 674886 709444 492560 566236 698263 530949
2847 530949 860213 1208499 1100387 775281 678143 705617 712814 792309 762633 664179 679749
2836 679749 630820 601923 710886 512108 548211 511631 418050 737693 605376 528799 866516
2825 866516 980880 793105 613413 646236 785034 519421 391775 461689 525309 597440
2815 597440 752961 762056 678541 623554 717066 563416 495436 449432 553111 354066 197543
2804 197543 383227 636580 463432 384231 499063 699893 700919 492082 379489 213236
2794 213236 186691 165514 502130 437944 330541 220949 668169 636672 261494 269243 357693
2783C57693J2529J62762k15627J28648q9508r8651J23613k31620J53007K21584
2773E24430j41451j34456K02758k07j13193m54272K16122K25865L4583K275m35550
2762g3096J65098L48947J12049p6099l16891J4194r5087J53825O4490j07844m881
2751A84705n9659l8362J66791q626j34315p9022J57339K56126P0684j93128p688
2740C14845J1867L8759k06352J46056Q4132k27716J62659J20114j02934p1227
2730B70203o4976j5195o2659P0999j73855N7810L7546j36081j7025K24584K38460
2719D29811l5473m06175J46866k04394j53061J32333R5742O0479L383J75611j92847
2708E2275N0243J21099L4129K75760J06938k10890k20731k62469K6734l3078J82984
$$ plain form
2783 357693 370222 532984 317357 446005 356497 257846 381459 149839 302846 524430
2773 524430 382979 248523 451281 451074 337881 -116391 99731 325596 360179 362454 -73096
2762 -73096 92002 440949 552998 476899 160008 174202 79115 232940 297430 189586 184705
2751 184705 125046 86684 253475 244849 110534 31512 188851 444977 515661 322533 314845
2740 314845 326712 365471 159119 305175 389307 161591 324250 444364 341430 270203
2730 270203 205227 190032 127373 198372 24517 82327 119873 -16208 -33233 191351 429811
2719 429811 394338 -11837 135029 -69365 -222426 -90093 5649 66128 69511 245122 52275
2708 52275 102518 223617 257746 533506 640444 429554 208823 -53646 -26912 -59990 122994
2697A22994j09891O5848M32162j01293k64208j76280j18241J9040K53533K11200
2687C34864N2994j87197k66738J17819j66r1223J80983J05780L0933j33241L4184
2676A78992r4732r3911j69249J27388J27220r6010L673j21216R9384k37610K86583
2665A0512J67630L08175j41872k44348J59874l9324n4071r5941J2485L1834j60922
2654d5968M93J2959J58748R8473J51352k53297J42830n1274l67293L1942Q1449
2643c9586J71066o5794r1504K76278j08237j44490p272R9913K23010K10482j46797
2632C77069n0590Q2697k0506k28801m4480K32356L9881k59867j0742J2014j93158
2621f4127K33480K21359l00432J3688j48215Q8836q3583N044K21533R134j38207
$$ plain form
2697 122994 13103 78951 511113 409820 145612 -30668 -148909 -129869 123664 334864
2687 334864 387858 200661 -66077 51742 51576 -39647 141336 247116 278049 144808 178992
2676 178992 84260 -9651 -178900 -51512 75708 -20302 -16629 -137845 -38461 -276071 10512
2665 10512 178142 486317 344445 100097 259971 220647 166576 70635 83120 114954 -45968
2654 -45968 -45475 -32516 126232 224705 376057 122760 265590 214316 -152977 -121035 -39586
2643 -39586 131480 65686 -25818 250460 142223 -2267 -9539 90374 313384 523866 377069
2632 377069 326479 409176 388670 159869 115389 347745 387626 127759 117017 129031 -64127
2621 -64127 169353 390712 90280 103968 -44247 44589 -38994 -33950 187583 196717 58510
2610E8510J4433R0020j75457j4858q1175J51244q1029k36272O6190k6310j63643
2599c98347L58446K54793O521j03240j27087K90433K2354l30994L3884M6376o5021
2588a1882K1914K43124L5369j55513n5751j94617J30832J30281M2284l2832J0752
2577A63961L5847Q2920L4054o5744O3055k55641k8548J28360J73086j4974k83041
2566C3335j28640Q9157m2042L85901j83036o7877q00J3973k13115P3843k46857
2555b86158J22742p4903N52412j473j63827J10424n6237J55903k06074l07241
2545a54432J44557p2540J22934J71862J85154k6788l00852P1617k1417Q0029l2523
2534A67601o4694j5222J77581l6008P7119j24488n3368k7505J6341k00711K08860
$$ plain form
2610 58510 72943 162963 -12494 -27352 -108527 42717 -38312 -274584 -208394 -234704 -398347
2599 -398347 -39901 214892 221413 118173 -8914 281519 303873 -27121 6763 53139 -11882
2588 -11882 10032 253156 288525 133012 77261 -117356 13476 143757 186041 153209 163961
2577 163961 199808 282728 316782 251038 314093 58452 29904 158264 331350 316376 33335
2566 33335 -95305 -6148 -48190 337711 154675 86798 85998 99971 -113144 -39301 -286158
2555 -286158 -163416 -238319 314093 312620 148793 259217 202980 358883 152809 -154432
2545 -154432 -9875 -82415 40519 212381 397535 370747 69895 141512 120095 200124 167601
2534 167601 102907 87685 265266 229258 306377 181889 128521 101016 117357 -83354 125506
2523A25506K42640k26413m8746K04248K49264j70437j12892p1378r6166J3804
2513A09430J50878L14530k04205j19881r0930j4683p3482J22963n9365m4277O8172
2502A59150J48396J983l53437N9061L36815N8010j27911j22250n1839j435J45260
2491B51803J81696m4515j95813J2005O6274m9843k84456J05376J99207j74067
2481F7667r297j22217M8649J25449J64955n7569K3283m695O2635J35222p2205
2470C61877j13007J46239O623K1090J11603J58962N6281m79933O4691J37230q2431
2459C89225K5009R4338R2453K26604l86969M8538P6476j0797j05717M9820l0234
2448D68746J26472Q4885J98376M420k40741J31711j84330j15113J23597p6311
$$ plain form
2523 125506 368146 141733 92987 297235 546499 376062 263170 191792 95626 109430
2513 109430 260308 574838 370633 250752 159822 145139 71657 194620 135255 90978 159150
2502 159150 307546 309529 -43908 15153 351968 409978 282067 159817 107978 106543 251803
2491 251803 433499 388984 193171 205176 271450 221607 -62849 42527 241734 67667
2481 67667 58370 -63847 -15198 110251 275206 217637 240920 236225 298860 434082 361877
2470 361877 248870 395109 401732 422822 534425 693387 749668 269735 334426 471656 389225
2459 389225 414234 508572 601025 827629 440660 489198 565674 554877 449160 498980 468746
2448 468746 595218 680103 878479 882899 642158 773869 589539 474426 598023 521712
2438E21712L17106K5440l43609J88695J83489J13658k84417n7837J15925J68354
2428I48516p5583K4600n8393o5891M06631o878L290J71806o9309j37788P2147
2417A213148J15652J9142j89643k9524K35191M23874K01616N5247K86393j34383
2407B196713l0836J38090K49145K13595N55718j37041j16099m1740k1812M55127
2397C460860r3247L5841J16605p0392L99694N39038K67717K75896M57572L30666
2387E720250N20089Q21324P10877R30596P20968O79814N61396Q86280J097191
2378A2648785J517492J599406J559564K485809L594128M056756N099675P028133
2370C9589748O562627L657873M133114J18680n320964p699966q080201n630961
$$ plain form
2438 521712 838818 864258 520649 709344 892833 1006491 722074 664237 780162 948516
2428 948516 872933 897533 839140 773249 1179880 1173002 1176292 1348098 1278789 1141001 1213148
2417 1213148 1328800 1347942 1158299 1128775 1363966 1787840 1989456 2044703 2331096 2196713
2407 2196713 2165877 2303967 2553112 2766707 3322425 3185384 3069285 3027545 3005733 3460860
2397 3460860 3367613 3403454 3520059 3449667 3849361 4388399 4656116 4932012 5389584 5720250
2387 5720250 6240339 7061663 7772540 8703136 9424104 10103918 10665314 11551594 12648785
2378 12648785 14166277 15765683 17325247 19811056 23405184 27461940 32561615 39589748
2370 39589748 46152375 49810248 53943362 54062042 48741078 41041112 32960911 27329950
2362B7329950m140958k627256k445618k298114j522033r03599j167251q75698
2354A1349423o82026m61163q63974p99700n75968n23907n15288l10646k06820
2345F409931p26304k70513l7956m87193J36692j30508j94210l21592k44487n3211
2335D080649l06929j12628l2142k68100p7420n6086j34966k26561k7484k09496
2325B628837l7865R5911k02807k83112m9342j32951j07352K23916J13388k99499
2315A949124k92123k7391k8214J1931j23104j9879q8179j87611J78391J07098
2305A480043l9855J85088j35761o6165j41834l60842J57476K09838L1455Q6357
2295A405800k23041j83820j58449j5414q9743K0902K8188j00439J98103j30991
$$ plain form
2362 27329950 23188992 20561736 18116118 15818004 14295971 13392372 12225121 11349423
2354 11349423 10667397 10206234 9342260 8542560 7966592 7442685 6927397 6616751 6409931
2345 6409931 5683627 5413114 5375158 4887965 5024657 4894149 4699939 4378347 4133860 4080649
2335 4080649 3773720 3661092 3628950 3360850 3283430 3227344 3092378 2865817 2838333 2628837
2325 2628837 2590972 2686883 2484076 2200964 2151622 2018671 1911319 2135235 2248623 1949124
2315 1949124 1657001 1629610 1601396 1613327 1490223 1470344 1382165 1194554 1372945 1480043
2305 1480043 1440188 1625276 1489515 1423350 1281516 920674 1078150 1287988 1319443 1405800
2295 1405800 1182759 998939 840490 825076 735333 756235 784423 683984 882087 751096
2285G51096O7229j67548J12061J16621j97028P2155m5479j3256J92018J46412
2275A034281p2897p1162j38180j3088p7154q523k0364J23249k12326L5418q2778
2264D96476J04059J66473j25531l74530Q2094O9264l9882l312J37578l7755l04589
2253A70345j72163o1056J26548L08108K36028k43264k07270J91725J06221N035
2243D60257j63257l4808j56482j77813L68059P216J8750j83197N7090J66929m490
2232C58254J7152K51855k00456j77064J6661k5592j57848J10220K27223n4104
2222C66301J8158j32756J9636j79944Q1620l7286o1313r875j03292J77543j21659
2211A7133J76452j11290J34649r8235l56922N793O9169J5513k0910J14963L073
$$ plain form
2285 751096 818325 650777 762838 879459 682431 754586 709107 695851 887869 1034281
2275 1034281 961384 890222 752042 738954 661800 653277 632913 756162 543836 579254 496476
2264 496476 600535 767008 641477 266947 349041 418305 378423 375111 512689 474934 170345
2253 170345 -1818 -62874 63674 371782 607810 364546 157276 349001 455222 460257
2243 460257 297000 262192 105710 -72103 295956 303172 321922 138725 195815 362744 358254
2232 358254 375406 627261 426805 249741 266402 240810 82962 193182 420405 366301
2222 366301 384459 251703 271339 91395 173015 135729 74416 64541 -38751 138792 17133
2211 17133 193585 82295 216944 118709 -238213 -232420 -163251 -147738 -168648 -53685 -50612
2200e0612K00380k12238o3745L2225J99491K7339n3797N9447K1970J21041j46030
2189A35471R2927J53730O1028R5105j37873P841L4911o9911k15801p500j64228
2178a4300o5941n8903L39644k02631p4965J32922J194O9432j69798L7245j00031
2167a06132J14889R4321j25870N1225j25939J29055J16027l12737P7464j2958
2157a00655k3608o8091K59362J81880j54053K2921J47200j32395q6505O5715j19266
2146g495L2238N2532k02454j36985K77589Q8906O2553J38308m5809K0074j63040
2135A16417l11851J89502J46918l9276p4776k36777j33262Q6378K32380Q1682
2125E7335K24384j22049j10557J847L49080l51066l5034L1924j99773P4871J83027
$$ plain form
2200 -50612 149768 -62470 -126215 -93990 105501 132840 79043 138490 160460 281501 135471
2189 135471 228398 382128 443156 538261 400388 408229 443140 373229 157428 149928 -14300
2178 -14300 -80241 -139144 200500 -2131 -77096 55826 57020 126452 -43346 -6101 -106132
2167 -106132 8757 103078 -22792 28433 -97506 31549 147576 -165161 -87697 -100655
2157 -100655 -124263 -192354 67008 248888 94835 117756 264956 132561 46056 111771 -7495
2146 -7495 24743 77275 -125179 -262164 15425 104331 166884 305192 259383 279457 116417
2135 116417 -195434 -5932 140986 101710 26934 -209843 -343105 -256727 -24347 57335
2125 57335 281719 159670 49113 50960 400040 48974 13940 45864 -153909 -79038 103989
2114A03989K4044j078M7160r9911j6002k25676K8149K75099J66985K41898p6126
2103D68531m40465J78841K03712n6498j41666m9072J51975l7775m5095q073m3397
2092A81018j9835k29484L06151j50937k33083J43013L9740j50562k7374K45279
2082A03926j30011N1313K38178N5744k68425J66094j74180L6241J44610j47845
2072G5645N7655j24068R889r5219k52789J27376M71346j83575j29664n8n626N3109
$$ plain form
2114 103989 128033 126955 174115 74204 58202 -167474 -139325 135774 302759 544657 468531
2103 468531 28066 206907 410619 354121 212455 163383 315358 277583 232488 224415 181018
2092 181018 161183 -68301 237850 86913 -146170 -3157 36583 -113979 -141353 103926
2082 103926 -26085 25228 263406 319150 50725 216819 42639 78880 223490 75645
2072 75645 133300 9232 19121 -76098 -328887 -201511 269835 86260 -43404 -43462 -49088 4021
$$ [...]
##END NTUPLES=NMR SPECTRUM
##END=
