##TITLE=1H_DE-80H_X3
 200.13MHz, d2o
 8 sc
 
 19ns.26.2.2025
##JCAMPDX= 6.0         $$ Bruker NMR JCAMP-DX V2.0
##DATA TYPE= NMR SPECTRUM
##DATA CLASS= NTUPLES
##ORIGIN= UXNMR, Bruker Analytische Messtechnik GmbH
##OWNER= pz
$$ XWIN-NMR		Version 3.5
$$ Thu Jul  3 11:11:20 2025 Russian Standard Time (UT+4h)  Yarkov@DPX200
##.OBSERVE FREQUENCY= 200.1313
##.OBSERVE NUCLEUS= ^1H
##.ACQUISITION MODE= SIMULTANEOUS
##.ACQUISITION SCHEME= undefined
##.AVERAGES= 8
##.DIGITISER RES= 18
##SPECTROMETER/DATA SYSTEM= spect
##.PULSE SEQUENCE= zg30
##.SOLVENT NAME= CDCl3
##.SHIFT REFERENCE= (INTERNAL, CDCl3, 0, 15.3635)
##AUDIT TRAIL= $$ (NUMBER, WHEN, WHO, WHERE, WHAT)
$$ ##TITLE= Audit trail, XWIN-NMR		Version 3.5
$$ ##JCAMPDX= 5.01
$$ ##ORIGIN= Bruker BioSpin GmbH
$$ ##OWNER= Yarkov
$$ C:/Bruker/XWIN-NMR/data/yarkov2/nmr/H-C/1/pdata/1/auditp.txt
$$ ##AUDIT TRAIL=  $$ (NUMBER, WHEN, WHO, WHERE, WHAT)
(   1,<2025-07-03 11:09:53.14 +0400>,<Yarkov>,<DPX200>,
      <created by zg, POWCHK disabled, PULCHK disabled
       configuration hash MD5:
       00 E9 B6 7A A2 85 ED C7 34 08 36 98 17 FE 4E 26
       data hash MD5: 16K
       67 4F 72 CA F1 DC 21 77 13 5F 83 FC A1 5C 77 A5>)
(   2,<2025-07-03 11:09:57.54 +0400>,<Yarkov>,<DPX200>,
      <Start of raw data processing
       efp BC_mod = 2 LB = 0.25 FT_mod = 6 PKNL = 1 PHC0 = -1343.07 PHC1 = -12.35052 SI = 16K 
       data hash MD5: 16K
       71 EA 83 23 FC 58 ED 93 30 60 71 40 A9 CB F9 48>)
(   3,<2025-07-03 11:10:04.04 +0400>,<Yarkov>,<DPX200>,
      <abs ABSG = 5 
       data hash MD5: 16K
       CE B6 FA 7A 0A D5 59 CE 84 0F 20 6C 31 BD D4 64>)
(   4,<2025-07-03 11:10:33.93 +0400>,<Yarkov>,<DPX200>,
      <pk PHC0 = -10.22261 PHC1 = 7.599999 
       data hash MD5: 16K
       E6 90 97 6E C4 E1 4D 80 FC 15 10 B2 96 53 70 30>)
$$ ##END=
$$ 
$$ hash MD5
$$ EE AD F8 2C AC D0 6E 82 E3 1C 49 A5 E3 C7 C6 55
##$RELAX= 
##$RELAX= 
##$RELAX= 
##$RELAX= 
##$RELAX= 
##$RELAX= 
$$ Bruker specific parameters
$$ --------------------------
##$DU= <C:/Bruker/XWIN-NMR>
##$EXPNO= 1
##$NAME= <H-C>
##$PROCNO= 1
##$TYPE= <nmr>
##$USER= <yarkov2>
##$AMP= (0..31)
100 100 100 100 100 100 100 100 100 100 100 100 100 100 100 100 100 100 
100 100 100 100 100 100 100 100 100 100 100 100 100 100 
##$AQSEQ= 0
##$AQ_mod= 1
##$AUNM= <au_zg>
##$AUTOPOS= <>
##$BF1= 200.13
##$BF2= 200.13
##$BF3= 200.13
##$BF4= 200.13
##$BF5= 200.13
##$BF6= 200.13
##$BF7= 200.13
##$BF8= 200.13
##$BYTORDA= 1
##$CFDGTYP= 0
##$CFRGTYP= 5
##$CHEMSTR= <none>
##$CNST= (0..31)
1 1 145 1 1 1 1 1 1 1 1 1 1 1 1 1 1 1 1 1 1 1 1 1 1 1 1 1 1 1 1 1 
##$CPDPRG= <>
##$CPDPRG1= <>
##$CPDPRG2= <>
##$CPDPRG3= <>
##$CPDPRG4= <mlev>
##$CPDPRG5= <mlev>
##$CPDPRG6= <mlev>
##$CPDPRG7= <mlev>
##$CPDPRG8= <mlev>
##$CPDPRGB= <>
##$CPDPRGT= <>
##$D= (0..31)
0 0.7 0 0 0 0 0 0 0 0 0 0.03 0 0 0 0 0 0 0 0 0 0 0 0 0 0 0 0 0 0 0 0 
##$DATE= 1751526592
##$DBL= (0..7)
120 120 120 120 120 120 120 120 
##$DBP= (0..7)
150 150 150 150 150 150 150 150 
##$DBP07= 0
##$DBPNAM0= <>
##$DBPNAM1= <>
$$ [...]
##$SUBNAM3= <"">
##$SUBNAM4= <"">
##$SUBNAM5= <"">
##$SUBNAM6= <"">
##$SUBNAM7= <"">
##$SUBNAM8= <"">
##$SUBNAM9= <"">
##$SW= 18.0517328524113
##$SWIBOX= (0..15)
0 0 2 0 0 0 0 0 0 0 0 0 0 0 0 0 
##$SW_h= 3612.71676300578
##$TD= 16384
##$TD0= 1
##$TE= 0
##$TE2= 300
##$TE3= 300
##$TEG= 300
##$TL= (0..7)
0 120 120 120 120 120 120 120 
##$TP= (0..7)
150 150 150 150 150 150 150 150 
##$TP07= 0
##$TPNAME0= <>
##$TPNAME1= <>
##$TPNAME2= <>
##$TPNAME3= <>
##$TPNAME4= <>
##$TPNAME5= <>
##$TPNAME6= <>
##$TPNAME7= <>
##$TPOAL= (0..7)
0.5 0.5 0.5 0.5 0.5 0.5 0.5 0.5 
##$TPOFFS= (0..7)
0 0 0 0 0 0 0 0 
##$TUNHIN= 0
##$TUNHOUT= 0
##$TUNXOUT= 0
##$USERA1= <user>
##$USERA2= <user>
##$USERA3= <user>
##$USERA4= <user>
##$USERA5= <user>
##$V9= 5
##$VALIST= <valist>
##$VCLIST= <CCCCCCCCCCCCCCC>
##$VD= 0
##$VDLIST= <DDDDDDDDDDDDDDD>
##$VPLIST= <PPPPPPPPPPPPPPP>
##$VTLIST= <TTTTTTTTTTTTTTT>
##$WBST= 1024
##$WBSW= 4
##$XGAIN= (0..3)
0 0 0 0 
##$XL= 0
##$YL= 0
##$YMAX_a= 691182
##$YMIN_a= -588348
##$ZGOPTNS= <>
##$ZL1= 120
##$ZL2= 120
##$ZL3= 120
##$ZL4= 120
##$ABSF1= 15.54085
##$ABSF2= -2.511002
##$ABSG= 5
##$ABSL= 3
##$ALPHA= 0
##$AQORDER= 0
##$ASSFAC= 0
##$ASSFACI= 0
##$ASSFACX= 0
##$ASSWID= 0
##$AUNMP= <proc_1d>
##$AZFE= 0.1
##$AZFW= 0.1
##$BCFW= 0
##$BC_mod= 2
##$BYTORDP= 0
##$COROFFS= 0
##$CY= -3
##$DATMOD= 1
##$DC= 0
##$DFILT= <>
##$DTYPP= 0
##$F1P= 0
##$F2P= 0
##$FCOR= 1
##$FTSIZE= 16384
##$FT_mod= 6
##$GAMMA= 0
##$GB= 0
##$INTBC= 1
##$INTSCL= 3.241238e-09
##$ISEN= 128
##$LB= 0.25
##$LEV0= 0
##$LPBIN= 0
##$MAXI= 10000
##$MC2= 0
##$MEAN= 0
##$ME_mod= 0
##$MI= 1.114404
##$NCOEF= 0
##$NC_proc= -6
##$NLEV= 6
##$NOISF1= 3.799351
##$NOISF2= 2.8
##$NSP= 0
##$NTH_PI= 0
##$NZP= 0
##$OFFSET= 15.36346
##$PC= 1
##$PHC0= -1353.293
##$PHC1= -4.750521
##$PH_mod= 1
##$PKNL= yes
##$PPARMOD= 0
##$PSCAL= 0
##$PSIGN= 0
##$REVERSE= no
##$SF= 200.130031668008
##$SI= 16384
##$SIGF1= 3
##$SIGF2= 2
##$SINO= 0.751879
##$SIOLD= 32768
##$SREGLST= <19F.Aceton>
##$SSB= 0
##$STSI= 16384
##$STSR= 0
##$SW_p= 3612.71676300578
##$SYMM= 0
##$S_DEV= 0
##$TDeff= 16384
##$TDoff= 0
##$TI= <>
##$TILT= no
##$TM1= 0
##$TM2= 0
##$TOPLEV= 0
##$USERP1= <user>
##$USERP2= <user>
##$USERP3= <user>
##$USERP4= <user>
##$USERP5= <user>
##$WDW= 1
##$XDIM= 16384
##$YMAX_p= 404203820
##$YMIN_p= -1825432
$$ End of Bruker specific parameters
$$ ---------------------------------
##NTUPLES= NMR SPECTRUM
##VAR_NAME=  FREQUENCY,     SPECTRUM/REAL,   SPECTRUM/IMAG
##SYMBOL=    X,             R,               I
##VAR_TYPE=  INDEPENDENT,   DEPENDENT,       DEPENDENT
##VAR_FORM=  AFFN,          ASDF,            ASDF
##VAR_DIM=   16384,         16384,           16384
##UNITS=     HZ,            ARBITRARY UNITS, ARBITRARY UNITS
##FACTOR=    0.220516191357247, 1,           1
##FIRST=     3074.68965369592, 0,            0
##LAST=      -538.027109309863, 0,           0
##MIN=       -538.027109309863, -1825432,    0
##MAX=       3074.68965369592, 404203820,    0
$$ Real data points
##PAGE= N=1
##DATA TABLE= (X++(R..R)), XYDATA
$$ [...]
7474D225554Q3075R0011Q9161J63004J00424N6714M9249Q984O9353K1523O6714
$$ 4225554 4308629 4398640 4487801 4650805 4751229 4807943 4857192 4866176 4935529 4957052 5023766
7463E023766J00497J3455M3077P0558K5101K3963N1695k0990N0706R2138n023
$$ 5023766 5124263 5137718 5180795 5251353 5276454 5300417 5352112 5331122 5381828 5473966 5468943
7452E468943Q0397O9050J20092K9562J5585L1458K197M9323j9597M5920R0845
$$ 5468943 5549340 5618390 5738482 5768044 5783629 5815087 5817284 5866607 5847010 5892930 5983775
7441E983775M1167P5193r774m1812P9446J6253n9174l2882J21341Q1537M5804
$$ 5983775 6024942 6100135 6090361 6048549 6127995 6144248 6085074 6052192 6173533 6255070 6300874
7430F300874K9074P4979R5477M3508R9799J90151M9971J30829J91050J56660J46561
$$ 6300874 6329948 6404927 6500404 6543912 6643711 6833862 6883833 7014662 7205712 7362372 7508933
7419G508933J17599J93160Q4041L3853M7096K7403L9581K1795M5817K2471p7275
$$ 7508933 7626532 7819692 7903733 7937586 7984682 8012085 8051666 8073461 8119278 8141749 8064474
7408H064474m1938j17603j00726m7044m2573j3351l9391j09036L4604k744Q8752
$$ 8064474 8022536 7904933 7804207 7757163 7714590 7701239 7661848 7552812 7587416 7584672 7673424
7397G673424K7863k8792Q9062K5447M9974J08937Q4624J757K9546Q8601J9540
$$ 7673424 7701287 7672495 7761557 7787004 7836978 7945915 8030539 8032296 8061842 8150443 8169983
7386H169983O818M0752J26527O9746Q2803J26056J18020J00493J04024J67300
$$ 8169983 8176801 8217553 8344080 8413826 8496629 8622685 8740705 8841198 8945222 9112522
7376I112522J86196J54999J82486J99127K52342K99191L19167L35943K15984L85338
$$ 9112522 9298718 9453717 9636203 9835330 10087672 10386863 10706030 11041973 11257957 11643295
7366A1643295L38379K82576L25853K64938K64727K12450J91353L5230J14N9080
$$ 11643295 11981674 12264250 12590103 12855041 13119768 13332218 13523571 13558801 13558915 13617995
7356A3617995j0934O394J396n1186l3215j5323m4759j2000Q1610J80513K22098
$$ 13617995 13607061 13613455 13614851 13563665 13530450 13515127 13470368 13458368 13539978 13720491 13942589
7345A3942589J65690J20492J38124J26059J695N8700N1757L921N4859j10958j81451
$$ 13942589 14108279 14228771 14366895 14492954 14494649 14553349 14605106 14609027 14663886 14552928 14371477
7334A4371477j11553p6618r4090j28568n2397J1034O3164O3121O3898K4979J39332
$$ 14371477 14259924 14183306 14089216 13960648 13908251 13919285 13982449 14045570 14109468 14134447 14273779
7323A4273779J26551J29592J37611J40921J68781O7868K556j53865p7436j26388
$$ 14273779 14400330 14529922 14667533 14808454 14977235 15045103 15047659 14893794 14816358 14689970
7313A4689970j38843k25501k18885k67397j86510k17522k24350k97566j82784
$$ 14689970 14551127 14325626 14106741 13839344 13652834 13435312 13210962 12913396 12730612
7304A2730612k13323k57183j87126j69132j89956j52639j01222j57868j37900
$$ 12730612 12517289 12260106 12072980 11903848 11713892 11561253 11460031 11302163 11164263
7295A1164263m5477L9926j2223J5220L172o9224r8596k379k6667q1573K585n5172
$$ 11164263 11118786 11158712 11146489 11161709 11164881 11095657 10997061 10994682 10968015 10886442 10889027 10833855
7283A0833855j03341r5085j15735j58180j46916j93416j69087j33991k00235j61856
$$ 10833855 10730514 10635429 10519694 10361514 10214598 10021182 9852095 9718104 9517869 9356013
7273I356013j06901k15867k22697j32361j70100j51176j41664o8402p6079n1762
$$ 9356013 9249112 9033245 8810548 8678187 8508087 8356911 8215247 8146845 8070766 8019004
7263H019004j01585N4509N5689k7486j3095P6629P2291r391N2267Q5141O6669
$$ 8019004 7917419 7971928 8027617 8000131 7987036 8063665 8135956 8126565 8178832 8263973 8330642
7252H330642N2169O7778O1633N280o7768n5520q9440j51871q3944r5896q7390
$$ 8330642 8382811 8450589 8512222 8517502 8449734 8394214 8304774 8152903 8068959 7973063 7885673
7241G885673p5978r431j0999p6639j4267M4298q17N5051J195R6525R4546O4139
$$ 7885673 7809695 7800264 7789265 7712626 7698359 7742657 7741840 7796891 7798086 7894611 7989157 8053296
7229H053296N9008J15199J03058P8995J92322J84518J98135J69313K25021J84740
$$ 8053296 8112304 8227503 8330561 8409556 8601878 8786396 8984531 9153844 9378865 9563605
7219I563605J93166K43635J96708K90936K60578L47043M63134L73757L99212N60944
$$ 9563605 9756771 10000406 10197114 10488050 10748628 11095671 11558805 11932562 12331774 12892718
7209A2892718N80767N85217O93689P33376P90330R57531R82309R41731J077841
$$ 12892718 13473485 14058702 14752391 15485767 16276097 17233628 18215937 19157668 20235509
7200B0235509J141590J173691J115901J162997R37194P34842N06568J32158k94037
$$ 20235509 21377099 22550790 23666691 24829688 25766882 26501724 27008292 27140450 26846413
7191B6846413n96682j011017j314713j424533j487853j466455j329294j211085
$$ 26846413 26249731 25238714 23924001 22499468 21011615 19545160 18215866 17004781
7183A7004781j151687r61992r19301q69863p57949n87508o24226m95082n02450
$$ 17004781 15853094 14891102 13971801 13101938 12343989 11756481 11132255 10637173 10134723
7174A0134723m73284m33282l58357l24375l74216l36951k67515k17710k19511
$$ 10134723 9661439 9228157 8869800 8545425 8171209 7834258 7566743 7349033 7129522
7165G129522j68904k85996k05023j50368j61186r9588j68890j92482j67801l0499
$$ 7129522 6960618 6674622 6469599 6319231 6158045 6058457 5889567 5697085 5529284 5498785
7155E498785l9841o4788J741k6324J4311K4728K7246M6307P9884P8099R2685L2028
$$ 5498785 5458944 5394156 5395897 5369573 5383884 5408612 5435858 5482165 5562049 5640148 5732833 5764861
7143E764861J352k8888r8196j12018j82577j91590k48208k64494k44049k73105
$$ 5764861 5766213 5737325 5639129 5527111 5344534 5152944 4904736 4640242 4396193 4123088
7133D123088j97159j62579j70414j72751q7624p8456j31909j41573p0700j55560
$$ 4123088 3925929 3763350 3592936 3420185 3332561 3254105 3122196 2980623 2909923 2754363
7123B754363n3232o8180n0920q3445j18991L4453m0214n9152m6906K1263j8447
$$ 2754363 2701131 2632951 2582031 2498586 2379595 2414048 2373834 2314682 2267776 2289039 2270592
7112B270592p1416j4941M1581k9861r1542l1905k6286j10076m3487p5925L3695
$$ 2270592 2199176 2184235 2225816 2195955 2104413 2072508 2046222 1936146 1892659 1816734 1850429
7101A850429K7068n7019o3766k3770L9022L6999K3523o9485j50593j8646l569
$$ 1850429 1877497 1820478 1756712 1732942 1771964 1808963 1832486 1763001 1612408 1593762 1590193
7090A590193n5899N3531J8312o5124o1179J8006J7586k6303n1982J7400K1283
$$ 1590193 1534294 1587825 1606137 1541013 1479834 1497840 1515426 1489123 1437141 1454541 1475824
7079A475824O910m9998l6683m2197J3668r604K6559p307n2416J5983k0632m1104
$$ 1475824 1482734 1432736 1396053 1353856 1367524 1357920 1384479 1377172 1324756 1340739 1320107 1279003
7067A279003m0487k6956r646K8855K6161L185Q514k3686J6531k5153M4981p3182
$$ 1279003 1238516 1211560 1201914 1230769 1256930 1260115 1268629 1244943 1261474 1236321 1281302 1208120
7055A208120m7129P0044p845n671L4408l3178o680J8427o2722j4366n5846k7798
$$ 1208120 1160991 1231035 1223190 1217519 1251927 1218749 1212069 1230496 1167774 1153408 1097562 1069764
7043A069764L2977K6441o5578n8894J7694K0169J13353K8065l7659l6417l1470
$$ 1069764 1102741 1129182 1063604 1004710 1022404 1042573 1155926 1183991 1146332 1109915 1078445
7032A078445K1130n1650j3172J4157K6305m2259J9274j6471p4968L5637n9742
$$ 1078445 1099575 1047925 1034753 1048910 1075215 1032956 1052230 1035759 960791 996428 936686
7021I36686m3816l115J8835l2422L8922J9857L0578J8442m4790P4589m8405o378
$$ 936686 892870 889755 908590 876168 915090 934947 965525 983967 939177 1013766 965361 958983
7009I58983m9368J5298P046M088k8746J0536M120R94o850m4356l8178J07505K5993
$$ 958983 909615 924913 931959 936047 907301 917837 921957 922951 916101 871745 833567 941072 967065
6996I67065j5145o3314O4559K3837k7605P9314L9075L3379j4928L397N6332L3887
$$ 967065 951920 888606 953165 977002 949397 1028711 1067786 1101165 1086237 1089634 1145966 1179853
6984A179853k7069o406q0239J9116M8356l5325M2338l0603q2117j1169o792k0728
$$ 1179853 1152784 1146378 1066139 1085255 1133611 1098286 1140624 1110021 1027904 1016735 1009943 989215
6972I89215p612L8642j389O9106m9785J7070M710P2089P1908l74K6955O2163J11357
$$ 989215 981603 1020245 1018856 1087962 1038177 1055247 1059957 1132046 1203954 1203580 1230535 1292698 1404055
6959A404055O440j2362Q2742O781l4874n8255k7033j4498j4289r2848r4763k3677
$$ 1404055 1410495 1398133 1480875 1487656 1452782 1394527 1367494 1352996 1338707 1245859 1151096 1127419
6947A127419k0508R60m3578n4231N7677L0001m6040R672j7550m5525r861M0870
$$ 1127419 1106911 1107871 1064293 1010062 1067739 1097740 1051700 1061372 1043822 998297 988436 1029306
6935A029306l353n981p1410l6640O7539O2082q6553m4781o5268o6543J0231l0167
$$ 1029306 1025953 1019972 948562 911922 979461 1041543 954990 910209 844941 778398 788629 758462
6923G58462L6555K4359l6737l1478J0551n2028K4777O6668Q7713K8353j18979
$$ 758462 795017 819376 782639 751161 761712 709684 734461 801129 888842 917195 798216
6912G98216l0800O324m6193J1227N4213K1658K3415k6365l9255P714o4957m9861
$$ 798216 767416 773740 727547 738774 792987 814645 838060 811695 772440 780154 715197 665336
6900F65336O2486l0928P998R150k6530P8368N4159m4093p7234j7549L0794k15
$$ 665336 727822 696894 704892 714042 687512 765880 820039 775946 698712 681163 711957 711742
6888G11742j3755M4116k4135M5100R798l5393N773m4808Q2360K1296o645n5916
$$ 711742 697987 742103 717968 763068 772866 737473 743246 698438 780798 802094 795449 739533
6876G39533J4174K9726k6245n2799Q5312k4283p4968J4303L2178J2600p7073K5218
$$ 739533 753707 783433 757188 704389 789701 765418 690450 704753 736931 749531 672458 697676
6864F97676k0583j6563K4609L4110l011k2271Q0425N5607k6140l9668j00860M6135
$$ 697676 677093 660530 685139 719249 716238 693967 774392 829999 803859 764191 663331 709466
6852G09466p294m630j1815j2572j0782m090J2475L8060L9558J2631L138q660n9599
$$ 709466 702172 697542 685727 673155 662373 658283 670758 708818 748376 761007 764145 755485 695886
6839F95886M2548L0187k3135O9604o8128q022j6256J6241O3294O0162j6778m0108
$$ 695886 738434 768621 745486 815090 746962 738940 722684 738925 802219 862381 845603 805495
6827H05495o748j5776m4125K8387L6923R628O8899r954j5322l706J4923K6338
$$ 805495 798747 782971 738846 767233 804156 813784 882683 872729 857407 853701 868624 894962
6815H94962m2361j2286L4750M708p1420L4872O8684q5002L0864M1540L5199q39
$$ 894962 852601 840315 875065 879773 808353 843225 911909 826907 857771 899311 934510 933671
6803I33671j7794m5734M0365M2819L7370o3108k2300K5178j5799J1578O1463l7744
$$ 933671 915877 870143 910508 953327 990697 927589 905289 930467 914668 926246 987709 949965
6791I49965p2742L4862J5182k1045P2393m0181O7408P1650k4062k4384L26k3314
$$ 949965 877223 912085 927267 906222 978615 938434 1005842 1077492 1053430 1029046 1029372 1006058
6779A006058l3259L8052M4454O6339j2539L7630j293l2557q844K3493m7844L6272
$$ 1006058 972799 1010851 1055305 1121644 1109105 1146735 1145442 1112885 1104041 1127534 1079690 1115962
6767A115962J1158P818m3943j552p223O7294m063n9291M6361N0915Nj844N8520
$$ 1115962 1127120 1134938 1090995 1089443 1082220 1149514 1145451 1086160 1132521 1183436 1183441 1181597 1240117
6754A240117j5931n1880K0721J2671M7553L0603K9680k6391R7170N9769N0622
$$ 1240117 1224186 1172306 1193027 1205698 1253251 1283854 1313534 1287143 1384313 1444082 1494704
6743A494704o5399q3995j2211l14L3101K7078K7230n2529j0877M5860l1947L0455
$$ 1494704 1429305 1345310 1333099 1332785 1365886 1392964 1420194 1367665 1356788 1402648 1370701 1401156
6731A401156Q1611k0361O1592n3091j9165P0364L524j4473M5971M3100O174M006
$$ 1401156 1482767 1462406 1523998 1470907 1451742 1522106 1525630 1511157 1557128 1600228 1606402 1610408
6719A610408K7059k0399P3300P2241l2786m9073l2218L4541L2998O8280q278M0951
$$ 1610408 1637467 1617068 1690368 1762609 1729823 1680750 1648532 1683073 1716071 1784351 1776073 1817024
6707A817024j8707n5515O8239L9204N9069j2540m9664N8738K6279m8396K8622
$$ 1817024 1798317 1742802 1811041 1850245 1909314 1896774 1847110 1905848 1932127 1883731 1912353
6696A912353K3282k355P0399M9078L857q880K9761M4740O3564L5542J9178n7720
$$ 1912353 1935635 1933280 2003679 2052757 2056614 2047734 2077495 2122235 2185799 2221341 2240519 2182799
6684B182799K0618M6511O7924L9000n3983L4943P6161O176o3896P8062M7334K9777
$$ 2182799 2203417 2249928 2317852 2356852 2302869 2337812 2413973 2420149 2356253 2434315 2481649 2511426
6672B511426N9902P5839P037j9689Q5790M2387j1818K8893O0921M6732K0963O2528
$$ 2511426 2571328 2647167 2654204 2634515 2720305 2762692 2750874 2779767 2840688 2887420 2908383 2970911
6660B970911J1346P7438O5865o160J7341P3784Q5225l032N8087J03144O1078R2368
$$ 2970911 2982257 3059695 3125560 3119400 3136741 3210525 3295750 3292718 3350805 3453949 3515027 3607395
6648C607395P7634R1968R8214O5698R1001J06728K3420J09722Q9316R3406N8278
$$ 3607395 3685029 3776997 3875211 3940909 4031910 4138638 4162058 4271780 4361096 4454502 4512780
6637D512780R8559J03606N6070J53828J40615J17579K20956J81246J06061J65489
$$ 4512780 4611339 4714945 4771015 4924843 5065458 5183037 5403993 5585239 5691300 5856789
6627E856789K27179J93557J52176K59414K84583K76178L31532K26400K47560K31068
$$ 5856789 6083968 6277525 6429701 6689115 6973698 7249876 7581408 7807808 8055368 8286436
6617H286436K28672K37994K76261J39244K11493K86963K01767K78733K93371L61392
$$ 8286436 8515108 8753102 9029363 9168607 9380100 9667063 9868830 10147563 10440934 10802326
6607A0802326L20753M08953N17997N18870N82074O50707O09856O41282O21188
$$ 10802326 11123079 11532032 12050029 12568899 13150973 13801680 14411536 15052818 15674006
6598A5674006M37247K82379K6615j22997k26325l30903l54903l75947k56071k04593
$$ 15674006 16111253 16393632 16420247 16297250 16070925 15740022 15385119 15009172 14753101 14548508
6588A4548508j45591k83949k06958k29053k37173j89756k33962k44220j29781
$$ 14548508 14402917 14118968 13912010 13682957 13445784 13256028 13022066 12777846 12648065
6579A2648065j44323j10170r4593r4964n8974M9226P7234N3892Q9753L3762J82605
$$ 12648065 12503742 12393572 12298979 12204015 12145041 12194267 12271501 12325393 12415146 12448908 12631513
6568A2631513J21140J59857k9323j52680k13734l64905m25865m91459m00199l81418
$$ 12631513 12752653 12912510 12883187 12730507 12516773 12151868 11726003 11234544 10834345 10452927
6558A0452927l66893k95146k89213k65997k87791j93173j58737k52023k09759
$$ 10452927 10086034 9790888 9501675 9235678 8947887 8754714 8595977 8343954 8134195
6549H134195j84146r5202j90355q9691p8362j24248q3783m6725j04670j18031
$$ 8134195 7950049 7854847 7664492 7574801 7496439 7372191 7288408 7241683 7137013 7018982
6539G018982l1530m1568p5407p6347n4621K0424j5348j7316m7761o0684r91K3818
$$ 7018982 6987452 6945884 6870477 6794130 6739509 6759933 6744585 6727269 6679508 6618824 6617833 6641651
6527F641651O2401n8918l262L8952m0974l2397J9584L1056O708L3082K9741J3186
$$ 6641651 6704052 6645134 6641872 6680824 6639850 6607453 6627037 6658093 6664801 6697883 6727624 6740810
6515F740810o803k6642L0618M585N5145J2462J1451Q3207j6591M1635p976L4764
$$ 6740810 6734007 6707365 6737983 6742568 6797713 6810175 6821626 6904833 6888242 6929877 6921901 6956665
6503F956665O9140j3592J5478J01052L426J0117N6961M0536j7833m4121K5657
$$ 6956665 7025805 7012213 7027691 7128743 7132169 7142286 7199247 7239783 7221950 7177829 7203486
6492G203486R9072R9089J5631L5734k0543o106j6922Q576K2683J38774K9525l9241
$$ 7203486 7302558 7401647 7417278 7453012 7432469 7426363 7409441 7418017 7440700 7579474 7608999 7569758
6480G569758J08296J5164J6015J32318m44j2533M073J3482J06309J4937J4112
$$ 7569758 7678054 7693218 7709233 7841551 7841107 7828574 7832647 7846129 7952438 7967375 7981487
6469G981487j7466L9234O4808J0416L6319L5736K8971M940L0511L1311O777j4785
$$ 7981487 7964021 8003255 8068063 8078479 8114798 8150534 8179505 8184445 8214956 8246267 8253044 8238259
6457H238259M6067J1544M7153K3169P1190L0829n035P1252k6217p520J8203J5098
$$ 8238259 8284326 8295870 8343023 8366192 8437382 8468211 8463176 8534428 8508211 8500691 8518894 8533992
6445H533992m2716N7839R3604J03033L4813m1059n7229k9693P0882Q8831R50K3375
$$ 8533992 8491276 8549115 8642719 8745752 8780565 8739506 8682277 8652584 8723466 8812297 8813247 8836622
6433H836622q00j8911n4424o477J01694k9829j1792l1379J9759m8493M1132M0698
$$ 8836622 8835822 8816911 8762487 8756010 8857704 8827875 8816083 8784704 8804463 8755970 8797102 8837800
6421H837800L0765j2233o4878J01201L090o4036j3543k7659K617p4459K9754p166
$$ 8837800 8868565 8856332 8791454 8892655 8895745 8831709 8818166 8790507 8793124 8718665 8748419 8741253
6409H741253k7245k7701J2328L5133j9135l5643J046O6262L2652k4323j4378k5195
$$ 8741253 8714008 8686307 8698635 8733768 8714633 8678990 8680036 8746298 8778950 8754627 8740249 8715054
6397H715054p6951l9881K5085L3470m2351o5698L3075J765J6787L0803m9869J8094
$$ 8715054 8638103 8598222 8623307 8656777 8614426 8548728 8581803 8583568 8600355 8631158 8581289 8599383
6385H599383k3425p838M54n9807K3209L2525n1656k5490J6385L317j384j3722
$$ 8599383 8575958 8568120 8568574 8508767 8531976 8564501 8512845 8487355 8503740 8507057 8505673 8491951
6373H491951l6634r259N3554m9192j9164j0141M05l273k6665L3453m0244L4997
$$ 8491951 8455317 8446058 8499612 8450420 8431256 8421115 8421520 8418247 8391582 8425035 8384791 8419788
6361H419788n4438K1874p422n1648q798k0027o0616N3403Q814L6142k97k6918
$$ 8419788 8365350 8387224 8379802 8328154 8319356 8299329 8238713 8292116 8300930 8337072 8336775 8309857
6349H309857l4654J3308J1787M1038p368n9899K7395N3888O369j4141P9158O823
$$ 8309857 8275203 8288511 8300298 8341336 8333968 8274069 8301464 8355352 8361721 8347580 8426738 8433561
6337H433561M3357O206K424L1306J2845L0099J1253J1684K5105L1429J7365M1222
$$ 8433561 8476918 8483124 8485548 8516854 8529699 8559798 8571051 8582735 8607840 8639269 8656634 8697856
6325H697856Q0065L977m3183P3092O3586O5001l719N5991M2692J8075P9578J6033
$$ 8697856 8777921 8781898 8738715 8811807 8875393 8940394 8936675 8992666 9035358 9053433 9133011 9149044
6313I149044O3408O0577L5334J7287J19223J3554L0656J9312K1480J05253M2835
$$ 9149044 9212452 9273029 9308363 9325650 9444873 9458427 9489083 9508395 9529875 9635128 9677963
6302I677963O8503N0884P4628R8652R1837M8003O3467P3547M016q799M5846O0229
$$ 9677963 9746466 9797350 9871978 9970630 10062467 10110470 10173937 10247484 10251500 10242701 10288547 10348776
6290A0348776J1477K5052Q7258o286O0164M2199Q941O1932M3593N6091J8841J32700
$$ 10348776 10360253 10385305 10472563 10466277 10526441 10568640 10577581 10639513 10683106 10739197 10758038 10890738
6278A0890738O6400o598R8638J54108R8412O1990J16733P7458O6469O5572j4785
$$ 10890738 10957138 10950540 11049178 11203286 11301698 11363688 11480421 11557879 11624348 11689920 11675135
6267A1675135L0402L1723J8446R764n5776l2516k0527p2297n4549j9693l061j3506
$$ 11675135 11705537 11737260 11755706 11765470 11709694 11677178 11656651 11584354 11529805 11510112 11507051 11493545
6255A1493545P217N231M7977l4565o0419j1711J931m3576Q7877M207L8828J4297
$$ 11493545 11500762 11505993 11553970 11519405 11458986 11447275 11449206 11405630 11493507 11497714 11536542 11550839
6243A1550839n6961K6603J4670k4165l7951r7579r3950l4606k8847o7540k3810
$$ 11550839 11493878 11520481 11535151 11510986 11473035 11375456 11281506 11246900 11218053 11150513 11126703
6232A1126703l6713n0697Q2980J406j9185m0227L7519k3944K3347M5513K6616
$$ 11126703 11089990 11039293 11122273 11123679 11104494 11064267 11101786 11077842 11101189 11146702 11173318
6221A1173318p2913o9780j5570N5419J8652r7984P2535k4582o3743n770l8182
$$ 11173318 11100405 11030625 11015055 11070474 11089126 10991142 11063677 11039095 10975352 10969582 10931400
6210A0931400p6911j5451K7239l4456J1057M5252l2517M4515N1011M3282N1413
$$ 10931400 10854489 10839038 10866277 10831821 10842878 10888130 10855613 10900128 10951139 10994421 11045834
6199A1045834K2332K802M7226O0944J13569K9608L6943J95667Q8656P7500O8016
$$ 11045834 11068166 11070968 11118194 11179138 11292707 11322315 11359258 11554925 11643581 11721081 11789097
6188A1789097J11193J68512J50482J54049J83878J00956J71893J57151J71157
$$ 11789097 11900290 12068802 12219284 12373333 12557211 12658167 12830060 12987211 13158368
6179A3158368K39110J67594K09910J67936K13394L99789L64873L21666L46235
$$ 13158368 13397478 13565072 13774982 13942918 14156312 14556101 14920974 15242640 15588875
6170A5588875M33748L98090M43027N17872M85674N43912N69841N00145M95249
$$ 15588875 16022623 16420713 16863740 17381612 17867286 18411198 18981039 19481184 19976433
6161A9976433M96760M08568L79864L62558L28299L92071L78706L17654M29634
$$ 19976433 20473193 20881761 21261625 21624183 21952482 22344553 22723259 23040913 23470547
6152B3470547M29041L91045L22811L66690L52408L11204L08088J82584J23531
$$ 23470547 23899588 24290633 24613444 24980134 25332542 25643746 25951834 26134418 26257949
6143B6257949J16342J04576K38350J65530J02014K14671Q6955J06599M937o1495
$$ 26257949 26374291 26478867 26717217 26882747 26984761 27199432 27286387 27392986 27397923 27336428
6133B7336428j82847m06573n93052n82548o65128o77435o11346o26875n71188
$$ 27336428 27153581 26747008 26153956 25571408 24906280 24228845 23617499 22990624 22419436
6124B2419436n59970m38900l61160k94449j37197j41073j76195p9970j39915j04213
$$ 22419436 21859466 21420566 21059406 20764957 20627760 20486687 20310492 20230522 20090607 19986394
6114A9986394j3945K5966Q7030j9732l1632m2905j85176k84994k81967l18846
$$ 19986394 19972449 19998415 20085445 20065713 20034081 19991176 19806000 19521006 19239039 18920193
6104A8920193l13983m81481m07575l71173m17672m63690m38581l92465m14976
$$ 18920193 18606210 18124729 17717154 17345981 16928309 16464619 16026038 15633573 15218597
6095A5218597l33609l18584k87700l18674j64385k14369j61630j47692k01757
$$ 15218597 14884988 14566404 14278704 13960030 13795645 13581276 13419646 13271954 13070197
6086A3070197j88460p5798j12135j36254j13283j54782j39596n4435j85909j15375
$$ 13070197 12881737 12805939 12693804 12557550 12444267 12289485 12149889 12095454 11909545 11794170
6076A1794170j04109j24768n2096j60120l7659m5669j30069o2298o6866l6772
$$ 11794170 11690061 11565293 11513197 11353077 11315418 11269749 11139680 11077382 11010516 10973744
6066A0973744p8040j28876j04476o7062r8381q9969n9520k4742p2760q9243l5336
$$ 10973744 10895704 10766828 10662352 10595290 10496909 10406940 10347420 10322678 10249918 10160675 10125339
6055A0125339J3825p0723J3627j5168m5695p9934j11614O4133j082k0492O4596
$$ 10125339 10139164 10068441 10082068 10066900 10021205 9941271 9829657 9893790 9892708 9872216 9936812
6044I936812o9421o2171m2752L917n439m3548m4317m0519M5138j6154o8399m6430
$$ 9936812 9867391 9805220 9762468 9766385 9760946 9717398 9673081 9632562 9677700 9661546 9593147 9546717
6032I546717P5098R5732M8020l3040J5186Q5161Q0693K2776J5442O4782P0462
$$ 9546717 9621815 9717547 9765567 9732527 9747713 9832874 9913567 9936343 9951785 10016567 10087029
6021A0087029O5356J12817K2011P1835P1281M9233R9154J06714N8292O2368J40794
$$ 10087029 10152385 10265202 10287213 10359048 10430329 10479562 10578716 10685430 10743722 10806090 10946884
6010A0946884J56692P675P0043Q9261N5552k2685l8817p9135p6705p4708l4098
$$ 10946884 11103576 11111251 11181294 11270555 11326107 11303422 11264605 11185470 11108765 11034057 10999959
5999A0999959j3074M256n5549K4635J14467Q3614O4272J50465J04565K26009J86172
$$ 10999959 10986885 10991141 10935592 10960227 11074694 11158308 11222580 11373045 11477610 11703619 11889791
5988A1889791K43978L51921K75509L00673K43126K31379J70596O1841n9076j61695
$$ 11889791 12133769 12485690 12761199 13061872 13304998 13536377 13706973 13768814 13709738 13548043
5978A3548043k51450k86630l61854m08809l47967l40850k52211k18017k67634
$$ 13548043 13296593 13009963 12648109 12239300 11891333 11550483 11298272 11080255 10812621
5969A0812621n6554r9317j05284j14898m6501K4403K7643N1803R4186M0223R8085
$$ 10812621 10756067 10656750 10551466 10436568 10390067 10414470 10442113 10493916 10588102 10628325 10726410
5958A0726410R7755N5729Q4972l0526j02243j77908j98457j78326k35168k54376
$$ 10726410 10824165 10879894 10964866 10934340 10832097 10654189 10455732 10277406 10042238 9787862
5948I787862k49307j61169k15235k37716k04860j21696k05653j52512q8755j08732
$$ 9787862 9538555 9377386 9162151 8924435 8719575 8597879 8392226 8239714 8150959 8042227
5938H042227j18318o7610o8681o6716j00422q521l5870p5882J3088p4963j1855
$$ 8042227 7923909 7856299 7787618 7720902 7620480 7611959 7576089 7500207 7513295 7438332 7426477
5927G426477K3468l6293q5417k4894Q2698k6485r0580o2542L8392k1762j7555
$$ 7426477 7449945 7413652 7328235 7303341 7386039 7359554 7268974 7206432 7244824 7223062 7205507
5916G205507k3356m4034K9722m8747p2577M8760K1871L7265L8523N2176o678j61
$$ 7205507 7182151 7138117 7167839 7119092 7046515 7095275 7117146 7154411 7192934 7245110 7238432 7238271
5904G238271L1767k3381K8206K0198Q1419O9321L3371k2772J05450k1358L5320
$$ 7238271 7270038 7246657 7274863 7295061 7376480 7445801 7479172 7456400 7561850 7540492 7575812
5893G575812M0282Q661J03000j4028L8921k522N3670N7956r214J13347M6375L8760
$$ 7575812 7616094 7624755 7727755 7713727 7752648 7750126 7803796 7861752 7852538 7965885 8012260 8051020
5881H051020Q255P0025J08787Q7073M7397M1281J31592J4310J3984O9534J11184
$$ 8051020 8059275 8129300 8238087 8325160 8372557 8413838 8545430 8559740 8573724 8643258 8754442
5870H754442Q8645L8993J33748J22017J41570O6629J08856Q1386J42010J2775
$$ 8754442 8843087 8882080 9015828 9137845 9279415 9346044 9454900 9536286 9678296 9691071
5860I691071P8942J66489O7230L2329J51109J28730O6224J27143J04121J07717
$$ 9691071 9770013 9936502 10003732 10036061 10187170 10315900 10382124 10509267 10613388 10721105
5850A0721105J49589J57759O3198Q5402J31162K13468J48539J15812J06206J92519
$$ 10721105 10870694 11028453 11091651 11177053 11308215 11521683 11670222 11786034 11892240 12084759
5840A2084759K00108J37723J69699J47481J99064K29940J55163K14479K35025
$$ 12084759 12284867 12422590 12592289 12739770 12938834 13168774 13323937 13538416 13773441
5831A3773441J54264K85656K48226K47511K51231K21444L54242K96334L31801
$$ 13773441 13927705 14213361 14461587 14709098 14960329 15181773 15536015 15832349 16164150
5822A6164150K54999K87183L59281L50972L65245L87825L48163M43248M13288
$$ 16164150 16419149 16706332 17065613 17416585 17781830 18169655 18517818 18961066 19374354
5813A9374354L48196M72553M45453N23398M28199M88211O69991N96722N96102
$$ 19374354 19722550 20195103 20640556 21163954 21592153 22080364 22750355 23347077 23943179
5804B3943179O51393O63125P06538O82509P61909Q73097Q48507R19975R13807
$$ 23943179 24594572 25257697 25964235 26646744 27408653 28281750 29130257 30050232 30964039
5795C0964039J027289J047135J065810J159272J295503J381005J363578J399004
$$ 30964039 31991328 33038463 34104273 35263545 36559048 37940053 39303631 40702635
5787D0702635J459592J582986J649282J737683J748207J761653J756176J814180
$$ 40702635 42162227 43745213 45394495 47132178 48880385 50642038 52398214 54212394
5779E4212394J722602J668658J558206J416256J346691J143278J009202Q42671
$$ 54212394 55934996 57603654 59161860 60578116 61924807 63068085 64077287 64919958
5771F4919958O89688N35614M81152M02310L73435L94537M70698N58189O36822
$$ 64919958 65609646 66145260 66626412 67028722 67402157 67796694 68267392 68825581 69462403
5762F9462403P55051Q83168R38429J182792J338062J376034J509723J657397J793208
$$ 69462403 70217454 71100622 72039051 73221843 74559905 75935939 77445662 79103059 80896267
5753H0896267J830921J975486K086421K042660K102115K218467K217094K308106
$$ 80896267 82727188 84702674 86789095 88831755 90933870 93152337 95369431 97677537
5745I7677537K471029K583421K769219K980365L184741L289186L385018L382075
$$ 97677537 100148566 102731987 105501206 108481571 111666312 114955498 118340516 121722591
5737A21722591L285645L280676L291828L154679L142961L373007L486045L584162
$$ 121722591 125008236 128288912 131580740 134735419 137878380 141251387 144737432 148321594
5729A48321594L685253L635269L476480L412787L081757K806268K477739J940980
$$ 148321594 152006847 155642116 159118596 162531383 165613140 168419408 170897147 172838127
5721A72838127R01747n42363k162633l878279n283833o224380o734227o943037
$$ 172838127 173739874 173197511 171034878 167156599 161872766 155648386 148914159 141971122
5713A41971122p006065p025070p049438o849003o555232o192381n544751n123619
$$ 141971122 134965057 127939987 120890549 114041546 107486314 101293933 95749182 90625563
5705I0625563m614856m069035l635490l193571k923426k795468k409863k249135
$$ 90625563 86010707 81941672 78306182 75112611 72189185 69393717 66983854 64734719
5697F4734719k045698j859695j640610j473543j348532j116597r83717q10972
$$ 64734719 62689021 60829326 59188716 57715173 56366641 55250044 54266327 53455355
5689E3455355p09012m47836l15869k26342k09246j31046k0468N5478Q4134J58709
$$ 53455355 52746343 52298507 51982638 51756296 51547050 51416004 51395536 51451014 51535148 51693857
5679E1693857J41727K19412L32725L56021L12350P2565Q3101J17056j57703q72551
$$ 51693857 51835584 52054996 52387721 52743742 53056092 53128657 53211758 53328814 53171111 52298560
5669E2298560j498121j880845j965196j482933j124367q40984o09498n06029l12744
$$ 52298560 50800439 48919594 46954398 45471465 44347098 43506114 42896616 42390587 42077843
5660D2077843k36508m8818j522L6562J87336K76796L94280L52153M12087M62183
$$ 42077843 41841335 41792517 41790995 41827557 42014893 42291689 42685969 43038122 43450209 43912392
5650D3912392M75036N20131N45495Q29427J034956J361485J832567K117608K156057
$$ 43912392 44387428 44907559 45453054 46282481 47317437 48678922 50511489 52629097 54785154
5641E4785154K317548K557671J669919q09201k994843m204032m420314l304749
$$ 54785154 57102702 59660373 61330292 60521091 57526248 53322216 48901902 45597153
5633D5597153k366746j787812j313344j080838q51560o69546n87001m36783l92368
$$ 45597153 43230407 41442595 40129251 39048413 38196853 37527307 36940306 36503523 36111155
5624C6111155k98848j82145k00122q9255m234M3170K47109L86202N35618Q60577
$$ 36111155 35812307 35630162 35430040 35340785 35336551 35379721 35626830 36013032 36548650 37409227
5614C7409227J222799J672737K047678K359697K288742K610468K687937J425665
$$ 37409227 38632026 40304763 42352441 44712138 47000880 49611348 52299285 53724950
5606E3724950j162851l352906m378216m546716l309301k409975j771008j429236
$$ 53724950 52562099 49209193 44830977 40284261 36974960 34564985 32793977 31364741
5598C1364741j180306r62738p92279p19295o62303n11794m11676l83888k47125
$$ 31364741 30184435 29221697 28429418 27710123 27047820 26536026 26124350 25740462 25493337
5589B5493337k60020j52218o311M984L9474J39006K64252L53316N11886O27808
$$ 25493337 25233317 25081099 25074788 25079772 25119246 25258252 25522504 25875820 26387706 27015514
5579B7015514O78405O82945P87156Q47770J95762o88643j195090j460908j472005
$$ 27015514 27693919 28376864 29164020 30011790 30207552 29518909 28323819 26862911 25390906
5570B5390906j151315q08979o61450m23543l91471l93520k52611k18778j89269
$$ 25390906 24239591 23430612 22769162 22345619 21954148 21560628 21308017 21089239 20899970
5561B0899970j01875r3338j01776j44374n2341J1536m0071j43573O9858O4165
$$ 20899970 20798095 20704757 20602981 20458607 20406266 20417802 20377731 20234158 20304016 20368181
5551B0368181k7754l2427K7164J02747J3704r458P5242J19656O943K5669J33694
$$ 20368181 20340427 20308000 20335164 20437911 20451615 20442157 20517399 20637055 20643998 20669667 20803361
5540B0803361J07297J34087J71953J66163Q3059Q2063J21668K34115K18932K30939
$$ 20803361 20910658 21044745 21216698 21382861 21465920 21547983 21669651 21903766 22122698 22353637
5530B2353637J70650Q1903J25532J31371n3211l5104j13148r1068k4441j35112
$$ 22353637 22524287 22606190 22731722 22863093 22809882 22774778 22661630 22570562 22546121 22411009
5520B2411009j07290k3958n7053Q3078N8208p3001j4526K7136L9445J23575J63436
$$ 22411009 22303719 22279761 22222708 22305786 22363994 22290993 22276467 22303603 22343048 22466623 22630059
5509B2630059J76498R9211K75884L34831K00296L20732K66303J47151L7039q8789
$$ 22630059 22806557 22905768 23181652 23516483 23716779 24037511 24303814 24450965 24488004 24399215
5499B4399215k00074l62958m34052m01494m76219m25196l67919l00606k77081
$$ 24399215 24199141 23836183 23402131 23000637 22524418 22099222 21731303 21430697 21153616
5490B1153616j93381k74552k44510n1816o3778q8535q3637N492M6535L0852J09491
$$ 21153616 20960235 20685683 20441173 20389357 20325579 20237044 20153407 20158899 20205434 20236286 20345777
5479B0345777O1213J34277M3137Q8682j3376j69178j22686j49314j13285j96172
$$ 20345777 20406990 20541267 20584404 20673086 20659710 20490532 20367846 20218532 20105247 19909075
5469A9909075k80871k38066k18905j80905j05319k33281j47679n2529j66451n8028
$$ 19909075 19628204 19390138 19171233 18990328 18885009 18651728 18504049 18451520 18285069 18227041
5459A8227041o3873K2586L419l1428K2800J127M3603K3394n3584K07J1187O260
$$ 18227041 18163168 18185754 18189173 18157745 18180545 18181672 18225275 18248669 18195085 18195292 18206479 18212739
5447A8212739P2181J10888Q8244k4753k7754J04348k0129l2950j9891M1382J7222
$$ 18212739 18284920 18395808 18484052 18459299 18431545 18535893 18515764 18482814 18462923 18504305 18521527
5436A8521527j2913N7445L9749J13167Q5689J03933Q0171K2648J71728J37368
$$ 18521527 18508614 18566059 18605808 18718975 18804664 18908597 18988768 19011416 19183144 19320512
5426A9320512J63761J19581J84586K25702J86661J33589J95818J98127K26844
$$ 19320512 19484273 19603854 19788440 20014142 20200803 20334392 20530210 20728337 20955181
5417B0955181K56389K13048J48147J87401K15706P3025N8912q822K4062J239l9895
$$ 20955181 21211570 21424618 21572765 21760166 21975872 22048897 22107809 22098987 22123049 22124288 22084393
5406B2084393j50618n5186o1332n6987N1221K0563k7875J27249K01895K49791
$$ 22084393 21933775 21878589 21817257 21760270 21811491 21832054 21804179 21931428 22133323 22383114
5396B2383114K10864J94012K75939K62040L51998K57592K29815J60123K0993o7112
$$ 22383114 22593978 22787990 23063929 23325969 23677967 23935559 24165374 24325497 24346490 24279378
5386B4279378p4578j15301j34295j57679k49773j07994j01144o5610J14486J71429
$$ 24279378 24204800 24089499 23955204 23797525 23547752 23439758 23338614 23273004 23387490 23558919
5376B3558919J84820M72817N84977Q52515J197980J528161K041386K306621K080205
$$ 23558919 23743739 24216556 24801533 25654048 26852028 28380189 30421575 32728196 34808401
5367C4808401K499415K664348J219243j480972l112483m360782m244634k913961
$$ 34808401 37307816 39972164 41191407 39710435 36597952 32237170 27992536 25078575
5359B5078575k300194j644465j357563j112734q84574p96086p09884o36354o06436
$$ 25078575 22778381 21133916 19776353 18663619 17779045 16982959 16273075 15636721 15030285
5350A5030285m22964l58137l27250k62510k36034j86981j20602j82247j02112
$$ 15030285 14607321 14249184 13921934 13659424 13423390 13236409 13115807 12933560 12831448
5341A2831448j39657r8204l8556j85968j42983n8388j25464r3128p9567l3534
$$ 12831448 12691791 12593587 12555031 12369063 12226080 12167692 12042228 11949100 11869533 11835999
5331A1835999j50276j01509p9120q8041j8758j07780o4196J7358k8304n4244R7876
$$ 11835999 11685723 11584214 11505094 11417053 11398295 11290515 11226319 11243677 11215373 11161129 11259005
5320A1259005j0435q0872j4859k9809n3926J5267q9841j01695p1802j24352j12007
$$ 11259005 11248570 11167698 11152839 11123030 11069104 11084371 10994530 10892835 10821033 10696681 10584674
5309A0584674j07787n0841j01557k0585k7709o8931o4426p4210l1064k9814j00574
$$ 10584674 10476887 10426046 10324489 10303904 10276195 10207264 10142838 10068628 10037564 10007750 9907176
5298I907176n8015q606l2749p9787k0873n1671m5044n7123j01173K6066q0446
$$ 9907176 9849161 9840555 9807806 9728019 9707146 9655475 9610431 9553308 9452135 9478201 9397755
5287I397755o6021K741m9728k9325q1109j0479l5842j23800K9362l3005o8562
$$ 9397755 9331734 9334475 9284747 9255422 9174313 9163834 9127992 9004192 9033554 9000549 8931987
5276H931987o5619n736J1861n7434j3790L5643k7600l0525O3854l3044J13o1824
$$ 8931987 8866368 8860632 8872493 8815059 8801269 8836912 8809312 8778787 8842641 8809597 8809710 8747886
5264H747886j01492N817M5718O4743K5329j3526j0269j235M7484o2167J2556K1780
$$ 8747886 8646394 8652211 8697929 8762672 8788001 8774475 8764206 8762971 8810455 8748288 8760844 8782624
5252H782624p2410o9754L7385J7091o993L7546N3277n1574k7689K5890K9465k5084
$$ 8782624 8710214 8640460 8677845 8694936 8687943 8725489 8778766 8727192 8699503 8725393 8754858 8729774
5240H729774j4893M5265M5400j0066j8765n3070M5162K7832n4603M7748o306j1056
$$ 8729774 8714881 8760146 8805546 8795480 8776715 8723645 8768807 8796639 8742036 8789784 8783478 8772422
5228H772422O9427P2697K2294J1482J6310p271K7678N7591K3097M6333J5318k7525
$$ 8772422 8841849 8914546 8936840 8948322 8964632 8957361 8985039 9042630 9065727 9112060 9127378 9099853
5216I099853M4753K3042L5016J00626L0522M1345L2116M0849J3537P8161j8395
$$ 9099853 9144606 9167648 9202664 9303290 9333812 9375157 9407273 9448122 9461659 9539820 9521425
5205I521425M5324O2034K3977J34094K5736J23790N6130j5468Q0981P732J28083
$$ 9521425 9566749 9628783 9652760 9786854 9812590 9936380 9992510 9977042 10058023 10065755 10193838
5194A0193838J21701J44254M5436Q2560L1869P1817J23271Q4111R2030P9626L3720
$$ 10193838 10315539 10459793 10505229 10587789 10619658 10691475 10814746 10898857 10990887 11070513 11104233
5183A1104233R2723J28471K4030K1545J19321J01447N4301p2740l3065P4657L2548
$$ 11104233 11196956 11325427 11349457 11371002 11490323 11591770 11646071 11573331 11540266 11614923 11647471
5172A1647471O7111j368l6231N5071M1327N5924J71752O8242O4217Q1579O5893
$$ 11647471 11714582 11713214 11676983 11732054 11773381 11829305 12001057 12069299 12133516 12215095 12280988
5161A2280988R2921L0029J00807R5733P4250J48774K12014J21225J8267J22723
$$ 12280988 12373909 12403938 12504745 12600478 12674728 12823502 13035516 13156741 13175008 13297731
5151A3297731J20233R0603J71347J42048M0804M3564N7605O0300L4969M4518K9685
$$ 13297731 13417964 13508567 13679914 13821962 13862766 13906330 13963935 14024235 14059204 14103722 14133407
5140A4133407o0620k8829m2530p760M5775O4663o0431K358R4026K8487J29194
$$ 14133407 14072787 14043958 14001428 13993668 14039443 14104106 14043675 14046033 14140059 14168546 14297740
5129A4297740J4320P7992O7984J1268P8975Q0628J01750P9982N4277R3059J04559
$$ 14297740 14312060 14390052 14458036 14469304 14548279 14628907 14730657 14810639 14864916 14957975 15062534
5118A5062534O2601J55444J59294L7118J09790O1036J12504J06813L7390J03981
$$ 15062534 15125135 15280579 15439873 15476991 15586781 15647817 15760321 15867134 15904524 16008505
5108A6008505N9171j7971Q6905N9411J1294P706M9441Q1937k169N0884P5431j8969
$$ 16008505 16067676 16049705 16136610 16196021 16207315 16215021 16264462 16346399 16344230 16395114 16470545 16451576
5096A6451576J25689J23553Q9124N7325Q6619R9494O8995L2283N2016J19605J35342
$$ 16451576 16577265 16700818 16789942 16847267 16933886 17033380 17102375 17134658 17186674 17306279 17441621
5085A7441621J21639m580L8070R2289J38506R6001J35774J08435J13880J08361
$$ 17441621 17563260 17558680 17596750 17689039 17827545 17923546 18059320 18167755 18281635 18389996
5075A8389996Q5875Q2665J51406M1980K5532J00155L2070J21794Q0454P3373Q5289
$$ 18389996 18475871 18558536 18709942 18751922 18777454 18877609 18909679 19031473 19111927 19185300 19270589
5064A9270589J7171M0917N3303M2355J06356J71196J48114J15665P1118O0688
$$ 19270589 19287760 19328677 19381980 19424335 19530691 19701887 19850001 19965666 20036784 20097472
5054B0097472J73724Q9508J45000K04543R2357J29142R2712J22599J69620J51710
$$ 20097472 20271196 20360704 20505704 20710247 20802604 20931746 21024458 21147057 21316677 21468387
5044B1468387J91613J14029J44467Q1678M0034J76461J56416J64201J85605R3385
$$ 21468387 21660000 21774029 21918496 22000174 22040208 22216669 22373085 22537286 22722891 22816276
5034B2816276J80214J88600J43011K23035K55423K46644K40422K03550K05326
$$ 22816276 22996490 23185090 23328101 23551136 23806559 24053203 24293625 24497175 24702501
5025B4702501K56753K24569K91389K92561K48769K38280M02265K85709K09025
$$ 24702501 24959254 25183823 25475212 25767773 26016542 26254822 26657087 26942796 27151821
5016B7151821L23930L12993L94605L96320L21224L67975L83228N01674M41792
$$ 27151821 27475751 27788744 28183349 28579669 28900893 29268868 29652096 30153770 30595562
5007C0595562L75836M88931L73558N15290M90352M99289N28219N42064N85487
$$ 30595562 30971398 31460329 31833887 32349177 32839529 33338818 33867037 34409101 34994588
4998C4994588O13558O80435N93318N74345N41120N15929N75514O30757O00464
$$ 34994588 35608146 36288581 36881899 37456244 37997364 38513293 39088807 39719564 40320028
4989D0320028N17534O00744O81035N71795O55802P03596O56574P38698P47633
$$ 40320028 40837562 41438306 42119341 42691136 43346938 44050534 44707108 45445806 46193439
4980D6193439Q07243P48021N75632M39506M78909N18576N56128O22951O09826
$$ 46193439 47000682 47748703 48324335 48763841 49242750 49761326 50317454 50940405 51550231
4971E1550231O83780O40521O50641O91298O01179N82855O53293O48765O55130
$$ 51550231 52234011 52874532 53525173 54216471 54817650 55400505 56053798 56702563 57357693
4962E7357693O78906P83081P26240P99722P91831Q12910Q01863P39417O06392
$$ 57357693 58036599 58819680 59545920 60345642 61137473 61950383 62752246 63491663 64098055
4953F4098055M85255L93566K99271L34030M33454M89542N55903O87518P01534
$$ 64098055 64583310 64976876 65276147 65610177 66043631 66533173 67089076 67776594 68478128
4944F8478128P16204P48063P97093Q46933P85452Q97067Q10611P92618Q70931
$$ 68478128 69194332 69942395 70739488 71586421 72371873 73268940 74079551 74872169 75743100
4935G5743100R68720J111077J161809J373839J522603J749171J836603K139408
$$ 75743100 76711820 77822897 78984706 80358545 81881148 83630319 85466922 87606330
4927H7606330K449075K707275K849844L126637L435694L760108L993969M276563
$$ 87606330 90055405 92762680 95612524 98739161 102174855 105934963 109928932 114205495
4919A14205495M624231M954323N289928N444928N542503N516597N234710M711580
$$ 114205495 118829726 123784049 129073977 134518905 140061408 145578005 150812715 155524295
4911A55524295M184088L382201K403892J489831N12108m15895j301942k125562
$$ 155524295 159708383 163090584 165494476 166984307 167496415 167080520 165778578 163653016
4903A63653016k701985l177726l434290l629813l681192l578886l486473l285794
$$ 163653016 160951031 157773305 154339015 150709202 147028010 143449124 139962651 136676857
4895A36676857k897929k604980k394555k055665j694715j468558j188928j101087
$$ 136676857 133778928 131173948 128779393 126723728 125029013 123560455 122371527 121270440
4887A21270440r75739r30814j050093j041845j167140j186028j174772j136270
$$ 121270440 120294701 119363887 118313794 117271949 116104809 114918781 113744009 112607739
4879A12607739j034047j022029q08429o21981m12543j63600O4085M27850O15421
$$ 112607739 111573692 110551663 109743234 109121253 108708710 108545110 108609195 109037045 109652466
4870A09652466Q96120J115867J431330J653867J785977J848250J996034K015920
$$ 109652466 110548586 111664453 113095783 114749650 116535627 118383877 120379911 122395831
4862A22395831J845343J601345J330118Q28705K8183q04423j830044k947723l643729
$$ 122395831 124241174 125842519 127172637 128001342 128029525 127225102 125395058 122447335 118803606
4853A18803606m114128m111652l753155l391120k779415k244033j755947j375594
$$ 118803606 114689478 110577826 106824671 103433551 100654136 98410103 96654156 95278562
4845I5278562r39645n75186k67667J71392M22789N95464Q64675Q57765O57524
$$ 95278562 94338917 93763731 93496064 93667456 94090245 94685709 95550384 96408149 97065673
4836I7065673M33572J1441o36924j310546j999077k549221k980781l329864l407317
$$ 97065673 97499245 97510686 96873762 95563216 93564139 91014918 88034137 84704273 81296956
4827H1296956l491562l351946l140219k930168k599456k405021k095818j849027
$$ 81296956 77805394 74453448 71313229 68383061 65783605 63378584 61282766 59433739
4819E9433739j660545j449694j346929j154951q72279p81333p29703o70910n67067
$$ 59433739 57773194 56323500 54976571 53821620 52949341 52168008 51438305 50767395 50200328
4810E0200328m11321l28611k95811k45844k15077j47991r9705j16099j22972l6712
$$ 50200328 49789007 49460396 49164585 48918741 48703664 48555673 48455968 48339869 48216897 48180185
4800D8180185o1510N3101J40597R8047J57759J87581K60417M15700M68796M48563
$$ 48180185 48118675 48171776 48312373 48410420 48568179 48755760 49016177 49431877 49900673 50349236
4790E0349236O33046O66896O67494P34348Q03353Q59471R40519J030895J010074
$$ 50349236 50982282 51649178 52316672 53051020 53854373 54713844 55654363 56685258 57695332
4781E7695332J006077J199901J253667J294663J407964J492873J633839J686690
$$ 57695332 58701409 59901310 61154977 62449640 63857604 65350477 66984316 68671006
4773F8671006J867648J976947K010470K045514K193429K346865K344523K314988
$$ 68671006 70538654 72515601 74526071 76571585 78765014 81111879 83456402 85771390
4765H5771390K243324K249645K322318K340500K353586K332202K246172K280457
$$ 85771390 88014714 90264359 92586677 94927177 97280763 99612965 101859137 104139594
4757A04139594K087579J860727J757268J559174J337619J188205J121065J158326
$$ 104139594 106227173 108087900 109845168 111404342 112741961 113930166 115051231 116209557
4749A16209557J156666J238280J348756J585217J732486J863559K040687K306971
$$ 116209557 117366223 118604503 119953259 121538476 123270962 125134521 127175208 129482179
4741A29482179K619985K782706L173195L418544L482116L689785L748263L727484
$$ 129482179 132102164 134884870 138058065 141476609 144958725 148648510 152396773 156124257
4733A56124257L809663L687703L507814L288869L257358L169015L116085L137513
$$ 156124257 159933920 163621623 167129437 170418306 173675664 176844679 179960764 183098277
4725A83098277K820075K169446J337026O22337K20276M23642J200281K106452
$$ 183098277 185918352 188087798 189424824 190047161 190267437 190691079 191891360 193997812
4717A93997812L240202M301778N425411O489217P115980P296473O854868N864731
$$ 193997812 197238014 201539792 206965203 213454420 220570400 227866873 234721741 240586472
4709B40586472N194556N032989N762789P255554Q663603R971098J1281442J2564986
$$ 240586472 245781028 250814017 256576806 263832360 272495963 282467061 293748503 306313489
4701C06313489J3986323J5437560J6858709J7581362J6557963J2573940M894474
$$ 306313489 320299812 335737372 352596081 370177443 386735406 399309346 404203820
4694D04203820n890458j7110378k4857144k7600324k6848350k4561888k1836598
$$ 404203820 398313362 381202984 356345840 328745516 301897166 277335278 255498680
4687B55498680j9139381j6551130j4432637j2550495j1040636r698801q479668
$$ 255498680 236359299 219808169 205375532 192825037 181784401 172085600 163605932
4680A63605932p592640o781446o079636n603474n168740m802514m349587l948926
$$ 163605932 156013292 149231846 143152210 137548736 132379996 127577482 123227895 119278969
4672A19278969l739518l404644k958857k769534k547492k163216j842422j496024
$$ 119278969 115539451 112134807 109175950 106406416 103858924 101695708 99853286 98357262
4664I8357262j124661p49315m85713m15991n36127p87628j247362j711400k166721
$$ 98357262 97232601 96483286 95997573 95581582 95045455 94257827 93010465 91299065 89132344
4655H9132344k548624k883136l087081l117608k892774k600780k511926k157982
$$ 89132344 86583720 83700584 80613503 77495895 74603121 72002341 69490415 67332433
4647F7332433j979720j722606j685569j570566j480172j387169j207155j094233
$$ 67332433 65352713 63630107 61944538 60373972 58893800 57506631 56299476 55205243
4639E5205243j039950r95933r11996q64902q20384p28622o54708p06913p17459
$$ 55205243 54165293 53169360 52257364 51392462 50572078 49843456 49188748 48481835 47764376
4630D7764376o58499o24873n57737m71444n35927n03271l68952l40157k93239
$$ 47764376 47105877 46481004 45923267 45451823 44915896 44412625 44043673 43703516 43410277
4621D3410277j88115j63639j67923r2179m4849j12150j42396k06209j39841j45235
$$ 43410277 43222162 43058523 42890600 42798421 42753572 42641422 42499026 42292817 42152976 42007741
4611D2007741j09603J5674k9781p4172N7318M9385O8394M1522J47260J83895J75670
$$ 42007741 41898138 41913812 41884031 41809859 41867177 41916562 41984956 42026478 42173738 42357633 42533303
4600D2533303K17675J67615K50653K19241K82710K86248L75058L64433L03321
$$ 42533303 42750978 42918593 43169246 43388487 43671197 43957445 44332503 44696936 45000257
4591D5000257M42048L90195N39368N11569M72268M81248M87750M48167M79370
$$ 45000257 45442305 45832500 46371868 46883437 47355705 47836953 48324703 48772870 49252240
4582D9252240M29071M29772M23483M87581N20291N40928N06210L87888N08233
$$ 49252240 49681311 50111083 50534566 51022147 51542438 52083366 52589576 52977464 53485697
4573E3485697O71883R46890J192172J484412J883826K250023K558750K914386
$$ 53485697 54157580 55104470 56296642 57781054 59664880 61914903 64473653 67388039
4565F7388039K985593K772332K170207J231437N5278j278533k510276l342658
$$ 67388039 70373632 73145964 75316171 76547608 76602886 75324353 72814077 69471419
4557F9471419l749774l898033l741461l307282k881385k497940k138948j839704
$$ 69471419 65721645 61823612 58082151 54774869 51893484 49395544 47256596 45416892
4549D5416892j678750j472170j394485j227971j047184r76650q94943p09125n94900
$$ 45416892 43738142 42265972 40871487 39643516 38596332 37619682 36724739 36015614 35420714
4540C5420714m56254l97589l55212l86660l58420m00034l56914l25946m34682
$$ 35420714 34964460 34566871 34211659 33824999 33466579 33066545 32709631 32383685 31949003
4531C1949003m88016n73210n68690n67480o48246p41428o26267n52809o40697
$$ 31949003 31460987 30887777 30319087 29751607 29103361 28361933 27735666 27182857 26542160
4522B6542160n71661m71140n08797l79535l30737k97238k73929k27661k90250
$$ 26542160 25970499 25499359 24990562 24611027 24280290 23983052 23709123 23481462 23191212
4513B3191212j39419k17800k52854k28076k50758j90743j88833k38273l88319
$$ 23191212 23051793 22833993 22581139 22353063 22102305 21911562 21722729 21484456 21096137
4504B1096137k94693k40323l28737l34903l46677l06494k19695k41425j98550
$$ 21096137 20801444 20561121 20232384 19897481 19550804 19244310 19024615 18783190 18584640
4495A8584640j89446j73196j27795j29603r3135k9989q9691m7117N6918J45468
$$ 18584640 18395194 18221998 18094203 17964600 17871465 17841476 17751785 17704668 17761586 17907054
4485A7907054R9499N4456K48238J52318N4993k1414o3203n8883N7767J82904J53623
$$ 17907054 18006553 18061009 18309247 18461565 18516558 18495144 18431941 18373058 18430825 18613729 18767352
4474A8767352J38894J70926J86456K44648K33170J77230K60862K32914K94219
$$ 18767352 18906246 19077172 19263628 19508276 19741446 19918676 20179538 20412452 20706671
4465B0706671M54276M98507L79569M2421j99531l41112m13156m28083k77544j10719
$$ 20706671 21160947 21659454 22039023 22081444 21881913 21540801 21127645 20699562 20422018 20311299
4455B0311299l0123n2947N3705P2314l7237Q4791M0914K553N2702J00133K2100
$$ 20311299 20281176 20228229 20281934 20354248 20317011 20401802 20442716 20445269 20497971 20598104 20620204
4444B0620204J04656J52100P2878J68863J53524J16646J9707Q2469J53124N8120
$$ 20620204 20724860 20876960 20949838 21118701 21272225 21388871 21408578 21491047 21644171 21702291
4434B1702291J62579J60460K26261K53873K33990K62957K84547L38566M01527
$$ 21702291 21864870 22025330 22251591 22505464 22739454 23002411 23286958 23625524 24027051
4425B4027051L16355L89630M01919M46451M17969J15212N0233k3522k81247m47034
$$ 24027051 24343406 24733036 25134955 25581406 25999375 26114587 26164820 26141298 25860051 25413017
4415B5413017m61126l69015k05873k95850k01441n5179l0783O582Q8705J18410
$$ 25413017 24951891 24582876 24377003 24081153 23879712 23824533 23793750 23800332 23889037 24007447
4405B4007447J11883L02924L08585M05634M66256M37280N43886M49232J98888
$$ 24007447 24119330 24422254 24730839 25136473 25602729 26040009 26583895 27033127 27232015
4396B7232015p5847k85823l28637l10860j59261j05607m233Q3064J7998O2945
$$ 27232015 27156168 26870345 26541708 26230848 26071587 25965980 25961747 26044811 26062809 26125754
4386B6125754k4255k60460l53268n04726n51418o53739o05607n61912n16222m03787
$$ 26125754 26101499 25841039 25487771 24983045 24431627 23777888 23172281 22610369 22094147 21690360
4376B1690360m31561k78442k43154k65058j62346j81907k29338r3286r4194J2413
$$ 21690360 21258799 20980357 20737203 20472145 20309799 20127892 19898554 19805268 19711074 19723487
4366A9723487N1648R1037J66234K26002K48711K90595L96876M53573M93698O15946
$$ 19723487 19775135 19866172 20032406 20258408 20507119 20797714 21194590 21648163 22141861 22757807
4356B2757807N46117N06380M31666L72334K31366P0267k4525j26711l7294M6526
$$ 22757807 23303924 23810304 24241970 24614304 24845670 24915937 24891412 24764701 24727407 24773933
4346B4773933N4735L3709J9577j1533j15386j81101r4438j1605O8723J68018J07958
$$ 24773933 24828668 24862377 24881954 24870421 24755035 24573934 24479496 24467891 24536614 24704632 24812590
4335B4812590J58105K32944L43375M51170N09599O28244P87755R38236J080465
$$ 24812590 24970695 25203639 25547014 25998184 26507783 27136027 27923782 28862018 29942483
4326B9942483J323891J443812J470752J395407J241752Q40446J33510p57300j506421
$$ 29942483 31266374 32710186 34180938 35576345 36818097 37658543 37792053 37034753 35528332
4317C5528332k226194k410667k345069k177635j935455j696908j487727j265200
$$ 35528332 33302138 30891471 28546402 26368767 24433312 22736404 21248677 19983477
4309A9983477j108846r85729q78836q42605o69567n61165n42864m91822m26392
$$ 19983477 18874631 17888902 17010066 16167461 15497894 14936729 14393865 13902043 13475651
4300A3475651l67974l34837l70198k91203k24013k64909k26361k11865k19274
$$ 13475651 13107677 12772840 12402642 12111439 11887426 11622517 11396156 11184291 10965017
4291A0965017k12268j74206j81637k68927j30445r0975j43758j13783j61503o7239
$$ 10965017 10752749 10578543 10396906 10127979 9997534 9906559 9762801 9649018 9487515 9420276
4281I420276q0660j19679j43748r1732r5383o0080K7826j27397j04739k5583N491
$$ 9420276 9339616 9219937 9076189 8984457 8889074 8828994 8856820 8729423 8624684 8599101 8604592
4270H604592J9621n5561q2519j13865o1079n2252n9209o5766m0211j1211k0662
$$ 8604592 8624213 8568652 8486133 8372268 8311189 8258937 8199728 8133962 8093751 8082540 8061878
4259H061878O6393K9462k1637N1599K8330j07866j00067j85128r3416j41195j15355
$$ 8061878 8128271 8157733 8136096 8187695 8216025 8108159 8008092 7822964 7729548 7588353 7472998
4248G472998j21888q3434q578n4028j07741n1430p9500r4168m4066l6914m2548
$$ 7472998 7351110 7267676 7259098 7205070 7097329 7045899 6966399 6872231 6828165 6791251 6748703
4237F748703l6437k7730l669m6671m6246r0448n6500o555n3588k7463p8293r1426
$$ 6748703 6712266 6684536 6680867 6634196 6587950 6497502 6441002 6434447 6380859 6353396 6275103 6183677
4225F183677q9315o3836K1812r1889r2399J9104j9660q8685r9896k5909n2300
$$ 6183677 6094362 6030526 6052338 5960449 5868050 5887154 5867494 5778809 5678913 5653004 5600704
4214E600704m0167p0899l9722p1659j00956l6393p3168j13851j58583m8959k9737
$$ 5600704 5560537 5489638 5449916 5378257 5277301 5240908 5167740 5053889 4895306 4846347 4816610
4203D816610j21333o8567p5667j15099o9691o7478j23036q8530m280p7655n4630
$$ 4816610 4695277 4626710 4551043 4435944 4366253 4298775 4175739 4087209 4082929 4005274 3950644
4192C950644j8878o3174l9884k7639j02598p6382M9138l8209j5665n8923l8566
$$ 3950644 3931766 3868592 3828708 3801069 3698471 3622089 3671227 3633018 3617353 3558430 3519864
4181C519864p5526J2267J2356K7757O3292j6880k5743o286J3315L9959J0233n8411
$$ 3519864 3444338 3456605 3468961 3496718 3560010 3543130 3517387 3511101 3524416 3564375 3574608 3516197
4169C516197P86J4101k8166P7055Q031n4742n9399l2609j0896J4810k314m408
$$ 3516197 3516983 3531084 3502918 3579973 3588004 3533262 3473863 3441254 3430358 3445168 3442854 3438446
4157C438446L3630K1000L9429k7688k0271j4495p2194O0129o3660p3004K4760
$$ 3438446 3472076 3493076 3532505 3504817 3484546 3470051 3397857 3457986 3394326 3321322 3346082
4146C346082j0956k310k2204l2303l7961q2749k3538l8763q7372M5781m8195j7777
$$ 3346082 3335126 3332816 3310612 3278309 3240348 3157599 3134061 3095298 3007926 3053707 3005512 2987735
4134B987735O506p8291K5817R970j20197k7946k807k8621m3801o874l4782m8303
$$ 2987735 2994241 2915950 2941767 2951737 2831540 2803594 2800787 2772166 2728365 2721491 2686709 2638406
4122B638406p6314p9247K2155k1415j53811q5205N425J2796m3626l019n8161j830
$$ 2638406 2562092 2482845 2505000 2483585 2329774 2244569 2249994 2262790 2219164 2216145 2157984 2156154
4110B156154P9378l4168j6951m9032M9102R5858O4892N275l2640j4660m9515l7971
$$ 2156154 2235532 2201364 2184413 2135381 2184483 2280341 2345233 2350508 2317868 2303208 2253693 2215722
4098B215722n9215q1633r4819o5525n5551j17416j82438n2557q6630M746j8760
$$ 2215722 2156507 2074874 1980055 1914530 1858979 1741563 1559125 1506568 1419938 1424684 1405924
4087A405924n1049r0430p1009o0064l7565J4834L5140j0494j47794m831p0717
$$ 1405924 1354875 1264445 1193436 1133372 1095807 1110641 1145781 1135287 987493 982662 911945
4076I11945q0236l6490l3565k2601m079r0323m7992k3620k9552J9256o4331q6780
$$ 911945 831709 795219 761654 739053 734974 644651 596659 573039 543487 562743 498412 411632
4064D11632O1644n0679j3256q3053k1759j3640L5691m1768j4101M8551L4168J1523
$$ 411632 473276 422597 409341 326288 304529 290889 326580 284812 270711 319262 353430 364953
4052C64953n3553K4122k7832j1026N755k1482k3233M4533j4093L9604l8156n0508
$$ 364953 311400 335522 307690 296664 302419 280937 257704 302237 288144 327748 289592 239084
4040B39084M795K4571k3874K9988o7105K0744N7551l2026J1462J6732l7617j6857
$$ 239084 243879 268450 244576 274564 207459 228203 285754 253728 265190 281922 244305 227448
4028B27448k7767J4555j2158n4528N5733J0093N2388J8165q728n9428J6944N5149
$$ 227448 199681 214236 202078 147550 203283 213376 265764 283929 275201 215773 232717 287866
4016B87866n828l1213K2762L5394m8047J242p0242L3634N7600m3741K5845J6123
$$ 287866 282038 250825 273587 308981 260934 262176 191934 225568 283168 239427 265272 281395
4004B81395p6562O0895L6457m0296M9491o100K2784K9822l788J7259m0865n2234
$$ 281395 204833 265728 302185 261889 311380 305280 328064 357886 354098 371357 330492 278258
3992B78258o790Q9515N1309L146j04542P7275P1918k187J0946m0334k387K3686
$$ 278258 271468 360983 412292 415438 310896 388171 460089 457902 468848 428514 426127 449813
3980D49813P3250Q1825K54O1868O005p522R4745J07517O5041R040O9747J44166
$$ 449813 523063 604888 605142 667010 673015 665493 760238 867755 932796 941836 1011583 1155749
3968A155749P4156R9246J14297L6089J29334K3525Q4809J65162J62225J710M7708
$$ 1155749 1229905 1329151 1443448 1479537 1608871 1632396 1717205 1882367 2044592 2046302 2094010
3957B094010L6168l6310q2331j43880j17766j45311j17326j10600j58818n0006
$$ 2094010 2130178 2093868 2011537 1867657 1749891 1604580 1487254 1376654 1217836 1167830
3947A167830L0514o0385q3934l6196j610m1036l4775k3271k8451O810l0662j0006
$$ 1167830 1198344 1137959 1054025 1017829 1016219 975183 940408 917137 888686 895496 864834 854828
3935H54828L804o188J8574n5634O967K4824k4026l5257k6345O1398l5289q4926
$$ 854828 858632 852444 871018 815384 822351 847175 823149 787892 761547 822945 787656 702730
3923G02730L026M263O8830J4924j4622N5682K6726R913N7353O9757k1958K0164
$$ 702730 705756 710019 778849 793773 779151 834833 861559 871472 928825 998582 976624 996788
3911I96788O7392k8536Q32L8431J04684M7208k013K4044k3742N2384L4894P4298
$$ 996788 1064180 1035644 1036476 1074907 1179591 1226799 1224786 1248830 1225088 1277472 1312366 1386664
3899A386664L3131R2500P2727L3009k3850N1842J3238R5336M5689k226P9562O5329
$$ 1386664 1419795 1512295 1585022 1618031 1594181 1646023 1659261 1754597 1800286 1798060 1877622 1942951
3887A942951N0360o842N3113Q5506M7577J32737R4428J05406K9057L2352J08948
$$ 1942951 1993311 1986469 2039582 2125088 2172665 2305402 2399830 2505236 2534293 2566645 2675593
3876B675593J25791J60187J94817K03140K14524J39165J66639J67508J65360J83450
$$ 2675593 2801384 2961571 3156388 3359528 3574052 3713217 3879856 4047364 4212724 4396174
3866D396174J66602J28306J64926j3525p4828j69121k14336k58818k18326j94543
$$ 4396174 4562776 4691082 4856008 4842483 4767655 4598534 4384198 4125380 3907054 3712511
3856C712511k59377j63159j20520p0978j46850r7903l9186l2684o8873q2709p9301
$$ 3712511 3453134 3289975 3169455 3098477 2951627 2853724 2814538 2781854 2712981 2630272 2550971
3845B550971J9024o5603q880k6304J3355n8417o119M0573j2888j2864Q0408O938
$$ 2550971 2569995 2504392 2495512 2469208 2482563 2424146 2418027 2458600 2445712 2432848 2513256 2520194
3833B520194k8729k9306P9141m8847l2345j4884J5321K2170J9257l3371j2993
$$ 2520194 2491465 2462159 2541300 2492453 2460108 2445224 2460545 2482715 2501972 2468601 2455608
3822B455608m6732N2685O4466k4974N065M0241P7707L4871K0547L6954M3342M2960
$$ 2455608 2408876 2461561 2526027 2501053 2506118 2546359 2624066 2658937 2679484 2716438 2759780 2802740
3810B802740l8047k2804K3543L5233j3895P807R230O4968O0797L589m5816J6710
$$ 2802740 2764693 2741889 2765432 2800665 2786770 2794577 2803807 2868775 2929572 2933161 2887345 2904055
3798B904055J4512K8017n4141q4651K2178r5451k9026n0528n631l8643n3926j1189
$$ 2904055 2918567 2946584 2892443 2807792 2829970 2734519 2705493 2654965 2649334 2610691 2556765 2545576
3786B545576n6129L5179K0854j3437k6895k6158m4383j8041k9821l6391J8909
$$ 2545576 2489447 2524626 2545480 2532043 2505148 2478990 2434607 2416566 2386745 2350354 2369263
3775B369263k5465M274K2060k149J6235O0124K5592j8103K4451k1467m0026M308
$$ 2369263 2343798 2348072 2370132 2367983 2384218 2444342 2469934 2451831 2476282 2454815 2414789 2419097
3763B419097P022k007J6817L660j7004J0425K8065R000L616P1362l240K1874J6071
$$ 2419097 2426119 2424112 2440929 2444589 2427585 2438010 2466075 2475075 2478691 2550053 2546813 2568687 2584758
3750B584758J0221l721K1076J1601M4389J6311O0428L5666N2873J258N8566J9873
$$ 2584758 2594979 2591258 2612334 2623935 2668324 2684635 2745063 2780729 2833602 2834860 2893426 2913299
3738B913299m407O7939M7074j2908m5231o1322K5495j5018P4944M5615O1289R6519
$$ 2913299 2908892 2976831 3023905 3010997 2965766 2904444 2929939 2914921 2989865 3035480 3096769 3193288
3726C193288K1809Q279J7634k1710N5340J4720L6920J22347Q0113j00641l6473
$$ 3193288 3215097 3223376 3241010 3219300 3274640 3289360 3326280 3448627 3528740 3428099 3391626
3715C391626Q4829O6369J735J22201R1493J2400K1010R1687J25900l2070n7370
$$ 3391626 3476455 3542824 3544559 3666760 3758253 3770653 3791663 3883350 4009250 3977180 3919810
3704C919810K6580m7468J2211N1223M7367L5027r740M9683L727J9396n1108K9863
$$ 3919810 3946390 3898922 3911133 3962356 4009723 4044750 4035010 4084693 4088420 4107816 4056708 4086571
3692D086571o118R9468M6849M2928L283J77K8986r661N1893L9652M9168N4693
$$ 4086571 4080453 4179921 4226770 4269698 4272981 4273158 4302144 4292483 4344376 4384028 4433196 4487889
3680D487889N3193M9808N7407O1927M7801j3079r03Q7316M5048L5399M2891L4791
$$ 4487889 4541082 4590890 4648297 4710224 4758025 4744946 4744043 4831359 4876407 4911806 4954697 4989488
3668D989488m8664O4427O4433N437M4920M5453J55782M2477J271P0988R2224M7128
$$ 4989488 4940824 5005251 5069684 5075121 5120041 5165494 5321276 5363753 5365024 5436012 5528236 5575364
3656E575364Q785J30072J5137O4006R7236P5045K8056Q1898J04901Q2824m404
$$ 5575364 5584149 5714221 5729358 5793364 5890600 5965645 5993701 6075599 6180500 6263324 6258920
3645F258920M6152J27252R7282O0225r79P5835J40893R4132J14079J14218R0660
$$ 6258920 6305072 6432324 6529606 6589831 6588852 6664687 6805580 6899712 7013791 7128009 7218669
3634G218669M5328M9326Q8826M8925J13114R9946J84266J10521J35306K31728
$$ 7218669 7263997 7313323 7402149 7451074 7564188 7664134 7848400 7958921 8094227 8325955
3624H325955Q0111J02794R2662K04754J46738J49536J97427R2601J62774K18379
$$ 8325955 8406066 8508860 8601522 8806276 8953014 9102550 9299977 9392578 9555352 9773731
3614I773731K19411J17381J95563J73255J31268J85112J72550K45436K30768J96141
$$ 9773731 9993142 10110523 10306086 10479341 10610609 10795721 10968271 11213707 11444475 11640616
3604A1640616J58932J95693K33899K95501L19000L21840L26058L71351L90549
$$ 11640616 11799548 11995241 12229140 12524641 12843641 13165481 13491539 13862890 14253439
3595A4253439M24629M50766N13666N79787N28859N99771O09567N71504O72292
$$ 14253439 14678068 15128834 15642500 16222287 16751146 17350917 17960484 18531988 19204280
3586A9204280O43916O07593P39309P21695O27850N72907N15905M81470M23729
$$ 19204280 19848196 20455789 21195098 21916793 22544643 23117550 23633455 24114925 24538654
3577B4538654L13641J13991J27517m3499k16838k69111l12947l23409m01560l79326
$$ 24538654 24852295 24966286 25093803 25050304 24833466 24564355 24251408 23927999 23526439 23147113
3567B3147113m08832l98874l80687l53903l29574l35653l44738k18833j94983
$$ 23147113 22738281 22339407 21958720 21604817 21275243 20939590 20594852 20376019 20181036
3558B0181036k73647j44888j97889j38964j75071j60528j66589j90622j4250j54975
$$ 20181036 19907389 19762501 19564612 19425648 19250577 19090049 18923460 18732838 18718588 18563613
3548A8563613j64123r3507j56656j94646j71253k84239l42907m78500n27000m74493
$$ 18563613 18399490 18305983 18149327 17954681 17783428 17499189 17156282 16677782 16150782 15676289
3538A5676289n37968n60507n37449n99051n34406n14243m48434m63570m73974
$$ 15676289 15138321 14577814 14040365 13441314 12906908 12392665 11944231 11480661 11006687
3529A1006687l43051k77828l05292k79528k38862k53673k85753j60810k26990
$$ 11006687 10663636 10385808 10080516 9800988 9562126 9308453 9022700 8861890 8634900
3520H634900k42618j73205k23146j17317j15130j20173r9813q9109j22902j12988
$$ 8634900 8392282 8219077 7995931 7878614 7763484 7643311 7543498 7454389 7331487 7218499
3510G218499j2588n8033m0079K0438K1538k5720K6413J01866K7188j6772k6715
$$ 7218499 7205911 7147878 7107799 7128237 7149775 7124055 7150468 7252334 7279522 7262750 7236035
3499G236035L6947L3947K4051R5187L9745M7106L5998P5738J09366O2154J49250
$$ 7236035 7272982 7306929 7330980 7426167 7465912 7513018 7549016 7624754 7734120 7796274 7945524
3488G945524J62978R0556J57533J15310O6950Q6062l3227J08612K20145J64513
$$ 7945524 8108502 8199058 8356591 8471901 8538851 8624913 8591686 8700298 8920443 9084956
3478I084956J94140K83416L30734K31043L97494M36948M97041N07072N74673N58886
$$ 9084956 9279096 9562512 9893246 10124289 10521783 10958731 11455772 11962844 12537517 13096403
3468A3096403O79243P76741Q82615J021856J407550J740021J961637K354066K711401
$$ 13096403 13775646 14552387 15435002 16456858 17864408 19604429 21566066 23920132 26631533
3459B6631533L057530L201622L314685J817156j010342l931980n047800l833962
$$ 26631533 29689063 32890685 36205370 38022526 37012184 33080204 28032404 24198442
3451B4198442k646292j892964j394592q81620n75775k61148j54439K088J45871
$$ 24198442 21552150 19659186 18264594 17382974 16807199 16546051 16391612 16393700 16539571
3442A6539571K40877L43032N04666O64222P72016Q35391J002055J193188J420891
$$ 16539571 16780448 17123480 17628146 18292368 19064384 19899775 20901830 22095018 23515909
3433B3515909J850992K469339L070203L822472M259619N019374N631314O071508
$$ 23515909 25366901 27836240 30906443 34728915 38988534 44007908 49639222 55710730
3425E5710730O329932J961329l749638r661781j0256987p168666n160310l626708
$$ 55710730 62040662 64001991 60252353 50590572 40333585 33164919 28004609 24377901
3417B4377901k648200j939081j510781j205785r94093o81730p45018m63248l72910
$$ 24377901 21729701 19790620 18279839 17074054 16079961 15398231 14653213 14189965 13817055
3408A3817055j24124l8876R2706K25813L00242L74329N98125P18005J019515J444019
$$ 13817055 13692931 13654055 13746761 13972574 14272816 14647145 15245270 15963275 16982790 18426809
3398A8426809J749939J988628K345515K529998K789047K544869L43939k347861
$$ 18426809 20176748 22165376 24510891 27040889 29829936 32374805 32718744 30370883
3390C0370883m917788m894778l518049k612825j880202j417961j052988r21742
$$ 30370883 25453095 20558317 17040268 14427443 12547241 11129280 10076292 9154550
3382I154550p11048o50011n88677m71164m12812l65467k12184k78513j75151j40679
$$ 9154550 8443502 7793491 7204814 6733650 6320838 5955371 5743187 5464674 5289523 5148844
3372E148844q2807o9982J7340p9712m5018N7316K7462N2268R3181Q402M1384O1052
$$ 5148844 5066037 4996055 5013395 4933683 4888665 4945981 4973443 5025711 5118892 5127294 5168678 5229730
3360E229730J39807J30576q0561k61372l22346l36410k85115k48556k36999k15618
$$ 5229730 5369537 5500113 5419552 5158180 4835834 4499424 4214309 3965753 3728754 3513136
3350C513136j97372j32027o8195j24709j5675Q047r693m3661L2216l332p497J1127
$$ 3513136 3315764 3183737 3115542 2990833 2975158 2983205 2973512 2929851 2962067 2958735 2951238 2962365
3338B962365L6349l6369J0025J10677R8872J54819M2596M9218L1933M9697M7607
$$ 2962365 2998714 2962345 2972370 3083047 3181919 3336738 3379334 3428552 3460485 3510182 3557789
3327C557789O3317M7313M1700k866p9574j90480j05635q2173j03352p8000q9850
$$ 3557789 3621106 3668419 3710119 3707253 3627679 3437199 3331564 3249391 3146039 3068039 2978189
3316B978189l4751K0451j0335k9568J4417l0491K2706O6729J5374J1952M8372
$$ 2978189 2943438 2963889 2953554 2923986 2938403 2907912 2930618 2997347 3012721 3024673 3073045
3305C073045Q4870L9511j7040M4385L2568P7686O1174O632M4402N1197Q1066O8135
$$ 3073045 3157915 3197426 3180386 3224771 3257339 3335025 3396199 3402831 3447233 3498430 3579496 3647631
3293C647631M9638J00950P5133P8031N5978K4166Q0761O2965R7458K0309J25293
$$ 3647631 3697269 3798219 3873352 3951383 4007361 4031527 4112288 4175253 4272711 4293020 4418313
3282D418313N2143R4754R7349O8834P210J30164J60108N6811J65476J23195J64223
$$ 4418313 4470456 4565210 4662559 4731393 4738603 4868767 5028875 5085686 5251162 5374357 5538580
3271E538580R0739J64335O0729J49225J45017J17204J52187J31991P0112M9575
$$ 5538580 5629319 5793654 5854383 6003608 6148625 6265829 6418016 6550007 6620119 6669694
3261F669694N2600J16854N6571J24362J10005j8403J9480J5846J24309O0395P1189
$$ 6669694 6722294 6839148 6895719 7020081 7130086 7111683 7131163 7147009 7271318 7331713 7402902
3250G402902N1082J15725R0967J32015J17120J18837N4183J00049J33137J38006
$$ 7402902 7453984 7569709 7660676 7792691 7909811 8028648 8082831 8182880 8316017 8454023
3240H454023K14778J90074K45675J94719J10038M7634j09949p1825j41461k92117
$$ 8454023 8668801 8858875 9104550 9299269 9409307 9456941 9346992 9275167 9133706 8841589
3230H841589k46379k17706j83733j35178j61353r2765r4905j61469l2570p3725
$$ 8841589 8595210 8377504 8193771 8058593 7897240 7804475 7709570 7548101 7515531 7441806
3220G441806o8111o6256q8198k050m3558p3834k8960N724L6530o1445j08338k9098
$$ 7441806 7373695 7307439 7219241 7217191 7173633 7099799 7070839 7076563 7113093 7051648 6943310 6914212
3208F914212m107m2544n1382q1271q0387m1440o8505j27423j44424j29712p5892
$$ 6914212 6910105 6867561 6816179 6734908 6654521 6613081 6544576 6417153 6272729 6143017 6067125
3197F067125j02781q2628j24494j03891j03586o0064o1131m6644k4241o6165n9679
$$ 6067125 5964344 5881716 5757222 5653331 5549745 5489681 5428550 5381906 5357665 5291500 5231821
3186E231821l7250q9652j68609j94655j23331j69597q8652j06027q4725j11153
$$ 5231821 5194571 5104919 4936310 4741655 4618324 4448727 4360075 4254048 4169323 4058170
3176D058170j69672q0152j18103j14118k5853P613q5931n5836q3375m4013j46510
$$ 4058170 3888498 3808346 3690243 3576125 3550272 3557885 3471954 3416118 3332743 3288730 3142220
3165C142220l6466o0998m8171j23203j05175j21718o9338k294p1759k6006K0220
$$ 3142220 3105754 3044756 2996585 2873382 2768207 2646489 2577151 2574857 2503098 2477092 2497312
3154B497312r0816o7965k2823p1943n3117o7695o0066p3671l5292n8978N904o6210
$$ 2497312 2406496 2338531 2315708 2243765 2190648 2122953 2062887 1989216 1953924 1894946 1900850 1834640
3142A834640j11111m1654O3042k0951p6580p4226r8404r6359n5612j9598n4972
$$ 1834640 1723529 1681875 1744917 1723966 1647386 1573160 1474756 1378397 1322785 1303187 1248215
3131A248215r6891p2262M5275Q297r3916j08470n6295k8598L325q0631j7967o1131
$$ 1248215 1151324 1079062 1124337 1132634 1038718 930248 873953 845355 848680 768049 750082 688951
3119F88951j8542k7502m8303r536o0970l6075J2499K2982N7032J4665J7775N9144
$$ 688951 670409 642907 594604 585068 524098 488023 500522 523504 580536 595201 612976 672120
3107F72120j5490j7366k9036o1129j34730n5431k8081r8818n6397m7002j43402
$$ 672120 656630 639264 610228 549099 414369 358938 330857 232039 175642 128640 -14762
3096a4762m4593j8651l9835q1045o7352M9794J2915n8082m0660o6303m2771J3934
$$ -14762 -59355 -78006 -117841 -198886 -266238 -216444 -203529 -261611 -302271 -368574 -411345 -397411
3084c97411m5261p1741J427k5481r744n1651m1170J1115j3197l0788m7048l0414
$$ -397411 -442672 -514413 -512986 -538467 -548211 -599862 -641032 -629917 -643114 -673902 -720950 -751364
3072g51364n93n5744L019l0725R840j3702o10O53L0294l2429n6365r025m3686
$$ -751364 -751957 -807701 -804682 -835407 -825567 -839269 -839879 -839226 -808932 -841361 -897726 -906751 -950437
3059i50437J9098n4012O4249l6179J3797o8716p5017M7182K1637m64j00226J1528
$$ -950437 -931339 -985351 -921102 -957281 -943484 -1012200 -1087217 -1040035 -1018398 -1018862 -1119088 -1107560
3047a107560R43m2373Q004j1538l0153k9417n391j3633r9916O1682N8506K2049
$$ -1107560 -1106617 -1148990 -1140986 -1152524 -1182677 -1212094 -1217485 -1231118 -1331034 -1269352 -1210846 -1188797
3035a188797Q654n8862r961N257l9199l3366M057j5121K5459l1015r8113N1724
$$ -1188797 -1180143 -1239005 -1248966 -1243709 -1282908 -1316274 -1312217 -1327338 -1301879 -1332894 -1431007 -1379283
3023a379283K5335L958k859m7752L117P5107n0227n7512r703j5024K4837n7195
$$ -1379283 -1353948 -1349990 -1352849 -1400601 -1397484 -1322377 -1372604 -1430116 -1439819 -1454843 -1430006 -1487201
3011a487201R555m8443O4632Q535l0197J6807q2227K9742m197K1253p371J2121
$$ -1487201 -1477646 -1526089 -1461457 -1452922 -1483119 -1466312 -1548539 -1518797 -1522994 -1501741 -1509112 -1496991
2999a496991K7589l0973K9314l0057L6886n138K4659l5623n996j796L6116m9736
$$ -1496991 -1469402 -1500375 -1471061 -1501118 -1464232 -1469370 -1444711 -1480334 -1486330 -1488126 -1452010 -1501746
2987a501746q3305k0967k1499J3699L1250O259l657J8782O3305q759o6716M6663
$$ -1501746 -1585051 -1606018 -1627517 -1613818 -1582568 -1576309 -1579966 -1561184 -1497879 -1506638 -1573354 -1526691
2975a526691m6851J2328J4215j1666k9648M1481L1138O3382k0540p6716k0334
$$ -1526691 -1573542 -1561214 -1546999 -1558665 -1588313 -1546832 -1515694 -1452312 -1472852 -1549568 -1569902
2964a569902M5498q398o8765m471M6537P9702r7961O249L2391l7856m0015p584
$$ -1569902 -1524404 -1532802 -1601567 -1606038 -1559501 -1479799 -1577760 -1571511 -1539120 -1576976 -1616991 -1624575
2952a624575R707l3444P766k272L3547O0152J421j0497j9376l1890R302Q821j6967
$$ -1624575 -1614868 -1648312 -1640546 -1642818 -1609271 -1549119 -1547698 -1558195 -1577571 -1609461 -1600159 -1591338 -1608305
2939a608305l769l3672l6480j9678K4466O3295R641n8416r776o152M4957L7803
$$ -1608305 -1612074 -1645746 -1682226 -1701904 -1677438 -1614143 -1604502 -1662918 -1672694 -1678846 -1633889 -1596086
2927a596086k0827j424n4457J5830M0596J3235j8228q0793O50K3358J8608l2707
$$ -1596086 -1616913 -1618337 -1672794 -1656964 -1616368 -1603133 -1621361 -1702154 -1701504 -1678146 -1659538 -1692245
2915a692245o6215l68O1589M9354J863J0430j9458J0982R781m4062m3686l319
$$ -1692245 -1758460 -1758828 -1697239 -1647885 -1646022 -1635592 -1655050 -1644068 -1634287 -1678349 -1722035 -1725354
2903a725354J6625N3663L240j3401R575k5159k6482m320K6112k9745J6881R1488
$$ -1725354 -1708729 -1655066 -1651826 -1665227 -1655652 -1680811 -1707293 -1711613 -1685501 -1715246 -1698365 -1606877
2891a606877J3811n9062n5319J276l1608M4929m6096q2374M1404k2112L2436N2494
$$ -1606877 -1593066 -1652128 -1707447 -1706171 -1737779 -1692850 -1738946 -1821320 -1779916 -1802028 -1769592 -1717098
2879a717098J2349o4853J155j2331M463P2716J0695j00179O0776L4325j4664J7554
$$ -1717098 -1704749 -1769602 -1768447 -1780778 -1776315 -1703599 -1692904 -1793083 -1732307 -1697982 -1712646 -1695092
2867a695092m1553L4158j144j0030P3332m0314n6316k7692l558k322k3458j4056
$$ -1695092 -1736645 -1702487 -1703631 -1713661 -1640329 -1680643 -1736959 -1764651 -1768209 -1770531 -1793989 -1808045
2855a808045j7387L8601N1041L6681L7692J258n30n9789m1415M3106j8519L7022
$$ -1808045 -1825432 -1786831 -1735790 -1699109 -1661417 -1660159 -1660689 -1720478 -1761893 -1718787 -1737306 -1700284
2843a700284m0561k5954N7548M5691l2107l6382P408J1369l1891K6434k4707j6283
$$ -1700284 -1740845 -1766799 -1709251 -1663560 -1695667 -1732049 -1724641 -1713272 -1745163 -1718729 -1743436 -1759719
2831a759719k6122M1196j3623J2838O6928J9884m9755R961K0051O977n3635O725
$$ -1759719 -1785841 -1744645 -1758268 -1745430 -1678502 -1658618 -1708373 -1698412 -1678361 -1671384 -1725019 -1718294
2819a718294O3832J0667m3940k9319K5816r002k2641K7131J6709k6107Q343M4487
$$ -1718294 -1654462 -1643795 -1687735 -1717054 -1691238 -1700240 -1722881 -1695750 -1679041 -1705148 -1696805 -1652318
2807a652318R335k9614o2768j2250K1803J0932m982O3847j8735m3128O4043k4101
$$ -1652318 -1642983 -1672597 -1735365 -1747615 -1725812 -1714880 -1719862 -1656015 -1674750 -1717878 -1653835 -1677936
2795a677936l7072r1652Q5701P6151N3448m6486j20308J6614M9741n22m4774j4003
$$ -1677936 -1715008 -1806660 -1720959 -1644808 -1591360 -1637846 -1758154 -1741540 -1691799 -1692321 -1737095 -1751098
2783a751098M4087K9070j7266l0507K4348O5155j5795m2828N299O9246j7543l8553
$$ -1751098 -1707011 -1677941 -1695207 -1725714 -1701366 -1636211 -1652006 -1694834 -1689535 -1620289 -1637832 -1676385
2771a676385K5027J4870p243K28j2446m0081n2190M2281J15293J8070l954j09288
$$ -1676385 -1651358 -1636488 -1643731 -1643503 -1655949 -1696030 -1748220 -1705939 -1590646 -1572576 -1576530 -1685818
2759a685818j3998M9349L1387o6105N1093N1601j1346m1285N775J2694m3648j0160
$$ -1685818 -1699816 -1650467 -1619080 -1685185 -1634092 -1582491 -1593837 -1635122 -1629347 -1616653 -1660301 -1670461
2747a670461r075P3033j3497m433M7213o8811J7074j1328J2480o3755O4753J0131
$$ -1670461 -1679536 -1606503 -1620000 -1624433 -1577220 -1646031 -1628957 -1640285 -1627805 -1691560 -1626807 -1616676
2735a616676j6903O8689K5427K2733q7928j0917q7095o352K1846N3826O3879l5092
$$ -1616676 -1633579 -1564890 -1539463 -1516730 -1604658 -1615575 -1702670 -1709022 -1687176 -1633350 -1569471 -1604563
2723a604563K8506o1682k242N4530k1121k301n3197R562K0196O9339J5001k1225
$$ -1604563 -1576057 -1637739 -1639981 -1585451 -1606572 -1608873 -1662070 -1652508 -1632312 -1562973 -1547972 -1569197
2711a569197r049j7979J7874N1432K317j7600j5577j3826Q2692j2369l455k4653
$$ -1569197 -1578246 -1596225 -1578351 -1526919 -1524602 -1542202 -1557779 -1571605 -1488913 -1501282 -1504737 -1529390
2699a529390l2559j6239P9745J2974n9613k5535j8149m9834j0316P5744P0235
$$ -1529390 -1561949 -1578188 -1498443 -1485469 -1545082 -1570617 -1588766 -1638600 -1648916 -1573172 -1502937
2688a502937O1444K0753Q838r5640J7611q137k0338q0165N9380N0212j5592o7778
$$ -1502937 -1441493 -1420740 -1411902 -1507542 -1489931 -1498068 -1518406 -1598571 -1539191 -1488979 -1504571 -1572349
2676a572349K7434n4643k6071R183j7404R236L5118K234P5834k2298p6452P1102
$$ -1572349 -1544915 -1599558 -1625629 -1616446 -1633850 -1624614 -1589496 -1587262 -1511428 -1533726 -1610178 -1539076
2664a539076N4868n3384J1641Q8212n0245N6735k0995o0787J0914n6617K3565
$$ -1539076 -1484208 -1537592 -1525951 -1437739 -1487984 -1431249 -1452244 -1513031 -1502117 -1558734 -1535169
2653a535169N8839m5518J6438K4070J3273K6546J1566K1034K8624p3326j2745
$$ -1535169 -1476330 -1521848 -1505410 -1481340 -1468067 -1441521 -1429955 -1408921 -1380297 -1453623 -1466368
2642a466368m704M336K7997J68m2282m8050M9067j1630M828J4166J350O9590o3872
$$ -1466368 -1471072 -1466736 -1438739 -1438571 -1480853 -1528903 -1479836 -1491466 -1486638 -1472472 -1471122 -1401532 -1465404
2629a465404L2631K6407o778k6725j20287P6028P7335N660K5247m4245n9325o2167
$$ -1465404 -1432773 -1406366 -1413144 -1439869 -1560156 -1484128 -1406793 -1401133 -1375886 -1420131 -1479456 -1541623
2617a541623l4037k0186R7198O0769R271l4398M4146n424j3472L1403j5939l0472
$$ -1541623 -1575660 -1595846 -1498648 -1437879 -1428608 -1463006 -1418860 -1424284 -1437756 -1406353 -1422292 -1452764
2605a452764J0173j3282L2519l2403N3256J783j7444N3760J635n0700N7258N5110
$$ -1452764 -1442591 -1455873 -1423354 -1455757 -1402501 -1400718 -1418162 -1364402 -1362767 -1413467 -1356209 -1301099
2593a301099q9544l8867O8445M902k2768l1992J2255L8071j9720j6699o0249P3322
$$ -1301099 -1390643 -1429510 -1361065 -1356163 -1378931 -1410923 -1398668 -1360597 -1380317 -1397016 -1457265 -1383943
2581a383943P3311j7867n4157o290J7879M6865o7849Q0762J9283l5559l8343k8592
$$ -1383943 -1310632 -1328499 -1382656 -1388946 -1371067 -1324202 -1392051 -1311289 -1292006 -1327565 -1365908 -1394500
2569a394500K3447l8741M5112K3535k4534K1987L603P279k2892N0867L3171k391
$$ -1394500 -1371053 -1409794 -1364682 -1341147 -1365681 -1343694 -1340091 -1332812 -1355704 -1304837 -1271666 -1274057
2557a274057J5544k0755k3591O489J8711L842n1314Q4707k2017k2904L3207L9785
$$ -1274057 -1258513 -1279268 -1302859 -1296370 -1277659 -1273817 -1325131 -1240424 -1262441 -1285345 -1252138 -1212353
2545a212353j9255j7355k9664J9803m132m5429l741P0121m9092k2962j1829L1930
$$ -1212353 -1231608 -1248963 -1278627 -1258824 -1262956 -1308385 -1312126 -1242005 -1291097 -1314059 -1325888 -1293958
2533a293958l2316N8110O7202l2482K5106j5220l3055r498R2347J3487N3298N7931
$$ -1293958 -1326274 -1268164 -1200962 -1233444 -1208338 -1223558 -1256613 -1266111 -1173764 -1160277 -1106979 -1049048
2521a049048q2723q7845M9512P741L1608j7395M8801P125L578p113K4743o058
$$ -1049048 -1131771 -1219616 -1170104 -1162363 -1130755 -1148150 -1099349 -1092224 -1088646 -1095759 -1071016 -1077074
2509a077074K4252l9080J6398l9832J04634j2251J4594L8448p1751O490L6950
$$ -1077074 -1052822 -1091902 -1075504 -1115336 -1010702 -1022953 -1008359 -969911 -1041662 -1035172 -998222
2498i98222M2462J7714M5304m3278j1708J7882J956O4123L2724M0584K4577K4550
$$ -998222 -955760 -938046 -892742 -936020 -947728 -929846 -927890 -863767 -831043 -790459 -765882 -741332
2486g41332Q8782O5310N0636L3227J2479L8053N2108L4549J21051P6919J8224
$$ -741332 -652550 -587240 -536604 -503377 -490898 -452845 -400737 -366188 -245137 -168218 -149994
2475a49994k3684j4450L8385J9776o6413Q2525M5505J6276M1469L1029O4089J09803
$$ -149994 -173678 -188128 -149743 -129967 -196380 -113855 -68350 -52074 -10605 20424 84513 194316
2463A94316J39078J00994J16143J23844J56064K22305J90360K62781L14595K39225
$$ 194316 333394 434388 550531 674375 830439 1052744 1243104 1505885 1820480 2059705
2453B059705K61430L35801K90708K33673K86508L22023L79849M96593O20253P36198
$$ 2059705 2321135 2656936 2947644 3181317 3467825 3789848 4169697 4666290 5286543 6022741
2443F022741J243084J639790J821070N3707j722964j023908j059683j440846j227655
$$ 6022741 7265825 8905615 10726685 10780392 9057428 8033520 6973837 5532991 4305336
2434D305336q80164o31091n31502m52241m32801l14711j50415j29223j37743q2112
$$ 4305336 3425172 2794081 2262579 1810338 1377537 1062826 912411 783188 645445 563333
2424E63333k35144j34905j02735r1529o9346o5746q9135j35328l4460k2082j8956
$$ 563333 328189 193284 90549 -980 -70326 -136072 -225207 -360535 -394995 -417077 -436033
2413d36033j0388r3549j13135Q536o8452q5786M296K0078l2181n0822M5833N559
$$ -436033 -446421 -539970 -653105 -644569 -713021 -798807 -794511 -774433 -806614 -857436 -811603 -806044
2401h06044r0495m7673J6606k8760l6009j061N2577l3155n1890K6076M4680k8781
$$ -806044 -896539 -944212 -927606 -956366 -992375 -993436 -940859 -974014 -1025904 -999828 -955148 -983929
2389i83929Q86j1894m3614m0103j8416N6431j5761j8735L5880o8156L528L7799
$$ -983929 -983043 -994937 -1038551 -1078654 -1097070 -1040639 -1056400 -1075135 -1039255 -1107411 -1103883 -1066084
2377a066084r1157n2571m7410P0266m1958K2971P0294l6332j0299J4255J3139
$$ -1066084 -1157241 -1209812 -1257222 -1186956 -1228914 -1205943 -1135649 -1171981 -1182280 -1168025 -1154886
2366a154886l506M0029m0756j3510Q804k2016J4915M8400J9038j5276J1220J1715
$$ -1154886 -1158392 -1118363 -1159119 -1172629 -1163825 -1185841 -1170926 -1122526 -1103488 -1118764 -1107544 -1095829
2354a095829k0099j01328k1813j4737M8059r062J1432K751J5840K9079J7840M3355
$$ -1095829 -1115928 -1217256 -1239069 -1253806 -1205747 -1214809 -1203377 -1200626 -1184786 -1155707 -1137867 -1094512
2342a094512J239n4160k8464K4813m1500j2147O3622J4978n0675O3327m8288M548
$$ -1094512 -1093273 -1147433 -1175897 -1151084 -1192584 -1204731 -1141109 -1126131 -1176806 -1113479 -1161767 -1157219
2330a157219J4364k1160N2955n3950m4904k7704J5699K6172j7513l1838O7850
$$ -1157219 -1142855 -1164015 -1111060 -1165010 -1209914 -1237618 -1221919 -1195747 -1213260 -1245098 -1177248
2319a177248K3644j3794J3287j0823m0000L4480P0148m4754M5893P539l2705J0885
$$ -1177248 -1153604 -1167398 -1154111 -1164934 -1204934 -1170454 -1100306 -1145060 -1099167 -1091628 -1124333 -1113448
2307a113448n1266M7819L3598q2171k1949M0686j5807l4856N6714r058L7980L3586
$$ -1113448 -1164714 -1116895 -1083297 -1165468 -1187417 -1146731 -1162538 -1197394 -1140680 -1149738 -1111758 -1078172
2295a078172m7720n0009K518l3152n200j7010L0665J01995n3130p224N3125k0829
$$ -1078172 -1125892 -1175901 -1173383 -1206535 -1211735 -1228745 -1198080 -1096085 -1149215 -1156439 -1103314 -1124143
2283a124143j4342K1769K3692K4446l5113j3053q295M5300p1310p8589O1700N711
$$ -1124143 -1138485 -1116716 -1093024 -1068578 -1103691 -1116744 -1125039 -1079739 -1151049 -1229638 -1167938 -1162227
2271a162227K3301J1916k2303o029j2634M0959L103m0469J0555O3969J6197Q48
$$ -1162227 -1138926 -1127010 -1149313 -1155342 -1167976 -1127017 -1123914 -1164383 -1153828 -1089859 -1073662 -1072814
2259a072814l2909m4722N2974J318r537O366O9838k8740m1926o0826L6093M9702
$$ -1072814 -1105723 -1150445 -1097471 -1096153 -1105690 -1099324 -1029486 -1058226 -1100152 -1160978 -1124885 -1075183
2247a075183p3164n2108J3394M5250J895J9013L8947l2456j0164P3752K805l1070
$$ -1075183 -1148347 -1200455 -1187061 -1141811 -1139916 -1120903 -1081956 -1114412 -1124576 -1050824 -1048019 -1079089
2235a079089k4629p3494k9037M880J03619J1393p2044K324k0883J3848K7831J8807
$$ -1079089 -1103718 -1177212 -1206249 -1201369 -1097750 -1086357 -1158401 -1156077 -1176960 -1163112 -1135281 -1116474
2223a116474o578n7588J9371L457N5736J2357r369l5897M0451O4229o2156l9343
$$ -1116474 -1123052 -1180640 -1161269 -1157812 -1102076 -1089719 -1099088 -1134985 -1094534 -1030305 -1092461 -1131804
2211a131804l902K8725J4320k5960N505o3221Q4281J1025n6620J28550j9373k5618
$$ -1131804 -1135706 -1106981 -1092661 -1118621 -1113116 -1176337 -1092056 -1081031 -1137651 -1009101 -1028474 -1054092
2199a054092J2869Q491q6441N1681k053k5896K162o960j8064O531L4889N234M1929
$$ -1054092 -1041223 -1032732 -1119173 -1067492 -1069545 -1095441 -1093279 -1100239 -1118303 -1111772 -1076883 -1071649 -1029720
2186a029720k2645J6500n2620k9107Q4325p0797N0240k6886L24L9441K6738N5117
$$ -1029720 -1052365 -1035865 -1088485 -1117592 -1033267 -1104064 -1053824 -1080710 -1080386 -1040945 -1014207 -959090
2174i59090M9090J3302o3258r549L2326l2937o9053J3717J664k3911m0336l4046
$$ -959090 -910000 -896698 -959956 -969505 -937179 -970116 -1039169 -1025452 -1023788 -1047699 -1088035 -1122081
2162a122081O8716J8246k1452K5996j0713L1270L622p76N2265m6730m3488J3559
$$ -1122081 -1053365 -1035119 -1056571 -1030575 -1041288 -1010018 -1006396 -1007172 -954907 -1001637 -1045125 -1031566
2150a031566p4547M6449L0362N7521O046m6633k2277l148k9923j2308L9630j6696
$$ -1031566 -1106113 -1059664 -1029302 -971781 -965735 -1012368 -1034645 -1037793 -1067716 -1080024 -1040394 -1057090
2138a057090N7923J6614o7063j2964K7673M2870J2733p481n7350l5584j3091M8324
$$ -1057090 -999167 -982553 -1049616 -1062580 -1034907 -992037 -979304 -986785 -1044135 -1079719 -1092810 -1044486
2126a044486J3324q419K3848L1310k2813l1062J2187k0695M2283K9262o239j0995
$$ -1044486 -1031162 -1039581 -1015733 -984423 -1007236 -1038298 -1026111 -1046806 -1004523 -975261 -981500 -992495
2114i92495j6394o3180K1427o890O4549L3204k9820m5589L0385M2673K2054K919
$$ -992495 -1008889 -1072069 -1050642 -1057532 -992983 -959779 -989599 -1035188 -1004803 -962130 -940076 -937157
2102i37157m8078l7107J31571J152j19617N0962K1422N093o2534m4535L6302J632
$$ -937157 -985235 -1022342 -890771 -889619 -1009236 -958274 -936852 -931759 -994293 -1038828 -1002526 -1000894
2090a000894j5899K2574k3107O1900n0433n1687l0617K6304J18301l8233j6752
$$ -1000894 -1016793 -994219 -1017326 -955426 -1005859 -1057546 -1088163 -1061859 -943558 -981791 -998543
2079i98543k698K1801o5626m2349R5731M4588l8450L2051k2055k68K6275m2626
$$ -998543 -1001241 -979440 -1045066 -1087415 -991684 -947096 -985546 -953495 -975550 -975818 -949543 -992169
2067i92169n6041L5210R3683l8751j2099O4754k5254n4523M2012j8058L8417L8607
$$ -992169 -1048210 -1013000 -919317 -958068 -970167 -905413 -930667 -985190 -943178 -961236 -922819 -884212
2055h84212n0713K0814K1829q6026l103O0826R238N0346j3790m7293m7840J7584
$$ -884212 -934925 -914111 -892282 -978308 -981411 -920585 -911347 -861001 -874791 -922084 -969924 -952340
2043i52340O09n848N2152P122J8848J6963o1958n8511J9750L7828J3712j1654
$$ -952340 -951731 -957579 -905427 -898305 -879457 -862494 -924452 -982963 -963213 -925385 -911673 -923327
2031i23327l2039R010P6972L013m0274p1427L3329M3386K873o302N9347j5130
$$ -923327 -955366 -946356 -869384 -866371 -906645 -978072 -944743 -901357 -898484 -904786 -845439 -860569
2019h60569m3773M786N6124m8839M872k1971o0920j0252M3467J0988J0751J2649
$$ -860569 -904342 -899556 -843432 -892271 -887399 -909370 -970290 -980542 -937075 -926087 -915336 -902687
2007i02687J1192L6428O155p21n0995J7407K3174J3200l81K5534l908j5311q2085
$$ -902687 -891495 -855067 -848912 -849633 -900628 -883221 -860047 -846847 -847228 -821694 -825602 -840913 -922998
1994i22998P9410k8820O413J6342p1450N2779K1076L8627k4616k2384j829m9807
$$ -922998 -843588 -872408 -865995 -849653 -921103 -868324 -847248 -808621 -833237 -855621 -857450 -907257
1982i07257q962L8399k8826K4476k9490p711M986k3799L3682J2967j5455N6535
$$ -907257 -916219 -877820 -906646 -882170 -911660 -919371 -914385 -938184 -904502 -891535 -906990 -850455
1970h50455n4032m9429J4460L0654m87J6890L5803o998N8878j9213j0854k8349
$$ -850455 -904487 -953916 -939456 -908802 -909289 -892399 -856596 -863594 -804716 -823929 -834783 -863132
1958h63132J5461J1462l8504L9555m652n8529j7979J7987k3497L0501O7582j2824
$$ -863132 -847671 -836209 -874713 -835158 -839810 -898339 -916318 -898331 -921828 -891327 -823745 -836569
1946h36569k2320M6390k0453k1975M3278o3425M5525o705o7773L268K8736k0230
$$ -836569 -858889 -812499 -832952 -854927 -811649 -875074 -829549 -836254 -904027 -900759 -872023 -892253
1934h92253O7698M0102n6435j1515M710K3919m5574J0228k8998N1354Q0959q113
$$ -892253 -824555 -784453 -840888 -852403 -847693 -823774 -869348 -859120 -888118 -836764 -755805 -763918
1922g63918N886o2778q454J8433L9597k9633j3503J1302k8914r519O6308k9296
$$ -763918 -758032 -820810 -829264 -810831 -771234 -800867 -814370 -803068 -831982 -841501 -775193 -804489
1910h04489l2720j1131J0443l0726k7415K9001K0965J00132L0864n0417m0633
$$ -804489 -837209 -848340 -837897 -868623 -896038 -867037 -846072 -745940 -715076 -765493 -806126
1899h06126j9167N9086m9966M2150k1725n85j5707L793Q126P7377L162r6668L1686
$$ -806126 -825293 -766207 -816173 -774023 -795748 -796333 -812040 -808247 -800121 -722744 -719582 -816250 -784564
1886g84564K5060o1378l1960J10137J0854j4983j1493K769l302j5966J2905R7852
$$ -784564 -759504 -820882 -852842 -742705 -731851 -746834 -758327 -755558 -758860 -774826 -761921 -664069
1874f64069r3244m6205l6096n2721M5402j5162J5140N8888j3716p65j910j1857
$$ -664069 -757313 -803518 -839614 -892335 -846933 -862095 -846955 -788067 -801783 -802548 -804458 -816315
1862h16315l247K9939j5883k6376k053J4678K1041P6406j9790r075K1099N0055
$$ -816315 -819562 -789623 -805506 -831882 -833935 -819257 -798216 -721810 -741600 -750675 -729576 -679521
1850f79521p83j12456j6930J1628j1242J9432J1078p394L8475n9435j8589j2078
$$ -679521 -680304 -792760 -809690 -798062 -809304 -789872 -778794 -786188 -747713 -807148 -825737 -837815
1838h37815k124J7860Q4711n3943n9986J02169k1898o4571j4035Q1832M1677M8915
$$ -837815 -839939 -822079 -737368 -791311 -851297 -749128 -771026 -835597 -849632 -767800 -726123 -677208
1826f77208l7463m8464o2249L2501j4205k3218m428K8017M4036o734m0922l7477
$$ -677208 -714671 -763135 -825384 -792883 -807088 -830306 -834734 -806717 -762681 -769415 -810337 -847814
1814h47814N3003K1446K0304N3243j6928l3407J2101n795l752j4554L6884L3333
$$ -847814 -794811 -773365 -753061 -699818 -716746 -750153 -738052 -743847 -747599 -762153 -725269 -691936
1802f91936R653j4620L6239p1640L828J4798j684M2773k2504l2786p877J213O805
$$ -691936 -682283 -696903 -660664 -732304 -728476 -713678 -715362 -672589 -695093 -727879 -735756 -734543 -727738
1789g27738L7633l9586J12764J0955o3238r4635o5474O6705K4168O2104M104k7880
$$ -727738 -690105 -729691 -616927 -605972 -669210 -763845 -829319 -762614 -738446 -676342 -672238 -700118
1777g00118k5214m769K7279k5770j9736L0706M0001J9800j8160n3856P3926K108
$$ -700118 -725332 -730101 -702822 -728592 -748328 -717622 -677621 -657821 -675981 -729837 -655911 -653803
1765f53803N841M86m9834M640n7704P1332l1422q400J3884K6183l294O525n4516
$$ -653803 -647962 -647476 -697310 -692670 -750374 -679042 -710464 -718864 -704980 -678797 -682091 -675566 -730082
1752g30082J5713J7787j02668j438N3401R8505l8971l6602K5784O4615l3457o2716
$$ -730082 -714369 -696582 -799250 -800688 -747287 -648782 -687753 -724355 -698571 -633956 -667413 -730129
1740g30129K4871l290k3624L2199K5583k2298m1560Q15N9J3462K3717m865o806
$$ -730129 -705258 -708548 -732172 -699973 -674390 -696688 -738248 -737433 -737374 -723912 -700195 -705060 -711866
1727g11866J8556J9738j3075m120J7800j3004l3486L4268o747k8037M3760p3181
$$ -711866 -693310 -673572 -686647 -690767 -672967 -685971 -719457 -685189 -691936 -719973 -676213 -749394
1715g49394m9515L1445O6009k320K7577K611n7309o456R4596l1602k0605m230
$$ -749394 -798909 -767464 -701455 -703775 -676198 -673587 -730896 -737352 -642756 -674358 -694963 -699193
1703f99193L1359P2843q5287L950N819J3096j2576K0121n0544N4976M6381Q652
$$ -699193 -667834 -594991 -680278 -676328 -670509 -657413 -669989 -649868 -700412 -645436 -599055 -590403
$$ [...]
##END NTUPLES=NMR SPECTRUM
##END=
