##TITLE=1H_DE-80H_X3
 200.13MHz, d2o
 8 sc
 
 19ns.26.2.2025
##JCAMPDX= 6.0         $$ Bruker NMR JCAMP-DX V2.0
##DATA TYPE= NMR SPECTRUM
##DATA CLASS= NTUPLES
##ORIGIN= UXNMR, Bruker Analytische Messtechnik GmbH
##OWNER= pz
$$ XWIN-NMR		Version 3.5
$$ Thu Jul  3 10:29:19 2025 Russian Standard Time (UT+4h)  Yarkov@DPX200
##.OBSERVE FREQUENCY= 200.1313
##.OBSERVE NUCLEUS= ^1H
##.ACQUISITION MODE= SIMULTANEOUS
##.ACQUISITION SCHEME= undefined
##.AVERAGES= 8
##.DIGITISER RES= 18
##SPECTROMETER/DATA SYSTEM= spect
##.PULSE SEQUENCE= zg30
##.SOLVENT NAME= CDCl3
##.SHIFT REFERENCE= (INTERNAL, CDCl3, 0, 15.4373)
##AUDIT TRAIL= $$ (NUMBER, WHEN, WHO, WHERE, WHAT)
$$ ##TITLE= Audit trail, XWIN-NMR		Version 3.5
$$ ##JCAMPDX= 5.01
$$ ##ORIGIN= Bruker BioSpin GmbH
$$ ##OWNER= Yarkov
$$ C:/Bruker/XWIN-NMR/data/yarkov2/nmr/H-C/1/pdata/1/auditp.txt
$$ ##AUDIT TRAIL=  $$ (NUMBER, WHEN, WHO, WHERE, WHAT)
(   1,<2025-07-03 10:28:11.70 +0400>,<Yarkov>,<DPX200>,
      <created by zg, POWCHK disabled, PULCHK disabled
       configuration hash MD5:
       00 E9 B6 7A A2 85 ED C7 34 08 36 98 17 FE 4E 26
       data hash MD5: 16K
       4B 6D 15 71 13 3C C1 CA 83 BD DD 2F 67 7D 96 EC>)
(   2,<2025-07-03 10:28:28.78 +0400>,<Yarkov>,<DPX200>,
      <Start of raw data processing
       efp BC_mod = 2 LB = 0.25 FT_mod = 6 PKNL = 1 PHC0 = -1343.07 PHC1 = -12.35052 SI = 16K 
       data hash MD5: 16K
       65 37 19 AF 18 23 18 0E BB C1 CB 37 59 1A 80 08>)
(   3,<2025-07-03 10:28:42.93 +0400>,<Yarkov>,<DPX200>,
      <abs ABSG = 5 
       data hash MD5: 16K
       2F A0 78 24 AA 5D 19 32 C6 60 88 F9 30 54 1D 3B>)
$$ ##END=
$$ 
$$ hash MD5
$$ DD 63 CE 17 90 17 84 E8 E7 A7 E3 3F 44 A8 1C B5
##$RELAX= 
##$RELAX= 
##$RELAX= 
##$RELAX= 
##$RELAX= 
##$RELAX= 
$$ Bruker specific parameters
$$ --------------------------
##$DU= <C:/Bruker/XWIN-NMR>
##$EXPNO= 1
##$NAME= <H-C>
##$PROCNO= 1
##$TYPE= <nmr>
##$USER= <yarkov2>
##$AMP= (0..31)
100 100 100 100 100 100 100 100 100 100 100 100 100 100 100 100 100 100 
100 100 100 100 100 100 100 100 100 100 100 100 100 100 
##$AQSEQ= 0
##$AQ_mod= 1
##$AUNM= <au_zg>
##$AUTOPOS= <>
##$BF1= 200.13
##$BF2= 200.13
##$BF3= 200.13
##$BF4= 200.13
##$BF5= 200.13
##$BF6= 200.13
##$BF7= 200.13
##$BF8= 200.13
##$BYTORDA= 1
##$CFDGTYP= 0
##$CFRGTYP= 5
##$CHEMSTR= <none>
##$CNST= (0..31)
1 1 145 1 1 1 1 1 1 1 1 1 1 1 1 1 1 1 1 1 1 1 1 1 1 1 1 1 1 1 1 1 
##$CPDPRG= <>
##$CPDPRG1= <>
##$CPDPRG2= <>
##$CPDPRG3= <>
##$CPDPRG4= <mlev>
##$CPDPRG5= <mlev>
##$CPDPRG6= <mlev>
##$CPDPRG7= <mlev>
##$CPDPRG8= <mlev>
##$CPDPRGB= <>
##$CPDPRGT= <>
##$D= (0..31)
0 0.7 0 0 0 0 0 0 0 0 0 0.03 0 0 0 0 0 0 0 0 0 0 0 0 0 0 0 0 0 0 0 0 
##$DATE= 1751524091
##$DBL= (0..7)
120 120 120 120 120 120 120 120 
##$DBP= (0..7)
150 150 150 150 150 150 150 150 
##$DBP07= 0
##$DBPNAM0= <>
##$DBPNAM1= <>
##$DBPNAM2= <>
##$DBPNAM3= <>
##$DBPNAM4= <>
##$DBPNAM5= <>
##$DBPNAM6= <>
##$DBPNAM7= <>
##$DBPOAL= (0..7)
0.5 0.5 0.5 0.5 0.5 0.5 0.5 0.5 
##$DBPOFFS= (0..7)
0 0 0 0 0 0 0 0 
##$DE= 6
$$ [...]
##$SUBNAM3= <"">
##$SUBNAM4= <"">
##$SUBNAM5= <"">
##$SUBNAM6= <"">
##$SUBNAM7= <"">
##$SUBNAM8= <"">
##$SUBNAM9= <"">
##$SW= 18.0517328524113
##$SWIBOX= (0..15)
0 0 2 0 0 0 0 0 0 0 0 0 0 0 0 0 
##$SW_h= 3612.71676300578
##$TD= 16384
##$TD0= 1
##$TE= 0
##$TE2= 300
##$TE3= 300
##$TEG= 300
##$TL= (0..7)
0 120 120 120 120 120 120 120 
##$TP= (0..7)
150 150 150 150 150 150 150 150 
##$TP07= 0
##$TPNAME0= <>
##$TPNAME1= <>
##$TPNAME2= <>
##$TPNAME3= <>
##$TPNAME4= <>
##$TPNAME5= <>
##$TPNAME6= <>
##$TPNAME7= <>
##$TPOAL= (0..7)
0.5 0.5 0.5 0.5 0.5 0.5 0.5 0.5 
##$TPOFFS= (0..7)
0 0 0 0 0 0 0 0 
##$TUNHIN= 0
##$TUNHOUT= 0
##$TUNXOUT= 0
##$USERA1= <user>
##$USERA2= <user>
##$USERA3= <user>
##$USERA4= <user>
##$USERA5= <user>
##$V9= 5
##$VALIST= <valist>
##$VCLIST= <CCCCCCCCCCCCCCC>
##$VD= 0
##$VDLIST= <DDDDDDDDDDDDDDD>
##$VPLIST= <PPPPPPPPPPPPPPP>
##$VTLIST= <TTTTTTTTTTTTTTT>
##$WBST= 1024
##$WBSW= 4
##$XGAIN= (0..3)
0 0 0 0 
##$XL= 0
##$YL= 0
##$YMAX_a= 395059
##$YMIN_a= -323107
##$ZGOPTNS= <>
##$ZL1= 120
##$ZL2= 120
##$ZL3= 120
##$ZL4= 120
##$ABSF1= 15.45932
##$ABSF2= -2.592529
##$ABSG= 5
##$ABSL= 3
##$ALPHA= 0
##$AQORDER= 0
##$ASSFAC= 0
##$ASSFACI= 0
##$ASSFACX= 0
##$ASSWID= 0
##$AUNMP= <proc_1d>
##$AZFE= 0.1
##$AZFW= 0.1
##$BCFW= 0
##$BC_mod= 2
##$BYTORDP= 0
##$COROFFS= 0
##$CY= -3
##$DATMOD= 1
##$DC= 0
##$DFILT= <>
##$DTYPP= 0
##$F1P= 0
##$F2P= 0
##$FCOR= 1
##$FTSIZE= 16384
##$FT_mod= 6
##$GAMMA= 0
##$GB= 0
##$INTBC= 1
##$INTSCL= 3.241238e-09
##$ISEN= 128
##$LB= 0.25
##$LEV0= 0
##$LPBIN= 0
##$MAXI= 10000
##$MC2= 0
##$MEAN= 0
##$ME_mod= 0
##$MI= 1.114404
##$NCOEF= 0
##$NC_proc= -7
##$NLEV= 6
##$NOISF1= 3.799351
##$NOISF2= 2.8
##$NSP= 0
##$NTH_PI= 0
##$NZP= 0
##$OFFSET= 15.43728
##$PC= 1
##$PHC0= -1343.07
##$PHC1= -12.35052
##$PH_mod= 1
##$PKNL= yes
##$PPARMOD= 0
##$PSCAL= 0
##$PSIGN= 0
##$REVERSE= no
##$SF= 200.130016893807
##$SI= 16384
##$SIGF1= 3
##$SIGF2= 2
##$SINO= 0.751879
##$SIOLD= 32768
##$SREGLST= <19F.Aceton>
##$SSB= 0
##$STSI= 16384
##$STSR= 0
##$SW_p= 3612.71676300578
##$SYMM= 0
##$S_DEV= 0
##$TDeff= 16384
##$TDoff= 0
##$TI= <>
##$TILT= no
##$TM1= 0
##$TM2= 0
##$TOPLEV= 0
##$USERP1= <user>
##$USERP2= <user>
##$USERP3= <user>
##$USERP4= <user>
##$USERP5= <user>
##$WDW= 1
##$XDIM= 16384
##$YMAX_p= 407443101
##$YMIN_p= -2092123
$$ End of Bruker specific parameters
$$ ---------------------------------
##NTUPLES= NMR SPECTRUM
##VAR_NAME=  FREQUENCY,     SPECTRUM/REAL,   SPECTRUM/IMAG
##SYMBOL=    X,             R,               I
##VAR_TYPE=  INDEPENDENT,   DEPENDENT,       DEPENDENT
##VAR_FORM=  AFFN,          ASDF,            ASDF
##VAR_DIM=   16384,         16384,           16384
##UNITS=     HZ,            ARBITRARY UNITS, ARBITRARY UNITS
##FACTOR=    0.220516191357247, 1,           1
##FIRST=     3089.46304740217, 0,            0
##LAST=      -523.253715603614, 0,           0
##MIN=       -523.253715603614, -2092123,    0
##MAX=       3089.46304740217, 407443101,    0
$$ Real data points
##PAGE= N=1
##DATA TABLE= (X++(R..R)), XYDATA
$$ [...]
$$ plain form
7636 429872 425971 406283 490226 553052 411857 490540 403412 312435 349908 320455 424184
7625 424184 329036 238666 179710 105354 11786 217852 158516 206001 302402 235163 156599
7614 156599 89346 261082 301389 266474 310113 238209 181396 349190 250577 117658 133605
7603 133605 290326 216218 157368 178856 165918 123454 207315 236989 182141 243790 356487
7592 356487 346206 223866 171778 231927 425123 286449 278266 466319 649609 628514 515243
7581 515243 544533 636589 475751 545214 605367 574261 584692 703391 613947 508421 532537
7570 532537 632615 627329 500690 636704 582351 588291 592145 544218 608922 645659 711199 649855
7558 649855 786370 700057 596779 592119 556747 720919 833487 906961 887088 825455 852978
$$ packed form
7636D29872l901j9688Q3943O2826j41195P8683q7128r0977L7473k9453J03729
7625D24184r5148r0370n8956p4356r3568K06066n9336M7485R6401o7239p8564
7614A56599o7253J71736M0307l4915M3639p1904n6813J67794r8613j32919J5947
7603A33605J56721p4108n8850K1488j2938m2464Q3861K9674n4848O1649J12697
7592C56487j0281j22340n2088O0149J93196j38674q183J88053J83290k1095j13271
7581E15243K9290R2056j60838O9463O0153l1106J0431J18699q9444j05526K4116
7570E32537J00078n286j26639J36014n4353N940L854m7927O4704L6737O5540o1344
7558F49855J36515q6313j03278m660l5372J64172J12568P3474j9873o1633K7523
$$ plain form
7547 852978 960269 925585 1000254 1205985 1228020 1269479 1333296 1471826 1619032 1684031 1778837
7536 1778837 1751755 1829508 1907359 1916907 1855641 1814008 1874919 2176486 2290235 2343632 2497737
7525 2497737 2586492 2741722 3101793 3257234 3424067 3653715 3910197 4215350 4506221 4963254
7515 4963254 5347027 5765321 6270181 7017986 7834868 8587099 9150426 9584828 9649990 9330052
7505 9330052 8951899 8435874 7598263 6898144 6358791 5687317 5367381 5152560 4859193 4529685
7495 4529685 4227211 4003313 3926004 3945485 3816256 3735870 3579899 3530845 3521702 3515617 3486145
7484 3486145 3395367 3361082 3261426 3345552 3373597 3349340 3489288 3402859 3523963 3498738 3476076
7473 3476076 3580626 3575873 3654666 3726483 3996624 4116193 4119762 4367111 4617395 4664691 4670291
$$ packed form
7547H52978J07291l4684P4669K05731K2035M1459O3817J38530J47206O4999R4806
7536A778837k7082P7753P7851R548o1266m1633O0911L01567J13749N3397J54105
7525B497737Q8755J55230L60071J55441J66833K29648K56482L05153K90871M57033
7515D963254L83773M18294N04860P47805Q16882P52231N63327M34402O5162l19938
7505I330052l78153n16025q37611p00119n39353o71474l19936k14821k93367l29508
7495D529685l02474k23898p7309J9481j29229q0386j55971m9054r143o085k9472
7484C486145r0778l4285r9656Q4126K8045k4257J39948q6429J21104k5225k2662
7473C476076J04550m753P8793P1817K70141J19569L569K47349K50284M7296N600
$$ plain form
7462 4670291 4870144 5020867 5129310 5306502 5295515 5450946 5529759 5686294 5634030 5570134
7452 5570134 5535024 5545327 5636117 5934357 6132903 6255966 6422640 6633375 6981925 7229987
7442 7229987 7440440 7919796 8076523 8173932 8552054 8870779 9119012 9431168 9968598 10522866
7432 10522866 10993156 11556246 12147106 12712316 13082149 13124477 12951520 12668295 12234587 11578412
7422 11578412 11071754 10743055 10527238 10452122 10389694 10096475 9811560 9846559 9984918 9760805
7412 9760805 9586637 9532547 9562373 9569989 9401677 9115288 9083471 8935047 8772366 8843123 8889745
7401 8889745 8856853 8950260 9092586 9112464 9263722 9375877 9481527 9747782 9747671 9680505 9648423
7390 9648423 9533002 9514397 9547481 9408898 9350620 9154873 9059387 9036151 8900600 8698547
$$ packed form
7462D670291J99853J50723J08443J77192j0987J55431P8813J56535n2264o3896
7452E570134l5110J0303R0790K98240J98546J23063J66674K10735L48550K48062
7442G229987K10453M79356J56727R7409L78122L18725K48233L12156N37430N54268
7432A0522866M70290N63090N90860N65210L69833M2328j72957k83225m33708o56175
7422A1578412n06658l28699k15817p5116o2428k93219k84915L4999J38359k24113
7412I760805j74168n4090K9826P616j68312k86389l1817j48424j62681P0757M6622
7401H889745l2892R3407J42326J9878J51258J12155J05650K66255j11o7166l2082
7390I648423j15421j8605L3084j38583n8278j95747r5486k3236j35551k02053
$$ plain form
7380 8698547 8710601 8819894 8787545 8669037 8715485 8635378 8606660 8653025 8676970 8716655 8728551
7369 8728551 8793694 8942209 9023896 9039035 9086623 9093742 9263451 9330789 9346524 9368080 9421034
7358 9421034 9410490 9523360 9661672 9766742 9826446 9973442 10206354 10447563 10656023 10779920
7348 10779920 11078275 11539499 11828385 11996974 12388323 12810305 12910600 13047865 13367723
7339 13367723 13602704 13788540 13837137 13868032 13927578 13950889 13975359 14084074 14270119 14326406
7329 14326406 14454168 14620794 14729437 14738712 14696181 14789876 14948477 14962525 14821319 14711968
7319 14711968 14679316 14583682 14561416 14528000 14463737 14375926 14245949 13961099 13795155 13799064 13862328
7308 13862328 13873060 13904196 14095346 14200647 14216254 14465118 14745720 14885943 15064741 15403954
$$ packed form
7380H698547J2054J09293l2349j18508M6448q0107k8718M6365K3945L9685J1896
7369H728551O5143J48515Q1687J5139M7588P119J69709O7338J5735K1556N2954
7358I421034j0544J12870J38312J05070N9704J46996K32912K41209K08460J23897
7348A0779920K98355M61224K88886J68589L91349M21982J00295J37265L19858
7339A3367723K34981J85836M8597L0895N9546K3311K4470J08715J86045N6287
7329A4326406J27762J66626J08643R275m2531R3695J58601J4048j41206j09351
7319A4711968l2652r5634k2266l3416o4263q7811j29977k84850j65944L909O3264
7308A3862328J0732L1136J91150J05301J5607K48864K80602J40223J78798L39213
$$ plain form
7298 15403954 15616038 15818000 15948843 16165326 16309754 16184147 16165639 16069909 16086488 16109537
7288 16109537 15983344 15921288 15828170 15845155 15847038 15855027 15799793 15904907 15843266 15823325 15635745
7277 15635745 15527053 15326010 14880318 14501049 13912098 13389708 12803200 12400382 12089658
7268 12089658 11793627 11517019 11265194 11112018 11121741 11074765 11094652 10993505 10869590 10857014
7258 10857014 10819337 10781806 10719534 10515088 10347834 10112205 9800178 9517535 9289231 9124514
7248 9124514 8884346 8775813 8798000 8626057 8585504 8571937 8398733 8393530 8340178 8111595 8260228
7237 8260228 8175178 8004191 7840843 7905983 8049141 8051951 8110369 8104954 8116923 8187114 8202349
7226 8202349 8344161 8362867 8398341 8497516 8387506 8402062 8409529 8633937 8763089 8815749 8979622
$$ packed form
7298A5403954K12084K01962J30843K16483J44428j25607j8508r5730J6579K3049
7288A6109537j26193o2056r3118J6985J883P989n5234J05114o1641j9941j87580
7277A5635745j08692k01043m45692l79269n88951n22390n86508m02818l10724
7268A2089658k96031k76608k51825j53176R723m6976J9887j01147j23915j2576
7258A0857014l7677l7531o2272k04446j67254k35629l12027k82643k28304j64717
7248I124514k40168j08533K2187j71943m0553j3567j73204n203n3352k28583J48633
7237H260228q5050j70987j63348O5140J43158K810N8418n415J1969P0191J5235
7226H202349J41812J8706L5474R9175j10010J4556P467K24408J29152N2660J63873
$$ plain form
7215 8979622 9197498 9260759 9367918 9598454 9819780 10005943 10254018 10497435 10873963 11350845
7205 11350845 11729132 12338140 13056771 13736136 14478985 15204587 16287219 17475834 18708291
7196 18708291 20228443 22017034 23804239 25888229 28268471 30624416 33001252 34949031
7188 34949031 36441355 36839783 36465474 35277469 33264204 30876480 28489764 26209312
7180 26209312 24037624 22216160 20453284 18943932 17755991 16784518 15830988 14841187 14043811
7171 14043811 13496928 12744357 12121624 11471477 10760167 10326730 10055849 9749920 9386183
7162 9386183 9001602 8630486 8411109 8321053 8300225 8072975 8002892 7955860 7919944 7967069 7979369
7151 7979369 8037398 8107248 8345194 8504015 8859822 9210096 9707143 10461836 11150534 11718764
$$ packed form
7215H979622K17876O3261J07159K30536K21326J86163K48075K43417L76528M76882
7205A1350845L78287O09008P18631O79365P42849P25602J082632J188615J232457
7196A8708291J520152J788591J787205K083990K380242K355945K376836J947779
7188C4949031J492324L98428l74309j188005k013265k387724k386716k280452
7180B6209312k171688j821464j762876j509352j187941r71473r53530r89801p97376
7171A4043811n46883p52571o22733o50147p11310m33437k70881l05929l63737
7162I386183l84581l71116k19377r0056k0828k27250p0083m7032l5916M7125J2300
7151G979369N8029O9850K37946J58821L55807L50274M97047P54693O88698N68230
$$ plain form
7141 11718764 12366560 12827473 12799094 12568953 11873216 11099289 10225042 9451297 8719120 8137187
7131 8137187 7659516 7176554 6796826 6549422 6224046 5984761 5843998 5779235 5564762 5251373
7121 5251373 5200804 5174989 4950987 4755760 4793977 4652932 4557636 4433134 4507193 4464766 4360990
7110 4360990 4383462 4517409 4558787 4535365 4575248 4462770 4542315 4830405 5072562 5099816 5360645
7099 5360645 5526901 5731390 6058287 6396479 6931681 7501956 8078697 8702405 9469865 10090591
7089 10090591 10580501 10779814 10787192 10429516 9712252 8808297 8068763 7353171 6709418 6206862
7079 6206862 5798674 5298588 4906937 4795420 4453536 4295145 4096238 3905187 3659831 3462359
7069 3462359 3364955 3125915 3012272 2916109 2887729 2770347 2718347 2480460 2374962 2381447 2237030
$$ packed form
7141A1718764O47796M60913k8379k30141o95737p73927q74247p73745p32177n81933
7131H137187m77671m82962l79728k47404l25376k39285j40763o4763k14473l13389
7121E251373n0569k5815k24002j95227L8217j41045r5296j24502P4059m2427j03776
7110D360990K2472J33947M1378k3422L9883j12478P9545K88090K42157K7254K60829
7099E360645J66256K04489L26897L38192N35202N70275N76741O23708P67460O20726
7089A0090591M89910J99313P378l57676p17264r03955p39534p15592o43753n02556
7079F206862m08188n00086l91651j11517l41884j58391j98907j91051k45356j97472
7069C462359r7404k39040j13643r6163k8380j17382n2000k37887j05498O485j44417
$$ plain form
7058 2237030 2105644 1903174 1986124 1960293 1942625 1737737 1722927 1843531 1733634 1589367
7048 1589367 1674147 1762314 1608690 1548529 1480241 1363981 1394586 1463541 1370081 1384143 1307003
7037 1307003 1251882 1315333 1288075 1274188 1198303 1163703 1134466 1060212 1060932 1071180 1174909 1098752
7025 1098752 985738 932056 898325 892543 854932 927036 977068 1019071 992585 982033 953566
7014 953566 851710 850688 679162 738178 741697 721132 766926 852834 695597 568680 762823
7003 762823 882399 833944 747318 738565 712968 639551 686063 809242 711488 567727 568993
6992 568993 504242 436673 460109 442157 391167 349722 515332 594587 461839 420563 399846
6981 399846 447867 408596 370319 560161 417164 342922 297016 385562 318459 264458 154845
$$ packed form
7058B237030j31386k02470Q2950k5831j7668k04888j4810J20604j09897j44267
7048A589367Q4780Q8167j53624o0161o8288j16260L0605O8955r3460J4062p7140
7037A307003n5121O3451k7258j3887p5885l4600k9237p4254P20J0248J03729p6157
7025A098752j13014n3682l3731n782l7611P2104N0032M2003k6486j0552k8467
7014I53566j01856j022j71526N9016L519k0565M5794Q5908j57237j26917J94143
7003G62823J19576m8455q6626q753k5597p3417M6512J23179r7754j43761J266
6992E68993o4751o7569K3436j7952n0990m1445J65610P9255j32748m1276k0717
6981C99846M8021l9271l8277J89842j42997p4242m5906Q8546o7103n4001j09613
$$ plain form
6970 154845 129890 260306 230063 351299 442488 490921 633165 607308 523932 466311 425801
6959 425801 484833 589119 519259 586268 688004 681120 562451 487952 658497 637186 714485
6948 714485 681951 556695 684888 803739 914699 916560 991012 1076450 1105469 1009184 959854
6937 959854 898680 997724 1177604 1105601 1158276 959832 993248 1056426 1153407 1257268 1235663
6926 1235663 1451976 1495380 1597462 1771516 1758666 1825567 1811083 1669113 1651008 1623860 1536715
6915 1536715 1426792 1447431 1492347 1478523 1317042 1154003 1123367 1199192 1207189 1135481 1142896
6904 1142896 1145200 1118838 1070739 943186 827661 915129 935269 827545 633550 655514 589448
6893 589448 548071 458696 441255 477254 422158 254654 310994 394961 395765 501088 371870
$$ packed form
6970A54845k4955J30416l0243J21236R1189M8433J42244k5857q3376n7621m0510
6959D25801N9032J04286o9860O7009J01736o884j18669p4499J70545k1311P7299
6948G14485l2534j25256J28193J18851J10960J861P4452Q5438K9019r6285m9330
6937I59854o1174R9044J79880p2003N2675j98444L3416O3178R6981J03861k1605
6926A235663K16313M3404J02082J74054j2850O6901j4484j41970j8105k7148q7145
6915A536715j09923K0639M4916j3824j61481j63039l0636P5825P997p1708P415
6904A142896K304k6362m8099j27553j15525Q7468K0140j07724j93995K1964o6066
6893E89448m1377q9375j7441L5999n5096j67504N6340Q3967Q04J05323j29218
$$ plain form
6882 371870 257222 265966 246525 172372 209461 280774 316853 291056 451407 429310 226065
6871 226065 86927 148037 315604 317342 304874 239833 159202 119163 90963 146143 165996
6860 165996 102882 68709 14592 -20809 25111 67841 70814 -69394 -193805 -118089 -153559
6849 -153559 -98901 -116803 -179661 14438 -69629 -159054 -229998 -195976 -159771 -226310 -322298
6838 -322298 -279811 -253126 -352395 -356198 -365486 -248084 -243221 -281641 -334871 -394824 -433032 -364385
6826 -364385 -413332 -395467 -429790 -216915 -151429 -254300 -251120 -248676 -241908 -297867 -280497 -346601
6814 -346601 -334381 -280033 -256001 -223293 -146032 -239935 -293191 -364256 -372876 -215449 -97537
6803 -97537 -101968 -224426 -217350 -269791 -300093 -406495 -500736 -400599 -371332 -405931 -287638
$$ packed form
6882C71870j14648Q744j9441p4153L7089P1313L6079k5797J60351k2097k03245
6871B26065j39138O1110J67567J738j2468o5041q0631m0039k8200N5180J9853
6860A65996o3114l4173n4117l5401M5920M2730K973j40208j24411P5716l5470
6849a53559N4658j7902o2858J94099q4067q9425p0944L4022L6205o6539r5988
6838c22298M2487K6685r9269l803r288J17402M863l8420n3230n9953l8208O8647
6826c64385m8947J7865l4323K12875O5486j02871L180K444O768n5959J7370o6104
6814c46601J2220N4348K4032L2708P7261r3903n3256p1065q620J57427J17912
6803i7537m431j22458P076n2441l0302j06402r4241J00137K9267l4599J18293
$$ plain form
6792 -287638 -263005 -236072 -221312 -234508 -211447 -346714 -201596 -174898 -217365 -296058 -329583
6781 -329583 -385174 -352997 -143769 -172018 -293978 -395552 -437557 -373078 -294983 -251961 -210767
6770 -210767 -124195 -73048 -199690 -288231 -171214 -215019 -286272 -335555 -350666 -292054 -260904
6759 -260904 -243961 -292622 -233616 -236432 -380981 -405911 -258759 -216211 -131457 -216375 -179410
6748 -179410 -145547 -140295 -157558 -230304 -238446 -206949 -173585 -286704 -202264 -155495 -60375 -161655
6736 -161655 -156337 -201396 -299256 -266139 -217597 -238978 -260892 -237776 -193569 -132695 -274852 -351727
6724 -351727 -381360 -384944 -320153 -293465 -251375 -354953 -296451 -249652 -269156 -136181 -172555
6713 -172555 -233286 -205741 -228718 -171719 -194020 -238946 -226071 -166102 -155225 -168881 -106577 -113022
$$ packed form
6792b87638K4633K6933J4760j3196K3061j35267J45118K6698m2467p8693l3525
6781c29583n5591L2177K09228k8249j21960j01574m2005O4479P8095M3022M1194
6770b10767Q6572N1147j26642q8541J17017m3805p1253m9283j5111N8612L1150
6759b60904J6943m8661N9006k816j44549k4930J47152M2548Q4754q4918L6965
6748a79410L3863N252j7263p2746q142L1497L3364j13119Q4440M6769R5120j01280
6736a61655N318m5059r7860L3117M8542k1381k1914K3116M4207O0874j42157p6875
6724c51727k9633l584O4791K6688M2090j03578N8502M6799j9504J32975l6374
6713a72555o0731K7545k2977N6999k2301m4926J2875N9969J0877j3656O2304o445
$$ plain form
6701 -113022 -240440 -315333 -276872 -149255 -147043 -208345 -191079 -228034 -309964 -316339 -271447 -292061
6689 -292061 -266041 -119880 -109433 -66135 45849 -84814 -79789 -142476 -176189 -66197 -121009
6678 -121009 -58337 -61006 -45573 25694 62215 120932 10846 18282 -2814 98816 60813 59084
6666 59084 162787 250497 198037 152259 141010 142361 202208 277801 294248 225205 364251 363683
6654 363683 270894 237815 283664 329506 377086 510711 491133 575604 528008 508186 496137
6643 496137 605806 753927 765264 721480 707817 713280 754938 955980 1121220 1259525 1257004
6632 1257004 1176494 1144428 1213990 1436534 1471348 1355655 1496968 1621650 1741897 1868238
6622 1868238 1873969 1878370 1988218 2105251 2484822 2701369 2734458 2953167 3092785 3512518
$$ packed form
6701a13022j27418p4893L8461J27617K212o1302J7266l6955q1930o375M4892k0614
6689b92061K6020J46161J0447M3298J11984j30663N025o2687l3713J09992n4812
6678a21009O2672k669J5433P1267L6521N8717j10086P436k1096J01630l8003j729
6666E9084J03703Q7710n2460m5778j1249J351N9847P5593J6447o9043J39046n68
6654C63683r2789l3079M5849M5842M7580J33625j9578Q4471m7596j9822j2049
6643D96137J09669J48121J1337m3784j3663N463M1658K01042J65240J38305k521
6632A257004q0510l2066O9562K22544L4814j15693J41313J24682J20247J26341
6622A868238N731M401J09848J17033L79571K16547L3089K18709J39618M19733
$$ plain form
6612 3512518 3830939 4119008 4315718 4575970 4989103 5555147 6017941 6517110 7032171 7624404
6602 7624404 8412416 9184705 10030248 10988835 12157552 13517703 15142434 16654140 18117322
6593 18117322 19428240 20253841 20391396 19984329 19108966 18196223 17482077 16808904 16310716
6584 16310716 15919630 15645002 15614875 15774410 16154851 16703628 17290868 17885947 18611498 19127164
6574 19127164 19449003 19472270 19274833 18665851 17910654 17357737 16761020 16339125 15959131 15739912
6564 15739912 15571458 15508618 15548375 15671476 15780651 15612949 15850389 15975716 16007942 16192891
6554 16192891 16249411 16027370 15686501 15364535 15177450 14945656 14601079 14405293 14283682 14270194
6544 14270194 14333786 14277925 14306914 14240325 14029496 13679626 13283403 12855093 12514595 12179989
$$ packed form
6612C512518L18421K88069J96710K60252M13133N66044M62794M99169N15061N92233
6602G624404P88012P72289Q45543R58587J168717J360151J624731J511706J463182
6593A8117322J310918Q25601J37555m07067q75363r12743p14146o73173m98188
6584A6310716l91086k74628l0127J59535L80441N48777N87240N95079P25551N15666
6574A9127164L21839K3267j97437o08982p55197n52917n96717m21895l79994k19219
6564A5739912j68454o2840L9757J23101J09175j67702K37440J25327L2226J84949
6554A6192891N6520k22041l40869l21966j87085k31794l44577j95786j21611j3488
6544A4270194O3592n5861K8989o6589k10829l49870l96223m28310l40498l34606
$$ plain form
6534 12179989 11814156 11475962 11303058 10914718 10550421 10304042 9738729 9122485 8575178
6525 8575178 8164268 7644741 7099822 6705010 6412953 5999881 5817986 5611663 5291886 5085725
6515 5085725 4851958 4719290 4607001 4492145 4209582 3944197 3879204 3663617 3542774 3608150
6505 3608150 3534583 3341859 3440243 3384050 3308457 3226153 3110832 3012807 3041675 3086680 2983060
6494 2983060 2845582 2817201 2829514 2753368 2609419 2773347 2861480 2673292 2673946 2682901 2759711
6483 2759711 2628274 2531067 2673275 2596960 2453408 2598379 2501458 2423447 2456230 2508715 2418748
6472 2418748 2453417 2539988 2511247 2463206 2398158 2455117 2366562 2316311 2263181 2257494 2211091 2280909
6460 2280909 2339362 2375182 2331456 2227445 2175476 2156234 2139784 2207268 2164117 1968766 1936120
$$ packed form
6534A2179989l65833l38194j72904l88340l64297k46379n65313o16244n47307
6525H575178m10910n19527n44919l94812k92057m13072j81895k06323l19777k06161
6515E085725k33767j32668j12289j14856k82563k65385o4993k15587j20843O5376
6505C608150p3567j92724R8384n6193p5593q2304j15321r8025K8868M5005j03620
6494B983060j37478k8381J2313p6146j43949J63928Q8133j88188O54Q955P6810
6483B759711j31437r7207J42208p6315j43552J44971r6921p8011L2783N2485q9967
6472B418748L4669Q6571k8741m8041o5048N6959q8555n0251n3130n687m6403O9818
6460B280909N8453L5820m3726j04011n1969j9242j6450O7484m3151j95351l2646
$$ plain form
6449 1936120 1962346 1848627 1757733 1740321 1812337 1603984 1400545 1422623 1536074 1529721 1562920
6438 1562920 1516551 1503207 1418183 1401571 1573399 1500888 1509140 1519014 1584026 1494053 1404651 1311155
6426 1311155 1190239 1385072 1446639 1411401 1383823 1322519 1441303 1415165 1304551 1396176 1330435
6415 1330435 1260622 1381175 1415108 1365932 1358538 1382994 1393278 1241275 1126291 1235183 1313554
6404 1313554 1186145 1137450 1275462 1241336 1102507 1098863 1178288 1231689 1299185 1374939 1385723
6393 1385723 1338917 1356514 1462504 1514806 1532782 1526492 1491492 1452987 1477452 1603336 1591258
6382 1591258 1490410 1547333 1706456 1613289 1610789 1701438 1827910 1807195 1787532 1847150 1993912
6371 1993912 1941122 2082037 1929131 1922100 1943616 2020936 2087012 2063864 2053894 1974758 2247388
$$ packed form
6449A936120K6226j13719r0894j7412P2016k08353k03439K2078J13451o353L3199
6438A562920m6369j3344q5024j6612J71828p2511Q252R874O5012q9973q9402r3496
6426A311155j20916J94833O1567l5238k7578o1304J18784k6138j10614R1625o5741
6415A330435o9813J20553L3933m9176p394K4456J0284j52003j14984J08892P8371
6404A313554j27409m8695J38012l4126j38829l644P9425N3401O7496P5754J0784
6393A385723m6806J7597J05990N2302J7976o290l5000l8505K4465J25884j2078
6382A591258j00848N6923J59123r3167k500R0649J26472k0715j9663N9618J46762
6371A993912n2790J40915j52906p031K1516P7320O6076k3148r970p9136K72630
$$ plain form
6360 2247388 2162468 2131211 2158961 2182340 2254878 2211044 2303063 2419577 2401103 2621097 2820905
6349 2820905 2833867 2896854 3158364 3161113 3157939 3302892 3333324 3306776 3316292 3235531 3097663
6338 3097663 3161998 3254520 3270173 3287677 3316424 3264856 3404777 3503727 3625289 3744825 3836484
6327 3836484 3937802 3919475 4184899 4351420 4354877 4458625 4570349 4869210 5103730 5192663
6317 5192663 5403208 5489124 5638148 5899760 6086829 6274552 6190465 6378453 6543866 6778885
6307 6778885 6930414 7085343 7362556 7675640 8039525 8427542 8944608 9224217 9635269 10009309
6297 10009309 10389800 10802423 11283497 12078097 12850690 13420631 14192923 14824521 15444687
6288 15444687 15674982 15807412 15861002 16073435 16397562 16628686 16990044 17256254 17516675 17885024
$$ packed form
6360B247388q4920l1257K7750K3379P2538m3834R2019J16514j8474K19994J99808
6349B820905J2962O2987K61510K749l174J44953L0432k6548R516q0761j37868
6338C097663O4335R2522J5653J7504K8747n1568J39921R8950J21562J19536R1659
6327C836484J01318j8327K65424J66521L457J03748J11724K98861K34520Q8933
6317E192663K10545Q5916J49024K61612J87069J87723q4087J87988J65413K35019
6307F778885J51529J54929K77213L13084L63885L88017N17066K79609M11052L74040
6297A0009309L80491M12623M81074P94600P72593N69941P72292O31598O20166
6288A5444687K30295J32430N3590K12433L24127K31124L61358K66210K60421L68349
$$ plain form
6278 17885024 18295263 18685978 19056276 19450976 19944171 20477919 20991762 21762379 22328822
6269 22328822 22541758 22485269 22336108 22199152 22210704 22372359 22617571 22815713 22656901 22433990
6259 22433990 22183014 22058053 21820332 21684274 21864487 22076735 22316784 22426300 22346407 22477046
6249 22477046 22464773 22126078 21773328 21271531 20810474 20482981 20369080 20136366 19471494 19005058
6239 19005058 18455874 17863235 17214401 16705862 16446987 16182970 15839141 15572417 15462126
6230 15462126 15268030 15190232 15048403 14937439 14808427 14920156 14853790 14840899 14934211 14752034
6220 14752034 14850771 15027937 14981593 14989841 15024276 14991845 15120509 15168086 15118282 15101214 15244957
6209 15244957 15354725 15555680 15700292 15956006 16228064 16635211 16848261 17178143 17481892
$$ packed form
6278A7885024M10239L90715L70298L94700M93195N33748N13843P70617N66443
6269B2328822K12936n6489j49161j36956J1552J61655K45212J98142j58812k22911
6259B2433990k50976j24961k37721j36058J80213K12248K40049J09516p9893J30639
6249B2477046j2273l38695l52750n01797m61057l27493j13901k32714o64872m66436
6239A9005058n49184n92639o48834n08539k58875k64017l43829k66724j10291
6230A5462126j94096p7798j41829j10964j29012J11729o6366j2891R3312j82177
6220A4752034R8737J77166m6344Q248L4435l2431J28664M7577m9804j7068J43743
6209A5244957J09768K00955J44612K55714K72058M07147K13050L29882L03749
$$ plain form
6200 17481892 17688864 17978050 18129169 18301014 18566339 18890313 19343398 19939246 20694939
6191 20694939 21458498 22392155 23326719 24182741 25387158 26256834 27381003 28633473 30028968
6182 30028968 31546910 33205944 35275839 37759947 40453110 43633797 47060874 50597285
6174 50597285 54279719 57452828 59992812 61366139 61801672 61652909 61428808 61524943 62100238
6165 62100238 63316907 65480897 68343836 72099369 76638449 81909897 87614407 93636946
6157 93636946 99504499 104122303 106854244 107933633 109274817 111579104 115556829 120929809
6149 120929809 127083291 133440979 138709000 141695971 141823700 139132607 134048193 128301765
6141 128301765 123382852 120429302 119306206 119382245 119772436 119226964 117256512 114114208 111006002
$$ packed form
6200A7481892K06972K89186J51119J71845K65325L23974M53085N95848P55693
6191B0694939P63559R33657R34564Q56022J204417Q69676J124169J252470J395495
6182C0028968J517942J659034K069895K484108K693163L180687L427077L536411
6174E0597285L682434L173109K539984J373327M35533j48763k24101R6135N75295
6165F2100238J216669K163990K862939L755533M539080N271448N704510O022539
6157I3636946N867553M617804K731941J079389J341184K304287L977725N372980
6149A20929809O153482O357688N268021K986971J27729k691093n084414n746428
6141A28301765m918913k953550j123096P6039L90191n45472j970452l142304l108206
$$ plain form
6132 111006002 108784406 107896173 108206887 109393904 111190872 112713615 112958189 112547356 112371872
6123 112371872 112640531 113019512 113058153 112391037 110994241 109537244 107787706 104565602 99124245
6114 99124245 91595321 83545380 76292705 70182074 65174461 61120255 57527281 54681701
6106 54681701 52119589 49621928 47574944 45527324 43664307 42208739 41004810 39656677
6098 39656677 38364293 37267701 36446930 35627752 34822743 34079010 33426016 32897378 32382059
6089 32382059 31802086 31209595 30697248 30038077 29684258 29426960 28780713 28342505 27814894
6080 27814894 27346628 27059132 26383306 25935470 25520866 24959319 24477804 24065895 23921168
6071 23921168 23529102 23167946 22865371 22503898 22259973 21901114 21863839 21621815 21369695 21086351
$$ packed form
6132A11006002k221596q88233L10714J187017J796968J522743K44574m10833j75484
6123A12371872K68659L78981L8641o67116j396796j456997j749538l222104n441357
6114I9124245p528924q049941p252675o110631n007613m054206l592974k845580
6106E4681701k562112k497661k046984k047620j863017j455568j203929j348133
6098C9656677j292384j096592q20771q19178q05009p43733o52994n28638n15319
6089C2382059n79973n92491n12347o59171l53819k57298o46247m38208n27611
6080B7814894m68266k87496o75826m47836m14604n61547m81515m11909j44727
6071B3921168l92066l61156l02575l61473k43925l58859l7275k42024k52120k83344
$$ plain form
6061 21086351 20791481 20745110 20562193 20414642 20316570 20207716 20226600 20169474 20087709 20187033
6051 20187033 20071406 20108232 20182948 19899697 19491881 19182046 18843546 18514773 18292586 17920420
6041 17920420 17476881 17353968 17201698 17124191 17087741 17085983 17085122 17085923 17024686 17136681 17285860
6030 17285860 17347251 17357398 17438180 17501203 17361437 17243661 17107731 17102366 17037016 16962874 16791663
6019 16791663 16476439 16408523 16377600 16153957 15822156 15432299 15003476 14799887 14592391 14472618
6009 14472618 14315219 14258930 14213844 14192766 14205575 14085853 14064106 14021497 14024952 13824690 13700892
5998 13700892 13702521 13714055 13479889 13424236 13398057 13212854 13103266 12969444 12829612 12816232
5988 12816232 12815776 12722773 12724102 12748871 12602612 12476843 12235105 12101062 11953989 11786022 11719701
$$ packed form
6061B1086351k94870m6371j82917j47551r8072j08854J8884n7126q1765R9324
6051B0187033j15627L6826P4716k83251m07816l09835l38500l28773k22187l72166
6041A7920420m43539j22913j52270p7507l6450j758q61Q01o1237J11995J49179
6030A7285860O1391J0147Q0782O3023j39766j17776j35930n365o5350p4142j71211
6019A6791663l15224o7916l0923k23643l31801l89857m28823k03589k07496j19773
6009A4472618j57399n6289m5086k1078J2809j19722k1747m2609L455k00262j23798
5998A3700892J629J1534k34166n5653k6179j85203j09588j33822j39832j3380
5988A2816232m56r3003J329K4769j46259j25769k41738j34043j47073j67967o6321
$$ plain form
5977 11719701 11565929 11383668 11122357 10867774 10740595 10533315 10475198 10258003 10249171 10091896
5967 10091896 9860657 9815656 9852404 9837120 9781697 9657019 9523570 9213225 9145489 9093692
5957 9093692 8809964 8769665 8692531 8489363 8309461 8371434 8353926 8175891 8061820 8045758
5947 8045758 8011696 7873700 7693623 7598882 7368934 7204307 7053069 7142739 7118102 7141286
5937 7141286 7164812 7142716 6970897 7058838 6897657 6752453 6730404 6703800 6788148 6669413 6553120
5926 6553120 6608290 6515181 6540161 6441380 6333982 6239245 6094644 6171152 6168756 6122530 6072278
5915 6072278 6069509 6057981 5962771 5780502 5904303 5879819 5724920 5781920 5719646 5573093 5612965
5904 5612965 5611038 5468312 5455721 5467557 5505515 5517669 5331037 5368108 5417910 5279006 5108866
$$ packed form
5977A1719701j53772j82261k61311k54583j27179k07280n8117k17195q832j57275
5967A0091896k31239m5001L6748j5284n5423j24678j33449l10345o7736n1797
5957I093692k83728m0299p7134k03168j79902O1973j7508j78035j14071j6062
5947H045758l4062j37996j80077r4741k29948j64627j51238Q9670k4637K3184
5937G141286K3526k2096j71819Q7941j61181j45204k2049k6604Q4348j18735j16293
5926F553120N5170r3109K4980r8781j07398r4737j44601P6508k396m6226n0252
5915F072278k769j1528r5210j82269J23801k4484j54899N7000o2274j46553L9872
5904E612965j927j42726j2591J1836L7958J2154j86632L7071M9802j38904j70140
$$ plain form
5893 5108866 4939844 5053826 5082239 5149133 5061078 5019977 5060676 5099197 5210226 5245168 5277899
5882 5277899 5205293 5154552 5231315 5214453 5250313 5369356 5311589 5356868 5283894 5296856 5408477
5871 5408477 5432907 5399498 5396661 5427484 5523542 5599175 5719997 5725582 5515969 5610060 5741376
5860 5741376 5718802 5746256 5745697 5794741 5859523 5952928 5758409 5654143 5800376 5857935 5767072
5849 5767072 5775828 5813685 5808765 5877044 5954256 5908626 6078223 6047611 6045890 6200967 6298785 6427480
5837 6427480 6434783 6614267 6664839 6656422 6593269 6610683 6714084 6685339 6735775 6749016 6885978
5826 6885978 7051004 7109681 7262609 7285955 7336927 7459217 7490502 7673658 7706749 7733560 7904241
5815 7904241 8013309 8133042 8358170 8490521 8731986 8897415 8956937 9131141 9312962 9423916
$$ packed form
5893E108866j69022J13982K8413O6894q8055m1101M0699L8521J11029L4942L2731
5882E277899p2606n0741P6763j6862L5860J19043n7767M5279p2974J2962J11621
5871E408477K4430l3409k837L0823R6058P5633J20822N585k09613R4091J31316
5860E741376k2574K7454n59M9044O4782R3405j94519j04266J46233N7559r0863
5849E767072Q756L7857m920O8279P7212m5630J69597l0612j721J55077R7818J28695
5837F427480P303J79484N0572q417o3153J7414J03401k8745N0436J3241J36962
5826F885978J65026N8677J52928K3346N0972J22290L1285J83156L3091K6811J70681
5815G904241J09068J19733K25128J32351K41465J65429N9522J74204J81821J10954
$$ plain form
5805 9423916 9688616 9942358 10063003 10194441 10484871 10825556 11005459 11218065 11536472 11934007
5795 11934007 12258806 12655368 12861765 13196838 13457658 13824963 14019211 14177598 14564877
5786 14564877 14740128 14914819 15196319 15508787 15756069 16026246 16462039 16861257 17260072
5777 17260072 17774709 18347110 18922966 19367647 19848213 20553496 21189558 21867003 22587215
5768 22587215 23235426 24014143 24775901 25455239 26181869 26960217 27820154 28741237 29618187
5759 29618187 30679327 31788971 33214835 34503179 35899786 37713706 39442576 41304487
5751 41304487 43424820 45984700 48797087 51793581 55228814 59125074 63487653 68059594
5743 68059594 72645210 76638091 79658135 81132083 80723372 78995504 76551039 74240459
$$ packed form
5805I423916K64700K53742J20645J31438K90430L40685J79903K12606L18407L97535
5795A1934007L24799L96562K06397L35073K60820L67305J94248J58387L87279
5786A4564877J75251J74691K81500L12468K47282K70177M35793L99218L98815
5777A7260072N14637N72401N75856M44681M80566P05283O36062O77445P20212
5768B2587215O48211P78717P61758O79338P26630P78348Q59937R21083Q76950
5759B9618187J061140J109644J425864J288344J396607J813920J728870J861911
5751D1304487K120333K559880K812387K996494L435233L896260M362579M571941
5743F8059594M585616L992881L020044J473948m08711j727868k444465k310580
$$ plain form
5735 74240459 72395284 71131997 70563631 70709262 71375290 72520437 74033677 75972484 78358929
5726 78358929 81034937 84304982 88227477 92835218 98424850 105009811 112231895 119948442
5718 119948442 127570960 134085662 138020458 138186057 135010564 129771327 124691414 120183761
5710 120183761 116778563 114494364 113344475 113251110 114214824 116070210 118456430 121422776
5702 121422776 124939535 128761568 132738350 137208326 141746261 146329251 151214557 156602411
5694 156602411 162686891 169321469 176149756 182672924 188302327 193028264 196879345 200266543
5686 200266543 203961370 207642412 211143648 213652089 214190204 212139236 207513869 201486915
5678 201486915 194559641 187351395 179998070 172376363 164375371 156427680 148729970 141464909
$$ packed form
5735G4240459j845175j263287n68366J45631O66028J145147J513240J938807K386445
5726G8358929K676008L270045L922495M607741N589632O584961P222084P716547
5718A19948442P622518O514702L934796J65599l175493n239237n079913m507653
5710A20183761l405198k284199j149889r3365R63714J855386K386220K966346
5702A21422776L516759L822033L976782M469976M537935M582990M885306N387854
5694A56602411O084480O634578O828287O523168N629403M725937L851081L387198
5686B00266543L694827L681042L501236K508441N38115k050968m625367o026954
5678B01486915o927274p208246p353325p621707q000992p947691p697710p265061
$$ plain form
5670 141464909 134799573 128661743 122915598 117762960 112956684 108820496 105406172 102447832
5662 102447832 99920742 97735711 95852246 94139628 92656408 91063832 89592204 88241654
5654 88241654 86964126 85710867 84519022 83212841 81679541 79789487 77602486 75420314
5646 75420314 73377334 71418377 69466969 67518314 65695588 64205830 62679517 61302923
5638 61302923 60100896 59035924 58186515 57325928 56642485 55863241 55040262 54360982 53721909
5629 53721909 53290142 52808004 52217296 51546132 51047924 50689079 50339855 50063246 49793272
5620 49793272 49421581 49196666 48975901 48847936 48726566 48570411 48505029 48256522 47818982 47284135
5610 47284135 46646132 46132188 45832787 45477319 45294151 45087773 44834245 44544039 44111477
$$ packed form
5670A41464909o665336o137830n746145n152638m806276m136188l414324k958340
5662A02447832k527090k185031j883465j712618j483220j592576j471628j350550
5654H8241654j277528j253259j191845j306181j533300j890054k187001k182172
5646G5420314k042980j958957j951408j948655j822726j489758j526313j376594
5638F1302923j202027j064972q49409q60587o83443p79244q22979o79280o39073
5629E3721909m31767m82138n90708o71164m98208l58845l49224k76609k69974
5620D9793272l71691k24915k20765j27965j21370j56155o5382k48507m37540n34847
5610D7284135o38003n13944k99401l55468j83168k06378k53528k90206m32562
$$ plain form
5601 44111477 43816288 43637340 43159495 42669667 42503420 42354335 42200179 41995484 41924079 42034254
5591 42034254 42123544 42130302 42330246 42591646 42777192 43044525 43562015 43974156 44405685 44796811
5581 44796811 45151133 45369356 45649043 45758737 45968914 46369105 46759874 47329152 48031448
5572 48031448 49091626 50252972 51521231 52971940 54700344 56765942 59054729 61599534
5564 61599534 64557186 68233471 72509558 77283099 82228544 86963258 90731266 92576033
5556 92576033 91846030 88907006 85511325 82951276 81489290 81268704 82063935 83831650 86410944
5547 86410944 89033460 91526373 92839460 93155936 93166199 93714649 94997401 97079758 99397929
5538 99397929 101311521 102073318 101201931 98996979 96271049 94052948 92575949 91712922 90737056
$$ packed form
5601D4111477k95189j78948m77845m89828j66247j49085j54156k04695p1405J10175
5591D2034254Q9290O758J99944K61400J85546K67333N17490M12141M31529L91126
5581D4796811L54322K18223K79687J09694K10177M00191L90769N69278P02296
5572D8031448J060178J161346J268259J450709J728404K065598K288787K544805
5564F1599534K957652L676285M276087M773541M945445M734714L768008J844767
5556I2576033p30003k939024l395681k560049j461986k20586P95231J767715K579294
5547H6410944K622516K492913J313087L16476J0263N48450J282752K082357K318171
5538I9397929J913592P61797q71387k204952k725930k218101j476999q63027r75866
$$ plain form
5529 90737056 89054005 86349753 82740273 79577066 77462945 76427600 76376497 77006307 78436622
5520 78436622 80274863 81915613 82984617 81971014 78627150 73435060 67764436 62518130
5512 62518130 58046556 54351870 51446003 49101046 47026503 45184811 43596942 42337266
5504 42337266 41090395 40005204 39048331 38117201 37351923 36754158 36100934 35470496 34878463
5495 34878463 34240716 33649528 33086730 32529616 32163237 31791736 31277885 30647805 30053236
5486 30053236 29469411 29106339 28835180 28356707 28124200 27908791 27655722 27511400 27279929
5477 27279929 27074435 26821950 26587014 26424410 26150193 25995463 25837838 25750241 25598872 25306861
5467 25306861 25259045 25082396 24929843 24772810 24595283 24464873 24389846 24233803 24047118 23943183
$$ packed form
5529I0737056j683051k704252l609480l163207k114121j035345n1103O29810J430315
5520G8436622J838241J640750J069004j013603l343864n192090n670624n246306
5512F2518130m471574l694686k905867k344957k074543j841692j587869j259676
5504D2337266j246871j085191r56873r31130p65278n97765o53224o30438n92033
5495C4878463o37747n91188n62798n57114l66379l71501n13851o30080n94569
5486C0053236n83825l63072k71159m78473k32507k15409k53069j44322k31471
5477B7279929k05494k52485k34936j62604k74217j54730j57625q7597j51369k92011
5467B5306861m7816j76649j52553j57033j77527j30410p5027j56043j86685j03935
$$ plain form
5457 23943183 23814884 23625918 23431690 23251235 23151793 22977427 22937146 22697230 22487571 22284003
5447 22284003 22163185 22048176 21771289 21567092 21237755 21098525 20992597 20769201 20549709
5438 20549709 20313705 20083281 19855568 19639589 19433811 19341923 19120418 18863005 18685432 18488179
5428 18488179 18265892 18106116 18037353 17957161 17711512 17649282 17597553 17402495 17298271 17292904
5418 17292904 17121869 16942847 16901880 16732765 16485981 16301669 16168391 15939817 15715720 15590712
5408 15590712 15429230 15546634 15305921 15173179 15068202 14988656 14964686 14869038 14708517 14532973
5398 14532973 14351044 14187503 14246573 14104156 13985113 13997017 13898464 13812714 13890369 13666134
5388 13666134 13575742 13452295 13405688 13342566 13215085 13083637 12976743 13039396 12868360 12854902
$$ packed form
5457B3943183j28299j88966j94228j80455r9442j74366m0281k39916k09659k03568
5447B2284003j20818j15009k76887k04197l29337j39230j05928k23396k19492
5438B0549709k36004k30424k27713k15979k05778r1888k21505k57413j77573j97253
5428A8488179k22287j59776o8763q0192k45649o2230n1729j95058j04224n367
5418A7292904j71035j79022m0967j69115k46784j84312j33278k28574k24097j25008
5408A5590712j61482J17404k40713j32742j04977p9546k3970r5648j60521j75544
5398A4532973j81929j63541N9070j42417j19043J1904r8553q5750P7655k24235
5388A3666134r0392j23447m6607o3122j27481j31448j06894O2653j71036j3458
$$ plain form
5378 12854902 12659951 12722850 12778545 12647722 12512872 12393020 12274313 12165883 12134428 12158668
5368 12158668 12111675 11905360 11906651 11899661 11851443 11683696 11691537 11656612 11640922 11492040 11407543
5357 11407543 11412038 11380875 11114640 11048010 11065488 10995540 10928614 10845635 10812469 10685947 10711991
5346 10711991 10757624 10602845 10681501 10683041 10645354 10596302 10577877 10529030 10503899 10544290 10605155
5335 10605155 10502400 10492553 10649146 10759539 10760732 10725378 10770135 10773271 10668069 10602229 10436406
5324 10436406 10283935 10257105 10187280 10107124 10088671 10143532 10131184 10046450 10016221 9998652 9971192
5313 9971192 9921184 9965529 10056260 10110187 10256423 10362299 10316479 10438814 10448926 10598270 10886068
5302 10886068 10972535 11080834 11125520 11068640 11211287 11327675 11323332 11271853 11286110 11274962 11256266
$$ packed form
5378A2854902j94951O2899N5695j30823j34850j19852j18707j08430l1455K4240
5368A2158668m6993k06315J291o990m8218j67747P841l4925j5690j48882q4497
5357A1407543M495l1163k66235o6630J7478o9948o6926q2979l3166j26522K6044
5346A0711991M5633j54779P8656J540l7687m9052j8425m8847k5131M0391O0865
5335A0605155j02755r847J56593J10393J193l5354M4757L136j05202o5840j65823
5324A0436406j52471k6830o9825q0156j8453N4861j2348q4734l0229j7569k7460
5313I971192n0008M4345R0731N3927J46236J05876m5820J22335J0112J49344K87798
5302A0886068Q6467J08299M4686n6880J42647J16388m343n1479J4257j1148j8696
$$ plain form
5291 11256266 11212279 10997273 11026871 11211218 11353975 11356550 11265744 11316084 11532714 11569193 11564840
5280 11564840 11653055 11691682 11533423 11585620 11698637 11606131 11525209 11602507 11528088 11687434 11864721
5269 11864721 11808518 11887015 11969231 11969115 12009751 12102689 12016079 11983240 12106202 12255018 12081749
5258 12081749 12051193 12173513 11936175 11998928 12115883 12080148 12089056 12044851 11982728 11933586 11836670
5247 11836670 11934126 12003765 11929172 11876581 11991723 12004395 12143011 12148845 12034097 11934939 11930976
5236 11930976 12037378 12043295 12019141 12032563 12103010 12161339 11929344 12010122 12073657 12040753 12132055
5225 12132055 12071465 11980187 11977271 12015215 12008562 11994650 12189821 12336023 12407851 12348797 12313358
5214 12313358 12457461 12520108 12552527 12598391 12724888 12700068 12552344 12543261 12548071 12580666 12532135
$$ packed form
5291A1256266m3987k15006K9598J84347J42757K575r0806N0340K16630L6479m353
5280A1564840Q8215L8627j58259N2197J13017r2506q0922P7298p4419J59346J77287
5269A1864721n6203P8497Q2216j16M0636R2938q6610l2839J22962J48816j73269
5258A2081749l0556J22320k37338O2753J16955l5735Q908m4205o2123m9142r6916
5247A1836670R7456O9639p4593n2591J15142J2672J38616N834j14748r9158l963
5236A1930976J06402N917k4154J3422P0447N8329k31995Q0778O3535l2904R1302
5225A2132055o0590r1278k916L7944o653j3912J95171J46202P1828n9054l5439
5214A2313358J44103O2647L2419M5864J26497k4820j47724r083M810L2595m8531
$$ plain form
5203 12532135 12677882 12734683 12652525 12759793 12781436 12603508 12561554 12612025 12441876 12577754
5193 12577754 12652970 12725194 12814016 12912869 12872418 12912322 13105957 13129399 13145583 13245629 13313688
5182 13313688 13362379 13445989 13568185 13682618 13947903 14213830 14376724 14389824 14715006 14974910
5172 14974910 15131729 15198561 15069137 14984212 14813602 14565107 14726574 14880565 15012807 15085285
5162 15085285 14951127 15036980 15215017 15193644 15306169 15657477 15680905 15770260 15916283 16077239
5152 16077239 16107039 16248245 16417995 16500835 16607417 16920934 17132949 17263873 17422667 17467479
5142 17467479 17629175 17809948 18099695 18425469 18625808 18816615 19070851 19215685 19436254
5133 19436254 19724676 19948127 20278034 20695177 20932810 21193242 21295375 21416994 21532084
$$ packed form
5203A2532135J45747N6801q2158J07268K1643j77928m1954N0471j70149J35878
5193A2577754P5216P2224Q8822R8853m0451L9904J93635K3442J6184J00046O8059
5182A3313688M8691Q3610J22196J14433K65285K65927J62894J3100L25182K59904
5172A4974910J56819O6832j29424q4925j70610k48495J61467J53991J32242P2478
5162A5085285j34158Q5853J78037k1373J12525L51308K3428Q9355J46023J60956
5152A6077239K9800J41206J69750Q2840J06582L13517K12015J30924J58794M4812
5142A7467479J61696J80773K89747L25774K00339J90807K54236J44834K20569
5133A9436254K88422K23451L29907M17143K37633K60432J02133J21619J15090
$$ plain form
5124 21532084 21820945 22134760 22435925 22740997 23029660 23374109 23867491 24454255 25328548
5115 25328548 26326997 27319921 28313544 29078302 29593726 29354910 28857831 28488754 28507492 28768687
5105 28768687 29002911 29676189 30552466 31290777 32233123 33365281 34594821 35967209 37836134
5096 37836134 40136323 42862746 45934947 49364516 53063777 56442326 57555234 54364879
5088 54364879 49404381 45353252 42423823 40078347 38414667 37122372 36159935 35668888
5080 35668888 35220732 34973751 35019892 35096561 35261889 35552037 35875830 36184346 36682153 37018123
5070 37018123 37191030 37634818 37714233 37843225 38122333 38581821 39038572 39562876 40165948 40686156
5060 40686156 41038587 41397966 41469426 41426722 41108268 40472635 39757712 39015940 38373843 37828448
$$ packed form
5124B1532084K88861L13815L01165L05072K88663L44449M93382N86764Q74293
5115B5328548R98449R92924R93623P64758N15424k38816m97079l69077J8738K61195
5105B8768687K34224O73278Q76277P38311R42346J132158J229540J372388J868925
5096C7836134K300189K726423L072201L429569L699261L378549J112908l190355
5088E4364879m960498m051129k929429k345476j663680j292295r62437m91047
5080C5668888m48156k46981M6141P6669J65328K90148L23793L08516M97807L35970
5070C7018123J72907M43788P9415J28992K79108M59488M56751N24304O03072N20208
5060D0686156L52431L59379P1460m2704l18454o35633p14923p41772o42097n45395
$$ plain form
5050 37828448 37534396 37322763 37059772 36928480 36988145 37098701 37127829 37220592 37387144 37639604
5040 37639604 37590577 37445853 37270476 36915540 36536952 36310773 36393968 36333547 36371636 36478435
5030 36478435 36625737 36897880 37250283 37620124 37974070 38151120 38519184 38635571 38738312
5021 38738312 38989568 39306529 39571230 39833708 40359511 40870519 41229543 41706981 42286030
5012 42286030 42925963 43525869 44285956 45035973 45583437 46340255 47125453 47864997 48713315
5003 48713315 49417699 50237484 51144220 52053452 53011539 53892698 54813369 55700897 56456634
4994 56456634 57215843 58299468 59321661 60646064 62219367 64042745 65933668 68124510
4986 68124510 70730911 73631665 76962089 80536077 84217776 88020319 91882837 96031630
$$ packed form
5050C7828448k94052k11633k62991j31292N9665J10556K9128R2763J66552K52460
5040C7639604m9027j44724j75377l54936l78588k26179Q3195o0421L8089J06799
5030C6478435J47302K72143L52403L69841L53946J77050L68064J16387J02741
5021C8738312K51256L16961K64701K62478N25803N11008L59024M77438N79049
5012D2286030O39933N99906P60087P50017N47464P56818P85198P39544Q48318
5003D8713315P04384Q19785R06736R09232R58087Q81159R20671Q87528P55737
4994E6456634P59209J083625J022193J324403J573303J823378J890923K190842
4986F8124510K606401K900754L330424L573988L681699L802543L862518M148793
$$ plain form
4978 96031630 100241158 104628664 109422622 114668986 120319541 126064349 131577691 136903793
4970 136903793 141763343 144849951 145107561 145122720 146382874 148537877 151456941 154875776
4962 154875776 158740984 162805481 166996413 171198263 175167121 178780419 182101639 184928039
4954 184928039 187513957 189630700 190956595 190815571 189219766 186068553 181568347 175946210
4946 175946210 169522021 163324889 157779102 153162539 149616199 147254201 146054527 145972200
4938 145972200 146601081 147284807 146714113 144506142 140640719 135550921 129960387 124517417
4930 124517417 119680662 115426091 111556063 108256172 105304805 102872980 100834249 98791405
4922 98791405 96937561 95340255 93861299 92688919 91690730 91030720 90652387 90371355 90369425
$$ packed form
4978I6031630M209528M387506M793958N246364N650555N744808N513342N326102
4970A36903793M859550L086608K57610J5159J260154K155003K919064L418835
4962A54875776L865208M064497M190932M201850L968858L613298L321220K826400
4954A84928039K585918K116743J325895j41024j595805l151213m500206n622137
4946A75946210o424189o197132n545787m616563l546340k361998j199674q2327
4938A45972200O28881O83726n70694k207971l865423n089798n590534n442970
4930A24517417m836755m254571l870028l299891k951367k431825k038731k042844
4922I8791405j853844j597306j478956j172380r98189o60010l78333k81032j930
$$ plain form
4913 90369425 90408980 90305472 90075177 89867705 89890692 90146342 90570697 91389746 92719729 94735735
4903 94735735 97296152 100493710 103668777 105608499 104557231 101908510 98811864 96007054
4895 96007054 93755241 91911287 90941385 90684245 90790174 90977730 90777432 90434605 90425758
4886 90425758 90798190 91443955 92391087 93590970 95056506 96646567 98785693 101524537 104620115
4877 104620115 107885460 111811500 115915357 120842132 126209881 132513717 139289170 146759887
4869 146759887 154669935 164040477 174559200 186533534 201065224 220077139 244470148
4862 244470148 274704487 307033908 343830934 381898307 407443101 394408131 345775603
4855 345775603 301120250 268807703 245673164 227895270 214256787 203238170 194021683
$$ packed form
4913I0369425L9555j03508k30295k07472K2987K55650M24355Q19049J329983K016006
4903I4735735K560417L197558L175067J939722j051268k648721l096646k804810
4895I6007054k251813j843954r69902k57140J05929J87556k00298l42827q847
4886I0425758L72432O45765R47132J199883J465536J590061K139126K738844L095578
4877A04620115L265345L926040M103857M926775N367749O303836O775453P470717
4869A46759887P910048R370542J0518723J1974334J4531690J9011915K4393009
4862B44470148L0234339L2329421L6797026L8067373K5544794j3034970m8632528
4855C45775603m4655353l2312547k3134539j7777894j3638483j1018617r216487
$$ plain form
4848 194021683 185983994 178784100 171736277 164789118 157430680 149833167 142523631 135641751
4840 135641751 129364676 123790427 118937747 114919400 111176820 107981114 105187140 102770726
4832 102770726 100166268 97202467 93768334 90261029 87183842 84477093 82360248 80463336
4824 80463336 78622592 77170290 75969798 74666108 73376353 71840119 70364483 68949065
4816 68949065 67502539 66115871 64733049 63423800 62142242 60946127 59951634 58870974
4808 58870974 57708091 56856340 56091807 55276244 54474734 53783508 53210977 52725770 52441610
4799 52441610 52097520 51767138 51637750 51691552 51644701 51803955 52103995 52613153 53223528 54061985
4789 54061985 54957156 55085295 53835748 52312943 50779400 49470298 48344545 47488582 46671306
$$ packed form
4848A94021683q037689p199894p047823o947159p358438p597513p309536o881880
4840A35641751o277075n574249m852680m018347l742580l195706k793974k416414
4832A02770726k604458k963801l434133l507305l077187k706749k116845j896912
4824H0463336j840744j452302j200492j303690j289755j536234j475636j415418
4816F8949065j446526j386668j382822j309249j281558j196115r94493j080660
4808E8870974j162883q51751p64533q15563q01510o91226n72531m85207k84160
4799E2441610l44090l30382j29388N3802m6851J59254L00040N09158O10375Q38457
4789E4061985Q95171J28139j249547j522805j533543j309102j125753q55963q17276
$$ plain form
4780 46671306 45943097 45268883 44800510 44401026 44258257 44134867 43766245 43321006 42919611
4771 42919611 42649793 42407207 42219515 41901364 41717269 41619664 41637126 41567683 41627195 41412373
4761 41412373 41216577 41211784 41141053 41056422 40829759 40580749 40363513 40253339 40082314 40021735
4751 40021735 40053979 40103780 40188964 40329660 40500089 40720745 40934619 41228076 41193682 41296626
4741 41296626 41265635 41247592 41128233 41040564 41077456 41073550 41314501 41461576 41556686 41863918 42137355
4730 42137355 42419203 42770932 43224397 43718255 44211866 44689778 45191009 45739180 46213617
4721 46213617 46892215 47610253 48230696 48844512 49443421 49955229 50520737 51197557 51982679
4712 51982679 52739646 53587563 54389170 55188554 56083292 57213015 58379874 59691059 61103460
$$ packed form
4780D6671306p28209o74214m68373l99484j42769j23390l68622m45239m01395
4771D2919611k69818k42586j87692l18151j84095r7605J7462o9443N9512k14822
4761D1412373j95796m793p0731q4631k26663k49010k17236j10174j71025o0579
4751D0021735L2244M9801Q5184J40696J70429K20656K13874K93457l4394J02944
4741D1296626l0991j8043j19359q7669L6892l906K40951J47075R5110L07232K73437
4730D2137355K81848L51729M53465M93858M93611M77912N01231N48171M74437
4721D6213617O78598P18038O20443O13816N98909N11808N65508O76820P85122
4712E1982679P56967Q47917Q01607P99384Q94738J129723J166859J311185J412401
$$ plain form
4703 61103460 62881187 64704814 66837148 69261487 72055455 75161842 78561262 82318506
4695 82318506 86412751 91027614 96246272 102047193 108381253 115433466 123169374 131860402
4687 131860402 141357249 151469130 162167218 174390742 189014464 207191991 229246471
4680 229246471 254877242 282314008 307291848 321889839 318828418 299787676 274022816
4673 274022816 248932750 227158873 209343442 194939786 183619096 174838898 168146713
4666 168146713 162875749 158519015 154307402 149491161 143919930 138356725 133698837 129932897
4658 129932897 127053184 125068955 123955262 123628245 124207945 125475822 127469610 130034823
4650 130034823 133370221 136579060 138683019 139622971 139238311 138159441 136968702 136245373
$$ packed form
4703F1103460J777727J823627K132334K424339K793968L106387L399420L757244
4695H2318506M094245M614863N218658N800921O334060P052213P735908Q691028
4687A31860402R496847J0111881J0698088J2223524J4623722J8177527K2054480
4680B29246471K5630771K7436766K4977840J4597991l061421j9040742k5764860
4673B74022816k5090066k1773877j7815431j4403656j1320690q780198o692185
4666A68146713n270964m356734m211613m816241n571231n563205m657888l765940
4658A29932897k879713j984229j113693l27017N79700J267877J993788K565213
4650A30034823L335398L208839K103959R39952l84660j078870j190739p23329
$$ plain form
4642 136245373 135834143 135688044 136222786 137321950 138783222 140717860 142984683 145173484
4634 145173484 146989955 147794222 146556776 142754961 137030795 130713840 124764435 119495273
4626 119495273 114732704 110541044 106570639 102973640 99530204 96176946 93198925 90250227
4618 90250227 87635476 85412615 83191487 81246934 79707781 78257166 76981279 75930300
4610 75930300 74874342 73468789 71637092 69621266 67486046 65537166 63901457 62382389
4602 62382389 60917117 59750472 58686932 57738081 57011703 56401949 55678785 54989352 54286356
4593 54286356 53464614 52522803 51350970 50277303 49092297 48263087 47506862 46792621 46124806
4584 46124806 45711384 45273366 44962395 44675955 44416436 44296048 44035321 43886291 43366744
$$ packed form
4642A36245373m11230j46099N34742J099164J461272J934638K266823K188801
4634A45173484J816471Q04267j237446l801815n724166o316955n949405n269162
4626A19495273m762569m191660l970405l596999l443436l353258k978021k948698
4618I0250227k614751k222861k221128j944553j539153j450615j275887j050979
4610G5930300j055958j405553j831697k015826k135220j948880j635709j519068
4602F2382389j465272j166645j063540r48851p26378o09754p23164o89433p02996
4593E4286356q21742r41811j171833j073667j185006q29210p56225p14241o67815
4584D6124806m13422m38018l10971k86440k59519j20388k60727j49030n19547
$$ plain form
4575 43366744 43103829 42967828 42935506 42942743 43105886 43297703 43744439 44307069 45010705 45494520
4565 45494520 45759404 45955141 45884565 45810987 45873367 46053722 46270846 46919757 47817159 48989911
4555 48989911 50488597 52026665 52917664 53289507 53245406 52596238 51304904 49893801 48126631
4546 48126631 46578877 45102977 43739974 42436187 41069544 39895165 38505761 37157351
4538 37157351 35808849 34540403 33539839 32664758 31924508 31167742 30411177 29975397 29573168
4529 29573168 29323337 29044145 28667585 28246730 27842484 27549565 27435664 27292655 27046627
4520 27046627 26878425 26700039 26498946 26213682 25811875 25489770 25222442 25091512 24926371
4511 24926371 24942440 24915844 25058616 25140379 25227950 25435285 25802113 26092664 26403775 27142277
$$ packed form
4575D3366744k62915j36001l2322P237J63143J91817M46736N62630P03636M83815
4565D5494520K64884J95737p0576p3578O2380J80355K17124O48911Q97402J172752
4555D8989911J498686J538068Q90999L71843m4101o49168j291334j411103j767170
4546D8126631j547754j475900j363003j303787j366643j174379j389404j348410
4538C7157351j348502j268446j000564q75081p40250p56766p56565m35780m02229
4529B9573168k49831k79192l76560m20855m04246k92919j13901j43009k46028
4520B7046627j68202j78386k01093k85264m01807l22105k67328j30930j65141
4511B4926371J6069k6596J42772Q1763Q7571K07335L66828K90551L11111P38502
$$ plain form
4501 27142277 28129819 29216519 30328453 31497816 32329872 32737531 32558497 31886860 30790425
4492 30790425 29428579 28024822 26578562 25375974 24280014 23498834 22981789 22450869 22251525
4483 22251525 21921095 21704605 21540858 21258805 20962798 20716878 20377837 20160156 19800899
4474 19800899 19499251 19240718 18958563 18840799 18771464 18704090 18657394 18584383 18481509 18350355
4464 18350355 18414742 18502555 18670499 18696979 18634755 18658765 18865786 19029340 19188070 19498730
4454 19498730 19874517 20153836 20447258 20828299 21160947 21490010 21612320 21707723 21716608 21610333
4444 21610333 21393643 21340568 21318191 21375762 21603513 21864103 22212528 22550989 23133007 23859539
4434 23859539 24430516 24269180 23833365 23534794 23354636 23380194 23460237 23728777 24139840 24731225
$$ packed form
4501B7142277R87542J086700J111934J169363Q32056M07659j79034o71637j096435
4492C0790425j361846j403757j446260j202588j095960p81180n17045n30920j99344
4483B2251525l30430k16490j63747k82053k96007k45920l39041k17681l59257
4474A9800899l01648k58533k82155j17764o9335o7374m6696p3011j02874j31154
4464A8350355O4387Q7813J67944K6480o2224K4010K07021J63554J58730L10660
4454A9498730L75787K79319K93422L81041L32648L29063J22310R5403Q885j06275
4444B1610333k16690n3075k2377N7571K27751K60590L48425L38461N82018P26532
4434B3859539N70977j61336m35815k98571j80158K5558Q0043K68540M11063N91385
$$ plain form
4424 24731225 25342709 26021718 26915114 28010062 28954398 30078417 31063640 31790390 32329237
4415 32329237 32375566 32332088 32389233 32054553 31335725 30489401 29636767 28829422 28362318 27842927
4405 27842927 27408870 27208114 27067756 26825319 26682535 26499712 26318883 25992413 25584231
4396 25584231 25055356 24781653 24550188 24270455 24137818 23964009 23701147 23532007 23331158
4387 23331158 23018882 22654996 22237730 21930868 21800965 21646468 21427210 21334623 21275004 21216313
4377 21216313 21119451 21125104 21107061 21200050 21181680 20999427 20966879 20785070 20645591 20714413 20559621
4366 20559621 20530272 20483410 20581181 20649587 20714465 20663904 20566657 20429408 20494494 20553724 20625766
4355 20625766 20776868 20768942 20738565 20830623 21002534 21091613 20972566 20926252 20914456 20913073 20882686
$$ packed form
4424B4731225O11484O79009Q93396J094948R44336J124019R85223P26750N38847
4415C2329237M6329m3478N7145l34680p18828q46324q52634q07345m67104n19391
4405B7842927m34057k00756j40358k42437j42784j82823j80829l26470m08182
4396B5584231n28875k73703k31465k79733j32637j73809k62862j69140k00849
4387B3331158l12276l63886m17266l06862j29903j54497k19258r2587n9619n8691
4377B1216313r6862N653j8043R2989j8370j82253l2548j81809j39479O8822j54792
4366B0559621k9349m6862R7771O8406O4878n0561r7247j37249O5086N9230P2042
4355B0625766J51102p926l0377R2058J71911Q9079j19047m6314j1796j383l0387
$$ plain form
4344 20882686 20807334 20651105 20534142 20439619 20242907 19901921 19763885 19693521 19481814 19185293
4334 19185293 18717488 18230688 17937749 17515425 17194086 16986586 16758209 16615133 16461534
4325 16461534 16216370 16139189 16028595 15839949 15757790 15524718 15478895 15417423 15219183 15018908
4315 15018908 14727700 14390767 14441037 14294754 14229497 13919007 13751690 13771503 13795933 13769830
4305 13769830 13613625 13516513 13225655 12970632 12853399 12602312 12408013 12107909 11901811 11711915
4295 11711915 11537197 11428359 11139790 10944769 10750210 10589151 10422939 10367769 10187826 10078831
4285 10078831 9995778 9980786 9836441 9575546 9439100 9370115 9296651 9174076 9032216 8860421
4275 8860421 8667903 8528285 8468116 8408035 8339623 8256281 8324209 8207939 8163808 8123657 7894056
$$ packed form
4344B0882686p5352j56229j16963r4523j96712l40986j38036p0364k11707k96521
4334A9185293m67805m86800k92939m22324l21339k07500k28377j43076j53599
4325A6461534k45164p7181j10594j88646q2159k33072m5823o1472j98240k00275
4315A5018908k91208l36933N0270j46283o5257l10490j67317J9813K4430k6103
4305A3769830j56205r7112k90858k55023j17233k51087j94299l00104k06098j89896
4295A1711915j74718j08838k88569j95021j94559j61059j66212n5170j79943j08995
4285A0078831q3053j4992j44345k60895j36446o8985p3464j22575j41860j71795
4275H860421j92518j39618o0169o0081o8412q3342O7928j16270m4131m0151k29601
$$ plain form
4264 7894056 7773496 7824435 7683267 7668773 7635995 7578412 7373145 7234137 7177213 7062751
4254 7062751 7165725 7110762 7049919 7101236 7100636 7146803 7124703 7050282 7087663 6920754 6819070
4243 6819070 6900680 6849576 6999511 6984710 6902280 6860518 6824653 6850362 6818307 6798619 6675797
4232 6675797 6705364 6717483 6733075 6730848 6831274 6751705 6721216 6633610 6621289 6568110 6557544
4221 6557544 6497454 6452078 6537594 6388605 6358209 6221253 6334450 6368125 6343900 6472573 6423500
4210 6423500 6413569 6429365 6529169 6571124 6518253 6508186 6575290 6564827 6548039 6631624 6681224 6807272
4198 6807272 6836564 6855625 6973631 7094146 7313762 7329036 7301835 7385095 7411451 7185060 7081703
4187 7081703 6748885 6411041 6327304 6277763 6246184 6125765 5916055 5778675 5743321 5716437
$$ packed form
4264G894056j20560N0939j41168j4494l2778n7583k05267j39008n6924j14462
4254G062751J02974n4963o0843N1317o00M6167k2100p4421L7381j66909j01684
4243F819070Q1610n1104J49935j4801q2430m1762l5865K5709l2055j9688j22822
4232F675797K9567J2119J5592k227J00426p9569l0489q7606j2321n3179j0566
4221F557544o0090m5376Q5516j48989l0396j36956J13197L3675k4225J28673m9073
4210F423500r931J5796R9804M1955n2871j0067O7104j0463j6788Q3585M9600J26048
4198F807272K9292J9061J18006J20515K19616J5274k7201Q3260K6356k26391j03357
4187G081703l32818l37844q3737m9541l1579j20419k09710j37380l5354k6884
$$ plain form
4177 5716437 5579126 5716626 5653155 5628610 5614310 5559039 5499404 5361723 5170130 5077384 5100282
4166 5100282 5040607 5060949 4910822 4874064 4900610 4848829 4615020 4554191 4674795 4640297 4549563
4155 4549563 4580676 4551053 4540605 4464018 4519675 4443328 4232750 4064699 4127183 4235278 4267936
4144 4267936 4318017 4128048 4166855 4198804 4166485 4224094 4243531 4265764 4217974 4245579 4274782
4133 4274782 4260259 4186766 4121819 4147427 4160774 4139940 4257634 4156433 4126811 4231338 4199794
4122 4199794 4108609 4145554 4174320 4031611 4034444 4011376 4000428 4167471 4109806 4036738 4052373
4111 4052373 4029902 3980264 4171791 4214543 4284021 4155083 4099230 4257213 4186878 4353061 4326316
4100 4326316 4301128 4399171 4394051 4319667 4316372 4490778 4588034 4642115 4637771 4710214 4795530 4869487
$$ packed form
4177E716437j37311J37500o3471k4545j4300n5271n9635j37681j91593r2746K2898
4166E100282n9675K0342j50127l6758K6546n1781k33809o0829J20604l4498r0734
4155D549563L1113k9623j0448p6587N5657p6347k10578j68051O2484J08095L2658
4144D267936N0081j89969L8807L1949l2319N7609J9437K2233m7790K7605K9203
4133D274782j4523p3493o4947K5608J3347k0834J17694j01201k9622J04527l1544
4122D199794r1185L6945K8766j42709K833k3068j0948J67043n7665p3068J5635
4111D052373k2471m9638J91527M2752O9478j28938n5853J57983p0335J66183k6745
4100D326316k5188R8043n120p4384l295J74406R7256N4081m344P2443Q5316P3957
$$ plain form
4088 4869487 5020480 5024914 5096260 5184398 5097798 5121404 5299099 5389048 5381568 5418641 5355526
4077 5355526 5347456 5348718 5287482 5400289 5471724 5416110 5493398 5498486 5464550 5535712 5523072 5533563
4065 5533563 5449258 5255377 5202920 5196727 5184975 5178414 5275107 5218479 5174205 5106262 4900759
4054 4900759 4760913 4899140 5075284 5021135 5040411 4866799 4780724 4880604 4927504 4784262
4044 4784262 4679483 4654517 4717133 4642205 4685810 4742413 4634192 4635244 4680287 4658275 4543080
4033 4543080 4515405 4542431 4519088 4406507 4346613 4333388 4135265 4017834 3983350 4176100 4170097
4022 4170097 3963004 3917402 3897612 3893505 3838560 3830522 3682327 3618334 3637109 3750907 3708398
4011 3708398 3594637 3785147 3689628 3625202 3532377 3497638 3569186 3541562 3515140 3580843 3539501
$$ packed form
4088D869487J50993M434P1346Q8138q6600K3606J77695Q9949p480L7073o3115
4077E355526q070J262o1236J12807P1435n5614P7288N088l3936P1162j2640J0491
4065E533563q4305j93881n2457o193j1752o561R6693n6628m4274o7943k05503
4054D900759j39846J38227J76144n4149J9276j73612q6075R9880M6900j43242
4044D784262j04779k4966O2616p4928M3605N6603j08221J052M5043k2012j15195
4033D543080k7675K7026k3343j12581n9894j3225j98123j17431l4484J92750o003
4022D170097k07093m5602j9790m107n4945q038j48195o3993J8775J13798m2509
4011C708398j13761J90510r5519o4426r2825l4739P1548k7624k6422O5703m1342
$$ plain form
4000 3539501 3492811 3478575 3485768 3359166 3344082 3275767 3177846 3101050 3061469 3268374 3292763
3989 3292763 3178494 2989665 2983144 3054838 3121468 3065140 3053151 3062372 3045201 3070656 3099595
3978 3099595 2967412 2971331 2835594 2828635 2880360 2951011 3108014 3073801 3105561 3032471 2968062
3967 2968062 3018087 3082456 3193651 3259941 3212303 3277035 3283577 3204464 3143862 3142953 3084776 3103282
3955 3103282 3172878 3249367 3387873 3259263 3091407 3163410 3213996 3238731 3176473 3270483 3352595
3944 3352595 3358317 3462655 3504753 3503934 3515633 3551258 3656246 3879032 4033945 4088166 4109401
3933 4109401 4176612 4254634 4555882 4641681 4764418 5124427 5374788 5477530 5618890 5974531
3923 5974531 6206738 6532902 6910388 7148793 7454717 7680603 7389073 7166924 6908491 6589712
$$ packed form
4000C539501m6690j4236P193j26602j5084o8315r7921p6796l9581K06905K4389
3989C292763j14269j88829o521P1694O6630n6328j1989R221j7171K5455K8939
3978C099595j32183L919j35737o959N1725P0651J57003l4213L1760p3090o4409
3967B968062N0025O4369J11195O6290m7638O4732O542p9113o0602r09n8177J8506
3955C103282O9596P6489J38506j28610j67856P2003N0586K4735o2258R4010Q2112
3944C352595N722J04338M2098q19J1699L5625J04988K22786J54913N4221K1235
3933D109401O7211P8022L01248Q5799J22737L60009K50361J02742J41360L55641
3923E974531K32207L26164L77486K38405L05924K25886k91530k22149k58433l18779
$$ plain form
3913 6589712 6316317 5920174 5709693 5529926 5395880 5293230 5089562 4939230 4890992 4929841
3903 4929841 4776457 4594451 4503168 4505021 4514158 4431196 4470187 4533208 4442613 4285588 4240058
3892 4240058 4066601 4100424 3993412 3844755 3974557 3889842 3763603 3775021 3713078 3761227
3882 3761227 3759953 3668642 3468388 3582100 3646929 3583290 3469333 3392689 3506164 3549762 3586197
3871 3586197 3634297 3603184 3532289 3562530 3569978 3497722 3400338 3565150 3596827 3407011 3452024
3860 3452024 3742572 3744544 3541284 3644316 3686524 3702329 3754162 3797831 3882847 3871721 3829549
3849 3829549 3791269 3878514 3874739 3774242 3843023 3979772 4110763 3999666 3910037 4014853 3970894
3838 3970894 3923367 4001204 4056919 4037004 4123422 4191197 4155307 4265391 4308517 4243882 4199377
$$ packed form
3913F589712k73395l96143k10481j79767j34046j02650k03668j50332m8238L8849
3903D929841j53384j82006r1283J853R137q2962L8991O3021r0595j57025m5530
3892D240058j73457L3823j07012j48657J29802q4715j26239J1418o1943M8149
3882C761227j274r1311k00254J13712O4829o3639j13957p6644J13475M3598L6435
3871C586197M8100l1113p0895L0241P448p2256r7384J64812L1677j89816M5013
3860C452024K90548J972k03260J03032M2208J5805N1833M3669Q5016j1126m2172
3849C829549l8280Q7245l775j00497O8781J36749J30991j11097q9629J04816m3959
3838C970894m7527P7837N5715j9915Q6418O7775l5890J10084M3126o4635m4505
$$ plain form
3827 4199377 4255752 4244438 4360675 4446916 4398854 4469661 4449035 4505537 4555445 4577286 4716060
3816 4716060 4709249 4660895 4692014 4795858 4816081 4742110 4768261 4733824 4802832 4966192 4981529
3805 4981529 5003867 4896234 4920607 4928991 4925612 4945996 5005985 5008368 5071952 5145605 4961444 5082974
3793 5082974 5150028 5128514 5165636 5139689 4998307 4987339 4976946 4957888 4957258 5088521 5211745
3782 5211745 5317285 5230887 5255782 5240924 5279878 5463370 5520334 5500444 5499728 5513247 5590462
3771 5590462 5627412 5631094 5633829 5621183 5798479 5869693 5836636 5960989 5898762 5878507 5764416
3760 5764416 5837249 5828574 5741909 5836415 5776866 5746988 5716747 5789590 5923582 5979131 5957459
3749 5957459 5922454 5856409 5945165 6093479 6058533 6052479 6035207 6027767 6048102 6038119 6163726 6167857
$$ packed form
3827D199377N6375j1314J16237Q6241m8062P0807k0626N6502M9908K1841J38774
3816D716060o811m8354L1119J03844K0223p3971K6151l4437O9008J63360J5337
3805D981529K2338j07633K4373Q384l379K0384N9989K383O3584P3653j84161J21530
3793E082974O7054k1514L7122k5947j41382j0968j0393j9058o30J31263J23224
3782E211745J05540q6398K4895j4858L8954J83492N6964j9890p16J3519P7215
3771E590462L6950L682K735j2646J77296P1214l3057J24353o2227k0255j14091
3760E764416P2833q675q6665R4506n9549k9878l0241P2843J33992N5549k1672
3749E957459l5005o6045Q8756J48314l4946o054j7272p440K0335r983J25607M131
$$ plain form
3737 6167857 6113539 6086366 6119412 6139558 6315876 6199087 6132766 6258821 6289439 6112812 6065162
3726 6065162 6044344 6110147 6140546 6004568 6113279 6229695 6361820 6288942 6348577 6521246
3716 6521246 6555103 6467329 6439873 6489132 6572554 6776776 6705909 6686699 6748186 6781894 6881812
3705 6881812 6739242 6710304 6883731 6968985 6962996 7041194 6969734 7039324 7068323 6994666 6951655
3694 6951655 6851527 6919376 7084449 7086819 7095538 7038219 7084011 7166291 7200093 7342879 7360471
3683 7360471 7339786 7237473 7285474 7485908 7487834 7609574 7651431 7627971 7770323 7851909 7987030
3672 7987030 8033292 7910059 7999918 8172178 8223924 8334961 8271124 8339065 8399314 8501331 8501579
3661 8501579 8534627 8584820 8694571 8709302 8708178 8937401 9075398 9084309 8999642 8994130 9014651
$$ packed form
3737F167857n4318k7173L3046K0146J76318j16789o6321J26055L0618j76627m7650
3726F065162k0818O5803L0399j35978J08711J16416J32125p2878N9635J72669
3716F521246L3857q7774k7456M9259Q3422K04222p0867j9210O1487L3708R9918
3705F881812j42570k8938J73427Q5254n989P8198p1460O9590K8999p3657m3011
3694F951655j00128O7849J65073K370Q719n7319M5792Q2280L3802J42786J7592
3683G360471k0685j02313M8001K00434J926J21740M1857k3460J42352Q1586J35121
3672G987030M6262j23233Q9859J72260N1746J11037o3837O7941O0249J02017K48
3661H501579L3048N0193J09751J4731j124K29223J37997Q911q4667n512K0521
$$ plain form
3650 9014651 9047931 9327283 9367543 9397454 9392592 9466405 9494014 9588097 9620811 9652050 9635492
3639 9635492 9696125 9720761 9697257 9764941 9745869 9891411 9942705 9884156 9948751 10057636 10154583
3628 10154583 10297389 10248508 10400673 10663905 10831262 10985918 10913549 10838918 10754960 10788953
3618 10788953 10850977 10884081 10888849 10869483 11009506 11131462 11288282 11293825 11212526 11235948 11200516
3607 11200516 11318032 11422732 11450974 11516347 11525924 11653985 11835735 11840583 11985995 12070707 11907802
3596 11907802 12113021 12302788 12411281 12384382 12413262 12437165 12504146 12680245 12638535 12719994
3586 12719994 12889102 12923266 12971796 12955842 13181577 13321429 13373744 13501873 13692041 13778933
3576 13778933 13993199 14199804 14430383 14589756 14910136 15137142 15390006 15572221 15654308 15771705
$$ packed form
3650I014651L3280K79352M0260K9911m862P3813K7609R4083L2714L1239j6558
3639I635492O0633K4636k3504O7684j9072J45542N1294n8549O4595J08885R6947
3628A0154583J42806m8881J52165K63232J67357J54656p2369p4631q3958L3993
3618A0788953O2024L3104M768j9366J40023J21956J56820N543q1299K3422l5432
3607A1200516J17516J04700K8242O5373R577J28061J81750M848J45412Q4712j62905
3596A1907802K05219J89767J08493k6899K8880K3903O6981J76099m1710Q1459
3586A2719994J69108L4164M8530j5954K25735J39852N2315J28129J90168Q6892
3576A3778933K14266K06605K30579J59373L20380K27006K52864J82215Q2087J17397
$$ plain form
3566 15771705 15632425 15388418 15314684 15237628 15135095 15089890 14900754 14880501 14914386 14969875
3556 14969875 14914905 14977920 14902349 14945411 15042190 15092002 15095437 15197718 15442281 15424841 15625464
3545 15625464 15808983 16059933 16162049 16314254 16639009 16982949 17420000 17888548 18253054
3536 18253054 18763724 19049158 18986396 18721364 18323098 17928537 17756351 17817795 17721594 17658550
3526 17658550 17724107 17871403 17904280 18092163 18321213 18504562 18706182 19048921 19367962 19652756
3516 19652756 19951163 20120957 20345075 20506975 20620201 20641402 20428428 20120924 19825206 19482421
3506 19482421 19173442 19032368 18836656 18705738 18563695 18246168 17778479 17422180 17089969
3497 17089969 16743548 16606664 16603277 16617989 16516001 16395933 16652525 16746652 16670668 16392034
$$ packed form
3566A5771705j39280k44007p3734p7056j02533m5205j89136k0253L3885N5489
3556A4969875n4970O3015p5571M3062R6779M9812L435J02281K44563j7440K00623
3545A5625464J83519K50950J02116J52205L24755L43940M37051M68548L64506
3536A8253054N10670K85434o2762k65032l98266l94561j72186O1444r6201o3044
3526A7658550O5557J47296L2877J87883K29050J83349K01620L42739L19041K84794
3516A9652756K98407J69794K24118J61900J13226K1201k12974l07504k95718l42785
3506A9482421l08979j41074j95712j30918j42043l17527m67689l56299l32211
3497A7089969l46421j36884l387J4712j01988j20068K56592R4127p5984k78634
$$ plain form
3487 16392034 15888109 15392582 14971674 14528961 14352980 14282072 14201028 14092910 13973923 14051549
3477 14051549 14010652 13871990 13727387 13482712 13256811 12937182 12775551 12684540 12393537 12154738
3467 12154738 11957352 11942139 12051070 12124996 11958839 11724313 11480300 11502648 11576730 11485652
3457 11485652 11479178 11409158 11431425 11531924 11572024 11629451 11696940 11899068 12085416 12443515 12857187
3446 12857187 13340125 13585571 13451236 12965502 12473668 11932600 11295001 10911269 10471864
3437 10471864 10087340 10040774 9979502 9748469 9711037 9676672 9674095 9655720 9639108 9633680 9549400
3426 9549400 9481734 9562141 9599734 9696289 9800533 9988736 10058144 10292968 10690195 11211868
3416 11211868 11586202 12171687 12772847 13252234 13110011 12300573 11500561 10782749 10145603
$$ packed form
3487A6392034n03925m95527m20908m42713j75981p0908q1044j08118j18987P7626
3477A4051549m0897j38662j44603k44675k25901l19629j61631r1011k91003k38799
3467A2154738j97386j5213J08931P3926j66157k34526k44013K2348P4082r1078
3457A1485652o474p0020K2267J00499M0100N7427O7489K02128J86348L58099M13672
3446A2857187M82938K45446j34335m85734m91834n41068o37599l83732m39405
3437A0471864l84524m6566o1272k31033l7432l4365k577j8375j6612n428q4280
3426I549400o7666Q0407L7593R6555J04244J88203O9408K34824L97227N21673
3416A1211868L74334N85485O01160M79387j42223q09438q00012p17812o37146
$$ plain form
3407 10145603 9616722 9241983 9019867 8851336 8685728 8470625 8250280 8203925 8129635 8073380
3397 8073380 8012007 7916846 7872565 7997410 8027011 8024964 8046073 8165170 8158758 8007044 8109937
3386 8109937 8251056 8322816 8734064 8956498 9116844 9380516 9218959 8910644 8490793 8201588
3376 8201588 8012563 7832026 7690820 7694892 7707141 7459768 7227972 7167424 7080738 6890213
3366 6890213 6855655 6711294 6567044 6467811 6417938 6300216 6462576 6414414 6229935 6181483
3356 6181483 6143820 6087689 6116787 5848163 5692506 5752712 5840461 5799307 5845072 5791126 5802065
3345 5802065 5822423 5776298 5890026 5963559 6027172 6091996 6113272 6151963 6209604 6174258 6099281
3334 6099281 5931506 5882182 5785949 5533139 5533283 5343034 5172530 5191985 4976105 5077632 5018396
$$ packed form
3407A0145603n28881l74739k22116j68531j65608k15103k20345m6355p4290n6255
3397H073380o1373r5161m4281J24845K9601k047K1109J19097o412j51714J02893
3386H109937J41119P1760M11248K22434J60346K63672j61557l08315m19851k89205
3376H201588j89025j80537j41206M072J2249k47373k31796o0548q6686j90525
3366F890213l4558j44361j44250r9233m9873j17722J62360m8162j84479m8452
3356F181483l7663n6131K9098k68624j55657O0206Q7749m1154M5765n3946J0939
3345E802065K0358m6125J13728P3533O3613O4824K1276L8691N7641l5346p4977
3334F099281j67775m9324r6233k52810J44j90249j70504J9455k15880J01527n9236
$$ plain form
3323 5018396 4991591 4750878 4563485 4602083 4667498 4659395 4529260 4536301 4541771 4551276 4534487 4532636
3311 4532636 4564615 4585964 4679286 4648874 4740499 4768200 4707986 4914456 5027901 5012085 4919038
3300 4919038 4870568 4831162 4810951 4798363 4655284 4475688 4527305 4677051 4653170 4652401 4601272
3289 4601272 4548788 4568728 4675998 4658817 4541164 4589149 4526666 4568406 4661828 4686544 4713205
3278 4713205 4670161 4733712 4729583 4676508 4840642 5014482 5007653 4921538 5063990 5282568 5334338
3267 5334338 5342056 5457815 5521922 5626709 5821626 5947285 5979806 5976027 6122694 6294976 6490458
3256 6490458 6593717 6659910 6676964 6604064 6609913 6690838 6784516 7022287 6834245 6992085 7184696
3245 7184696 7141307 7237603 7299041 7463306 7444165 7472159 7620529 7756239 7901814 7941133 8058713
$$ packed form
3323E018396k6805k40713j87393L8598O5415q103j30135P041N470R505j6789j851
3311D532636L1979K1349R3322l0412R1625K7701o0214K06470J13445j5816r3047
3300D919038m8470l9406k0211j2588j43079j79596N1617J49746k3881p69n1129
3289D601272n2484J9940J07270j7181j17653M7985o2483M1740R3422K4716K6661
3278D713205m3044O3551m129n3075J64134J73840o829q6115J42452K18578N1770
3267E334338P718J15759O4107J04787J94917J25659L2521l779J46667J72282J95482
3256F490458J03259O6193J7054p2900N849Q0925R3678K37771j88042J57840J92611
3245G184696m3389R6296O1438J64265j9141K7994J48370J35710J45575L9319J17580
$$ plain form
3234 8058713 8300681 8550737 8650671 8817757 9078973 9244498 9340353 9501239 9726902 9813821
3224 9813821 9946120 10086451 10264197 10356882 10524876 10536503 10775100 11129085 11457492 11732753
3214 11732753 11917737 12150888 12409869 12743606 12800989 13007813 13317677 13566783 13798328 14059035
3204 14059035 14307452 14575018 14770266 14843484 15101085 15290820 15442730 15640751 15664626 15670084
3194 15670084 15660321 15627826 15741316 15797009 15885183 15906987 16096917 16014923 16281369 16631213 16944918
3183 16944918 17167865 17149633 17371329 17459042 17861219 18169708 18358742 18494812 18752487 18947725
3173 18947725 19259322 19457641 19499235 19445969 19547421 19529835 19520818 19480321 19379731 19274366
3163 19274366 18936167 18720263 18500932 18358931 18161063 17755039 17307504 16890319 16717183
$$ packed form
3234H058713K41968K50056R9934J67086K61216J65525R5855J60886K25663Q6919
3224I813821J32299J40331J77746R2685J67994J1627K38597L53985L28407K75261
3214A1732753J84984K33151K58981L33737N7383K06824L09864K49106K31545K60707
3204A4059035K48417K67566J95248P3218K57601J89735J51910J98021K3875N458
3194A5670084r763l2495J13490N5693Q8174K1804J89930q1994K66446L49844L13705
3183A6944918K22947j8232K21696Q7713M02177L08489J89034J36070K57675J95238
3173A8947725L11597J98319M1594n3266J01452j7586r017m0497j00590j05365
3163A9274366l38199k15904k19331j42001j97868m06024m47535m17185j73136
$$ plain form
3154 16717183 16648455 16380171 16180858 16179974 16246607 16127673 15908894 15791491 15540704 15471346
3144 15471346 15502655 15220805 15013960 14886706 14823980 14680070 14568862 14420063 14222452 14022313
3134 14022313 13846021 13505645 13274666 13104493 12833149 12673554 12479983 12339028 12025445
3125 12025445 11810164 11554049 11344284 11002967 10688461 10631031 10365450 10227795 10196101 10086461
3115 10086461 9842640 9706847 9506213 9404135 9389869 9200800 9001849 8992398 9069871 8994569
3105 8994569 9084829 9266257 9063650 8843599 8611826 8317235 8034846 7723030 7473732 7190384
3095 7190384 6930757 6802002 6679178 6569056 6459691 6248399 6085528 6037547 5912136 5571960
3085 5571960 5400094 5570325 5440759 5195014 4963812 4899609 4794527 4748224 4588347 4363632
$$ packed form
3154A6717183o8728k68284j99313q84O6633j18934k18779j17403k50787o9358
3144A5471346L1309k81850k06845j27254o2726j43910j11208j48799j97611k00139
3134A4022313j76292l40376k30979j70173k71344j59595j93571j40955l13583
3125A2025445k15281k56115k09765l41317l14506n7430k65581j37655l1694j09640
3115A0086461k43821j35793k00634j02078j4266j89069j98951r451P7473p5302
3105H994569R0260J81428k02607k20051k31773k94591k82389l11816k49298k83348
3095G190384k59627j28755j22824j10122j09365k11292j62871m7981j25411l40176
3085E571960j71866J70231j29566k45745k31202o4203j05082m6303j59877k24715
$$ plain form
3075 4363632 4409187 4284021 4189439 4097846 4068916 3967109 4010835 4085932 3885579 3642854 3589613
3064 3589613 3671413 3550308 3549970 3590988 3443492 3331963 3216622 3273891 3261010 3034451 2984324
3053 2984324 2909932 2942199 2849397 2867365 2897895 2814091 2686882 2632955 2617698 2609052 2444797
3042 2444797 2431208 2358293 2415318 2407800 2345925 2422934 2377447 2235808 2082239 1943393 1947482
3031 1947482 2019941 2125761 2099651 1883352 2002660 1738936 1698240 1771918 1791324 1697984 1569198
3020 1569198 1546436 1589482 1621495 1678407 1566849 1565800 1509133 1416870 1304400 1246670 1264614
3009 1264614 1240718 1154367 1168224 1097862 1201402 1137784 1014957 1079504 1014955 1088499 1156733
2998 1156733 1076902 967297 1093023 1015615 830695 965144 903702 770234 790510 869804
$$ packed form
3075D363632M5555j25166r4582r1593k8930j01807M3726P5097k00353k42725n3241
3064C589613Q1800j21105l38M1018j47496j11529j15341N7269j2881k26559n0127
3053B984324p4392L2267r2802J7968L0530q3804j27209n3927j5257q646j64255
3042B444797j3589p2915N7025p518o1875P7009m5487j41639j53569j38846M089
3031A947482P2459J05820k6110k16299J19308k63724m0696P3678J9406r3340j28786
3020A569198k2762M3046L2013N6912j11558j049n6667r2263j12470n7730J7944
3009A264614k3896q6351J3857p0362J03540o3618j22827O4547o4549P3544O8234
2998A156733p9831j09605J25726p7408j84920J34449o1442j33468K0276P9294
$$ plain form
2988 869804 791850 858571 817887 833060 774533 552617 596754 687977 740247 704002 672092
2977 672092 579311 620178 557860 375820 398350 464321 482668 469678 537398 690932 634321
2966 634321 490641 504216 492019 403247 381065 270470 214018 233052 131851 230854 278222
2955 278222 242428 274296 226456 164231 183920 224355 196349 261526 222645 183812 224636 341038
2943 341038 321482 239353 148285 146639 236299 196474 185941 162319 205569 225784 40282 184575
2931 184575 116548 27064 177190 169642 89153 36934 78226 -3570 -34770 57923 50928 110578
2919 110578 167211 -4875 -104495 64427 144846 127374 62879 -21523 -182110 -71498 -92482
2908 -92482 -66275 10412 -4063 -1755 66069 94184 -96195 -113370 -171356 -174100 -77272 -48937
$$ packed form
2988H69804p7954O6721m0684J5173n8527k21916M4137R1223N2270l6245l1910
2977F72092r2781M0867o2318j82040K2530O5971J8347j2990O7720J53534n6611
2966F34321j43680J3575j2197q8772k2182j10595n6452J9034j01201R9003M7368
2955B78222l5794L1868m7840o2225J9689M0435k8006O5177l8881l8833M0824J16402
2943C41038j9556q2129r1068j646Q9660l9825j0533k3622M3250K0215j85502J44293
2931A84575o8027q9484J50126p548q0489n2219M1292q1796l1200R2693o995N9650
2919A10578N6633j72086r9620J68922Q0419j7472o4495q4402j60587J10612k0984
2908i2482K6207P6687j4475K308O7824K8115j90379j7175n7986k744R6828K8335
$$ plain form
2896 -48937 -119785 -81084 62924 18311 61416 -38460 -8356 105825 -10730 11623 -48783
2885 -48783 -117386 -35344 22071 -83224 -116621 -108460 -216408 -329007 -215125 -108224 -55316
2874 -55316 -20487 -31043 -62549 -65948 -24689 -79974 -150151 -79277 -63931 -43414 -222492 -321046
2862 -321046 -249195 -271736 -192832 -173225 -224197 -242350 -146043 -105607 -156581 -57012 -55853 -125244
2850 -125244 -129389 -190189 -131996 -140364 -164402 -226989 -278706 -337289 -297101 -423588 -327076 -275302
2838 -275302 -391946 -313643 -400070 -324056 -216355 -355343 -228560 -226832 -143769 21651 -144330
2827 -144330 -321758 -299920 -230332 -276734 -306281 -289324 -283102 -326853 -191964 -281113 -300404
2816 -300404 -218836 -206760 -316188 -404604 -307364 -295062 -262000 -265507 -163510 -193805 -270664
$$ packed form
2896d8937p0848L8701J44008m4613M3105r9876L0104J14181j16555K2353o0406
2885d8783o8603Q2042N7415j05295l3397Q161j07948j12599J13882J06901N2908
2874e5316L4829j0556l1506l399M1259n5285p0177P0874J5346K0517j79078r8554
2862c21046P1851k2541P8904J9607n0972j8153R6307M0436n0974R9569J159o9391
2850a25244m145o0800N8193q368k4038o2587n1717n8583M0188j26487R6512N1774
2838b75302j16644P8303q6427P6014J07701j38988J26783J728Q3063J65420j65981
2827a44330j77428K1838O9588m6402k9547J6957O222m3751J34889q9149j9291
2816c00404Q1568J2076j09428q8416R7240J2302L3062l507J01997l0295p6859
$$ plain form
2805 -270664 -428584 -398871 -299924 -351405 -382430 -364557 -186990 -249509 -217427 -189487 -216656
2794 -216656 -286861 -335580 -331622 -329802 -428836 -410624 -361107 -278980 -267627 -261577 -252414 -348534
2782 -348534 -360444 -342918 -308871 -154733 -186989 -290695 -335524 -311024 -329546 -325557 -321546 -359013
2770 -359013 -422698 -299689 -279687 -315013 -412976 -369066 -275145 -396919 -487930 -469833 -336615
2759 -336615 -309144 -291995 -259023 -251817 -246989 -252555 -234671 -136327 -286003 -354318 -375002 -362946
2747 -362946 -203344 -315802 -266832 -211970 -260185 -339366 -276799 -232288 -334780 -322704 -274347
2736 -274347 -179868 -217953 -297810 -332282 -306232 -429521 -462782 -415750 -342973 -200009 -172570
2725 -172570 -299837 -263337 -184744 -329281 -336215 -312433 -355773 -394662 -421864 -547595 -520161
$$ packed form
2805b70664j57920K9713R8947n1481l1025J7873J77567o2519L2082K7940k7169
2794b16656p0205m8719L958J820r9034J8212M9517Q2127J1353O050R163r6120
2782c48534j1910J7526L4047J54138l2256j03706m4829K4500j8522L989M011l7467
2770c59013o3685J23009K0002l5326r7963M3910R3921j21774r1011J8097J33218
2759c36615K7471J7149L2972P206M828n566J7884R8344j49676o8315k0684J2056
2747c62946J59602j12458M8970N4862m8215p9181O2567M4511j02492J2076M8357
2736b74347R4479l8085p9857l4472K6050j23289l3261M7032P2777J42964K7439
2725a72570j27267L6500P8593j44537o934K3782m3340l8889k7202j25731K7434
$$ plain form
2714 -520161 -463008 -456273 -441724 -448763 -523986 -571986 -506222 -478238 -443163 -434778 -346510 -276398
2702 -276398 -449803 -490247 -274149 -288262 -292260 -403897 -482881 -476326 -476640 -420050 -217685 -333550
2690 -333550 -379412 -386705 -479438 -427005 -359796 -336287 -357353 -429466 -410035 -400465 -490886 -463935
2678 -463935 -560723 -364013 -362760 -373221 -335279 -401067 -313573 -161980 -176300 -313292 -249372
2667 -249372 -396681 -332281 -299238 -348168 -402074 -457146 -417594 -290232 -335290 -265906 -296952
2656 -296952 -238907 -111105 -138935 -350876 -421644 -464805 -561395 -344460 -372431 -479014 -389225
2645 -389225 -162885 -178729 -246319 -172229 -221664 -285028 -299588 -224361 -79790 -186126 -201481
2634 -201481 -174205 -171269 -215118 -279236 -279352 -303382 -178967 -334125 -419593 -346841 -410743 -438561
$$ packed form
2714e20161N7153O735J4549p039p5223m8000O5764K7984L5075Q385Q8268P0112
2702b76398j73405m0444K16098j4113l998j11637p8984O555l14N6590K02365j15865
2690c33550m5862p293r2733N2433O7209K3509k1066p2113J9431R570r0421K6951
2678d63935r6788J96710J253j0461L7942o5788Q7494J51593j4320j36992O3920
2667b49372j47309O4400L3043m8930n3906n5072L9552J27362m5058O9384l1046
2656b96952N8045J27802k7830k11941p0768m3161r6590K16935k7971j06583Q9789
2645c89225K26340j5844o7590P4090m9435o3364j4560P5227J44571j06336j5355
2634b01481K7276K936m3849o4118j16k4030J24415j55158q5468P2752o3902k7818
$$ plain form
2622 -438561 -426074 -404201 -372193 -387579 -334723 -330587 -432897 -371772 -302720 -296010 -278044 -322319
2610 -322319 -351107 -396947 -417511 -252698 -261063 -283565 -380641 -377144 -420568 -407756 -397888 -400178
2598 -400178 -375094 -366948 -404456 -382745 -238767 -316339 -336784 -333950 -304495 -371519 -281121 -185181
2586 -185181 -301865 -239743 -321372 -388600 -308971 -405766 -320604 -413796 -337970 -191837 -292161
2575 -292161 -209785 -270727 -226189 -245734 -212823 -218128 -290671 -394992 -397860 -311727 -333706 -299043
2563 -299043 -258905 -197057 -240841 -341756 -353143 -369986 -307698 -276217 -355131 -458522 -449079
2552 -449079 -342894 -385062 -428231 -466553 -320323 -193410 -249699 -164816 -253931 -314033 -322933
2541 -322933 -266572 -115123 -47023 -62507 -180892 -303534 -378335 -381368 -400043 -424604 -413808
$$ packed form
2622d38561J2487K1873L2008j5386N2856M136j02310O1125O9052O710J7966m4275
2610c22319k8788m5840k0564J64813q365k2502r7076L497m3424J2812R868k290
2598d00178K5084Q146l7508K1711J43978p7572k0445K834K9455o7024R0398R5940
2586a85181j16684O2122q1629o7228P9629r6795Q5162r3192P5826J46133j00324
2575b92161Q2376o0942M4538j9545L2911n305p2543j04321k868Q6133k1979L4663
2563b99043M0138O1848m3784j00915j1387j6843O2288L1481p8914j03391R443
2552d49079J06185m2168m3169l8322J46230J26913n6289Q4883q9115o0102q900
2541c22933N6361J51449O8100j5484j18385j22642p4801l033j8675k4561J0796
$$ plain form
2530 -413808 -332127 -287067 -192513 -194739 -187324 -27370 -144662 -151408 -204470 -131779 -206713 -344614
2518 -344614 -373654 -326945 -191563 -120555 -75894 -21740 -198949 -101008 -166998 -206271 -65167
2507 -65167 17919 4523 -86739 -74115 -113769 -195050 -192997 -168180 -149536 -202420 -190607 -174699
2495 -174699 -228271 -121250 -184577 -103305 -13267 -166879 -139940 -80691 -99339 -128193 -278432
2484 -278432 -219009 -179737 -58812 -48000 -81476 -114268 -73125 132931 138537 45157 51052 -4191
2472 -4191 -139190 -120375 38237 -103375 -143138 -130318 -73513 -171259 -177191 -59023 75661
2461 75661 36772 -7006 103929 181908 41932 -920 30557 23994 71868 68642 31070 80228
2449 80228 72590 207898 212421 161822 287161 211425 171690 191732 118500 92034 126841 230117
$$ packed form
2530d13808Q1681M5060R4554k226P415J59954j17292o746n3062P2691p4934j37901
2518c44614k9040M6709J35382P1008M4661N4154j77209R7941o5990l9273J41104
2507f5167Q3086j3396r1262J2624l9654q1281K053K4817J8644n2884J1813J5908
2495a74699n3572J07021o3327Q1272R0038j53612K6939N9249j8648k8854j50239
2484b78432N9423L9272J20925J0812l3476l2792M1143K06056N606r3380N895n5243
2472d191j34999J8815J58612j41612l9763J2820N6805r7746n932J18168J34684
2461G5661l8889m3778J10935P7979j39976m2852L1477o563M7874l226l7572M9158
2449H0228p638J35308M523n0599J25339p5736l9735K0042p3232k6466L4807J03276
$$ plain form
2437 230117 98517 81899 186403 240696 336833 412902 337468 211527 280159 394667 462645
2426 462645 485941 530487 553613 484366 609579 738116 684539 799439 783900 751534 800810
2415 800810 882670 955051 818680 917777 1063046 986279 1142218 1313465 1390206 1475156 1571176
2404 1571176 1641301 1648035 1837522 1858305 1901386 1985787 2216211 2398708 2646116 2920889 3203521
2393 3203521 3488279 3842893 4324651 4853829 5495551 6123029 6523358 6914534 7256436 7820421
2383 7820421 8417102 9066078 9909438 11043935 12560475 14443210 17037956 20567574 25599274
2374 25599274 32493191 36829906 33446003 28492537 23233287 18312631 15180037 12677222
2366 12677222 10664542 9102434 8304730 7615190 6994320 6449631 6104399 5807839 5466569
$$ packed form
2437B30117j31600j6618J04504N4293R6137P6069p5434j25941O8632J14508O7978
2426D62645K3296M4546K3126o9247J25213J28537n3577J14900j5539l2366M9276
2415H00810Q1860P2381j36371R9097J45269p6767J55939J71247P6741Q4950R6020
2404A571176P0125O734J89487K0783M3081Q4401K30424J82497K47408K74773K82632
2393C203521K84758L54614M81758N29178O41722O27478M00329L91176L41902N63985
2383G820421N96681O48976Q43360J134497J516540J882735K594746L529618N031700
2374B5599274O893917M336715l383903m953466n259250m920656l132594k502815
2366A2677222k012680j562108p97704o89540o20870n44689l45232k96560l41270
$$ plain form
2357 5466569 4935009 4582115 4106315 3631739 3246090 2924126 2777504 2576722 2458047 2207437
2347 2207437 1992702 1762862 1792448 1739450 1532890 1340663 1304406 1249021 1202909 1161717 961426
2336 961426 912441 995959 929825 880675 806710 754578 739866 748358 665733 644688 567298 369319
2324 369319 332603 432731 460505 318785 199965 225141 257265 146485 115665 215950 205330
2313 205330 226424 179425 182171 152722 226191 150101 152491 192988 182729 215750 64384 -44195
2301 -44195 -46751 -28645 -46257 -73779 -168644 -23275 36150 150415 72532 -1438 45777 58116
2289 58116 72262 139681 173821 68020 -55295 -92995 -147814 -142858 -197010 -95936 -167549
2278 -167549 -245930 -101128 62399 -32153 -87794 -99307 -145853 -109834 -129987 -193153 -647
$$ packed form
2357E466569n31560l52894m75800m74576l85649l21964j46622k00782j18675k50610
2347B207437k14735k29840K9586n2998k06560j92227l6257n5385m6112m1192k00291
2336I61426m8985Q3518o6134m9150p3965n2132j4712Q492q2625k1045p7390j97979
2324C69319l6716J00128K7774j41720j18820K5176L2124j10780l0820J00285j0620
2313B05330K1094m6999K746k9449P3469p6090K390M0497j0259L3021j51366j08579
2301d4195k556J8106j7612k7522r4865J45369N9425J14265p7883p3970M7215J2339
2289E8116J4146O7419L4140j05801j23315l7700n4819M956n4152J01074p1613
2278a67549p8381J44802J63527r4552n5641j1513m6546L6019k0153o3166J92506
$$ plain form
2267 -647 -94625 -108012 -44424 -27120 -210727 -163955 -75400 -144242 -99087 -74158 -114963 -37788
2255 -37788 -136606 -114518 -148715 -253523 -285793 -284644 -123282 -102664 -164204 -93828 -49381 -127022
2243 -127022 -238583 -261460 -152220 -53580 -183320 -307006 -242258 -201152 -197002 -186903 -154026
2232 -154026 -144729 -285351 -333746 -171484 -87258 -155733 -147997 -102790 -127352 -79064 -166905 -208706
2220 -208706 -198926 -151394 -177490 -147101 -85106 -231427 -17380 -12342 -273742 -164051 -177307
2209 -177307 -219836 -218010 -101823 -172706 -59842 -86854 -251202 -259228 -168863 -129454 -124411 -150904
2197 -150904 -71267 -132304 -55138 -50441 -75511 -54346 -141039 -107926 -289291 -315733 -157391
2186 -157391 -205851 -136221 -170626 -276073 -316976 -233159 -296864 -289899 -241447 -194520 -138354 -107242
$$ packed form
2267f47r3978j3387O3588J7304j83607M6772Q8555o8842M5155K4929m0805P7175
2255c7788r8818K2088l4197j04808l2270J149J61362K0618o1540P0376M4447p7641
2243a27022j11561k2877J09240R8640j29740j23686O4748M1106M150J0099L2877
2232a54026R297j40622m8395J62262Q4226o8475P736M5207k4562M8288q7841m1801
2220b08706R780M7532k6096L0389O1995j46321K14047N038k61400J09691j3256
2209a77307m2529J826J16187p0883J12864k7012j64348q026R0365L9409N043k6493
2197a50904P9637o1037P7166M697k5070K1165q6693L3113j81365k6442J58342
2186a57391m8460O9630l4405j05447m0903Q3817o3705O965M8452M6927N6166L1112
$$ plain form
2174 -107242 -53905 -124994 -195741 -283575 -161132 -143470 -316293 -328906 -278495 -228831 -322681
2163 -322681 -265411 -278290 -250197 -233942 -303246 -263486 -314441 -179031 -115203 -15682 -132529
2152 -132529 -231248 -113599 -149074 -179041 -190826 -305256 -264640 -105817 -247859 -211509 -197898
2141 -197898 -168469 -215003 -253068 -173809 -175110 -256360 -333409 -348778 -321825 -288432 -171140 -43911
2129 -43911 -171105 -181457 -280968 -224576 -282531 -177986 -132681 -197896 -309110 -305103 -288683
2118 -288683 -308901 -140587 -106395 -151028 -266304 -343130 -333742 -177837 -118622 -70219 -73919
2107 -73919 4505 31492 154821 140657 -16126 -168568 -196967 -117061 -181629 -98789 -76096
2096 -76096 -148890 -242757 -186307 -204559 -127326 -72317 394 17419 -14509 -22819 -130307 -219662
$$ packed form
2174a07242N3337p1089p0747q7834J22443J7662j72823j2613N0411M9664r3850
2163c22681N7270j2879K8093J6255o9304L9760n0955J35410O3828R9521j16847
2152a32529r8719J17649l5475k9967j1785j14430M0616J58823j42042L6350J3611
2141a97898K9429m6534l8065P9259j301q1250p7049j5369K6953L3393J17292J27229
2129d3911j27194j0352r9511N6392n7955J04545M5305o5215j11214M007J6420
2118b88683k0218J68314L4192m4633j15276p6826R388J55905N9215M8403l700
2107g3919P8424K6987J23329j4164j56783j52442k8399P9906o4568Q2840K2693
2096g6096p2794r3867N6450j8252P7233N5009P2711J7025l1928q310j07488q9355
$$ plain form
2084 -219662 -269017 -272818 -285354 -179195 -103092 -231881 -170997 -182240 -158301 -208052 -242779
2073 -242779 -58787 29615 19390 -32732 -143609 -194919 -100143 -105927 -83415 -7761 34740
2062 34740 -13617 -92803 -154596 -170149 -144061 -186558 -295784 -174610 -112186 -119365 -53393 53506
2050 53506 11731 -81889 -133383 -96278 -81460 -130530 -166528 -130491 -7157 -75239 -179906
2039 -179906 -195819 -225676 -255180 -175793 9267 6919 -54437 -190586 -169561 -47949 -77263
2028 -77263 -151132 -229246 -244134 -212313 -217070 -151993 -116901 -81486 -62039 -64240 -152699 -165059
2016 -165059 -46442 -128771 -99152 -110696 -74008 -147712 -107103 -92852 806 -33538 -204779
2005 -204779 -247576 -79935 -118369 -81115 -119499 -173340 -116875 -172819 -134148 33188 -66833
$$ packed form
2084b19662m9355l801j2536J06159P6103j28789O0884j1243K3939m9751l4727
2073b42779J83992Q8402j0225n2122j10877n1310R4776n784K2512P5654M2501
2062C4740m8357p9186o1793j5553K6088m2497j09226J21174O2424p179O5972J06899
2050E3506m1775r3620n1494L7105J4818m9070l5998L6037J23334o8082j04667
2039a79906j5913k9857k9504P9387J85060k348o1356j36149K1025J21612k9314
2028g7263p3869p8114j4888L1821m757O5077L5092L5415J9447k201q8459j2360
2016a65059J18617q2329K9619j1544L6688p3704M0609J4251R3658l4344j71241
2005b04779m2797J67641l8434L7254l8384n3841N6465n5944L8671J67336j00021
$$ plain form
1994 -66833 -138249 -137055 -228784 -170936 -186813 -157510 -113329 -73700 -93963 -138649 -108976 -11243
1982 -11243 -133822 -106711 20631 88926 5933 -140120 -195877 -120297 -183270 -222013 -145914
1971 -145914 -198677 -147830 -19422 -2669 53023 90062 -3493 58120 17498 95510 59822
1960 59822 -76185 -113419 -148145 -78052 -57580 6216 -121400 -139032 -188900 -102077 -67794
1949 -67794 -158757 -91488 -130210 -114084 -70544 -56437 -107631 -180373 62005 104850 -23930
1938 -23930 38664 63536 -63534 -92719 -94592 -123722 -92994 -172377 -166212 -63242 -165418 -11469
1926 -11469 -86751 -128595 -160225 -196177 -88853 -82628 -47610 -167474 -155059 -75532 -126722 -186870
1914 -186870 -165371 -119431 -241967 -178217 -118038 6101 -104017 -146073 -118851 -162350 -33621
$$ packed form
1994f6833p1416J194r1729N7848j5877K9303M4181L9629k0263m4686K9673R7733
1982a1243j22579K7111J27342O8295q2993j46053n5757P5580o2973l8743P6099
1971a45914n2763N0847J28408J6753N5692L7039r3555O1613m0622P8012l5688
1960E9822j36007l7234l4726P0093K0472O3796j27616j7632m9868Q6823L4283
1949f7794r0963O7269l8722J6126M3540J4107n1194p2742K42378M2845j28780
1938b3930O2594K4872j27070k9185j873k9130L0728p9383O165J02970j02176J53949
1926a1469p5282m1844l1630l5952J07324O225L5018j19864J2415P9527n1190o0148
1914a86870K1499M5940j22536O3750O0179J24139j10118m2056K7222m3499J28729
$$ [...]
##END NTUPLES=NMR SPECTRUM
##END=
