##TITLE=1H_DE-80H_X3
 200.13MHz, d2o
 8 sc
 
 19ns.26.2.2025
##JCAMPDX= 6.0         $$ Bruker NMR JCAMP-DX V2.0
##DATA TYPE= NMR SPECTRUM
##DATA CLASS= NTUPLES
##ORIGIN= UXNMR, Bruker Analytische Messtechnik GmbH
##OWNER= pz
$$ XWIN-NMR		Version 3.5
$$ Wed Jul  2 12:14:22 2025 Russian Standard Time (UT+4h)  Yarkov@DPX200
##.OBSERVE FREQUENCY= 200.1313
##.OBSERVE NUCLEUS= ^1H
##.ACQUISITION MODE= SIMULTANEOUS
##.ACQUISITION SCHEME= undefined
##.AVERAGES= 8
##.DIGITISER RES= 18
##SPECTROMETER/DATA SYSTEM= spect
##.PULSE SEQUENCE= zg30
##.SOLVENT NAME= CDCl3
##.SHIFT REFERENCE= (INTERNAL, CDCl3, 0, 15.4593)
##AUDIT TRAIL= $$ (NUMBER, WHEN, WHO, WHERE, WHAT)
$$ ##TITLE= Audit trail, XWIN-NMR		Version 3.5
$$ ##JCAMPDX= 5.01
$$ ##ORIGIN= Bruker BioSpin GmbH
$$ ##OWNER= Yarkov
$$ C:/Bruker/XWIN-NMR/data/yarkov2/nmr/H-C/1/pdata/1/auditp.txt
$$ ##AUDIT TRAIL=  $$ (NUMBER, WHEN, WHO, WHERE, WHAT)
(   1,<2025-07-02 12:13:20.12 +0400>,<Yarkov>,<DPX200>,
      <created by zg, POWCHK disabled, PULCHK disabled
       configuration hash MD5:
       00 E9 B6 7A A2 85 ED C7 34 08 36 98 17 FE 4E 26
       data hash MD5: 16K
       2A 54 76 DE 40 F5 05 61 38 EC 95 E1 62 33 DB 87>)
(   2,<2025-07-02 12:13:23.60 +0400>,<Yarkov>,<DPX200>,
      <Start of raw data processing
       efp BC_mod = 2 LB = 0.25 FT_mod = 6 PKNL = 1 PHC0 = -1361.479 PHC1 = 18.42521 SI = 16K 
       data hash MD5: 16K
       3F AB CC F2 08 21 8F 96 52 1E 81 B4 C2 7C E5 4C>)
(   3,<2025-07-02 12:13:50.12 +0400>,<Yarkov>,<DPX200>,
      <pk PHC0 = 18.40912 PHC1 = -30.77573 
       data hash MD5: 16K
       16 AF 03 6F 35 D8 35 7B B5 DE BD E3 78 8C 75 9A>)
$$ ##END=
$$ 
$$ hash MD5
$$ C4 3D E0 87 83 AB 00 04 DA 04 DB 63 08 0E 94 9F
##$RELAX= 
##$RELAX= 
##$RELAX= 
##$RELAX= 
##$RELAX= 
##$RELAX= 
$$ Bruker specific parameters
$$ --------------------------
##$DU= <C:/Bruker/XWIN-NMR>
##$EXPNO= 1
##$NAME= <H-C>
##$PROCNO= 1
##$TYPE= <nmr>
##$USER= <yarkov2>
##$AMP= (0..31)
100 100 100 100 100 100 100 100 100 100 100 100 100 100 100 100 100 100 
100 100 100 100 100 100 100 100 100 100 100 100 100 100 
##$AQSEQ= 0
##$AQ_mod= 1
##$AUNM= <au_zg>
##$AUTOPOS= <>
##$BF1= 200.13
##$BF2= 200.13
##$BF3= 200.13
##$BF4= 200.13
##$BF5= 200.13
##$BF6= 200.13
##$BF7= 200.13
##$BF8= 200.13
##$BYTORDA= 1
##$CFDGTYP= 0
##$CFRGTYP= 5
##$CHEMSTR= <none>
##$CNST= (0..31)
1 1 145 1 1 1 1 1 1 1 1 1 1 1 1 1 1 1 1 1 1 1 1 1 1 1 1 1 1 1 1 1 
##$CPDPRG= <>
##$CPDPRG1= <>
##$CPDPRG2= <>
##$CPDPRG3= <>
##$CPDPRG4= <mlev>
##$CPDPRG5= <mlev>
##$CPDPRG6= <mlev>
##$CPDPRG7= <mlev>
##$CPDPRG8= <mlev>
##$CPDPRGB= <>
##$CPDPRGT= <>
##$D= (0..31)
0 0.7 0 0 0 0 0 0 0 0 0 0.03 0 0 0 0 0 0 0 0 0 0 0 0 0 0 0 0 0 0 0 0 
##$DATE= 1751443999
##$DBL= (0..7)
120 120 120 120 120 120 120 120 
##$DBP= (0..7)
150 150 150 150 150 150 150 150 
##$DBP07= 0
##$DBPNAM0= <>
##$DBPNAM1= <>
##$DBPNAM2= <>
##$DBPNAM3= <>
##$DBPNAM4= <>
##$DBPNAM5= <>
##$DBPNAM6= <>
##$DBPNAM7= <>
##$DBPOAL= (0..7)
0.5 0.5 0.5 0.5 0.5 0.5 0.5 0.5 
##$DBPOFFS= (0..7)
$$ [...]
##$SUBNAM2= <"">
##$SUBNAM3= <"">
##$SUBNAM4= <"">
##$SUBNAM5= <"">
##$SUBNAM6= <"">
##$SUBNAM7= <"">
##$SUBNAM8= <"">
##$SUBNAM9= <"">
##$SW= 18.0517328524113
##$SWIBOX= (0..15)
0 0 2 0 0 0 0 0 0 0 0 0 0 0 0 0 
##$SW_h= 3612.71676300578
##$TD= 16384
##$TD0= 1
##$TE= 0
##$TE2= 300
##$TE3= 300
##$TEG= 300
##$TL= (0..7)
0 120 120 120 120 120 120 120 
##$TP= (0..7)
150 150 150 150 150 150 150 150 
##$TP07= 0
##$TPNAME0= <>
##$TPNAME1= <>
##$TPNAME2= <>
##$TPNAME3= <>
##$TPNAME4= <>
##$TPNAME5= <>
##$TPNAME6= <>
##$TPNAME7= <>
##$TPOAL= (0..7)
0.5 0.5 0.5 0.5 0.5 0.5 0.5 0.5 
##$TPOFFS= (0..7)
0 0 0 0 0 0 0 0 
##$TUNHIN= 0
##$TUNHOUT= 0
##$TUNXOUT= 0
##$USERA1= <user>
##$USERA2= <user>
##$USERA3= <user>
##$USERA4= <user>
##$USERA5= <user>
##$V9= 5
##$VALIST= <valist>
##$VCLIST= <CCCCCCCCCCCCCCC>
##$VD= 0
##$VDLIST= <DDDDDDDDDDDDDDD>
##$VPLIST= <PPPPPPPPPPPPPPP>
##$VTLIST= <TTTTTTTTTTTTTTT>
##$WBST= 1024
##$WBSW= 4
##$XGAIN= (0..3)
0 0 0 0 
##$XL= 0
##$YL= 0
##$YMAX_a= 254743
##$YMIN_a= -163468
##$ZGOPTNS= <>
##$ZL1= 120
##$ZL2= 120
##$ZL3= 120
##$ZL4= 120
##$ABSF1= 0
##$ABSF2= 0
##$ABSG= 0
##$ABSL= 0
##$ALPHA= 0
##$AQORDER= 0
##$ASSFAC= 0
##$ASSFACI= 0
##$ASSFACX= 0
##$ASSWID= 0
##$AUNMP= <proc_1d>
##$AZFE= 0.1
##$AZFW= 0.1
##$BCFW= 0
##$BC_mod= 2
##$BYTORDP= 0
##$COROFFS= 0
##$CY= -3
##$DATMOD= 1
##$DC= 0
##$DFILT= <>
##$DTYPP= 0
##$F1P= 0
##$F2P= 0
##$FCOR= 1
##$FTSIZE= 16384
##$FT_mod= 6
##$GAMMA= 0
##$GB= 0
##$INTBC= 1
##$INTSCL= 3.241238e-09
##$ISEN= 128
##$LB= 0.25
##$LEV0= 0
##$LPBIN= 0
##$MAXI= 10000
##$MC2= 0
##$MEAN= 0
##$ME_mod= 0
##$MI= 1.114404
##$NCOEF= 0
##$NC_proc= -8
##$NLEV= 6
##$NOISF1= 3.799351
##$NOISF2= 2.8
##$NSP= 0
##$NTH_PI= 0
##$NZP= 0
##$OFFSET= 15.45932
##$PC= 1
##$PHC0= -1343.07
##$PHC1= -12.35052
##$PH_mod= 1
##$PKNL= yes
##$PPARMOD= 0
##$PSCAL= 0
##$PSIGN= 0
##$REVERSE= no
##$SF= 200.130012483668
##$SI= 16384
##$SIGF1= 3
##$SIGF2= 2
##$SINO= 0.751879
##$SIOLD= 32768
##$SREGLST= <19F.Aceton>
##$SSB= 0
##$STSI= 16384
##$STSR= 0
##$SW_p= 3612.71676300578
##$SYMM= 0
##$S_DEV= 0
##$TDeff= 16384
##$TDoff= 0
##$TI= <>
##$TILT= no
##$TM1= 0
##$TM2= 0
##$TOPLEV= 0
##$USERP1= <user>
##$USERP2= <user>
##$USERP3= <user>
##$USERP4= <user>
##$USERP5= <user>
##$WDW= 1
##$XDIM= 16384
##$YMAX_p= 453926472
##$YMIN_p= -3058944
$$ End of Bruker specific parameters
$$ ---------------------------------
##NTUPLES= NMR SPECTRUM
##VAR_NAME=  FREQUENCY,     SPECTRUM/REAL,   SPECTRUM/IMAG
##SYMBOL=    X,             R,               I
##VAR_TYPE=  INDEPENDENT,   DEPENDENT,       DEPENDENT
##VAR_FORM=  AFFN,          ASDF,            ASDF
##VAR_DIM=   16384,         16384,           16384
##UNITS=     HZ,            ARBITRARY UNITS, ARBITRARY UNITS
##FACTOR=    0.220516191357247, 1,           1
##FIRST=     3093.87391826978, 0,            0
##LAST=      -518.842844735999, 0,           0
##MIN=       -518.842844735999, -3058944,    0
##MAX=       3093.87391826978, 453926472,    0
$$ Real data points
##PAGE= N=1
##DATA TABLE= (X++(R..R)), XYDATA
$$ [...]
13680 -1969183 -2018380 -2149445 -2158810 -1697982 -1849444 -2184103 -2005755 -2212290 -2070577 -2050389
13670 -2050389 -1825990 -1541841 -1758084 -2016538 -2230885 -1986521 -2049431 -2119422 -2076428 -1917681
13660 -1917681 -2041323 -2266138 -2010178 -1892102 -2058916 -2072137 -2125113 -1812962 -1905271 -2109990
13650 -2109990 -2006779 -1895868 -2342170 -2121559 -2181620 -2461325 -2380644 -2323975 -2522729 -2398539
13640 -2398539 -2210317 -2376593 -2550885 -2620290 -2113725 -2271205 -2388790 -2213781 -2215427 -2040477
13630 -2040477 -1900992 -2121369 -1993345 -2067906 -2138214 -2279605 -2343787 -2194881 -2150489 -2132541
13620 -2132541 -2034143 -2102730 -2433771 -2369165 -1916250 -1936747 -1932715 -1886211 -1949964 -1973786 -2087559
13609 -2087559 -1940091 -2028541 -2021639 -2271425 -2312221 -2425419 -2571053 -2423053 -2451987 -2203661
13599 -2203661 -2195959 -2009055 -2187380 -1979627 -1935124 -2058797 -1940916 -2064269 -1970297 -1901047
13589 -1901047 -1836888 -2118326 -2312782 -2188259 -1953386 -2227884 -2296134 -2188272 -2241708 -2282676
13579 -2282676 -2084089 -2099254 -2002938 -1854529 -1972597 -1958623 -2045266 -2010132 -1939641 -2139664
13569 -2139664 -2387641 -2171599 -2122652 -2244465 -2239629 -2424996 -2349082 -2334035 -2412015 -2495928 -2473610
13558 -2473610 -2124039 -2043168 -2202438 -2172381 -2162738 -2182889 -2070544 -2243854 -2306583 -2214446 -2218418
13547 -2218418 -2368007 -2345386 -2332492 -2070179 -2367319 -2466794 -2302469 -2260267 -2219828 -2187890
13537 -2187890 -2413805 -2423739 -2374851 -2487390 -2227721 -1978440 -2045503 -2100625 -2163269 -2246937 -2200658
13526 -2200658 -2220010 -2044218 -2238690 -2151596 -2027015 -1906058 -2090685 -2519469 -2491846 -2264175
13516 -2264175 -1930824 -1945240 -2187580 -2126823 -1840338 -1636258 -1722789 -1891076 -2070602 -2040110
13506 -2040110 -2178401 -2539768 -2205328 -1796443 -2005963 -1976867 -2013150 -2402563 -2487343 -2208257
13496 -2208257 -1939066 -1996488 -2174109 -2380654 -2153276 -2088580 -2275428 -2382755 -2397690 -2293621
13486 -2293621 -2177660 -2149855 -2214595 -1949093 -1912485 -1943147 -1768922 -1866258 -2290150 -2133900
13476 -2133900 -1911216 -1918265 -2040057 -2176035 -2268090 -2102641 -2299682 -2267972 -2305979 -2282361
13466 -2282361 -2067031 -2012079 -2286726 -2499695 -2443418 -2168360 -2233978 -2220916 -2143839 -1981995
13456 -1981995 -1842988 -2175855 -2245593 -2235130 -2021429 -2174418 -2302589 -2564300 -2483317 -2392151
13446 -2392151 -2473758 -2187816 -2031378 -1886719 -1715939 -2014488 -1948277 -1833180 -2054894 -2238648
13436 -2238648 -2314764 -2417326 -2215606 -2164921 -2308035 -2197695 -1973254 -1901510 -2059893 -2004631
13426 -2004631 -2138768 -2111018 -1760895 -2227231 -2251671 -2229160 -2422796 -2178714 -2287373 -2187749
13416 -2187749 -2126804 -2390572 -2440105 -2427380 -2313514 -2237574 -2248015 -2143993 -1999908 -2139233
13406 -2139233 -2401869 -2537723 -2359487 -2438148 -2346633 -2174705 -2332422 -2371844 -2184256 -2147929
13396 -2147929 -2472722 -2444509 -2222314 -2076735 -2044085 -2146348 -2264412 -2422567 -2415978 -2372424
13386 -2372424 -2311591 -2291920 -2150827 -2350431 -2291259 -2131569 -2228027 -2397535 -2127079 -2156738
13376 -2156738 -2286484 -2365964 -2530307 -2494594 -2312861 -2131608 -2260813 -2265758 -2317915 -2091168
13366 -2091168 -2176268 -2160146 -2208139 -2241431 -2133255 -1947541 -2091128 -2054871 -2120609 -2292339
13356 -2292339 -2063242 -2019202 -2152570 -2077479 -2218785 -2163410 -2241975 -2095571 -2079376 -2179530
13346 -2179530 -2256339 -2222253 -2171541 -2245566 -2504040 -2389575 -2259335 -2412306 -2441746 -2205267
13336 -2205267 -2110188 -2248377 -2465901 -2295319 -2202018 -1790926 -1909176 -2274562 -2215599 -2428530
13326 -2428530 -2458948 -2420488 -2122577 -2182382 -2119196 -2075794 -1902779 -2113929 -2171135 -2218207 -2131055
13315 -2131055 -2408183 -2412530 -2100173 -2184917 -2209585 -2434353 -2484631 -2048267 -2022442 -1803264
13305 -1803264 -1914762 -1995199 -2120940 -2163651 -1921212 -1900615 -1952207 -1859175 -1996771 -2360495
13295 -2360495 -2073046 -2087966 -1984619 -1831597 -1852058 -1854632 -1993808 -2221361 -1863854 -2124672
13285 -2124672 -2143281 -2027539 -2351822 -2550188 -2376600 -2438227 -2240013 -2109607 -2415470 -2268006
13275 -2268006 -2421243 -2412980 -2108733 -2161081 -2403225 -2251419 -2285150 -2049856 -2294204 -2566774
13265 -2566774 -2308967 -2319069 -2397721 -2305632 -2082309 -2058258 -2170365 -2324746 -2521577 -2110389
13255 -2110389 -2146149 -1994071 -1724166 -2173395 -2282875 -2175557 -2152278 -2148993 -2241171 -2067713
13245 -2067713 -2022472 -2096485 -2016526 -2290138 -2176192 -2218138 -2190797 -2080865 -2210642 -2210124 -2262356
13234 -2262356 -2385800 -2420289 -2136317 -2409207 -2463472 -2310971 -2324422 -2485681 -2814325 -2372550
13224 -2372550 -2151309 -2377318 -2310679 -2382823 -2271288 -2125720 -2276342 -2307848 -2236617 -2230682
13214 -2230682 -2243210 -2256480 -2331460 -2516887 -2418017 -2270267 -2284601 -2126628 -2274193 -2343748
13204 -2343748 -2273909 -2204411 -2382938 -2519707 -2294276 -2247038 -2409612 -2407966 -2533679 -2494402
13194 -2494402 -2291411 -2233341 -2214811 -2296946 -2561465 -2629446 -2380977 -2144395 -2352020 -2239394
13184 -2239394 -2061811 -2237424 -2367053 -2063872 -1741928 -1787142 -2007389 -2272300 -2244158 -2261386
13174 -2261386 -2204872 -2291463 -2271027 -2328510 -2248697 -2271904 -2257371 -2166651 -2189697 -2165931 -2258980
13163 -2258980 -2250939 -2272274 -2266305 -2308581 -2346586 -2391003 -2046421 -1905596 -2277396 -2149103 -2230573
13152 -2230573 -2465291 -2493029 -2147767 -2233854 -2375717 -2266663 -2356193 -2352969 -2073827 -1895592
13142 -1895592 -1995475 -1966287 -1966010 -2221365 -2108807 -2022094 -2167925 -2334874 -2343090 -2252134 -2264865
13131 -2264865 -1965850 -2129273 -2264049 -2081696 -2060447 -2313109 -2355186 -2168056 -2194669 -2098943
13121 -2098943 -2203154 -2085696 -2109825 -2166676 -1907555 -2107890 -2112920 -2232633 -2194733 -2209049
13111 -2209049 -2110595 -2068162 -2144111 -2222930 -2075514 -2269174 -2353369 -2094351 -2153167 -2150343 -2086756
13100 -2086756 -2285819 -2292222 -2078556 -1938462 -1987986 -1988405 -2055102 -2329896 -2342199 -2248767 -2169266
13089 -2169266 -2120201 -1945284 -2039693 -2266707 -2323504 -2359695 -2373740 -2177490 -2229463 -2163766 -2287277
13078 -2287277 -2296503 -2022612 -2012401 -2028501 -2271199 -2241800 -2213891 -2155745 -2196917 -2332322 -1992116
13067 -1992116 -1976265 -1996594 -2002923 -2015120 -2058635 -2168934 -1893977 -1950806 -2245405 -2224675 -2002790
13056 -2002790 -2187246 -2184191 -1975220 -2056748 -2480946 -2391870 -2308634 -2461434 -2260018 -1880893
13046 -1880893 -1946338 -2112886 -2148817 -2183235 -2128382 -2207250 -2214395 -2029493 -2068442 -2274079 -2451541
13035 -2451541 -2361072 -2295456 -2283872 -2232499 -2346786 -2000093 -1994696 -1976624 -1898211 -2057540 -2250924
13024 -2250924 -2168399 -2185111 -2059843 -2039365 -2245564 -2439426 -2469152 -2264683 -2262769 -2187807 -2164717
13013 -2164717 -2315656 -2128953 -2011963 -2128233 -2057629 -2107654 -2170072 -2350060 -2365694 -2167169
13003 -2167169 -2060269 -2139300 -2305638 -1912012 -2072391 -2122153 -2089547 -2095812 -2043342 -2157645
12993 -2157645 -2221098 -2244877 -2465345 -2364091 -2133112 -1988152 -1980302 -1997414 -1977090 -1964291 -2028448
12982 -2028448 -1922621 -1969971 -2015915 -2082889 -2258576 -2397517 -2475276 -2379478 -2291856 -2277405 -2169137
12971 -2169137 -2230027 -2098568 -1926986 -2129103 -2126662 -1978949 -2057231 -1973367 -1889862 -2214167
12961 -2214167 -2358252 -2354543 -2331794 -2436231 -2493341 -2369145 -2182555 -2359107 -2142593 -2008936
12951 -2008936 -1908288 -1942927 -2103316 -2186196 -2000577 -1901110 -2170960 -2303802 -2339773 -2228940
12941 -2228940 -1851107 -1979047 -2278177 -2288801 -2480623 -2321992 -2284384 -2360202 -2351643 -2414674
12931 -2414674 -2417136 -2508682 -2449116 -2270401 -2127078 -2318103 -2350932 -2112020 -1910023 -1982220
12921 -1982220 -2075962 -2326387 -2237781 -2130702 -2401547 -2383314 -2269289 -2333087 -2221087 -2182900
12911 -2182900 -2106816 -2188663 -2485167 -2374826 -2272544 -2119254 -1948613 -2298747 -2464628 -2474068
12901 -2474068 -2313794 -2148989 -1993784 -2033504 -2253283 -2217634 -1961960 -1920602 -2026541 -1861245
12891 -1861245 -2059898 -2192436 -2138886 -2116841 -2235750 -2088182 -1971374 -2136709 -2298201 -2326926
12881 -2326926 -2113103 -1958364 -2105688 -2257370 -2319220 -2154289 -2093696 -2134144 -2037984 -2118662
12871 -2118662 -2081867 -2149654 -2105896 -2214926 -2165390 -2462989 -2300679 -2257324 -2292508 -1943624
12861 -1943624 -1883866 -1954160 -2063245 -2245155 -2268209 -2034334 -2028067 -2243188 -2158468 -2117968 -2036249
12850 -2036249 -1993265 -2000034 -2274772 -2527303 -2418269 -2422945 -2345640 -2384310 -2286920 -2254426 -2389783
12839 -2389783 -2436193 -2321068 -2422275 -2268862 -2093166 -2004670 -2219889 -2254969 -2122717 -2187221
12829 -2187221 -2188968 -2215740 -2140103 -2071522 -2276802 -2159516 -2326529 -2474077 -2424591 -2412630 -2319007
12818 -2319007 -1992236 -2115554 -2283599 -2409680 -2154339 -1806464 -1899250 -1969198 -2232128 -2358444
12808 -2358444 -2240049 -2044504 -2217768 -2166740 -2032730 -2059262 -2302999 -2440013 -2306703 -2240950
12798 -2240950 -2308233 -2267196 -1908810 -1712320 -2012344 -2378828 -2232594 -2368893 -2268900 -2396843
12788 -2396843 -2248726 -2203775 -2311917 -2267482 -2235623 -2231636 -2459802 -2414415 -2144707 -1985761
12778 -1985761 -1887636 -1931793 -1909794 -1822085 -2024847 -2147248 -2241572 -2362698 -2108175 -2241119
12768 -2241119 -2353720 -2047841 -2005118 -2174120 -2082547 -2416382 -2273195 -1908130 -1991456 -1968602
12758 -1968602 -2017399 -2141331 -2122599 -2346425 -2339908 -2238133 -2263497 -2202822 -2220120 -2351720 -2406815
12747 -2406815 -2378487 -2359529 -2319938 -2392653 -2197371 -2204368 -2122884 -2226235 -2259739 -2117087 -2165556
12736 -2165556 -2325854 -2163832 -2153011 -2166229 -2593463 -2538604 -2523778 -2374170 -2400112 -2525567
12726 -2525567 -2489742 -2081337 -2178362 -2319256 -2227859 -2324226 -2222409 -2349495 -2293620 -2316145
12716 -2316145 -2163724 -1848689 -2054286 -2068643 -1924102 -2018755 -2182509 -2353915 -2123429 -2209297
12706 -2209297 -2389931 -2471074 -2453362 -2368841 -2365903 -2169497 -2021031 -2138018 -2283908 -2080338
12696 -2080338 -2115789 -2310336 -2332264 -2032817 -2097058 -2215335 -2145355 -2150811 -2154856 -2406074 -2458556
12685 -2458556 -2203379 -1941383 -2216504 -2017655 -1877275 -2119993 -2193470 -2249024 -2315188 -2263571
12675 -2263571 -1898893 -1829890 -1759342 -2169994 -2119195 -2276393 -2161826 -2027686 -2113592 -2135060
12665 -2135060 -2218626 -2106683 -2257676 -2397900 -2434919 -2330319 -2208295 -2379494 -2356648 -2434072
12655 -2434072 -2174010 -2133986 -2436799 -2613317 -2446568 -2041799 -2185679 -1987855 -2015997 -2061328
12645 -2061328 -2051013 -2102369 -2334552 -2145868 -2080644 -2063189 -2085231 -2094745 -2138310 -2446304 -2252498
12634 -2252498 -2146533 -2281616 -2089641 -2016845 -2093451 -2403717 -2627732 -2379408 -2113465 -2277512
12624 -2277512 -2377928 -2172083 -2202267 -2310086 -2192242 -2514371 -2495227 -2347900 -2531487 -2546130
12614 -2546130 -2572996 -2459212 -2358110 -2635179 -2528195 -2142315 -2120255 -2294113 -2173528 -2303342
12604 -2303342 -2163978 -2056052 -2114340 -2274655 -2126211 -1975943 -2170913 -2472604 -2417151 -2163837
12594 -2163837 -2266100 -2229666 -2007068 -2298263 -2220878 -2190612 -2273708 -2454885 -2573520 -2301393
12584 -2301393 -2390360 -2527298 -2482313 -2239191 -2155150 -2142082 -1975340 -2203730 -2205055 -2258590 -2335114
12573 -2335114 -2150995 -2412342 -2430891 -2121778 -2007524 -2321898 -2475476 -2422394 -2371155 -2211508
12563 -2211508 -2134997 -2223862 -2315012 -2519233 -2275159 -2278260 -1966316 -1974616 -2368031 -2349434 -2059057
12552 -2059057 -2097999 -1941233 -2008792 -2116317 -1972756 -1985705 -2090525 -2013796 -1986676 -1865652
12542 -1865652 -1875568 -1917944 -2111000 -1930214 -1769433 -1993034 -1858722 -1872014 -2121441 -2081643
12532 -2081643 -2120409 -2208049 -2094553 -2327493 -2064789 -2168040 -2144205 -2270454 -2266386 -2176607
12522 -2176607 -2070853 -2325028 -2436626 -2265318 -2366549 -2360921 -2204812 -2136345 -2404505 -2473219
12512 -2473219 -2449373 -2221238 -2171683 -2211983 -2040095 -2161611 -2249667 -2311897 -2146010 -2172244
12502 -2172244 -2284399 -2353364 -2263549 -2158251 -2226361 -2305781 -2146821 -2141566 -2152338 -1990965 -2016831
12491 -2016831 -2280881 -2360038 -2510597 -2512359 -2188849 -2228543 -2153475 -2000539 -2345399 -2483047
12481 -2483047 -2237893 -2346815 -2030391 -1865669 -1852858 -2041814 -1925399 -2015944 -2057864 -1976252
12471 -1976252 -2212525 -2129640 -2363124 -2457002 -2004610 -2153829 -2375224 -2323224 -2220125 -2247371
12461 -2247371 -2439630 -2409803 -2350136 -2329641 -2085846 -2185787 -2180650 -2368742 -2188356 -2134631 -2271226
12450 -2271226 -2307643 -2332886 -2458498 -2353239 -2640356 -2433132 -2188663 -2160826 -2508481 -2635800
12440 -2635800 -2617996 -2617687 -2340405 -2089537 -2180225 -2264849 -2363654 -2424694 -2232096 -2302726 -2222610
12429 -2222610 -2305223 -2396907 -2384795 -2427154 -2408014 -2367569 -2343983 -2116552 -2204526 -2010168 -2104240
12418 -2104240 -2217461 -2091272 -2077064 -1969232 -2122600 -2232398 -1996612 -2098647 -1999861 -2176499
12408 -2176499 -1865962 -1938347 -2165868 -2074424 -2366968 -2264910 -2135682 -2097874 -2234450 -2672297
12398 -2672297 -2362305 -2015004 -2255512 -2165621 -2180295 -2184784 -1893313 -2014815 -2111064 -2211061
12388 -2211061 -2037935 -1886005 -1925928 -2073976 -2176423 -2212970 -2124183 -2185797 -2293635 -2343771
12378 -2343771 -2505485 -2601952 -2608833 -2406786 -2248588 -2274004 -2321317 -2509436 -2197669 -2130394
12368 -2130394 -2106547 -1833569 -2011617 -2023506 -1800171 -1968192 -1970818 -2233052 -1960051 -1967778
12358 -1967778 -2097104 -2259316 -2455213 -2333313 -2081190 -2215110 -2288156 -2016021 -2143927 -2367023
12348 -2367023 -2146775 -1964626 -2053956 -2023372 -2163834 -2264891 -2147304 -2317790 -2334534 -2102356
12338 -2102356 -2279258 -2214063 -2127829 -2210166 -2218784 -2329035 -2196137 -2187534 -2238872 -1998292 -2062643
12327 -2062643 -2134163 -2121013 -2200913 -2168183 -2143194 -2202093 -2307234 -2332319 -2208126 -2253076 -2080983
12316 -2080983 -1961817 -2139657 -2084947 -2312282 -2371970 -2103700 -2127752 -2271455 -2530041 -2525180
12306 -2525180 -2369847 -2158377 -2425395 -2452782 -2181691 -2016264 -2216620 -2192492 -2116228 -2120333
12296 -2120333 -2096242 -2157881 -2207095 -1978486 -2282674 -2355903 -2298853 -2202659 -2055991 -2073769 -1993526
12285 -1993526 -1899893 -2070126 -2118341 -1884713 -1799259 -1777079 -1751544 -2051806 -2054877 -2102822 -2226042
12274 -2226042 -2521441 -2400812 -2568670 -2489988 -2288115 -2227245 -2435597 -2407222 -2396203 -2464753
12264 -2464753 -2383550 -2440358 -2286164 -2323647 -2270816 -2419743 -2289393 -2196014 -2386639 -2249096
12254 -2249096 -2359782 -2352436 -2038508 -2020692 -2178571 -2191060 -2130284 -2307827 -2477183 -2298800
12244 -2298800 -1873659 -2370954 -2529780 -2400739 -2291222 -2408073 -2356034 -1975632 -1891760 -2145376
12234 -2145376 -2404927 -2338460 -2465049 -2470515 -2199261 -2169411 -2207708 -1910151 -1952865 -2280713
12224 -2280713 -2608624 -2598041 -2349405 -2108925 -2155693 -2115845 -2208792 -2171177 -2182792 -2197342 -2162836
12213 -2162836 -2140566 -2234556 -2189833 -2123040 -2174264 -2159109 -2271884 -2164476 -2340117 -2337092 -2167769
12202 -2167769 -2075552 -2186570 -2124644 -2269137 -2243632 -2187520 -2320322 -2201570 -2242267 -2336461
12192 -2336461 -2293415 -2174126 -1823483 -1807578 -1878672 -2241856 -2299520 -2391740 -2353016 -2085637
12182 -2085637 -2023064 -1931795 -1918650 -2175109 -2127248 -2092913 -1791821 -1819327 -2006478 -2055831 -2010172
12171 -2010172 -2109097 -2406734 -2164211 -2117157 -2360862 -2471580 -2474021 -2407291 -2405587 -2022390 -2191611
12160 -2191611 -2471609 -2645981 -2680113 -2363536 -2276623 -2410706 -2193540 -2090244 -2501701 -2471514
12150 -2471514 -2223755 -2224280 -2142999 -2141327 -2117331 -2451601 -2268129 -2278503 -2474147 -2679407 -2511357
12139 -2511357 -2146190 -2149605 -2209503 -2406925 -2234455 -2120435 -2077409 -2029814 -1867020 -2040152
12129 -2040152 -2121330 -2107012 -2234995 -2088637 -2158005 -2116534 -2358083 -2570844 -2429353 -2301015
12119 -2301015 -2250381 -2464720 -2584846 -2440095 -2282784 -2459496 -2219671 -2309274 -2270602 -2081711
12109 -2081711 -2132081 -2377824 -2251329 -2057225 -2067439 -2475275 -2605279 -2397459 -2334022 -2218963
12099 -2218963 -2222876 -2229776 -2272394 -2327127 -2243249 -2209487 -1992793 -1962455 -1983925 -1791468 -2066845
12088 -2066845 -2453900 -2453358 -2280521 -2138479 -2209246 -2333734 -2268134 -2155186 -2304232 -2167333
12078 -2167333 -2325694 -2158467 -2336224 -2460895 -2333877 -2168453 -2241029 -2127193 -2270499 -2097186
12068 -2097186 -2488198 -2626094 -2452899 -2276738 -2224324 -2253960 -2124303 -2356423 -2235215 -2380333
12058 -2380333 -2424291 -2272275 -2302769 -2328587 -2236120 -2298457 -2301401 -2241087 -2265172 -2414321 -2435232
12047 -2435232 -1973172 -1776954 -2142260 -2052733 -2371651 -2328730 -2286152 -2238257 -2306640 -2235413
12037 -2235413 -2036640 -2012915 -2260101 -2436069 -2205577 -2051909 -2237602 -2387096 -2246919 -2288803
12027 -2288803 -2042704 -1772460 -1967660 -2027339 -2382436 -2589629 -2253606 -2339275 -2177439 -2088591
12017 -2088591 -2098962 -2364006 -2424366 -2202665 -1949984 -1886074 -1846749 -2154051 -2136617 -2114789
12007 -2114789 -2332869 -2276867 -2169105 -2510915 -2496750 -2269756 -2046223 -1763644 -2052074 -2246239
11997 -2246239 -2295502 -2033568 -2087553 -2197724 -2239717 -2136247 -2428292 -2338829 -2301657 -1921725
11987 -1921725 -1775481 -1982621 -2262752 -2361426 -2334050 -2237010 -2094847 -2029464 -2218144 -2263532
11977 -2263532 -1882270 -2076120 -2323961 -2592478 -2483443 -2266228 -2464469 -2403063 -2473496 -2250138
11967 -2250138 -2370986 -2428272 -2346380 -2298811 -2164593 -2061152 -2029244 -2053946 -2060965 -2009569 -2307275
11956 -2307275 -2289980 -2091200 -2267845 -2075543 -1946364 -2088731 -2140353 -2251165 -2288529 -2173128
11946 -2173128 -2036881 -2267507 -2310457 -2051335 -2067769 -2506832 -2373215 -1923489 -1948786 -2105142
11936 -2105142 -2021976 -2278067 -2244517 -2012541 -2447107 -2543358 -2338110 -2084927 -2129945 -2248742
11926 -2248742 -2090017 -2214320 -2307755 -2363157 -2461478 -2235852 -2170564 -1883445 -2021974 -2113938
11916 -2113938 -2249929 -2228831 -2058585 -1990522 -1987624 -2051857 -1926216 -2026811 -2329798 -2415791
11906 -2415791 -2307490 -2354200 -2117461 -2169195 -2164125 -2364103 -2514693 -2372833 -2334955 -2467670
11896 -2467670 -2422811 -2327682 -2220847 -2041158 -2206908 -2288969 -2402595 -2161255 -2286604 -2491859
11886 -2491859 -2362681 -2122196 -2211345 -2134950 -1856231 -1855712 -2153421 -2020351 -2052258 -2161001
11876 -2161001 -1967190 -2043027 -2205112 -2318672 -2440617 -2301074 -2162122 -2355716 -2617810 -2522719
11866 -2522719 -2238323 -2069547 -2290135 -2320194 -2042563 -1950255 -1967456 -2054778 -2259469 -2004885
11856 -2004885 -1694550 -1820109 -2092672 -2135870 -2085745 -2050414 -2200029 -2295272 -2309842 -2298935
11846 -2298935 -2066685 -1636697 -2066821 -2311540 -1941852 -2044074 -2127433 -2101170 -2135892 -2201080
11836 -2201080 -2367460 -2267729 -2359596 -2351489 -2448863 -2138693 -2196858 -2158074 -2136799 -2201945 -2112148
11825 -2112148 -2190946 -1808162 -1616055 -2005310 -2022246 -1851478 -1896952 -2061118 -1824568 -1953013
11815 -1953013 -2174695 -1997667 -2120936 -1945430 -1856217 -1857533 -1863303 -1920734 -1852217 -1895373 -1825123
11804 -1825123 -1707079 -1818062 -1715754 -2187083 -2303889 -2504974 -2541758 -2449887 -2329421 -2152169
11794 -2152169 -2113068 -2136530 -1902776 -2025081 -1928506 -1953209 -2067169 -2030839 -2123930 -2125694 -2168982
11783 -2168982 -2134083 -2064263 -1903992 -1896476 -2107453 -1879988 -1910397 -1744345 -1977074 -2015326
11773 -2015326 -2067182 -2077898 -2035951 -1942165 -1777754 -1763651 -1864762 -1755838 -1887546 -1990782
11763 -1990782 -2015921 -1916580 -2078001 -2046482 -2131802 -2257494 -2056463 -1770386 -1834435 -1949761
11753 -1949761 -2076841 -2211611 -2050612 -1998559 -1997178 -2170064 -2204940 -1975170 -1686966 -1725308
11743 -1725308 -2118316 -2225942 -2191448 -2225306 -2089541 -2249234 -2073193 -2086008 -2199257 -2092686
11733 -2092686 -1819977 -1760688 -1881174 -2076107 -1859971 -1751611 -2010787 -2096389 -1908579 -1960500
11723 -1960500 -1942986 -1970879 -1887137 -2133798 -2410828 -2351549 -2354195 -2132596 -2105587 -2214496 -2042432
11712 -2042432 -2104770 -2171634 -2075115 -2375002 -2449871 -2497881 -2776360 -2287253 -2060985 -2024171
11702 -2024171 -2355815 -2557819 -2506775 -2247862 -2121075 -1941270 -2109593 -2155795 -2231262 -2399738
11692 -2399738 -2269556 -2220861 -2119454 -1932023 -1702938 -1931274 -2276637 -2057610 -1955419 -1874992
11682 -1874992 -1771879 -1697644 -1820736 -1695899 -1953997 -2159573 -2002252 -1917342 -1978950 -2333528
11672 -2333528 -2294116 -2234599 -2260692 -2292858 -2021662 -2201996 -2278037 -1997623 -1980216 -2186577
11662 -2186577 -2193484 -2047539 -1955388 -2132276 -2131927 -2160341 -2092756 -2128277 -2054620 -1915682 -1841766
11651 -1841766 -2001922 -2034434 -2033728 -1821918 -2049751 -2134810 -2121256 -1933102 -1856950 -2194452 -2187993
11640 -2187993 -1804398 -1891531 -2384060 -2138823 -1967636 -1922906 -2120088 -2207824 -2102446 -2053380
11630 -2053380 -2287718 -2128182 -2083663 -2211309 -2083240 -2041185 -2277886 -2548833 -2339223 -2348300
11620 -2348300 -2512359 -2369541 -2225638 -2260821 -2284733 -2216512 -2280698 -2339769 -2361611 -2028438
11610 -2028438 -2020818 -2148864 -2231643 -2250247 -2205576 -2463965 -2456495 -2257343 -2231630 -2292017 -2139854
11599 -2139854 -1949490 -1832350 -1932280 -2052743 -2292275 -2482277 -2051937 -1901760 -1810126 -1970841
11589 -1970841 -1924371 -1789851 -1876111 -1998976 -1871288 -1917878 -1965294 -1808991 -1955168 -2188716
11579 -2188716 -1970416 -1798711 -1998521 -1808315 -1648706 -1824774 -1887613 -1733072 -1809693 -1724958
11569 -1724958 -1936337 -2114085 -2123609 -1975320 -1983570 -1790495 -1761606 -1747696 -1907888 -1932108 -1676195
11558 -1676195 -1616597 -1647804 -1708518 -1785027 -1968236 -2237289 -2202193 -2066931 -2055849 -1906658
11548 -1906658 -1920429 -2115623 -1990082 -1894606 -2013312 -2025352 -1935726 -1697352 -1634522 -1837514
11538 -1837514 -1836994 -1827523 -1834944 -1697340 -1652518 -1670692 -1904748 -2085086 -2203042 -1962754 -1799563
11527 -1799563 -2264535 -2217423 -2121264 -1973439 -1905283 -1837473 -1984754 -2120949 -1987891 -2142058
11517 -2142058 -2186929 -1792622 -1715283 -2001760 -2077280 -2072845 -2084558 -2087751 -2136547 -2418235 -2502523
11506 -2502523 -2565461 -2333780 -1998323 -1956304 -2093310 -2318674 -2242744 -2150076 -2110291 -2055423
11496 -2055423 -2057766 -2006541 -2139906 -2088218 -1914522 -1833408 -1995122 -1939540 -2111535 -2056316 -1937897
11485 -1937897 -1973058 -1849911 -1739193 -1843544 -2023202 -2017621 -2094379 -2137473 -2070578 -2092456 -2175562
11474 -2175562 -2330008 -2236579 -2107400 -2200601 -2073954 -2146230 -2118234 -2046214 -2186269 -2284127
11464 -2284127 -2304813 -2248684 -2107139 -2202178 -2049216 -1933082 -2128631 -2295498 -2241023 -2030507
11454 -2030507 -1970052 -1881823 -2228544 -2302933 -2174102 -2008270 -2216229 -2189686 -2455896 -2336440
11444 -2336440 -2146574 -2271383 -2069302 -2319859 -2337510 -2017951 -2146449 -2389509 -2363751 -2209375
11434 -2209375 -1966816 -1780415 -1606311 -2065013 -1944163 -1757007 -1883709 -2041451 -1987600 -1849524
11424 -1849524 -2150063 -2118351 -2163244 -2117961 -1683028 -1867760 -1998802 -2170760 -2285306 -2144276
11414 -2144276 -2247694 -2226740 -2287853 -2158685 -2255875 -2422991 -2406273 -2341083 -2165938 -1799947
11404 -1799947 -1782691 -1841752 -1871580 -2132255 -2215103 -2123106 -2176734 -2244954 -2147945 -2250473 -2434330
11393 -2434330 -2260794 -1917381 -1882785 -2015045 -2093271 -2117596 -2100510 -1846709 -1981887 -2177822
11383 -2177822 -2079910 -1967214 -2025879 -2356287 -2317043 -2144123 -1916841 -2039625 -2050995 -2196177
11373 -2196177 -2184628 -2180608 -2095898 -1867535 -2003677 -2025749 -2191049 -2253591 -2400580 -2400709 -2174276
11362 -2174276 -2055390 -2214774 -2207728 -2443335 -2354267 -2428478 -2280106 -2389840 -2393570 -2169516
11352 -2169516 -2193872 -2322034 -2286104 -2120265 -2456222 -2443191 -2408944 -2399019 -2232428 -2350101
11342 -2350101 -2190220 -2265301 -2173149 -1809993 -2085000 -2202087 -1879718 -2023198 -2270561 -2222508
11332 -2222508 -2351230 -2709502 -2575428 -2275233 -2348227 -2238584 -1986519 -2035181 -2072238 -2078872
11322 -2078872 -2218221 -2107437 -2132722 -2311183 -2349501 -2111495 -2079563 -2294172 -2664011 -2637580
11312 -2637580 -2589265 -2294439 -2270646 -2341569 -2358339 -2048892 -1799843 -2000361 -1983391 -2020221
11302 -2020221 -1730349 -1905794 -2004952 -1809669 -2177801 -2516432 -2510635 -2386817 -2355534 -2220568
11292 -2220568 -2205082 -2247689 -2280841 -2199965 -2236354 -2165509 -2188787 -2009563 -1979577 -2278155 -2154219
11281 -2154219 -2281969 -2196110 -2175305 -2000681 -2374216 -2540683 -2378942 -2182792 -2005290 -2117600
11271 -2117600 -2054712 -2242073 -2259410 -2194440 -2384971 -2062213 -2132166 -2266828 -2015700 -2146189
11261 -2146189 -2043928 -2116833 -2002736 -2079766 -2192418 -2091664 -1916449 -2013072 -1962824 -2013761
11251 -2013761 -2125769 -2107124 -2230080 -2349949 -2274201 -2145086 -2407378 -2387078 -2152053 -1959252
11241 -1959252 -1729115 -1983173 -2317095 -2131723 -1951409 -1800692 -1910689 -2170314 -2029166
11232 -2029166 -2236749 -2286208 -2162885 -1965471 -2141623 -2405395 -2140296 -2193776 -2291678 -2191215
11222 -2191215 -2088219 -2106851 -2201183 -2156379 -2242583 -2143606 -1982389 -2282612 -2218233 -2005775
11212 -2005775 -1965524 -2032386 -2284656 -2070420 -1777899 -1849132 -2048784 -1978044 -1992483 -2035727
11202 -2035727 -1917200 -1847409 -2077891 -2280253 -2227909 -2119018 -2122482 -2110221 -1720496 -1622872
11192 -1622872 -1952232 -2023013 -1736079 -2041748 -2052150 -1777443 -1787345 -2081872 -2071065 -2183637
11182 -2183637 -2429108 -2379091 -2372571 -2445768 -2364668 -1978675 -2281867 -2420008 -2340440 -2128038
11172 -2128038 -2271115 -2469861 -2516877 -2351059 -2215536 -2400788 -2141643 -2349166 -2267338 -1962245
11162 -1962245 -1992787 -2156957 -2008982 -2182494 -2418161 -2398557 -2125440 -2332976 -2286813 -2141918
11152 -2141918 -2183768 -2201283 -2190161 -2245591 -2296462 -2286942 -2428518 -2458991 -2165798 -2335484 -2500811
11141 -2500811 -2376215 -2370420 -2376724 -2294115 -2258191 -2049050 -1919579 -1980325 -1959658 -1878970 -2187038
11130 -2187038 -2245028 -1968428 -2254375 -2244963 -2018973 -1941533 -2107144 -2235740 -2179277 -1965419
11120 -1965419 -2387322 -2308179 -2358997 -2355253 -2103557 -2102945 -1994330 -1817204 -2059667 -2020730 -2111590
11109 -2111590 -2089059 -1909537 -1820364 -1867499 -2153586 -2259352 -2474061 -2382708 -2304525 -2385799
11099 -2385799 -2368138 -2261996 -2133255 -2154852 -2323829 -2238612 -2228688 -2572638 -2556002 -2435312
11089 -2435312 -2217473 -2079901 -2020007 -2160938 -2358629 -2194714 -2253741 -2558745 -2578761 -2474793
11079 -2474793 -2460337 -2342505 -2320382 -2280074 -2373593 -2136813 -2052074 -2408343 -2437145 -2328498
11069 -2328498 -2379898 -2524058 -2385476 -2294297 -2316914 -2190670 -2106930 -2204864 -2113084 -2100728 -2056858
11058 -2056858 -2225820 -2292911 -2105700 -2038681 -2284428 -2205498 -2249658 -2269428 -2190113 -2149450 -2327833
11047 -2327833 -2437571 -2212351 -2124618 -2354815 -2205289 -1933534 -2274811 -2239276 -2186763 -2037618
11037 -2037618 -2056290 -2247072 -2375052 -2292123 -2479230 -2535476 -2349388 -2292370 -2121451 -2201121
11027 -2201121 -2292975 -2293800 -2576420 -2550114 -2092131 -2044243 -2356346 -2455584 -2378106 -2087130 -2305319
11016 -2305319 -2432140 -2295492 -2203826 -2512674 -2241634 -2548816 -2601044 -2382466 -2424924 -2526678
11006 -2526678 -2461370 -2249247 -2237073 -2370694 -2554359 -2343210 -2398869 -2593399 -2303772 -2125453
10996 -2125453 -2489974 -2285257 -2108512 -2077554 -2064254 -2070569 -2219192 -2361831 -2340023 -2257639
10986 -2257639 -2243137 -2338560 -2284023 -2395776 -2422342 -1989837 -2129496 -2344783 -2577284 -2784148
10976 -2784148 -2534737 -2361250 -2523939 -2408231 -2428418 -2277148 -2386310 -2695141 -2364616 -2361523
10966 -2361523 -2524795 -2575828 -2587001 -2543008 -2175589 -2174629 -2329388 -2455951 -2265325 -2504562
10956 -2504562 -2579549 -2297342 -2324195 -2238655 -2403442 -2469096 -2364011 -2325519 -2231361 -2202540 -2318346
10945 -2318346 -2382194 -2307611 -1831389 -1932327 -2311423 -2348451 -2479770 -2587295 -2705963 -2583833
10935 -2583833 -2537719 -2566815 -2619072 -2503050 -2483620 -2550027 -2332172 -2197286 -2218799 -2264291 -2365053
10924 -2365053 -2308256 -2193563 -2286874 -2271882 -2497912 -2174548 -2355531 -2420603 -2472046 -2159697
10914 -2159697 -2114675 -2203056 -2028511 -2176144 -2543424 -2543390 -2442774 -2646785 -2716856 -2531527 -2301912
10903 -2301912 -2376753 -2550976 -2488181 -2245914 -2309467 -2222454 -2272002 -2374440 -2264863 -2143997
10893 -2143997 -1984368 -2070727 -2011634 -2116156 -2286663 -2045950 -2094530 -2362549 -2372724 -2321714
10883 -2321714 -2183135 -2273473 -2487743 -2494922 -2459986 -2311008 -2408572 -2362680 -2420797 -2433217 -2214002
10872 -2214002 -2002169 -2259680 -2260262 -2269345 -2402700 -2553346 -2537465 -2324423 -2196500 -2394599
10862 -2394599 -2389911 -2350975 -2393783 -2505917 -2760196 -2509395 -2469070 -2348817 -2164175 -2032205
10852 -2032205 -1911395 -2122334 -2169758 -2295456 -2329953 -2595128 -2654855 -2709995 -2543326 -2510994
10842 -2510994 -2641062 -2645838 -2449712 -2365496 -2384953 -2250016 -2295005 -2461908 -2199658 -2249698
10832 -2249698 -2491714 -2479868 -2360268 -2208861 -2298624 -2339475 -2198919 -2210159 -2306388 -2253865
10822 -2253865 -2392246 -2227212 -2435395 -2426911 -2460592 -2513435 -2184319 -2397615 -2479885 -2390955
10812 -2390955 -2443960 -2432472 -2338639 -2125417 -2148819 -2147086 -2053752 -1843790 -2033279 -2088660 -1935188
10801 -1935188 -2000985 -2320925 -2426428 -2370630 -2460461 -2558290 -2267810 -2403537 -2492340 -2338942
10791 -2338942 -2198103 -2273290 -2288979 -2314958 -2240242 -2439674 -2348398 -2510025 -2513930 -2399693 -2367113
10780 -2367113 -2243501 -2228965 -2127299 -2171245 -2158404 -2259490 -2178285 -2585033 -2353098 -2341258
10770 -2341258 -2289000 -2348018 -2461224 -2463820 -2418467 -2281108 -2115482 -2082288 -2202524 -2002091
10760 -2002091 -2003077 -2142132 -2167683 -2205910 -2250297 -2528400 -2393925 -2167068 -2291149 -2347933 -2366158
10749 -2366158 -2364640 -2405325 -2209135 -2147127 -2119142 -2293664 -2078352 -2134723 -2449387 -2373042 -2268836
10738 -2268836 -2329535 -2619484 -2604799 -2529112 -2292602 -2696330 -2576691 -2357706 -2444488 -2369543
10728 -2369543 -2316213 -2432609 -2538663 -2349734 -2280488 -2554012 -2783004 -2688318 -2486083 -2570821
10718 -2570821 -2625510 -2637214 -2411524 -2469948 -2419234 -2315055 -2225034 -2034964 -2175225 -2372148
10708 -2372148 -2370024 -2251065 -2421705 -2229872 -2230339 -2355830 -2355096 -2251660 -2176444 -2145112 -2140107
10697 -2140107 -2072496 -2041867 -2276116 -2106847 -2277798 -2580139 -2412582 -2495435 -2436780 -2503175
10687 -2503175 -2314656 -2128521 -2295597 -2453910 -2118797 -2121376 -2331630 -2347348 -2055894 -2158855
10677 -2158855 -2337361 -2182230 -1997751 -2128661 -2256578 -2587897 -2700471 -2599453 -2714520
10668 -2714520 -2531527 -2439991 -2386574 -2390416 -2232411 -2219996 -2214361 -2382376 -2344314 -1882732 -2066653
10657 -2066653 -2431152 -2355427 -2302025 -2236091 -2344326 -2405042 -2243936 -2188295 -2206190 -2189019 -2181997
10646 -2181997 -2234378 -2379396 -2403697 -2369667 -2142170 -2225001 -2624539 -2674967 -2289357 -2142307
10636 -2142307 -2447552 -2435304 -2353263 -2462389 -2419493 -2178563 -2584488 -2778800 -2476992 -2247776
10626 -2247776 -2299602 -2285980 -2226006 -2027236 -2093267 -2262535 -2334734 -2228219 -2069988 -2347807
10616 -2347807 -2572038 -2596242 -2458272 -2208615 -2531845 -2402437 -2212382 -2359020 -2480425 -2403007
10606 -2403007 -2267945 -2407646 -2459030 -2579847 -2439308 -2436205 -2423555 -2177971 -2120455 -2458425
10596 -2458425 -2679976 -2845823 -2641772 -2560170 -2515914 -2397858 -2667637 -2576420 -2429326 -2395088
10586 -2395088 -2287476 -2451417 -2368826 -2592550 -2565852 -2665056 -2308152 -2229863 -2364277 -2324875
10576 -2324875 -2304865 -2502607 -2534025 -2438242 -2573834 -2547593 -2585667 -2454852 -2450518 -2474713 -2572582
10565 -2572582 -2479864 -2333838 -2456996 -2478315 -2328251 -2300718 -2350754 -2349759 -2594144 -2650167 -2733339
10554 -2733339 -2788325 -2839817 -2668357 -2749544 -2814764 -2500591 -2404941 -2377765 -2382643 -2604955 -2303971
10543 -2303971 -2250943 -2596592 -2530135 -2493816 -2448221 -2379507 -2491194 -2709525 -2691104 -2606874 -2593505
10532 -2593505 -2622666 -2495253 -2627511 -2424613 -2386757 -2356526 -2310271 -2136798 -2223932 -2315684
10522 -2315684 -2033727 -2284782 -2583676 -2364579 -2375920 -2456856 -2346670 -2259984 -2160937 -2346685
10512 -2346685 -2419962 -2530877 -2419871 -2300403 -2447882 -2404189 -2350602 -2285004 -2295370 -2500737
10502 -2500737 -2623398 -2293603 -2174816 -2463212 -2491608 -2430810 -2562157 -2515337 -2603539 -2398286
10492 -2398286 -2444956 -2421156 -2376528 -2448981 -2156005 -2385927 -2275607 -2195134 -2433964 -2346864
10482 -2346864 -2420843 -2532356 -2676138 -2623710 -2502910 -2404628 -2632029 -2589966 -2314389 -2345088
10472 -2345088 -2504862 -2588823 -2424870 -2394647 -2718003 -2862530 -2667461 -2520611 -2465654 -2465282
10462 -2465282 -2458284 -2416351 -2529906 -2504486 -2447897 -2329013 -2547744 -2398029 -2386611 -2620734
10452 -2620734 -2475272 -2497889 -2767697 -2612522 -2518382 -2767476 -2536829 -2407476 -2367678 -2302789
10442 -2302789 -2368948 -2361315 -2698414 -2753113 -2700766 -2691446 -2380919 -2527161 -2487917 -2679682 -2644047
10431 -2644047 -2612687 -2557630 -2633864 -2741874 -2664268 -2433553 -2236114 -2348092 -2440230 -2669867
10421 -2669867 -2493002 -2627105 -2847092 -2676388 -2436573 -2235218 -2336812 -2466797 -2553997 -2782330
10411 -2782330 -2642283 -2604439 -2665899 -2486936 -2613763 -2718645 -2691419 -2609126 -2644100 -2563433
10401 -2563433 -2525753 -2395515 -2371523 -2222884 -2283772 -2532847 -2311674 -2327666 -2592608 -2491420
10391 -2491420 -2294145 -2407233 -2610752 -2507187 -2654839 -2786518 -2569006 -2408124 -2237587
10382 -2237587 -2214974 -2372877 -2410642 -2603408 -2495111 -2490469 -2443713 -2619048 -2439009 -2540906
10372 -2540906 -2345709 -2205683 -2490883 -2526391 -2651080 -2750033 -2632565 -2823559 -2716251 -2647493
10362 -2647493 -3058944 -3016586 -2805480 -2871243 -2833723 -2542714 -2298828 -2336594 -2649367 -2607785
10352 -2607785 -2579109 -2586712 -2495961 -2355840 -2351910 -2368503 -2294778 -2349382 -2535551 -2254661 -2045631
10341 -2045631 -2324736 -2412332 -2229800 -2254860 -2238034 -2404988 -2448581 -2521003 -2427196 -2496656 -2374567
10330 -2374567 -2523855 -2606588 -2817785 -2820814 -2749317 -2791649 -2736239 -2731887 -2524052 -2464009 -2777757
10319 -2777757 -2701449 -2448539 -2460851 -2325543 -2407298 -2698700 -2680388 -2501761 -2540863 -2737665
10309 -2737665 -2785641 -2558419 -2527539 -2513167 -2664961 -2701874 -2658368 -2655264 -2730864 -2637662 -2493334
10298 -2493334 -2365426 -2353999 -2452593 -2395808 -2207134 -2366026 -2521781 -2489182 -2536508 -2424920
10288 -2424920 -2466240 -2259094 -2339900 -2324022 -2428214 -2296136 -2200106 -2260638 -2279965 -2188194 -2251504
10277 -2251504 -2091974 -2296329 -2645154 -2518787 -2477718 -2708988 -2687112 -2454936 -2835604 -2702042
10267 -2702042 -2561033 -2578652 -2486979 -2505315 -2277917 -2350459 -2342571 -2038257 -2306170 -2367284 -2028594
10256 -2028594 -1884202 -2226835 -2302723 -2416299 -2474139 -2061188 -2109632 -2312591 -2099095 -2254893
10246 -2254893 -1902166 -1906759 -2129630 -2258141 -2211002 -1872887 -1824906 -1866528 -1746325 -1958105
10236 -1958105 -2221022 -2169412 -2020614 -1855773 -2108546 -2160078 -1799355 -1925931 -1989058 -2135554
10226 -2135554 -2172266 -2086570 -2123618 -1969943 -1854982 -1838303 -1692675 -1436374 -1445281 -1737526
10216 -1737526 -1500891 -1451218 -1702757 -1455166 -1470622 -1521801 -1689334 -1654127 -1568340 -1382121
10206 -1382121 -1068915 -879128 -1428817 -1460410 -1418761 -1541461 -1307768 -1241318 -1139974 -1178008
10196 -1178008 -1317864 -1418979 -1582452 -1444587 -1519182 -1850033 -1696387 -1494683 -1250397 -936145
10186 -936145 -1167101 -1076874 -1127656 -1149462 -885253 -1064451 -1253799 -1191686 -1049974 -1063852
10176 -1063852 -1129944 -1064724 -1073710 -1137727 -913781 -935319 -858606 -951028 -830502 -905224 -1069803
10165 -1069803 -919725 -1101377 -904945 -500120 -146387 -543305 -504692 -556780 -601334 -680558
10155 -680558 -933428 -497764 -282214 -420238 -723756 -736953 -643402 -774731 -923969 -849714
10145 -849714 -963218 -1002140 -978309 -870555 -1248383 -936778 -715321 -859669 -877878 -852816
10135 -852816 -686449 -896596 -1032836 -968239 -1019708 -1060514 -1045377 -1150064 -1122073 -1117248 -1128883
10124 -1128883 -1021508 -1212410 -1191009 -1226158 -1368087 -1483740 -1278802 -1208107 -1414546 -1395097
10114 -1395097 -1158320 -1286003 -1508187 -1254822 -1114126 -1285413 -1669151 -1582778 -1220732 -1399041
10104 -1399041 -1221964 -1272979 -1276688 -1200126 -1233077 -1284372 -1565308 -1521886 -1585339 -1657133 -1451739
10093 -1451739 -1663897 -1824566 -1751321 -1800418 -1761862 -1751113 -1741649 -1637454 -1615416 -1596542 -1652576
10082 -1652576 -1644432 -1680990 -1739988 -1595547 -1727388 -1741626 -1716361 -1712782 -1715205 -1959838 -1965686
10071 -1965686 -1596321 -1848772 -1742894 -1936465 -1903531 -2071183 -1956655 -1999902 -2285031 -2051186
10061 -2051186 -2119204 -2171866 -1952287 -1856511 -1987079 -2093328 -1975265 -2150803 -2216226 -2261061
10051 -2261061 -2096234 -1981162 -1818374 -1861311 -1902041 -2142357 -2223687 -2278738 -2390351 -2137695
10041 -2137695 -2092107 -2024456 -1791659 -1823932 -2015424 -1963889 -2076051 -2028566 -2421949 -2282195
10031 -2282195 -2174268 -2387983 -1919683 -1738186 -2058356 -1982669 -1702246 -1773258 -1789924 -1850562
10021 -1850562 -2034332 -2085648 -2373990 -2233528 -2199178 -2288303 -2345519 -2301903 -2142865 -2046397
10011 -2046397 -1976033 -2144109 -2089866 -1979546 -2028249 -2117067 -2236229 -2269983 -2437982 -2417917
10001 -2417917 -1997832 -2224676 -2296661 -2082713 -2080273 -2061332 -1912412 -2134804 -2239310 -1887559
9991 -1887559 -1939219 -2150371 -2263961 -2272063 -2044957 -2077588 -1866830 -1933155 -2142134 -1875448
9981 -1875448 -2002015 -2103279 -2126240 -1967331 -2253898 -2251675 -2108526 -2210780 -2242839 -2079621
9971 -2079621 -1896461 -1835733 -2017533 -2081022 -1952639 -1954353 -2158467 -1953643 -1878670 -1865411 -2140587
9960 -2140587 -2106598 -2157187 -1963754 -1938134 -1979857 -1944453 -2095763 -2043456 -1928654 -1763801 -1898141
9949 -1898141 -1680469 -1608768 -1469345 -1294539 -1478883 -1653136 -1770084 -1793661 -1604092 -1417588
9939 -1417588 -1449483 -1597159 -1567199 -1398768 -1321709 -1263312 -1440727 -1710405 -1840053 -1662395
9929 -1662395 -1559107 -1746916 -1601348 -1520748 -1775179 -1894423 -1876969 -1763105 -1429052 -1615664
9919 -1615664 -1813202 -1867730 -1703442 -1721015 -1847573 -1709780 -1720895 -1462080 -1367106 -1659622
9909 -1659622 -1820139 -1814920 -1761970 -2005535 -1876386 -1958940 -1899287 -1833943 -1942251 -2007177 -2056750
9898 -2056750 -2196825 -2113753 -1706710 -1584478 -1924149 -1792035 -1607571 -1645806 -1682193 -1837797
9888 -1837797 -1712766 -1744925 -1751960 -1855109 -1865026 -1935512 -1847282 -1853008 -1735626 -1836837 -1696247
9877 -1696247 -1819037 -2014573 -1906660 -1703746 -1919934 -2096441 -2027464 -1999496 -2042011 -2212731
9867 -2212731 -2280340 -2076024 -1989135 -1970873 -1919790 -2205004 -2138498 -1744534 -1744955 -1939791 -1693538
9856 -1693538 -1762643 -1939388 -2005647 -1722185 -1736579 -1907622 -1907235 -1885605 -1973196 -2072369 -2136891
9845 -2136891 -1949147 -2162044 -2217513 -2324126 -2321737 -2324574 -2268925 -2385159 -2419354 -2343664 -2208592
9834 -2208592 -2392748 -2274967 -2295432 -2321387 -2296157 -2132946 -1893505 -2086606 -2059041 -1953089
9824 -1953089 -1841617 -1999242 -2210509 -2284611 -2159371 -2023149 -1846597 -2050594 -2130547 -2218824
9814 -2218824 -2331953 -1946652 -2069032 -2296976 -2010575 -2023037 -1908509 -1952366 -2253202 -2332835
9804 -2332835 -2349936 -2313678 -2056591 -2275430 -2346506 -2127160 -2228380 -2495284 -2284668 -2221340
9794 -2221340 -2126012 -2088713 -2335006 -2297021 -2218724 -2224877 -2317571 -2226908 -2301399 -2281707 -1889164
9783 -1889164 -1892925 -2236407 -2111417 -2151234 -2197530 -2161980 -2396279 -2624936 -2423009 -2170233
9773 -2170233 -2170514 -1983927 -2221338 -2352149 -2380093 -2283240 -2215621 -2245127 -2355010 -2364781 -2510885
9762 -2510885 -2470741 -2445153 -2611111 -2353878 -2369184 -2422234 -2230786 -2372924 -2269658 -2338986
9752 -2338986 -2453773 -2334483 -2406982 -2658593 -2637995 -2289305 -2177037 -2418258 -2387026 -2458526
9742 -2458526 -2482486 -2495279 -2631793 -2460910 -2469238 -2685736 -2448550 -2179847 -2127807 -2503792
9732 -2503792 -2415572 -2136930 -2212348 -2286783 -2412017 -2504728 -2384641 -2161124 -2120099 -2278349
9722 -2278349 -2163065 -1983285 -2031909 -2012422 -2048853 -2115117 -2158562 -2112038 -2201880 -2263153 -2132948
9711 -2132948 -2035506 -2321874 -2237445 -2334512 -2367182 -2242868 -2153468 -1981152 -2259354 -2360922
9701 -2360922 -2071347 -1979984 -2042446 -2151493 -1921547 -1690828 -1966951 -2142946 -2244464 -2287965
9691 -2287965 -2123780 -2065285 -2006165 -2014171 -2401693 -2319991 -2255686 -2306729 -2052701 -1957782 -1981970
9680 -1981970 -2156052 -2159257 -2164885 -2258963 -2217676 -1888864 -2098310 -2015929 -2059161 -2486844 -2462519
9669 -2462519 -2058928 -2068870 -2008356 -1926775 -1908595 -1893212 -2208084 -1907389 -1994269 -2049085 -2327745
9658 -2327745 -2408280 -2160793 -2086490 -2003282 -2003081 -1964399 -2089239 -1936195 -2067348 -1941559 -2277111
9647 -2277111 -2135681 -2086696 -2068272 -2003046 -2036737 -1826776 -1821627 -1749528 -1925289 -2216074 -2298278
9636 -2298278 -2021251 -1760348 -1958999 -1794185 -2014962 -2249220 -2158320 -2162578 -2091484 -2054712
9626 -2054712 -1992885 -1848170 -1880062 -1962416 -1856559 -1915441 -1726287 -1702221 -1497014 -1461269 -1592366
9615 -1592366 -1680415 -1913298 -1808161 -1795273 -1779901 -1562897 -1612070 -1466875 -1539215 -1550365 -1517160
9604 -1517160 -1671205 -1861113 -1890669 -1892268 -1857100 -1451194 -1358636 -1525127 -1827220 -1873182 -1807282
9593 -1807282 -1730624 -1515484 -1595874 -1496785 -1704257 -1914527 -1949551 -2061536 -1970795 -1820548
9583 -1820548 -1957794 -1819489 -1731246 -1561972 -1484649 -1293563 -934718 -1067452 -1142337 -1423113
9573 -1423113 -1651330 -1660009 -1446489 -1365395 -1491489 -1528326 -1722440 -1885107 -1932185 -1812636
9563 -1812636 -1684810 -1372043 -1097622 -1351809 -1350058 -1389629 -1403726 -1470081 -1568974 -1389572 -1415859
9552 -1415859 -1422668 -1399025 -1623147 -1770143 -1640356 -1582436 -1314669 -1397617 -1410793 -1720580 -1867508
9541 -1867508 -2011989 -1856700 -1848860 -1983009 -1869523 -1592338 -1580969 -1531967 -1604712 -1496244
9531 -1496244 -1518887 -1969840 -2042844 -1803684 -1872108 -2186076 -2146258 -1874705 -1966078 -1913378 -1750417
9520 -1750417 -1851162 -1550347 -1779973 -1808654 -1678297 -1692130 -1860848 -2230644 -2290886 -2137502
9510 -2137502 -2055966 -1887130 -1599651 -1291319 -1601363 -1539242 -1547060 -1689958 -1841000 -1798878
9500 -1798878 -1864607 -1951249 -1929809 -1675363 -1880395 -1993637 -1712675 -1978726 -1910860 -1884294
9490 -1884294 -1630831 -1747649 -1856341 -1790321 -1640363 -1630348 -1711024 -1733850 -1561780 -1457724
9480 -1457724 -1570515 -1538612 -1548642 -1376527 -1776818 -1849427 -1654408 -1728343 -1818573 -1597905
9470 -1597905 -1336664 -1209295 -1300701 -1508490 -1391587 -1442950 -1539027 -1440219 -1535435 -1095344
9460 -1095344 -1131388 -1151957 -906548 -898674 -1157246 -1137402 -1118274 -1010468 -851085 -954034 -959415
9449 -959415 -825117 -765544 -1053310 -910591 -663682 -740133 -675412 -682050 -1082159 -1048808 -770300
9438 -770300 -699391 -913116 -919383 -1053309 -1007855 -1026184 -962323 -916717 -855892 -854212 -796624 -645327
9426 -645327 -667919 -670786 -556675 -469796 -401401 -346522 -228167 -171452 -42444 -54538 -386115
9415 -386115 -384415 -347216 -190889 78282 -242192 -381158 -244418 -340896 -353365 -3477 98795
9404 98795 183462 342955 429742 716905 1131771 1317187 1159251 999734 746153 526125
9394 526125 430990 -76734 -359259 -316518 -597679 -482798 -290391 -291082 -533174 -411985 -330408
9383 -330408 -87832 -238403 -313762 -625816 -481641 -217404 -238346 -339571 -607379 -562315
9373 -562315 -398954 -183389 -249864 -178425 -221145 -168963 -347130 -180042 93158 -336830
9363 -336830 -371450 -142825 130462 142978 285617 305970 62233 -85600 177182 375325
9353 375325 432593 385149 360594 496875 485827 706184 901266 704047 621792 658949 597929
9342 597929 826364 1055280 1070859 834681 743313 695608 931362 890237 954688 1008006 1355891
9331 1355891 1280860 843330 909457 1018200 1046475 1131286 1316740 1382915 1310796 1343654 1580667
9320 1580667 1675083 1677621 1535133 1252671 1322910 1433059 1196742 1089302 1616721 1666642
9310 1666642 1351802 1089594 1126680 1220520 1375234 1418815 1430530 1454322 1700021 1474565
9300 1474565 1238779 1309610 1067666 945080 1308098 1448643 1446158 1126207 1131908 1272591
9290 1272591 1444268 1620810 1833488 1891043 1956511 1950476 1693125 1652002 1284479 1323539 1274421
9279 1274421 1299920 1432530 1571825 1492559 1428221 1371965 1366668 1361392 1118206 1184835 1222429
9268 1222429 1264697 1484047 1518652 1768259 1721031 1835901 2061371 1941832 1765421 1817019
9258 1817019 1883703 1867282 1931576 1590468 1615291 1918816 2063769 2332220 2376166 2394191 2138416
9247 2138416 2267384 2455792 2691468 2758467 2925298 3102324 3199332 3298792 3431511 3651704
9237 3651704 3616112 3232866 3242950 3381265 3659665 4001037 4338380 4416686 4489923 4929959
9227 4929959 5323305 5467571 5950244 6397198 6575700 6807394 6953132 7488428 7604850 7969837
9217 7969837 8309800 8920192 9390988 9476965 10172432 11235827 12629056 13488277 14395032
9208 14395032 15108858 15639730 16506308 16756581 16626097 16775053 16865533 16740092 16472808 16167797
9198 16167797 15460884 15184968 15263576 14939909 15081847 15326232 15607513 15457969 15446098 15474731
9188 15474731 15485241 15534427 15601705 15565303 15562322 15992483 16644146 17476355 18108277 18905882
9178 18905882 19544813 20043501 20274545 20144515 19656414 19426662 19557412 19592278 19949047 20118538
9168 20118538 20428230 20630153 20284857 19958594 19432674 18613452 17387764 16454588 15544126
9159 15544126 14619765 14078564 13481074 12870602 12449329 11867774 11597593 11579297 11691686 11307030
9149 11307030 11307639 11700726 11436005 11060949 10999334 10655288 10503752 10393056 10443727 10303135
9139 10303135 10025224 10195045 10144226 10080440 9948123 9963462 9898519 9733346 9721365 9701633
9129 9701633 9422298 9498282 9399739 9633572 9616700 9628446 9699966 9692765 9506388 9699508 9688461
9118 9688461 9972467 10126459 10066861 10201243 10470766 10743010 10945542 11342335 11360830 11679734
9108 11679734 12032822 12513859 13030228 13494087 13597196 14045752 14655574 15328143 16283430
9099 16283430 17056932 18057757 18689767 19185464 19874975 20596210 21394297 22167470 22812235
9090 22812235 23212053 23328640 23449072 23151030 23040032 23017083 22853776 22873480 22988230 22597268
9080 22597268 22456525 22501127 22564400 22654934 22408711 22415951 22668543 22914057 23288546 23787216
9070 23787216 24623040 25804282 26789467 27298060 27892055 28565504 29567764 30737739 31912602
9061 31912602 32931111 33646776 33893044 33984605 34540647 34658479 34369244 34498653 34464302 33483472
9051 33483472 32743689 32322768 31614413 31166125 30641343 30239214 29948482 29683732 29080513
9042 29080513 28635970 28072873 27819656 27318347 27032683 26524512 26080021 25954028 25853970
9033 25853970 26079487 25933146 25958282 26114428 26655089 27087453 27778925 28137584 28690927 29357059
9023 29357059 29919511 30453638 30971381 31834321 32577693 33249837 34466353 35193466 36287544
9014 36287544 37336220 38423598 39381846 40461734 41109789 41798754 42401087 42543022 42655666
9005 42655666 42290187 42202570 42236197 41920604 41649353 41318659 41142678 41047590 41114693 41064026
8995 41064026 41737520 42321665 43168501 44150125 45091327 46043448 47402532 48945480 50750667
8986 50750667 52781461 54542676 56073413 58085686 60018655 62307239 64636422 66968328
8978 66968328 69324845 71525094 73748906 76494432 79238558 82220314 84813522 86583234
8970 86583234 86848448 86277808 85525676 85002670 84739666 84958866 85561653 86628588 88435887
8961 88435887 90036522 90965807 91256394 91582570 92137031 92382390 92825680 93802323 95689094
8952 95689094 98134778 101291386 104501649 108085906 112299862 117131251 123083846 129927917
8944 129927917 137371319 145807828 155375554 165573151 176385470 186188267 194636914 202990247
8936 202990247 211698696 222227271 235140143 250754142 268929478 288273742 313830335
8929 313830335 347086801 386671801 423675277 453926472 449371893 420145940 382226127
8922 382226127 347039095 317799724 288951723 265147781 245416002 231587288 221761557
8915 221761557 215784757 211873789 211156661 213452342 218767953 225692527 233055844 238435343
8907 238435343 240967228 240398644 237292988 231188480 222813709 212267785 201092503 190534362
8899 190534362 181606984 173840484 167909495 162964238 159129103 156595164 155205151 154543445
8891 154543445 154728631 155371855 157176052 160281533 164444039 169455952 176125766 184275324
8883 184275324 194365196 206124299 219153968 233234142 248439997 262606348 275051887
8876 275051887 285908600 293945797 298095360 298852437 294706173 287024939 276601882 264442299
8868 264442299 251170882 237574781 225633769 215496622 207100327 200572667 194961917
8861 194961917 190540649 186859380 183677841 180753605 178663046 177245773 176253672 175886762
8853 175886762 176057513 176110085 176181173 176329018 177049949 177599929 178448039 179801976 181027408
8844 181027408 182670221 183953836 185038753 185061727 184589263 183108853 180428261 177067737
8836 177067737 172864778 168390404 163455622 158279661 153564163 148702920 143539778 138625654
8828 138625654 134164573 131027434 128599645 126820834 125694252 124291890 122619543 120962583
8820 120962583 119421007 117461719 114749266 111882367 109170628 106577519 104677448 103021079
8812 103021079 101956227 101146813 100864340 100245880 100101218 100232410 100615858 100775562 100796589
8803 100796589 100035912 98764484 96950348 94668506 92613137 90904148 88960731 87513200
8795 87513200 86382303 85286250 84858007 84358314 84231430 84006433 84005560 83735378 82522060
8786 82522060 80936004 79352901 77711978 76181431 74969971 73697380 72710034 72280882
8778 72280882 71993851 71273978 70227639 69014003 67524918 66524115 65350473 64629689 63981703
8769 63981703 63161513 62429835 61731083 61265589 61011932 60912828 60572677 60180779 59670150 59467598
8759 59467598 59056669 58092629 57466489 56558205 55568762 54545132 53474795 52853012 51978364
8750 51978364 51684032 51347373 51066255 50805788 50446131 49684253 48593804 47695060 46617678
8741 46617678 45672252 44840210 44276806 43565423 43193337 42443557 41957434 41751985 41439957
8732 41439957 41252495 40755022 40422165 40316938 40013318 39741494 39352347 39007185 38467432
8723 38467432 37824450 37529085 36932702 36388034 36022258 35728856 35069498 34893797 34440504
8714 34440504 34027978 33552609 33085634 32982001 32734984 32507977 32239814 31671149 31785637
8705 31785637 31407879 31223801 31125051 30672612 30873589 30391257 30295715 30001950 29208867 28505218
8695 28505218 28700771 28586162 28265157 27923124 27477420 27210363 26900787 26626387 26366789
8686 26366789 26618326 26221083 25882853 25981580 26235460 26007423 25816321 25934207 26051303 25915304
8676 25915304 25699056 25545061 25757855 26056885 25713998 25588816 25370919 25245391 25471117
8667 25471117 25419648 25318762 25169296 25054843 24899051 24551605 24325080 24329549 24167875 23838474
8657 23838474 23893281 23856944 23531540 23390424 23408550 23279526 23147035 22941680 23075631 22800892
8647 22800892 22575968 22648697 22623623 22572979 22498223 22408881 22520107 22455652 22899993 23417262
8637 23417262 23467186 23742585 23932811 23831387 24045295 24230357 24263195 24157113 24398462 24505582
8627 24505582 24326386 24057743 23855695 23378845 23300891 23215789 22653634 22553711 22495336 22218769
8617 22218769 21788613 21834724 21716218 21095633 21069306 21186610 20951347 20709809 20543402 20514257
8607 20514257 20699909 20881342 20914536 21225818 21601571 21905273 22086604 22459732 22538671 22701779
8597 22701779 22694010 22600204 22490870 22255967 22030383 21496576 21066141 20752824 20332503 20093584
8587 20093584 19786751 19391121 18527913 18716048 19256535 19132574 19293771 19145243 19219531 19337463
8577 19337463 19350865 19416260 19707819 20057300 20158441 20214176 20647268 20990685 21073490 21139956
8567 21139956 21174646 21212984 21123321 20965382 20606531 20332167 19923016 19488690 19015670 18369544
8557 18369544 17931511 17551252 17082607 16977644 16860477 16549172 16304723 16228238 16189039 16175838
8547 16175838 16385669 16344968 16240402 16442554 16507745 16717902 16711021 16538435 16506932 16768572
8537 16768572 16816881 16760665 16741954 16722877 16929665 16868116 16724533 16897625 16488774 16303485
8527 16303485 16328361 16180802 15867038 15637641 15640967 15713019 15661773 15399664 15315757 15404306 15504479
8516 15504479 15501214 15509046 15647966 15758398 15684479 15587591 15326419 15267489 14894765 14539861 14443140
8505 14443140 14230417 13956943 13792665 13889853 13992986 14039239 14336053 14261294 14405238 14353771
8495 14353771 14290701 14142554 14009687 13799413 13898496 13895667 13707038 13379314 13421209 13449599
8485 13449599 13335137 13159993 13008936 12754543 12531972 12529508 12441466 12294240 11895857 12031105
8475 12031105 11962687 11734268 11605131 11282402 11401542 11249270 10711000 10587671 10737587 10763911
8465 10763911 10611157 10676405 10594147 10482097 10523650 10250711 10162305 10198419 10290052 10368410 10325242
8454 10325242 10420187 10302716 10329711 10424969 10731349 10941095 10851410 10702261 10651156 10293524
8444 10293524 10350117 10299071 9887584 9425634 9363501 9145827 9230230 9332107 9023893 8581531
8434 8581531 8473506 8511035 8263089 8190686 8030368 7882079 7747550 7621019 7492752 7195407
8424 7195407 7458976 7307794 7362717 7335617 6987454 7087336 6633889 6782557 6763335 6761214 6783245
8413 6783245 6702464 6980602 7104552 6857280 6633042 6737472 6744222 6645580 6479022 6481282 6546901
8402 6546901 6642442 6412380 6275792 6240340 5928291 5867773 6085752 5919354 5567160 5585563
8392 5585563 5625612 5665491 5670300 5725685 5651782 5447995 5603661 5842202 5801195 5508984 5456444
8381 5456444 5551901 5661006 5758209 5393439 5317530 5319394 5245744 5055556 4992365 5188103 4981008
8370 4981008 4908983 4917103 4831286 4999889 5169893 5324893 5195281 5109684 4957771 5201611
8360 5201611 5470143 5480309 5428242 5276352 5321689 5303559 5234742 5304271 4951605 4854049 4796088
8349 4796088 4660888 4628759 4556421 4634932 4364933 4199172 3883662 3849872 3964248 3907901
8339 3907901 3957035 4068427 4205806 4096133 3896729 4073585 4052352 4024336 4137656 4168319
8329 4168319 4258893 4095859 4044041 3801178 3872658 4052526 3923610 3978116 4184995 3934778
8319 3934778 3777610 3829316 3720032 3778418 3928522 3902654 3806068 3801489 3801761 3915723 3952505
8308 3952505 4183775 4046107 3853262 3545838 3355388 3669820 3758876 3786860 3676645 3748470
8298 3748470 3887232 3836636 3752622 3804252 3802093 3926495 3834287 3675743 3513807 3553732 3609830
8287 3609830 3228910 3038322 2984585 2698210 2828881 2908223 2961353 2845919 2543381 3026286
8277 3026286 3241264 3188410 3002708 2980013 3317130 3312357 2967237 3157628 3029970 2809841
8267 2809841 3006626 2890327 2798812 2880125 2922169 2820507 2646458 2717246 2722634 2698255 2686334
8256 2686334 2548445 2829310 3006051 2989274 2783078 2760157 2821332 2982968 2990037 2762988
8246 2762988 2778141 2561674 2593534 2688402 2709383 2546130 2559017 2528558 2577687 2887272 2942379
8235 2942379 2698529 2810135 2885566 2820076 2614656 2384556 2434409 2316388 2368056 2602135
8225 2602135 2652828 2716416 2498216 2388373 2316732 2390453 2333908 2257915 2182857 2390963 2274107
8214 2274107 2106985 2156641 2097109 2263574 2260375 2063252 2292304 2096280 2170855 2025976
8204 2025976 1970185 1836176 2051204 2225500 2292404 2358192 2375935 2152280 2220321 1971095
8194 1971095 1557500 607281 -2509852 -212059 1433213 1637063 1897513 1756890 1972417
8185 1972417 1831622 1697374 1821665 2004368 1769950 1718086 1725401 1978498 2016920 1802957
8175 1802957 1733851 1861362 1773933 1834149 1750555 1669772 1606789 1354923 1217996 1447733 1614621
8164 1614621 1448233 1362291 1589224 1469226 1680389 1371154 1281933 1238373 1348951 1336157
8154 1336157 1277165 1175809 1137824 1444819 1194370 1011856 1238889 1415252 1163497 1335930
8144 1335930 1302329 1225161 1432975 1336345 1244405 1109611 1024035 1048588 973541 1093498 1042820
8133 1042820 1045851 1041889 1076798 1107218 1358265 1126229 905136 1028270 876639 960887 1002767
8122 1002767 1211524 1362187 1469001 1317531 1113883 1059436 1019921 915031 820640 785018
8112 785018 861566 1066432 1194816 1031795 979889 1006368 1141471 1194837 1204619 1360557 1205853
8101 1205853 1099528 1101158 1235882 778756 1029055 903361 771337 783071 927427 1193075
8091 1193075 1169769 1144715 806743 991465 1013804 848843 745797 754308 930468 732738
8081 732738 563207 782042 957694 1001693 847279 769458 867427 968976 888277 899929 761036
8070 761036 879840 817071 918450 824854 593500 619578 846407 826778 761597 797945 800533
8059 800533 813509 816774 834485 843439 729752 839454 699115 725888 991856 1047823 988370
8048 988370 870055 872814 845021 764451 623532 829081 975907 1087160 982214 903693 766350
8037 766350 724788 753787 843285 933798 888918 832663 1010559 1078074 846232 934879 985442
8026 985442 758341 701926 856092 852910 671972 713201 783196 639875 626576 555228 621227
8015 621227 552919 544223 643949 883744 898498 548532 562974 555201 666289 911261 801681
8004 801681 1020565 800184 384105 454963 959230 1021401 855230 827540 664541 695345
7994 695345 539831 539777 710765 858356 709937 706189 765590 571720 453443 424520 413615
7983 413615 704626 654157 639734 359140 438458 439100 133895 407197 593949 659487 903404
7972 903404 675013 369182 598897 865822 978184 762816 1060673 1066358 999918 629154
7962 629154 595903 720518 558622 847901 719993 526768 340926 733527 774462 488927
7952 488927 423237 321880 544644 588285 627412 619057 330856 487701 642461 715361 728548
7941 728548 573067 518026 646040 733141 718170 594439 584027 355654 392481 302262 149771
7930 149771 38744 345830 442406 385958 400177 222072 618148 794876 728681 578275
7920 578275 450606 265219 443233 720570 572735 345572 196526 516309 655386 500254
7910 500254 396503 293078 373706 211058 206221 153079 405567 428280 360220 337058 407868
7899 407868 494863 324563 79038 116090 330131 667591 806246 709750 607647 306744
7889 306744 408652 650199 556838 371913 320088 150700 285512 491626 479250 272362
7879 272362 -1050 59817 259999 419036 166463 2650 214481 379610 356027 135001
7869 135001 79984 255399 386725 448812 338977 163954 222398 365391 447479 682183
7859 682183 607069 239681 314780 376252 369871 286264 160989 214661 117627 216974 231295
7848 231295 155485 310735 370876 677560 716330 384492 347974 282582 291771 460099 606505
7837 606505 662876 677114 418673 233898 184626 271801 319090 293861 226787 257191 453625
7826 453625 479526 335031 202922 56767 118551 296883 195889 121123 196930 192213 533318
7815 533318 615634 549382 633152 491398 637361 555702 671390 758391 564489 441224 486530
7804 486530 394634 722045 542607 288156 1336112 1358901 986431 675769 735647 845606
7794 845606 757364 900647 709914 844052 1083742 1175272 983690 818722 622549 673577
7784 673577 1011006 1046129 789145 602901 636972 758760 768227 688788 470062 435032 513709
7773 513709 635486 526353 490374 556579 558015 713029 796240 865094 949197 1004395 864194
7762 864194 591186 676365 747916 718003 1047454 1029645 863605 857135 956156 1106800 1286414
7751 1286414 1103108 955802 896865 773995 1131238 844842 851237 734954 777020 854404
7741 854404 691455 813694 731768 766591 971294 943248 1048144 1079791 1027020 1063355 937835
7730 937835 1138190 1250925 1176377 993692 927854 1150004 1419638 1317830 1487499 1409673
7720 1409673 1139886 1110745 1064205 1011355 848899 741562 1097866 869664 643183 881426
7710 881426 1052602 1216215 1085828 1003224 1068572 962227 1097883 1058617 884873 1128754
7700 1128754 1206895 1115505 910029 688470 754869 873540 1112865 937407 841093 903700
7690 903700 691788 1033148 1145015 1042488 1053008 1147588 982776 1183619 1357411 1224284
7680 1224284 1267188 1117880 906573 1129714 1248816 1212556 1083915 942356 1105407 1058378
7670 1058378 948774 806592 685975 654689 727232 944516 1051457 930765 876657 975189
7660 975189 918671 865872 1058816 874433 890583 1047741 1089437 954073 1109560 1259306
7650 1259306 1016122 874069 871401 1276891 1335720 1132236 746200 908748 1052904 924478
7640 924478 920437 970901 859858 960107 859027 865045 866334 870709 1165598 1027040 1019920 729321
7628 729321 637650 688328 905862 876448 926602 983132 1369153 1398191 1242372 1071160 1047660
7617 1047660 889210 1079923 1231267 1149939 1423692 1480174 1427337 1263338 1195845 1481858
7607 1481858 1452882 1530798 1791322 1660448 1876141 1999220 1908898 1974483 2053319 2520662
7597 2520662 2730168 2786994 3131718 3391033 3663292 4184457 4337099 4487316 4962282 5031853
7587 5031853 5159016 4871556 4742334 4135349 3686227 3550385 3434007 3234145 3006561 2853486
7577 2853486 2615374 2801493 2776105 2458285 2431927 2405133 2293244 1937965 2030081 2153060
7567 2153060 2216981 2120313 2034851 1843006 1866368 1897972 2013252 2235440 1919065 1948317 2137179
7556 2137179 1851678 1982474 1676338 1705044 1939330 2017957 2115539 2108634 2045196 2105831 2161613
7545 2161613 1961292 1678096 1856824 2065358 2162063 2331846 2188910 2361893 2311180 2325280
7535 2325280 2084962 2176699 2282600 2401760 2452084 2254314 2125799 2172287 2200140 2408127
7525 2408127 2483955 2672454 2576765 2776744 3015711 3027308 3063671 3168147 3367747 3485936
7515 3485936 3705795 3664840 3601089 3586100 3625559 3886646 3872079 3834010 3896334 3922546 4133528
7504 4133528 3971477 3595335 3376925 3559680 3389559 3247409 3412688 3373190 3521478 3442439
7494 3442439 3382392 3310641 3301978 3296464 3332940 3403396 3229584 3340692 3650862 3637454 3559945
7483 3559945 3870787 3878990 3876492 3746460 3939861 4000310 4115554 4404423 4084131 4037292 4188836
7472 4188836 4408014 4467089 4700094 4887858 5352321 5543064 5696571 5840406 6195912 6270524
7462 6270524 6454099 6698490 6694708 6936491 6787945 6826604 7012451 7351731 6975024 7084346
7452 7084346 7227286 7512281 7781829 8053447 8040902 8115257 8797817 9136282 9573268 9810142
7442 9810142 10088384 10166391 10192657 10445724 10139292 9774097 9558545 9231125 9171648 9384094
7432 9384094 9489249 9198699 9156406 9143805 9058947 9162725 9032255 9040652 9420445 9547122
7422 9547122 9478171 9649808 10082368 10332939 10261270 10356344 10832311 10698393 10733950 10739015 10701405
7411 10701405 10447577 10828865 10917095 10875366 10981244 10765674 10735700 10664231 10690606 10695860 10528124
7400 10528124 10441527 10581364 11019184 11165020 11394121 11630322 11990941 12169259 12117551 12726022
7390 12726022 12892234 13213532 13387804 13656746 13654284 13994978 14300379 14463580 14756116 14599690
7380 14599690 14583527 14471303 14198126 13808606 13323451 13353743 13192559 12791441 12370347 12557568
7370 12557568 12939166 12917304 12897952 12870548 13117391 13519142 13699864 13809754 13700637 13637872
7360 13637872 13423744 12842058 12602250 12520006 12403848 12066506 11836754 11832679 11344374 11287291
7350 11287291 11288714 11403243 11112196 11293381 11231210 11069602 10925941 10796147 10972450 10804635
7340 10804635 10753625 10788558 10911371 10679666 10972800 10888400 10735190 10812904 10677077 10699945
7330 10699945 10626658 10538289 10560321 10398425 10368153 10392411 10417591 10331621 10280852 10700660 10696719
7319 10696719 10693392 10983902 11248022 11738660 12374221 12774653 13276821 13720141 14119012 14835449
7309 14835449 15485014 15714437 15865555 16015340 15903775 15669056 15393142 15132400 14800649
7300 14800649 14449473 14206173 14180202 13969745 13584355 13286616 13218986 13192383 13274389 13433052
7290 13433052 13640829 13707339 13955851 14403353 14656633 15146801 15665924 15661874 15715591 15427061
7280 15427061 15008305 14477458 13626865 12632302 11960369 11703115 11641556 11313951 11247250 10880719
7270 10880719 10482406 10175807 9947433 9785820 9741698 9681269 9242475 9203133 9409836 9316496
7260 9316496 9545952 9540562 9271898 9186689 9195543 9197118 9166597 9204733 9483166 9851187 9992476
7249 9992476 10438981 10660327 10882887 11404655 12085251 12432103 12608919 12639495 12526361 12089943
7239 12089943 11410147 10657287 9809304 9334677 9220491 8726047 8313340 7754297 7330443
7230 7330443 7279854 6919744 6654732 6527553 6298951 6238484 5892178 5621496 5527839 5333693
7220 5333693 5371021 5454400 5317110 5241959 5010281 4609295 4709405 4700450 4496583 4401113 4490508
7209 4490508 4370728 4566103 4476304 4338351 4358347 4344123 4192006 4193230 4291774 4358017 4285373
7198 4285373 4260254 4354777 4098434 4032807 3942010 3910742 3752565 3665550 3951407 4032476 3937488
7187 3937488 3549442 3681900 3750733 3392755 3196871 3517461 3590836 3330148 3445546 3344809
7177 3344809 3324841 3255679 3286671 3435078 3656267 3155678 3421145 3541589 3433568 3675134
7167 3675134 3823493 3877631 4065602 4247941 4313252 4315906 4029491 3847185 3911858 3822509 3713792
7156 3713792 3645961 3540468 3360299 3044627 2940248 3105204 3424585 3492062 3329355 3414748
7146 3414748 3377816 3228974 3381935 3353873 3634375 3943825 3796413 3777486 3776450 3722238 3665781
7135 3665781 3791290 3797570 3958748 3746218 3642903 3624613 3549484 3689668 3511526 3390373
7125 3390373 3822433 4001816 3914145 3972818 3972785 4009199 4361596 4582080 4456354 4777223 5092642
7114 5092642 4979719 5067017 5178121 4896541 4618435 4359206 4195576 4177918 4091198 3814199
7104 3814199 3689011 3625359 3593257 3543558 3549954 3742677 3521124 3145169 2957332 2896690 3043378
7093 3043378 2962969 3055101 3201629 3353920 3603908 3566861 3263986 3315400 3468802 3445507
7083 3445507 3432096 3275830 2869961 2802661 2685075 2768855 2942392 3033785 3118216 3154622 2951340
7072 2951340 3102495 3181864 3346967 3140419 2853433 3109017 3420460 3155967 3103357 3040909
7062 3040909 2995931 2575976 2301184 2515658 2642934 2659041 2638698 2495225 2297895 2372970
7052 2372970 2425196 2571764 2280133 2362478 2247140 2264500 2150940 2062465 2087302 2017476 1971076
7041 1971076 1833963 1381683 1419470 1597570 1566177 1664156 1702942 1688713 1668203 1480693 1707623
7030 1707623 1742511 1688810 1706141 1715220 1673753 1657504 1551558 1351483 1709241 1966169 1558798
7019 1558798 1592287 1771066 1783539 1962507 1955721 2175916 2204891 2191259 1841674 1544978 1574505
7008 1574505 1517676 1362610 1488571 1434704 1605077 1364978 1237576 996313 1258957 1344634
6998 1344634 1335253 1287125 1375703 1288610 1248300 1224910 1300943 1455221 1130396 1204092 1077168
6987 1077168 1328456 1377684 1150673 1016701 1104978 1229235 1281194 1197244 1053913 1230155
6977 1230155 1329416 1236307 1168618 1047624 1158801 1418160 1413786 1160462 1508776 1376256
6967 1376256 1531191 1569095 1242634 1121364 1300152 1176270 1147616 1179805 1505293 1522987
6957 1522987 1462644 1332425 1212594 1524360 1006810 770042 1403188 1758928 2014972 2083756
6947 2083756 2092344 1943968 1874501 1914225 1873357 2065451 2366940 2510211 2728915 2919403
6937 2919403 2669883 2558240 2337745 2342028 2477675 2357523 2344649 2327232 2579252 3071445
6927 3071445 2979811 2733197 2610055 2692137 2724719 2754843 2519565 2363373 2203676 2102344
6917 2102344 2033917 1874353 1832971 2125861 2376642 2374290 2263338 2138128 2091595 1795118
6907 1795118 1676882 1670136 1837975 1915867 1930174 1739208 1381028 1180728 1184167 1211879 1526601
6896 1526601 1383515 1027795 1187918 1319207 1448983 1244026 1069011 1049031 1353912 1255113
6886 1255113 1207337 1356647 1204958 1418844 1371677 873733 865683 804762 1019185 1012101 918524
6875 918524 1029806 831148 793220 1229261 1332067 1004882 989406 979456 953159 1089579 1055044
6864 1055044 930515 854872 1102446 1367413 1293126 1151216 925807 877870 688055 704468
6854 704468 821287 769344 797304 977409 985570 966354 878620 742551 767827 944668 737340
6843 737340 1019741 1056490 910988 833177 855259 910509 993901 1048218 935921 734193 631629
6832 631629 605695 760472 867605 854419 1158295 1087708 1128029 1110156 990290 1104160 1188718
6821 1188718 952430 732825 478161 960535 1057351 1274070 1069903 1079462 842330 632922
6811 632922 932622 953604 798261 692612 1001210 1259359 938488 779469 954369 1033299
6801 1033299 725153 691836 894967 904663 954653 1228435 1088129 692344 753151 700550 914973
6790 914973 794767 829038 887758 960646 1091667 1240596 1105088 871275 928898 953870 1060959
6779 1060959 871567 880025 1036259 762450 853052 1047549 1003970 832170 896755 1134482
6769 1134482 1308093 950310 937007 873213 801844 941012 852648 1011167 1196988 1255627
6759 1255627 1118771 1229107 1135057 803649 867900 825771 978913 1036754 1203925 1315890
6749 1315890 1197932 1374380 1473767 1380551 1364418 1233873 1321105 1447129 1125697 1141721
6739 1141721 1441378 1625431 1348598 1093749 1290136 1456127 1205497 1313313 1449708 1379456
6729 1379456 1537997 1803580 1717418 1402788 1480983 1560718 1792636 1598908 1471792 1418219
6719 1418219 1643378 1643350 1537882 1481944 1565688 1879719 2159597 1952052 1633695 1632536 2015113
6708 2015113 2117295 1869383 1796261 1968605 2168482 1956622 1943165 1956569 1718459 1887713
6698 1887713 2402662 2319589 2227054 1944763 2098188 2275016 2268252 2157579 2505280 2428263
6688 2428263 2055665 2186205 2567166 2475793 2286039 2433429 2343189 2533159 2813981 2870001
6678 2870001 2857520 2991157 3061625 3131974 3013749 3213544 3458503 3473932 3466538 3337915 3204323
6667 3204323 3465260 3756239 3807998 3857424 4052680 4114638 4408963 4372050 4384469 4669855
6657 4669855 4526096 4837324 5099580 4824606 4397744 4494304 4848103 5000991 4880756 4662461
6647 4662461 4640189 4841696 5156183 5289632 5207415 5382511 5750769 5583022 5834426 5909643
6637 5909643 5929838 6349452 6612767 6809523 7125112 7236534 7465032 8101503 8472567 8565270
6627 8565270 8852478 9355509 9253606 9634432 9762829 10110198 10492991 10687028 11135203 11489747
6617 11489747 12049541 12388427 13099296 13889816 14504931 15477410 16366371 17721006 19263634
6608 19263634 20541946 22047001 24034121 26303082 28765084 31931602 34919794 38337165
6600 38337165 42698692 47441226 52854127 58929369 65576152 72104040 77985019 82065114
6592 82065114 83678890 82470957 78699178 73246014 67275923 61029896 55445925 50542499
6584 50542499 45998711 42520694 39722168 37244996 35538743 33737043 32512866 31464188
6576 31464188 30761330 30142116 29695559 29275642 28514079 27718624 26649873 25842806 24538620
6567 24538620 23373084 22414797 21478781 20912288 20610110 19716515 19393825 18883971 18774727
6558 18774727 18532387 18146798 17951047 17495906 17168344 16583310 15961696 15246644 14741339
6549 14741339 14164880 13808245 13690720 13228703 12625959 12064345 11566173 11301690 11044893
6540 11044893 10867119 10522425 9843466 9870261 9465332 9398928 9120605 8666547 8563045 8131682
6530 8131682 7920447 8181853 7991387 7666359 7431914 7196069 7068586 6766702 6810949 6722397
6520 6722397 6624556 6548572 6523017 6296095 6005443 5664435 5463166 5274742 5330596 5434591
6510 5434591 5151930 5081024 5076204 5221534 5187190 4842615 4963223 4839947 4752062 4668189 4476291
6499 4476291 4382807 4454908 4517318 4207024 4147497 4197611 4463952 4533027 4274025 4156872 4084797
6488 4084797 4270794 4278173 4282131 4035413 4199962 4084965 3925241 4134135 4185382 4188491 4202775
6477 4202775 4235029 4068289 3786847 3953615 4255074 4175313 4058335 3994383 4165351 4150116
6467 4150116 4153691 4035948 4057444 4167765 4228740 4273259 4350895 4282931 4179518 4285005 4333452
6456 4333452 4181781 4030566 4075825 4261593 4164755 4352333 4119939 4189145 4208017 4263243
6446 4263243 4243601 4174448 3910497 3845212 3916214 4270041 4294007 4078320 4147720 3968286 4060476
6435 4060476 4170709 4215381 4090598 4310871 4545850 4409249 4202816 4222863 4131682 4496922
6425 4496922 4542470 4430608 4430845 4619797 4842627 4687153 4526102 4585219 4823734 4891663 4814240
6414 4814240 4777319 5022774 5252244 5135569 5041919 5046097 5258914 5429596 5480909 5426725 5557377
6403 5557377 5421559 5477615 5709617 6000518 6134623 6102803 6045614 6102351 6163278 6173539 6308183
6392 6308183 6164552 6318202 6524639 6696645 6855527 6581639 6784756 6966507 7264213 7503998
6382 7503998 7867940 7961143 8299107 8383985 8522823 8978907 9207054 9196523 9381357 9779080
6372 9779080 10140440 10544318 10909488 11124934 11275659 11621775 11609767 11905777 12190936 12733034
6362 12733034 13355894 13798035 14708447 15336866 15872611 16654917 17427442 18031912 18506205
6353 18506205 19671033 20839126 21672520 22677947 23805475 25105634 26799909 28625952
6345 28625952 31066313 33777476 37085772 40725864 44677113 48805501 53149463 57312190
6337 57312190 59684988 60121026 59658091 58919834 59215404 59837359 61280763 63591540 67068704
6328 67068704 71575689 77132890 83692799 90418672 96520958 102726706 109150874 115074899
6320 115074899 118846390 120059729 119526195 117538074 114988559 112163593 110671575 110411276
6312 110411276 111941868 114483247 117942212 121574438 123063195 123326881 124026470 125097677
6304 125097677 127231439 130818664 135174282 138968650 141377140 142565176 143055687 142566590
6296 142566590 140764396 138417726 136329360 134243540 131590737 127342189 122084154 116796759
6288 116796759 113109443 111092671 110472914 111677312 114297292 117726968 120793304 122881242
6280 122881242 122180550 118260156 111896084 105253159 99630585 94669173 90323702 86558384
6272 86558384 82935993 79191400 75660505 72431758 70104340 68090786 66621995 65506269
6264 65506269 64642776 63174290 61482698 59673777 58262100 57413167 56690768 56337533 56241631
6255 56241631 56703284 57088044 57121544 56260688 54905422 52471940 49663005 46881702 44129077
6246 44129077 41608624 39114986 37610748 36074166 34671178 33484416 32217319 31180450
6238 31180450 30025182 29221907 28462688 28228895 27563068 27371575 27099823 26926428 26630192
6229 26630192 26343060 26603603 26306132 26148571 26007114 25501411 25345402 24908550 24445528
6220 24445528 24301609 24053222 24035463 23888081 23740806 23438595 23412893 23806185 23976410 23959535
6210 23959535 23882905 23861035 23962996 23646761 23068713 22562380 22438797 22337773 22109501 21962310
6200 21962310 22013989 21945341 22086719 22156281 22263821 22065438 22041185 21971550 21866943 21867883 22020569
6189 22020569 22103575 22091641 22298929 22708102 23011558 23323667 23597471 24114432 24461090 24352688
6179 24352688 24126654 23952886 23823067 23545943 23706075 23910232 24173401 24377293 24651810
6170 24651810 24706496 24901503 24963062 25066007 24984195 24999571 24820019 24467052 24030520 23750443
6160 23750443 23459168 23543327 23402921 23443311 23597319 23890828 24503810 24838930 25158996 25618450
6150 25618450 25380531 24749064 24710764 24653050 24505454 23849797 23548635 23482902 22982680 22363019
6140 22363019 21703894 21062093 20654659 20192993 19756113 19399206 18983754 18407774 18016477
6131 18016477 17833482 17763302 17305559 17202428 17284901 17067703 16745755 16478311 16242382 15879247
6121 15879247 15678632 15439426 15035678 14608888 14087293 13644202 13344096 13395663 13441854 13180090
6111 13180090 13016749 13043222 12934002 12769270 12822382 12683284 12673862 12506919 12327140 12421452
6101 12421452 12500806 12275472 11897102 11786057 11643771 11803853 11762436 11553630 11785240 11867104
6091 11867104 11443825 11558023 11364544 11263469 11157210 11075420 11025701 10998524 10860827 10995847
6081 10995847 10881048 10814545 10785005 10571400 10436942 10262985 10045244 9837731 9960060 9636258
6071 9636258 9507513 9604085 9575328 9675879 9502966 9567893 9661987 9477266 9602402 9611633 9707873
6060 9707873 9839884 9988736 9987698 10000684 10108733 10050946 10046951 9868515 9648657 9516703 9140591
6049 9140591 8708242 8513592 8765835 8435256 8245990 8284641 8378312 8388149 8474476 8399068 8380469
6038 8380469 8562182 8640239 8618916 8603285 8683248 8455477 8518702 8798990 8473001 8550090 8620181
6027 8620181 8760194 9227137 9118391 9219194 9675649 9746559 9852866 9627286 9223517 9151303
6017 9151303 9214104 9049810 8685725 8557004 8685540 8762282 8760605 8710019 8662322 8792059 8490322
6006 8490322 8166655 8253261 8166699 8269826 8082496 8139539 8330604 8389057 8200249 8069661
5996 8069661 8230437 8272052 8245789 8584607 8730953 8724248 8295502 8355403 8802959 8769010 8768771
5985 8768771 9082127 9125036 9087907 9195682 9073360 8954780 9107569 8899663 8572687 8831459
5975 8831459 8572523 8161619 7891424 8298306 8318119 8039440 8011956 8294738 8303659 8200947
5965 8200947 8448515 8514324 8552504 8491481 8446038 8512854 8483738 8619960 8734167 8651287 8205014
5954 8205014 8179810 8290330 8190319 8165905 8111181 8022817 8155730 7973864 8044025 8154575
5944 8154575 7903586 7847926 7925752 8139320 8233533 8186807 8247772 8095170 8044341 8061515 8247090
5933 8247090 8161128 7975481 8050716 8023081 7969507 8171039 7970925 7914045 7990354 7897446 7930485
5922 7930485 8150542 8342576 8250676 7973562 8031134 8448156 8472997 8215196 8045172 8379781
5912 8379781 8392199 8284083 8445532 8479106 8683493 8747210 8617476 8669414 8964976 9092867
5902 9092867 9124379 9333457 9051677 8906730 8864070 9047911 8986504 8792898 9044470 8879875
5892 8879875 8895290 8927254 8994000 9182180 9410482 9400534 9492335 9447441 9366887 9563934 9757874
5881 9757874 9968359 9828690 9907113 9773261 9818850 10128454 10107645 10354406 10416078 10463491
5871 10463491 10743510 10918765 10904254 10985771 11334582 11457766 11589862 11593086 11429774 11429216 11659293
5860 11659293 11903034 11926600 11852531 12078469 12125955 12171689 12505748 12581323 12628171 13106908
5850 13106908 13125683 13158221 13009687 13214511 13839706 14090184 14330433 14564962 14604349 14970852
5840 14970852 15395638 15522128 15655663 16046184 16456957 16654029 16530754 16749635 17257078
5831 17257078 17715539 18178412 18562167 18953303 19181756 19715450 20405150 21044385 21457332
5822 21457332 21935130 22440975 23418729 24173021 25050153 25856440 26777748 27684093 28489338
5813 28489338 29337607 30276617 31118568 31882799 32830235 33625143 34459234 35581379 36765175
5804 36765175 37731985 38869680 40225948 41741605 43337286 45309997 47581931 50391493
5796 50391493 53130730 56327679 59837255 64138916 68617441 73462855 79455620 86231121
5788 86231121 93129906 100822488 109315118 118291807 127977783 136466221 142378607 146234115
5780 146234115 147509972 146058933 143336703 140550647 138641334 138250548 139352174 141626173
5772 141626173 145068724 149446578 153951313 159127785 163737122 167774799 172359106 177555601
5764 177555601 183154379 188508209 193272490 195177312 194492447 191664859 187906209 184326077
5756 184326077 180472303 176943781 172906243 169049089 164802508 159559935 154883678 151511341
5748 151511341 150176348 150390977 152389617 155879359 160479456 165380359 169208807 171073183
5740 171073183 170771963 166976658 160499485 153195088 146106203 139746466 133333650 126166951
5732 126166951 119205989 112386356 106255427 101353128 97187844 93997200 91033045 88757856
5724 88757856 87264598 86063744 84969403 83977107 83639912 83854666 84333160 85140684 86550973
5715 86550973 88514048 90727604 92702865 94609562 96530016 98071402 99198972 99825801
5707 99825801 99565702 98191705 96644583 95178354 94020867 93554373 93276924 93846596 95215075
5698 95215075 96590566 98021078 99908875 101678644 103686954 105911270 108490124 111612752
5690 111612752 115483383 119364537 123250294 126790248 129574291 132347207 135275839 138434073
5682 138434073 141585793 144139734 145493797 145410503 143747414 141607738 139657723 138743432
5674 138743432 138285036 138432025 139204503 141173261 143556011 145636958 146208573 144585430 141511904
5665 141511904 138354198 134948727 130274634 125084051 119577934 114516929 110390107 107259656
5657 107259656 104950149 103582845 102948886 103273194 104007076 105068561 107397858 110491763
5649 110491763 113201217 115686462 117623010 118626427 118471984 117903733 117096590 116131024 114561110
5640 114561110 111728638 107769008 104161414 100510012 96483856 92114536 87815610 83856382
5632 83856382 79955772 76791029 73972027 71889641 70165743 68967525 68087323 67540434
5624 67540434 67310365 67668996 68350396 68987344 69727399 70112300 69725570 69625011 69109449
5615 69109449 68797976 68674383 68258295 67663432 66755890 65624010 64487002 63669099 62301998
5606 62301998 60690180 59136277 57752059 56200136 55118370 54270282 53810314 53461574 53265152
5597 53265152 52474973 51955513 51660693 50914147 50465185 50229115 49717195 49275947 48829950
5588 48829950 48529958 48298507 47741142 47530215 47352600 46891435 45969314 45327454 44351361
5579 44351361 43882034 43615601 43105856 42730210 42224034 42044791 41864702 41846911 41886608 41666656
5569 41666656 41587751 41256581 40905255 40441661 39777059 39355914 39053752 38470757 37675324 37414255
5559 37414255 37253239 36605718 36350482 36077762 35863089 35389803 35097696 34903529 34373377
5550 34373377 34139993 33585487 33021755 32860085 32277230 32042958 31708164 31452979 31429842 30909500
5540 30909500 30182450 29818036 29158943 28344229 27795389 27299909 27032062 26586677 26467617
5531 26467617 26036326 25806733 25978140 25754524 25589303 25609997 25363617 24963513 24867469 24766805
5521 24766805 24724263 24537302 23971588 23726511 23457217 23488261 23457777 23670031 24057017 24365394
5511 24365394 24434678 25090166 25810544 26038300 26030648 25531530 24894214 24390960 23857458 23173050
5501 23173050 23143593 22312605 21841982 21424197 21097352 21040633 20902232 20507551 20045083 20071463
5491 20071463 20272116 20034367 19913270 20253020 20336418 20482934 21084503 21580651 21906388 22409791
5481 22409791 23153031 24096862 25303932 25787999 25759511 25407532 24466162 23591512 22817152
5472 22817152 21832584 20774584 20256196 19590210 19169764 18745483 18316980 17832405 17551889
5463 17551889 17515554 17225817 16957107 17023268 17223315 17274566 17020773 17291280 17768722 17737027
5453 17737027 17730900 18070722 18644641 19278102 19730646 20140433 20199105 20237146 19739433 19515662
5443 19515662 19250246 18421588 17916005 17928913 17546238 17229586 16740187 16342861 16155987 16168670
5433 16168670 16356589 16210783 15877640 15563320 15435033 15572106 15823202 15807394 15501868 14935911
5423 14935911 14526041 14432220 14293479 14061253 13760836 13662422 13454991 13218437 13206121 13254903
5413 13254903 13138281 13018321 12884560 12770528 12523118 12484380 12543629 12728410 12574467 12406294
5403 12406294 12240534 12222576 12263185 12321674 12260981 12198787 12088053 12384501 12603249 12570014
5393 12570014 12571750 12566808 12772620 12651141 12602645 12681262 12621617 12537696 12527678 12649944 12839684
5382 12839684 12775605 12896443 13201738 13287947 13470398 13634596 13819105 14128421 14580339 14725775
5372 14725775 14866804 15544787 16308617 17207626 17955469 18993695 19915908 20937508 21894746
5363 21894746 22656146 22608910 22495682 22099543 21918782 21207444 20525191 19594737 19002436 18556099
5353 18556099 18260255 18142680 18159336 18221103 18273608 18238398 18577173 18849134 19382436 20013370
5343 20013370 20253276 20545463 21391802 22395567 23652511 25146198 27090527 28944153 31486098
5334 31486098 34459443 37670535 40725550 42716953 43726105 43158424 41404186 39165008
5326 39165008 36723785 34502712 32502167 30344915 28471604 27105823 25763916 24818491
5318 24818491 24062312 23819004 23354498 23080791 23111692 22951095 23028094 23309797 23841522 24466661
5308 24466661 25249865 26153301 27346800 28659325 30555304 32668936 35551952 38529612
5300 38529612 41617130 44094503 45608553 45516742 44169251 42057252 39672929 37076412
5292 37076412 34653028 32012119 30181167 28477174 26840548 26010182 24789310 23948356
5284 23948356 23260192 22719722 22438959 21788718 21305608 21396266 21134095 20940569 20995424 20987487
5274 20987487 21365872 21821226 22003703 22666556 23830116 24508899 25399128 26376336 26858712
5265 26858712 26941310 26708883 26308935 25621288 25015480 24592577 23765735 23219598 22957408 22694348
5255 22694348 22420606 22303451 21972738 21863873 21681500 21401594 20966459 20770536 20537806
5246 20537806 20139234 19665935 19181458 18810798 18961323 18799422 18444083 18364304 18681364 18490450
5236 18490450 18514321 18583912 18618384 18869212 18935289 19127351 19555952 19912798 20241257 20875176
5226 20875176 21266746 21813132 22412158 22743666 23251842 23867727 24173008 24001832 23917681 23819018
5216 23819018 23456299 23202725 23232651 22773632 22587674 22562048 21994929 21672564 21820486 21458895
5206 21458895 21234816 21258088 21024229 20834639 20775383 21393131 21708891 21766254 22050123 22151178
5196 22151178 22509156 23012391 23534432 23886247 24376034 25068958 25447426 25951886 26421617
5187 26421617 26878156 27443496 27806323 28063029 28389617 28337555 28228204 28302880 28212482 28386823
5177 28386823 28594010 28836445 29094548 29449033 29895096 30360336 30999854 31497214 32173199
5168 32173199 32757702 33564332 34383223 35624332 37073420 38251200 38837351 39752610 40770562
5159 40770562 41458715 42220155 43374239 44647503 45786130 47187605 48934937 50766137
5151 50766137 52640618 54756505 57453304 60450615 63031649 65417465 68011383 71319991
5143 71319991 75013634 78870651 83540839 88941500 95104733 102469187 111400579 122126269
5135 122126269 135992014 151787691 171588140 194778213 219385103 243054338 264882358
5128 264882358 271640660 266670865 257120252 243661533 231806723 221833055 215660210 214713189
5120 214713189 219463336 229999116 245467955 267104695 294613249 324280478 351781600
5113 351781600 374201001 370394911 343640348 309760032 273307693 243084237 216497535
5106 216497535 194765629 176161882 161744741 150066751 141324169 133951765 127821868
5099 127821868 122670363 118346524 114212800 110903042 108017800 105909746 104087181 102887488
5091 102887488 102785101 103111101 103991984 105810903 107824259 110088576 111430866 112248382 112322568
5082 112322568 111444714 110288932 108726484 107218782 106317834 105992215 106196250 107464162 109246569
5073 109246569 111127106 112651893 114725826 116786489 118456023 120112904 122019666 123191044
5065 123191044 124749346 126348032 128057219 130267067 133192318 136580405 139916337 142835145
5057 142835145 144450505 145492550 144678441 142370762 139653961 136427049 132376389 127958423
5049 127958423 123107112 118303083 113926189 110213671 107125487 104460678 102208047 100614913
5041 100614913 98765351 96413013 93653172 90604486 87080682 83562332 80405899 77719471
5033 77719471 74916371 72722516 70895746 69278857 67842402 67031565 66518981 66352340 66413425
5024 66413425 66578657 67014860 67715579 68443658 69334514 69899022 70378141 70619727 70674203 69757011
5014 69757011 68062871 66124575 64238909 62680813 61042617 59884752 58863071 58049532
5006 58049532 57483754 57358046 57073588 56616330 56470820 56252322 56084511 55947362 56240619
4997 56240619 56843670 57254717 58096932 59215097 61092482 63257054 65380774 67782407 71418441
4988 71418441 75969632 81339313 88362697 96542467 106499364 118557542 132836421 145905910
4980 145905910 157117822 159970265 151740488 139284233 125453657 113697973 102972096
4973 102972096 94125373 86612089 80512682 75811535 72245865 69152206 66915654 65325586
4965 65325586 64039195 62652862 61391417 60540447 59765199 59241018 59284757 59278416 59392828
4956 59392828 59292118 59644801 60121385 59718370 59253690 58963408 58060434 57412058 56728602
4947 56728602 55883646 55523637 55074455 54837686 54838635 54526061 54823848 55078853 55065301 54686685
4937 54686685 54388251 54511581 54696639 54351516 54078499 54025306 53890022 53919306 53891218 53444435
4927 53444435 53134009 52977631 52647191 52155826 52197298 52331821 52223099 52694772 53479146 54748646
4917 54748646 56082386 57245175 58717685 60305944 61815618 63674595 66088940 69510228
4909 69510228 73744719 78883925 85669156 94053198 102303182 110204224 115901462 115306039
4901 115306039 111285745 103992994 95374319 86898720 79433770 73356569 67730562 63111412
4893 63111412 59710364 56888457 54357946 52582227 50972878 49636345 48367733 47383525
4885 47383525 46530887 46168888 45616650 45566815 45663307 46328128 46762714 47884147 48847382 49456819
4875 49456819 49901175 50127714 49878883 49061056 47960371 46760234 45436061 44565055 43971845
4866 43971845 43502038 43230349 43293652 43592141 44168132 44407119 44671307 45252619 45868159 46306765
4856 46306765 46407073 46587322 47061429 47218713 47046343 46826273 46611777 46149451 45676650
4847 45676650 45041650 44464881 43842125 43163625 42832969 42415006 41896459 41242021 40550774
4838 40550774 40222561 39753245 39488226 39311604 39122544 38829486 39025638 39016994 38789499 38587740
4828 38587740 38662804 38380002 38502296 38852165 38881806 38521356 38833761 39205126 39304664 39665048
4818 39665048 40056515 40757869 41039353 41174222 41742188 42625522 43353140 44382729 45481108
4809 45481108 46647157 47831027 49329755 51165487 52820152 54420951 55227105 54410852
4801 54410852 53397968 52334983 50773350 48912913 47655849 46537559 45306307 44058826
4793 44058826 43178651 42269061 41509167 40593747 39988906 39632653 39140147 38519379 38075890
4784 38075890 37463642 37144642 36955032 36444448 35985039 35727275 35663975 35692152 35797217 35473930
4774 35473930 35668658 36026790 36036482 36260034 36490159 36542023 36482491 36568098 36249740 35846912
4764 35846912 35387283 35093777 34965865 34768934 34696635 34341550 34084632 34120791 33945814 33977854
4754 33977854 34109309 33921237 33458351 33200221 32915909 32858496 32732044 32690325 32557231 32514692
4744 32514692 32659787 32820197 33002551 33311061 33749169 33990451 34562424 35362626 36155005
4735 36155005 36999225 38179077 39755506 41405862 43351098 45098606 46486933 47498115
4727 47498115 48192241 48279156 47938174 46652026 45124602 43538895 42268725 40989804 39993234
4718 39993234 39139613 38594564 38444355 38156548 38000448 38123447 38582834 38767166 39235126
4709 39235126 39482350 39962428 40295047 40406006 40913751 41324898 41579316 41618184 41913230 42323270
4699 42323270 42774127 43276417 44218404 44825891 45808450 46768788 47747099 49341492 50856474
4690 50856474 52797409 55254906 57702766 60361605 63186504 66478885 70483562 74848937
4682 74848937 80640654 87292738 95253551 104302129 115103017 127323083 140343524 152758305
4674 152758305 162425689 166846844 164929293 158642176 149934645 140648194 132310432 124525482
4666 124525482 117858779 112368065 107779193 102881486 97961583 93470827 88909872 84345551
4658 84345551 80002519 76213125 72841085 69659824 66932305 64813777 62794115 61112987
4650 61112987 59832043 58329034 57523689 56873229 56342446 55919201 55737080 55712596 55693506
4641 55693506 55937824 56291803 56864964 57736320 58462515 59685241 61120388 62902101 64602178
4632 64602178 66249166 67768743 69229029 70118500 70511217 71189708 71243210 70688406 69894153
4623 69894153 68727890 67412240 65643853 63327669 61003912 58512090 56091959 53985938
4615 53985938 52327244 51115536 49779627 48522588 47567353 46627663 45850448 44940964 44462131
4606 44462131 43976374 43536097 43246092 42763503 42232141 41973594 41413937 40898525 40318716
4597 40318716 40033432 39893452 39892798 39607717 39231276 39007142 38986503 39013296 38793586 38537299
4587 38537299 38090976 37404829 37112724 36647418 36328682 36255491 35843318 35668126 35485572 35247765
4577 35247765 35042145 34887047 34772279 34674298 34435004 34406458 34224738 34083886 34013649 33593237
4567 33593237 33038429 32695515 32391176 31764107 31505694 31252123 30730744 30298791 30166900
4558 30166900 29714287 29662769 29834132 29626225 29309908 29390585 29630302 29850585 29975251 29997557
4548 29997557 30428477 30419478 30398389 30276332 30231615 30514065 30741270 31105536 31147522 31441674
4538 31441674 31878333 32348055 32557769 32739865 33198290 33827368 34402053 35279692 36124774
4529 36124774 36997444 37850748 38819157 40128682 41250037 42937297 44697975 46348326 47744968
4520 47744968 49137495 50313927 51203734 51929580 52603403 53518729 54456912 55453149 56886028
4511 56886028 58456318 60069692 61958291 64116214 66946588 70109644 73924897 78423661
4503 78423661 83356056 89045017 95496914 103034094 111301238 120990337 132237112 145398693
4495 145398693 161056888 179862897 202981379 231085267 264592071 302404274 341082426
4488 341082426 377068979 406000885 423434541 427312652 417450954 395449565 364979668
4481 364979668 330477444 294752770 260868389 230561757 204558068 182916520 165037246
4474 165037246 150801242 138498962 127921114 118851898 110922173 103561491 96871437 90569507
4466 90569507 84819926 79669342 75279980 71309122 67690030 64872232 62111795 60006663
4458 60006663 57804777 55710319 53942199 52345608 51118620 49915256 48507598 47357846
4450 47357846 46348738 45530372 44682137 43592069 42636562 41964700 41250905 40516549 40037555
4441 40037555 39446369 38819952 38287650 37764899 37134853 36237227 35679469 35225675 34414248
$$ [...]
##END NTUPLES=NMR SPECTRUM
##END=
