##TITLE=1H_DE-80H_X3
 200.13MHz, d2o
 8 sc
 
 19ns.26.2.2025
##JCAMPDX= 6.0         $$ Bruker NMR JCAMP-DX V2.0
##DATA TYPE= NMR SPECTRUM
##DATA CLASS= NTUPLES
##ORIGIN= UXNMR, Bruker Analytische Messtechnik GmbH
##OWNER= pz
$$ XWIN-NMR		Version 3.5
$$ Wed Jun 25 09:30:43 2025 Russian Standard Time (UT+4h)  Yarkov@DPX200
##.OBSERVE FREQUENCY= 200.1313
##.OBSERVE NUCLEUS= ^1H
##.ACQUISITION MODE= SIMULTANEOUS
##.ACQUISITION SCHEME= undefined
##.AVERAGES= 8
##.DIGITISER RES= 18
##SPECTROMETER/DATA SYSTEM= spect
##.PULSE SEQUENCE= zg30
##.SOLVENT NAME= CDCl3
##.SHIFT REFERENCE= (INTERNAL, CDCl3, 0, 15.4417)
##AUDIT TRAIL= $$ (NUMBER, WHEN, WHO, WHERE, WHAT)
$$ ##TITLE= Audit trail, XWIN-NMR		Version 3.5
$$ ##JCAMPDX= 5.01
$$ ##ORIGIN= Bruker BioSpin GmbH
$$ ##OWNER= Yarkov
$$ C:/Bruker/XWIN-NMR/data/yarkov2/nmr/H-C/1/pdata/1/auditp.txt
$$ ##AUDIT TRAIL=  $$ (NUMBER, WHEN, WHO, WHERE, WHAT)
(   1,<2025-06-25 09:29:40.93 +0400>,<Yarkov>,<DPX200>,
      <created by zg, POWCHK disabled, PULCHK disabled
       configuration hash MD5:
       00 E9 B6 7A A2 85 ED C7 34 08 36 98 17 FE 4E 26
       data hash MD5: 16K
       03 C2 BD 61 B2 13 A3 5C 57 BF 72 8E 71 77 25 E6>)
(   2,<2025-06-25 09:29:44.95 +0400>,<Yarkov>,<DPX200>,
      <Start of raw data processing
       efp BC_mod = 2 LB = 0.25 FT_mod = 6 PKNL = 1 PHC0 = -1713.766 PHC1 = 10.1666 SI = 16K 
       data hash MD5: 16K
       76 21 E9 39 7F 70 2B 2C 35 A7 53 C2 6F 90 2C A9>)
(   3,<2025-06-25 09:30:02.81 +0400>,<Yarkov>,<DPX200>,
      <pk PHC0 = 1.801757 PHC1 = -5.6 
       data hash MD5: 16K
       84 29 87 A8 8D F4 A7 AC B1 1E 16 65 F8 35 CF AA>)
(   4,<2025-06-25 09:30:08.95 +0400>,<Yarkov>,<DPX200>,
      <abs ABSG = 5 
       data hash MD5: 16K
       8C 23 F7 38 48 20 B9 40 45 0B 19 65 21 1B C1 28>)
$$ ##END=
$$ 
$$ hash MD5
$$ 5F 8C F3 6D C1 96 76 E8 47 20 EA D1 DC 5F 8A 5F
##$RELAX= 
##$RELAX= 
##$RELAX= 
##$RELAX= 
##$RELAX= 
##$RELAX= 
$$ Bruker specific parameters
$$ --------------------------
##$DU= <C:/Bruker/XWIN-NMR>
##$EXPNO= 1
##$NAME= <H-C>
##$PROCNO= 1
##$TYPE= <nmr>
##$USER= <yarkov2>
##$AMP= (0..31)
100 100 100 100 100 100 100 100 100 100 100 100 100 100 100 100 100 100 
100 100 100 100 100 100 100 100 100 100 100 100 100 100 
##$AQSEQ= 0
##$AQ_mod= 1
##$AUNM= <au_zg>
##$AUTOPOS= <>
##$BF1= 200.13
##$BF2= 200.13
##$BF3= 200.13
##$BF4= 200.13
##$BF5= 200.13
##$BF6= 200.13
##$BF7= 200.13
##$BF8= 200.13
##$BYTORDA= 1
##$CFDGTYP= 0
##$CFRGTYP= 5
##$CHEMSTR= <none>
##$CNST= (0..31)
1 1 145 1 1 1 1 1 1 1 1 1 1 1 1 1 1 1 1 1 1 1 1 1 1 1 1 1 1 1 1 1 
##$CPDPRG= <>
##$CPDPRG1= <>
##$CPDPRG2= <>
##$CPDPRG3= <>
##$CPDPRG4= <mlev>
##$CPDPRG5= <mlev>
##$CPDPRG6= <mlev>
##$CPDPRG7= <mlev>
##$CPDPRG8= <mlev>
##$CPDPRGB= <>
##$CPDPRGT= <>
##$D= (0..31)
0 0.7 0 0 0 0 0 0 0 0 0 0.03 0 0 0 0 0 0 0 0 0 0 0 0 0 0 0 0 0 0 0 0 
##$DATE= 1750829380
##$DBL= (0..7)
120 120 120 120 120 120 120 120 
##$DBP= (0..7)
150 150 150 150 150 150 150 150 
##$DBP07= 0
##$DBPNAM0= <>
##$DBPNAM1= <>
$$ [...]
##$SUBNAM3= <"">
##$SUBNAM4= <"">
##$SUBNAM5= <"">
##$SUBNAM6= <"">
##$SUBNAM7= <"">
##$SUBNAM8= <"">
##$SUBNAM9= <"">
##$SW= 18.0517328524113
##$SWIBOX= (0..15)
0 0 2 0 0 0 0 0 0 0 0 0 0 0 0 0 
##$SW_h= 3612.71676300578
##$TD= 16384
##$TD0= 1
##$TE= 0
##$TE2= 300
##$TE3= 300
##$TEG= 300
##$TL= (0..7)
0 120 120 120 120 120 120 120 
##$TP= (0..7)
150 150 150 150 150 150 150 150 
##$TP07= 0
##$TPNAME0= <>
##$TPNAME1= <>
##$TPNAME2= <>
##$TPNAME3= <>
##$TPNAME4= <>
##$TPNAME5= <>
##$TPNAME6= <>
##$TPNAME7= <>
##$TPOAL= (0..7)
0.5 0.5 0.5 0.5 0.5 0.5 0.5 0.5 
##$TPOFFS= (0..7)
0 0 0 0 0 0 0 0 
##$TUNHIN= 0
##$TUNHOUT= 0
##$TUNXOUT= 0
##$USERA1= <user>
##$USERA2= <user>
##$USERA3= <user>
##$USERA4= <user>
##$USERA5= <user>
##$V9= 5
##$VALIST= <valist>
##$VCLIST= <CCCCCCCCCCCCCCC>
##$VD= 0
##$VDLIST= <DDDDDDDDDDDDDDD>
##$VPLIST= <PPPPPPPPPPPPPPP>
##$VTLIST= <TTTTTTTTTTTTTTT>
##$WBST= 1024
##$WBSW= 4
##$XGAIN= (0..3)
0 0 0 0 
##$XL= 0
##$YL= 0
##$YMAX_a= 97585
##$YMIN_a= -98316
##$ZGOPTNS= <>
##$ZL1= 120
##$ZL2= 120
##$ZL3= 120
##$ZL4= 120
##$ABSF1= 15.46923
##$ABSF2= -2.58262
##$ABSG= 5
##$ABSL= 3
##$ALPHA= 0
##$AQORDER= 0
##$ASSFAC= 0
##$ASSFACI= 0
##$ASSFACX= 0
##$ASSWID= 0
##$AUNMP= <proc_1d>
##$AZFE= 0.1
##$AZFW= 0.1
##$BCFW= 0
##$BC_mod= 2
##$BYTORDP= 0
##$COROFFS= 0
##$CY= -3
##$DATMOD= 1
##$DC= 0
##$DFILT= <>
##$DTYPP= 0
##$F1P= 0
##$F2P= 0
##$FCOR= 1
##$FTSIZE= 16384
##$FT_mod= 6
##$GAMMA= 0
##$GB= 0
##$INTBC= 1
##$INTSCL= 3.241238e-09
##$ISEN= 128
##$LB= 0.25
##$LEV0= 0
##$LPBIN= 0
##$MAXI= 10000
##$MC2= 0
##$MEAN= 0
##$ME_mod= 0
##$MI= 1.114404
##$NCOEF= 0
##$NC_proc= -7
##$NLEV= 6
##$NOISF1= 3.799351
##$NOISF2= 2.8
##$NSP= 0
##$NTH_PI= 0
##$NZP= 0
##$OFFSET= 15.44169
##$PC= 1
##$PHC0= -1711.964
##$PHC1= 4.5666
##$PH_mod= 1
##$PKNL= yes
##$PPARMOD= 0
##$PSCAL= 0
##$PSIGN= 0
##$REVERSE= no
##$SF= 200.130016011554
##$SI= 16384
##$SIGF1= 3
##$SIGF2= 2
##$SINO= 0.751879
##$SIOLD= 32768
##$SREGLST= <19F.Aceton>
##$SSB= 0
##$STSI= 16384
##$STSR= 0
##$SW_p= 3612.71676300578
##$SYMM= 0
##$S_DEV= 0
##$TDeff= 16384
##$TDoff= 0
##$TI= <>
##$TILT= no
##$TM1= 0
##$TM2= 0
##$TOPLEV= 0
##$USERP1= <user>
##$USERP2= <user>
##$USERP3= <user>
##$USERP4= <user>
##$USERP5= <user>
##$WDW= 1
##$XDIM= 16384
##$YMAX_p= 327994205
##$YMIN_p= -203668
$$ End of Bruker specific parameters
$$ ---------------------------------
##NTUPLES= NMR SPECTRUM
##VAR_NAME=  FREQUENCY,     SPECTRUM/REAL,   SPECTRUM/IMAG
##SYMBOL=    X,             R,               I
##VAR_TYPE=  INDEPENDENT,   DEPENDENT,       DEPENDENT
##VAR_FORM=  AFFN,          ASDF,            ASDF
##VAR_DIM=   16384,         16384,           16384
##UNITS=     HZ,            ARBITRARY UNITS, ARBITRARY UNITS
##FACTOR=    0.220516191357247, 1,           1
##FIRST=     3090.34575599256, 0,            0
##LAST=      -522.371007013219, 0,           0
##MIN=       -522.371007013219, -203668,     0
##MAX=       3090.34575599256, 327994205,    0
$$ Real data points
##PAGE= N=1
##DATA TABLE= (X++(R..R)), XYDATA
$$ [...]
7933A11865p225J5573m5683Q642J9129r712j7266l1127Q4271K8503n2784P722
7921A11908l7571k4672J5027P044Q91J3157L5404j8846K2581r246j3084r417m6230
7908D6946j2003j7427J0517n5104M5768J343J4867K0882m2549p4269N2844P2923
7896F4738j7301q721m2780j7480K8646L4629J136J7442M102o810J2309M1611l7290
7883G4231j0061j2060j5636L4438J9500j0904l5465j1223m9537M4679l2160J0826
7871F628M6053j8683n3943N8996M4419j219O1155k5007j5068k9818k982m3098
7859B7433N2647m486j5165N512J5528k7416o6638J944K9087k7433K6140O4644
7847H1797N8218m8591n0015k4213l275L6302L1451N131j7233L5152l4561m211
$$ y = [111865, 104640, 120213, 74530, 83172, 102301, 92589, 75323, 44196, 128467, 156970, 104186, 111908, 74337, 49665, 64692, 71736, 72627, 85784, 121188, 102342, 124923, 115677, 102593, 93176, 46946, 34943, 17516, 28033, -27071, 18697, 20040, 34907, 55789, 13240, -61029, -8185, 64738, 47437, 38716, -4064, -21544, 7102, 41731, 42867, 60309, 64411, 57601, 69910, 111521, 74231, 64170, 52110, 36474, 70912, 90412, 79508, 44043, 32820, -16717, 27962, -4198, 6628, 52681, 33998, -19945, 39051, 83470, 82251, 143406, 118399, 103331, 73513, 70531, 27433, 80080, 75594, 60429, 65941, 81469, 54053, -12585, -10641, 18446, -8987, 17153, 81797, 140015, 91424, 41409, 17196, 13921, 50223, 81674, 86805, 69572, 104724, 70163, 65952]
7835F5952j9472k7149j3668j4978M0267k1460J5637m8947K4584P8343j9292n2956
7823F861J2888l1617J2872L9950j2717l4757R8759M6016o9823n415K7786r5214
7811d411Q5166q0027L1661o8391J10302J00300R34510k66082q24233O0802p1214
7800H383O1453j14044N931M6381N3322m2284K0502m4072K8848k9322L7641j6599
7788A6140L3066K0255K6587K5525j9926j31053J3433M0363R4755l1243Q878M0294
7776A37074k2230k736k5108l2757J3649j17323R2959M7308m1970l6902o3920n982
7764e7938K8916M6418K3689n9922k0261K9589P5137L0132R155p715l5371m0913
7752B0916j4986O7352n998p3444L6875O629K3553l2112l545Q1292j3156k9794
$$ y = [65952, 46480, 19331, 5663, -9315, 30952, 9492, 25129, -23818, 766, 79109, 59817, 6861, 19749, -11868, 1004, 40954, 28237, -6520, 92239, 138255, 68432, 63017, 90803, -4411, 80755, 728, 32389, -36002, 74300, 174600, 1109110, 843028, 18795, 79597, 8383, 69836, -44208, -38277, 8104, 61426, 19142, 39644, -4428, 24420, -4902, 32739, 16140, 49206, 69461, 96048, 121573, 101647, -29406, -15973, 24390, 119145, 87902, 96780, 137074, 114844, 112108, 87000, 54243, 67892, -49431, 43528, 90836, 48866, 11964, -51956, -57938, -29022, 17396, 41085, -18837, -39098, -9509, 65628, 95760, 104915, 97200, 61829, 20916, 5930, 73282, 67284, -6160, 30715, 37344, 60897, 28785, 25240, 106532, 93376, 63582]
7740F3582L0015J5010o9928m0402n81k1534m304K4151K5557P1126k1721l9465
7728C1506p1886M5115L8853J6430K8325p8342K8533K6349J2023m1563k4378k7921
7716a6956P4553q257J8212K694j8688j5733j7727m8276K4707Q646j4038k9108
7704c9971j595p451J2730L3359m684L7482L903n3739j7827M0625q0578J5172K9376
7691c3198K7777J6547M4220n0612N3318p017k2098J8126O597R469p2715N3368
7679D3782k4963j4072o19K032r933M8138j9513n5629o96J8691O835Q0319j2247
7666F2125j09557K5174j2727J5831l8586R140J6429Q4269j4251j9889l5989L6802
7654A8771n3207n2042L8978L5982j9972J6874j2q973R832P705N9132o967k4688
$$ y = [63582, 93597, 108607, 38679, -1723, -2304, -23838, -28142, -3991, 21566, 92692, 70971, 31506, -40380, 4735, 43588, 60018, 88343, 10001, 38534, 64883, 76906, 35343, 10965, -16956, 57597, 49340, 67552, 70246, 51558, 35825, 18098, -30178, -5471, 3175, -10863, -39971, -41566, -49017, -36287, -2928, -7612, 29870, 33773, -19966, -37793, 2832, -77746, -62574, -33198, -5421, 11126, 55346, 4734, 58052, 51035, 28937, 47063, 53660, 63129, -9586, 43782, 18819, 4747, 4128, 6160, -3773, 44365, 24852, -30777, -31473, -12782, -5947, 74372, 62125, -47432, -22258, -34985, -19154, -57740, -48600, -32171, 52098, 37847, 17958, -18031, 18771, -34436, -86478, -47500, -11518, -31490, -14616, -14628, -23601, -13769, -6064, 53068, 46101, 21413]
7641B1413k6536m7394M4915J8727n9569N7854J3613l865L0133l0477L5572K3326
7629G7712k6851Q84O9882n5597J287q6998K6238M1248M3265k5055p9275r120J1310
7616a1070l6618M2532N499k4188n2226j2622M9017R7635Q315o2408l7638j4877
7604d8649K1383N5359L501l2486Q056l3214k7833K1946N8147n9819M6433M0369
7592E3193M233J5755J0916o3029N496n614K5645m5640J2768j9174J2643M6049
7580E3241J02L3496j7785o1189m2724m9896K5507M2730P4993L1984o8440l0952
7568h933n2105L7395J6334j6109K9126k9785L5364j6410j661L9906j3397m09n7674
7555c8358K5472L5457J2172J9514L1246j3623k5582K9467n2742j5027L4698l3527
$$ y = [21413, -5123, -52517, -7602, 11125, -48444, 9410, 23023, 19158, 49291, 18814, 54386, 77712, 50861, 51745, 121627, 66030, 67317, -19681, 6557, 47805, 91070, 66015, -13260, -22380, -11070, -47688, -5156, 343, -23845, -76071, -88693, -39676, 57959, 66274, 3866, -33772, -48649, -27266, 28093, 31594, -892, 7164, -26050, -53883, -31937, 26210, -33609, 12824, 53193, 57426, 73181, 84097, 21068, 26564, 20950, 46595, 955, 13723, -5451, 7192, 53241, 53343, 86839, 69054, 7865, -34859, -84755, -59248, -16518, 58475, 90459, 22019, -8933, -61038, -23643, -7309, -23418, 5708, -24077, 11287, -5123, -6784, 33122, 19725, 19316, -38358, -12886, 22571, 34743, 54257, 85503, 71880, 46298, 75765, 23023, 7996, 42694, 9167]
7543I167K0325q35k7805j0299k5484O5377R206l9594l5049J993K0722K8782p5651
7530e9145L8025J6163l7763m5697M1453J9421P6343J8995p9234L1515j2113K1004
7518B8967R580n3298k305l5717j8016O0214O6863j6424N2882n1242l2029l79L6742
7505D5838n2071j2262P187m061q943K9410P1826l4319n8029K6028R858K6279j4837
7492C1904M837p8640M506N4427j7041L5054j10L1400O7364M4310l0212o4319n9883
7479B3597k8341l2397M1785J4386k822m6652J8685L6632m904o7214O4912L3302
7467E0969m063q097o087M9849k2898j8308J1152m5668K585j8135l913J8830L1792
7454C8008k5931K8767P7119j6953o2114l5043n1113K6465P4924N9704j8839k2312
$$ y = [9167, 29492, 28657, 852, -9447, -34931, 30446, 39652, 58, -34991, -32998, -12276, 16506, -59145, -21120, -4957, -42720, -88417, -46964, -27543, 48800, 67795, -11439, 20076, 7963, 28967, 38547, -14751, -17056, -52773, -70789, -10575, 56288, 39864, 92746, 41504, 9475, 9096, 45838, -6233, -18495, -11308, -15369, -24312, 5098, 76924, 42605, -15424, 10604, 20462, 46741, 31904, 36741, -41899, -37393, 17034, -7, 35047, 34937, 66337, 133701, 178011, 147799, 83480, 23597, -4744, -37141, 4644, 19030, 16208, -30444, -11759, 24873, 19969, -47245, 17667, 50969, 46906, 38809, 32722, 82571, 59673, 41365, 52517, 6849, 9434, -8701, -12614, 6216, 38008, 12077, 40844, 117963, 101010, 38896, 3853, -47260, -20795, 54129, 113833, 94994, 72682]
7442G2682n3483M9492p1353P7189N6624M355o5920l7273j2926K7880N6882O8337
7430A72486Q218K404J3363K4596P4300o6665j4760r331k249k488J6160o202Q676
7417B18508r189P7994O3262n9157p7749K1652L6758j0692o9720L9522M6519J0034
7405B87742j3830q883m0020J8319M6283k2076L8884j5510N6318n7374N1383O5883
7393D07119R070L8813M7352N9621l445j21103R287n1546J203j9651j0596l7342
7381C28782k5198P590K77q160M2703q6323n285J0077k4716N4305N0786K4887p0864
7368B98861o9930o6871J8534m0927Q9306L6592J2899O7099R2402q2286l7325j5971
7356C02383L7673o4170m2829n9069m0905M5805K4623m0319j8406k6829r928j6542
$$ y = [72682, 19199, 68691, -2662, 74527, 131151, 135506, 69586, 32313, 19387, 47267, 104149, 172486, 180704, 183108, 196471, 221067, 295367, 228702, 213942, 204611, 202362, 199874, 216034, 209832, 218508, 209319, 287313, 350575, 291418, 213669, 235321, 272079, 261387, 191667, 231189, 277708, 287742, 273912, 265029, 225009, 243328, 289611, 267535, 306419, 290909, 347227, 289853, 341236, 407119, 416189, 455002, 502354, 561975, 558530, 437427, 446714, 395168, 396371, 376720, 366124, 328782, 303584, 311174, 311451, 303291, 345994, 259671, 254386, 264463, 239747, 294052, 344838, 369725, 298861, 228931, 162060, 180594, 139667, 228973, 265565, 278464, 345563, 437965, 355679, 318354, 302383, 340056, 275886, 233057, 173988, 133083, 178888, 203511, 163192, 144786, 117957, 108029, 91487]
7344I1487l5675k8389P494J5849J8407j6125O579R362J4075j4393J8121m3854
7332D2938m925K1035j9695j3266k9570N2485K0720j007l28m5970K1055o1449M436
7319a3541J457K9944k5500k1473L6000L850j9199L8869q245l9316J3838J1713
7307H397j8345N6834k695j8593m0056j3832K6317J4637k2649K2130J840j3149
7295H36J0897n9579k859L988J2353O1200J5537m1378j7163N8956N897K2076m569
7282F6192J1761o3110j0521O2578p1487J9133M4986m7758p594P7625m0125m2935
7270a255n934M6234j3524K1122M055m5709J610K6098j5012m795N623J6532N8735
7257I3780M6247n5966N8457o5965m6074N1947O5260j3762k8532l4596l0532N3285
$$ y = [91487, 55812, 27423, 34917, 50766, 69173, 53048, 59627, 68989, 83064, 68671, 86792, 42938, 38013, 59048, 39353, 26087, -3483, 49002, 69722, 68715, 68387, 22417, 43472, -17977, -13541, -12084, 17860, -7640, -29113, 6887, 10737, -8462, 30407, 22162, -17154, -3316, 8397, -9948, 46886, 44191, 25598, -14458, -28290, -1973, 12664, -9985, 12145, 13985, 836, 11733, -47846, -50705, -46717, -34364, 26836, 42373, 995, -16168, 42788, 48685, 70761, 66192, 77953, 14843, 4322, 66900, -4587, 14546, 59532, 11774, 4180, 81805, 41680, -1255, -7189, 39045, 25521, 46643, 50698, 4989, 6599, 32697, 17685, 12890, 18513, 35045, 93780, 140027, 84061, 142518, 76553, 30479, 82426, 147686, 133924, 105392, 70796, 40264, 93549]
7245I3549N5654n8352j2568m3774J7258k5946O474L8721L8431J920J7109j4472
7233A14004J2879J976Q506n3525K524R829K5688k6606k415j1053j6629L6448L7176
7220A38802m5178k7568K6229n081Q964l1721K755J120N4628M724L0670r056n7917
7207I1371K8344j3740r787r121J7198J1812k2929L2843o5597k9781N3N4229R408
7194I4303l9892P6186J0250k2520m4131q1162l9949J8641J02252P0222m1668k7989
7182G4543J1278l8594l9917K0132J9782j1794m3628p520L3501N3686j2643j7233
7170D1593n7925M6736K9655n054L7852m6119Q5619L9237l2478n6377K3944N971
7158A12654J03104M258M8419l5857k7854N9177N690J2567J381J8429K1692k2057
$$ y = [93549, 149203, 90851, 78283, 34509, 51767, 25821, 32295, 71016, 109447, 111367, 128476, 114004, 126883, 128859, 137365, 83840, 86364, 96193, 121881, 95275, 92860, 81807, 65178, 101626, 138802, 93624, 66056, 92285, 87204, 96168, 64447, 67202, 68322, 122950, 127674, 158344, 149288, 91371, 119715, 105975, 96188, 87067, 104265, 116077, 93148, 125991, 60394, 30613, 30666, 84895, 94303, 54411, 130597, 140847, 118327, 74196, -6966, -46915, -28274, 73978, 144200, 102532, 74543, 85821, 47227, 7310, 27442, 47224, 35430, -8198, -15718, 17783, 71469, 58826, 41593, -16332, 30404, 60059, 55005, 92857, 46738, 132357, 171594, 139116, 82739, 106683, 112654, 215758, 220016, 268435, 232578, 204724, 263901, 269591, 282158, 283539, 301968, 323660, 301603]
7146C01603o266m4615l4209J271k5712l0586M1482o3250L9646k7769l1160l5148
7134H5287m8784j9596m5267j0770L9941l5285k2182N6090K7119M0340K346j06722
7122c7483J4518R447k7886k4295m7850J0938k807q074k3491N6667R044j252J2593
7109e9931m0130J1617j928O9552M8536n3763R827n1694M2787q541j1677J8832
7097b6513m1333O4486J8483o4262l7191O2520l7345K258M0812n6112k7574M2628
7085e9143M026k6527k2968O3831Q527m3435j4291R935Q4770k9647p6789L7344
7073f4367P5605m3876r946m6400L3398m105M7358j9262J4389l2411M1101P3829
7061F5313l6764L2823k9928k35112J12308J22654o3142m3092K3635N2627R137
$$ y = [301603, 295337, 250722, 216513, 217784, 192072, 161486, 202968, 139718, 179364, 151595, 120435, 85287, 36503, 16907, -28360, -39130, 811, -34474, -56656, -566, 26553, 66893, 69239, -37483, -22965, -13518, -41404, -65699, -113549, -102611, -105418, -113492, -136983, -80316, -71272, -72524, -59931, -100061, -88444, -90372, -20820, 27716, -26047, -16220, -67914, -25127, -33668, -45345, -26513, -67846, -3360, 15123, -49139, -86330, -23810, -61155, -58897, -18085, -74197, -101771, -59143, -55117, -81644, -104612, -40781, -32254, -75689, -89980, -80045, 4725, -24922, -101711, -64367, 11238, -32638, -42584, -88984, -55586, -59691, -12333, -31595, -17206, -49617, -8516, 65313, 28549, 61372, 31444, -203668, -91360, 31294, -31848, -74940, -51305, 1322, 10459]
7050A0459m789j3505m1828O9431J603o0197J9250L2898j2318n2132L1904L4650
7038A5426O851l4532J9800L9022K0264O8215j8086n7305k636J6749n8289j5888
7026d09M7730n2224l409J7976J5927J0954L5813K844O5990J49n2694m431N5974
7013A40190L3830Q3683j7507m2090r027p6943j15230o778J1044M4156K0564m4375
7001B1517p2873M6682L2942R844J8391k1153L9522m8417K2707n9250L8767o21
6989B8058k4508L3756K5366j9931m1349j1678l246O9976p769p7396j8336M7703
6977F46n1500P374M0275k141j7541N206m1518M1125P404N626L8575j3448j8646
6964A437q0395j4495j9662K095N5806K2664K2361l1700k1521L4948j9510k0986
$$ y = [10459, 5670, -7835, -49663, 19768, 21371, -38826, -19576, 13322, 1004, -51128, -19224, 15426, 22277, -12255, 7545, 46567, 66831, 135046, 116960, 59655, 57019, 73768, 15479, -409, 47321, -4903, -8312, 9664, 25591, 36545, 72358, 75202, 141192, 141341, 88647, 84216, 140190, 174020, 257703, 240196, 198106, 189079, 112136, -3094, -9872, 1172, 45328, 65892, 21517, -51356, -4674, 28268, 38112, 56503, 35350, 74872, 26455, 49162, -10088, 28679, 28058, 3550, 37306, 62672, 42741, 1392, -10286, -13532, 56444, 48675, -28721, -47057, 646, -50854, -43480, -3205, -5346, -22887, -17681, -59199, -18074, -10670, -5044, 33531, 20083, 1437, -78958, -93453, -113115, -111020, -55214, -32550, -10189, -41889, -63410, -28462, -47972, -68958]
6952f8958L4435o623O3904o080m9369K3769j7473l2155o824K9126K2703M6590
6940C3045r443n427o5046M4745k0731L3722k1653m3499K8039L9840J4550k675
6928B5467j3239K9257l7943R782O8991l3339n0534n3209N450K1456N2846l8759
6916a3774N2086n0877L5495j7500R350l9594q188L1695J9897l4092j597J05855
6904H8756l6712r490o9599O00M5710L7766k886n4537n6984j9935M7721k5996M503
6891e1083L4450R8446m2348r0514P4608k8239n3415l4394O204J05210J02106k9261
6879I1770q1955o3500K0599J8461L9326K1651j28365p890N0777P2974l9658M6573
6867D0763M3255o6401Q411k418J2169k5155n1646n041J25431m2447K3030l9320
$$ y = [-68958, -34523, -41146, 22758, 16678, -32691, -8922, -26395, -58550, -65374, -36248, -13545, 33045, 23602, 18175, -46871, -2126, -22857, 10865, -10788, -54287, -26248, 13592, 28142, 25467, 12228, 41485, 3542, 13324, 82315, 48976, -1558, -54767, -49317, -27861, 24985, -13774, 38312, -12565, 22930, 5430, 14780, -24814, -33002, -1307, 18590, -15502, -17099, 88756, 52044, 42554, -27045, -26445, 19265, 57031, 54145, -392, -57376, -77311, -29590, -55586, -51083, -16633, 81813, 39465, -51049, 23559, -4680, -58095, -92489, -86285, 18925, 121031, 91770, 9815, -53685, -33086, -14625, 24701, 46352, -82013, -89903, -39126, 33848, -5810, 40763, 84018, 17617, 26028, 23610, 35779, 10624, -41022, -46063, 79368, 36921, 59951, 20631]
6855B0631l0787j3222M2383o449q4325L3245L1708R888m0615l2987j4332O9121
6843a5741k5915j8475O9420J7259k114M3356q8925j06895M6051M328M6308L3558
6831B215P4259L1006j8468n2564p4716M057J3904j8318l327Q5240m864l9894r4802
6818i6272M1326L1179J471L4887J5987J7495J6997o0938L0408l11O236O5219k7679
6805G6005l2894N7152l906k0586k2576K5643j5504j8258M370k2528k0290r513
6793b885Q2346l9244K9561k2800n6136l4103N8322k0359n9223L9594O7393j9938
6781B2528m9983M3821j0981k9446O5876R404l3735n6601L4848J9231l2811J7538
6769c11J3575j1833k6811K2974j5971k4915L2140k9235l371M3801p954P65M9187
$$ y = [20631, -10156, -23378, 19005, 12556, -71769, -38524, -6816, 3072, -37543, -70530, -84862, -15741, -41656, -60131, 9289, 26548, 24434, 67790, -21135, -128030, -81979, -77651, -31343, 2215, 76474, 107480, 89012, 36448, -38268, -34211, -20307, -38625, -41952, 43288, 38424, -1470, -96272, -54946, -23767, -22296, 12591, 28578, 46073, 63070, 2132, 32540, 32229, 38465, 103684, 76005, 43111, 100263, 96357, 75771, 53195, 78838, 63334, 45076, 49446, 26918, 6628, -2885, 79461, 40217, 69778, 46978, -9158, -43261, 15061, -5298, -64521, -24927, 42466, 22528, -27455, 16366, 5385, -24061, 41815, 51219, 17484, -39117, -4269, 14962, -17849, -311, 13264, 1431, -25380, -2406, -18377, -43292, -11152, -40387, -43758, 43, -7911, -7146, 42041]
6756D2041K9394m6043m5649m095j0562j1333k8833L0734K3315P414m8343j4185
6744g6145j8931N5401l4170l8513J00852p10l2341m5718J8575j5029N2833L5719
6732A823k6140m4032N8148P5202n9236l7607K9500L9074k4502j2463M5741m5560
6720e2j3667l3435L4968J7969M2574L4432m9560J197J8981K5052l2529j1903j6576
6707A7451N7202j5079K2749K9440l9302m7274l834R932k7700O9947k6733q27Q174
6694E4146p1565J2268q619L6614m4965M4921J7159K6979K8705r7858K9686k0796
6682F675K1681K9661J4306k2643o7744M2108M8369l1376l8023p0877K7652L580
6670c6631L6171j1225K9335K9212N363O1997J6781l2886K6427n386p5456J3983
$$ y = [42041, 71435, 25392, -20257, -24352, -34914, -46247, -75080, -44346, -21031, -13617, -61960, -76145, -95076, -39675, -73845, -112358, -11506, -12216, -44557, -90275, -71700, -86729, -33896, 1823, -24317, -68349, -10201, 65001, 5765, -31842, -2342, 36732, 12230, -233, 45508, -52, -13719, -47154, -12186, 5783, 48357, 82789, 33229, 34426, 53407, 78459, 45930, 34027, 17451, 74653, 59574, 82323, 111763, 72461, 25187, 21353, 31285, 3585, 73532, 46799, 45972, 54146, -17419, -5151, -13770, 22844, -22121, 22800, 39959, 66938, 95643, -2215, 27471, 6675, 28356, 58017, 72323, 49680, -18064, 24044, 72413, 41037, 3014, -67863, -40211, -36631, -460, -11685, 17650, 46862, 52225, 114222, 131003, 98117, 124544, 119158, 43702, 57685]
6658E7685M3600J5689j2469n5370J6012M2164n1455j9804J1400K2791k2720L6910
6646H4433n8217l2019M4530K3232j5325M8721Q2914j8375o8700j4583J01774m4703
6634A33682r004J0739K5296l3381O2657N3780J0887p3001p1471N4033K4386r346
6622A79257k8757K5478R799k7912q191P4955K5559J9565m6633o5913P7419O6076
6610C00702p0390J8464k1560n3771M5086Q945N19Q0759Q1094L364m5793L8472
6598C85891K9240Q4713L4368j85P0807J6350J222R2492Q4417l1695j00074l4080
6586F33466o69m9485o2099n4889P928M4454o8337J3871n5439n4224m3489k0663
6574B90425j2658K1756J2617m3247J736L3791m2021K9919K8468r8673P9461Q419
$$ y = [57685, 101285, 116974, 104505, 49135, 65147, 107311, 55856, 36052, 47452, 70243, 47523, 84433, 26216, -5803, 38727, 61959, 46634, 95355, 178269, 159894, 91194, 76611, 178385, 133682, 124678, 135417, 160713, 127332, 189989, 243769, 254656, 181655, 110184, 164217, 188603, 179257, 150500, 175978, 185777, 157865, 149674, 224629, 250188, 269753, 223120, 157207, 234626, 300702, 230312, 248776, 227216, 173445, 218531, 227476, 227995, 308754, 389848, 393212, 347419, 385891, 415131, 499844, 534212, 534027, 604834, 621184, 622406, 714898, 799315, 767620, 667546, 633466, 632797, 583312, 521213, 466324, 474252, 518706, 450369, 464240, 408801, 354577, 311088, 290425, 277767, 299523, 312140, 268893, 270629, 304420, 262399, 292318, 320786, 222113, 301574, 309993]
6562C09993Q0609k4665l5747n8272j2850J4778m6636J991J654N4273j4659m4936
6550B25533P6905J3404k1322n3534n8698N2017M8599J5667l2105J0828J573n6983
6538B21884J8698o3310N6398K8176l0111j0835j1385P7158J1507Q389j16728N2039
6526B41880n955k4472r099k2573L7459M5226n575n6099m0014m373N381J0401R9994
6513B72181R846m8095K2523N2841r634k2228p146J6828k7872M5431r604J5521
6501C10592l871j8726k0862o1513k105Q2529K7465k0475M7421q641M7J060L061
6488C35982K5874j9657j3755j2440K1801J5226l0043M3912k6355m4457L6406n9988
6476B72506M2391N4655k2597j5005P8538l13j4170k911l456l8129J5616O2782
$$ y = [309993, 390602, 365937, 330190, 271918, 259068, 273846, 227210, 229201, 230855, 285128, 270469, 225533, 302438, 315842, 294520, 240986, 182288, 234305, 282904, 298571, 266466, 277294, 278867, 221884, 240582, 177272, 233670, 261846, 231735, 220900, 209515, 286673, 298180, 306569, 189841, 241880, 235925, 211453, 202354, 179781, 217240, 262466, 256891, 200792, 160778, 156405, 161786, 172187, 272181, 282027, 233932, 256455, 309296, 299662, 277434, 270288, 287116, 259244, 304675, 295071, 310592, 306721, 287995, 267133, 205620, 203515, 286044, 313509, 293034, 340455, 331814, 331861, 332921, 335982, 361856, 342199, 328444, 316004, 337805, 353031, 322988, 366900, 340545, 296088, 332494, 272506, 314897, 369552, 346955, 331950, 410488, 410175, 396005, 393094, 389638, 351509, 367125, 429907]
6464D29907k6937K6828k0148K3194J2783o612n4476J2238O3017Q3308o4587k8689
6452D49826o500N7835J4505M916k894O2623j5647r4228J33O8665K2073r239J1103
6439E63171K9338K717p7247O4447O2861L1750j6578J4616j6148p927R6613l4188
6427G13425o0958l6081K3341M4563N6612n4057P4005k0507k2315l4021j0519P5231
6415G48719m5851J2993L6421K0339k6630p814k5279R9372Q476j223J9593K5747
6403H64863J2002k5825m1692M8657P0681k0763k8173K3291p693J30205l9170n0829
6391I35554L9227K4541o4426L8954L4070j0747Q284k7293k4149K8900K3849J9633
6379A026397l4847M8324P1412k4965j7445O0255j0048M6155K0773J2578O9655
$$ y = [429907, 402970, 429798, 409650, 432844, 445627, 439015, 384539, 396777, 459794, 543102, 478515, 449826, 443326, 501161, 515666, 520582, 517688, 580311, 564664, 470436, 470569, 539234, 561307, 552068, 563171, 592509, 595226, 517979, 582426, 645287, 677037, 660459, 675075, 658927, 651000, 747613, 713425, 652467, 616386, 639727, 684290, 740902, 686845, 760850, 740343, 718028, 684007, 673488, 748719, 702868, 715861, 752282, 772621, 745991, 738177, 712898, 812270, 820746, 819523, 839116, 864863, 876865, 851040, 809348, 858005, 928686, 907923, 879750, 903041, 895348, 1025553, 986383, 935554, 974781, 999322, 934896, 973850, 1007920, 997173, 1005457, 978164, 954015, 982915, 1006764, 1026397, 991550, 1039874, 1111286, 1086321, 1068876, 1129131, 1119083, 1165238, 1186011, 1198589, 1268244]
6368A268244k4236n0460j9888J15635k3603o6772M9851M5806L6611o671K046K0874
6356A347437J3377P1592K2605K5877J3922K7987j6959l1905J1743M7576J8539
6345A551791j7731J7983J1530N0274M3653n217L6533R3188L7643j1263j6509p0601
6333A721274J9611M2385M9175K6211K5137L6746Q4470p9714O4600L0133M6298
6322B066326K357k7382k7932O7445L3507J034M6730n827L682J5022Q9607J16258
6310B380827o8299j8969N2964N6235K3570K3159Q3178P4925M7941l647L8315J8619
6298B708818Q9174J09696J19228J2832k6240l5019m0427m6914M7575M8018M3113
6287C029854l275L1874N9961P8929l0030n1660k2529L2888M889N8507N2197N9377
$$ y = [1268244, 1244008, 1193548, 1173660, 1289295, 1265692, 1198920, 1248771, 1294577, 1331188, 1324517, 1326563, 1347437, 1360814, 1432406, 1455011, 1480888, 1494810, 1522797, 1505838, 1473933, 1485676, 1533252, 1551791, 1534060, 1552043, 1563573, 1613847, 1657500, 1652283, 1688816, 1782004, 1819647, 1808384, 1791875, 1721274, 1740885, 1783270, 1832445, 1858656, 1883793, 1920539, 2005009, 1925295, 1989895, 2020028, 2066326, 2068683, 2041301, 2013369, 2080814, 2114321, 2115355, 2162085, 2156258, 2159940, 2174962, 2264569, 2380827, 2312528, 2293559, 2346523, 2402758, 2426328, 2449487, 2532665, 2607590, 2655531, 2651884, 2690199, 2708818, 2797992, 2907688, 3026916, 3039748, 3013508, 2978489, 2938062, 2891148, 2938723, 2986741, 3029854, 3026579, 3058453, 3118414, 3197343, 3167313, 3115653, 3093124, 3126012, 3130901, 3189408, 3241605, 3300982]
6275C300982n6853M8704l5790j63064k7426n0791J13859k4159k8661M1617M6584
6264C165002p2040p6884k4203K6753j4487N7633L5969p578M755M6739k1312j46570
6252B973777j29175r4336n9805q768L7053m4247k7612n1796n2175n4550J2005
6241B500371J0652N310k5148M1067k951j22744j11892K5259p0136j4655J3984
6230B249117j1573M59l4996L1080m7249R1972j2054j16520P078J9225o9752n8649
6218B048138M1759l7786j9849M0175J2933o5306r9719n6302O6464J9975m6932
6207A903550k8296m5995L5948Q168p1554l9661J5570k1472L5530K9742q0371M9192
6195A790351n770o4772j997j4504q334l4828l238j8282m0493n2740R281n6565
$$ y = [3300982, 3244129, 3292833, 3257043, 3093979, 3066553, 3015762, 3129621, 3105462, 3076801, 3118418, 3165002, 3092962, 3016078, 2991875, 3018628, 3004141, 3061774, 3097743, 3090165, 3094920, 3141659, 3120347, 2973777, 2844602, 2750266, 2690461, 2681693, 2718746, 2674499, 2646887, 2595091, 2542916, 2488366, 2500371, 2511023, 2516333, 2491185, 2532252, 2529301, 2406557, 2294665, 2319924, 2249788, 2235133, 2249117, 2237544, 2238003, 2203007, 2234087, 2186838, 2278810, 2266756, 2150236, 2157314, 2176539, 2106787, 2048138, 2089897, 2052111, 2032262, 2072437, 2085370, 2020064, 1920345, 1864043, 1930507, 1950482, 1903550, 1875254, 1829259, 1865207, 1873375, 1801821, 1762160, 1777730, 1756258, 1791788, 1821530, 1741159, 1790351, 1784581, 1719809, 1717812, 1703308, 1694974, 1660146, 1656908, 1638626, 1598133, 1545393, 1554674, 1498109]
6183A498109L7129Q935M1561q8157q5163Q127P119J9270L3m697o2954L5340N8500
6170A473152l7703l4439l7063K8677m5657m984M3969k4674p0383o5439j4429R321
6158A220348k816r884L8594o5598L83k6642R2067k2470m4708j14622m8325O0763
6146A077090m799o2844J07717k4649q5084r93N2058k8605L8437L4342m7539k3792
6134A031339J8276K9867o2554L8494L715j2391k7382J8635l8901o4686N967P1434
6122A011813n7371k9162K8529j1676J678k1108K7962r952J8474L9224N2659N1530
6110A102600m4979m297n4546l1939m2451J7301j0589N659M6460o1295l6609J22466
6098A007781j6025m6250O8963m5942l2626l1210R704P53j7534J4045M163K3312
$$ y = [1498109, 1535238, 1544173, 1585734, 1497577, 1412414, 1420541, 1427660, 1446930, 1446963, 1442266, 1379312, 1414652, 1473152, 1435449, 1401010, 1363947, 1392624, 1346967, 1341983, 1385952, 1361278, 1290895, 1225456, 1211027, 1220348, 1217532, 1207648, 1246242, 1180644, 1181027, 1154385, 1246452, 1223982, 1179274, 1064652, 1016327, 1077090, 1072291, 1009447, 1117164, 1092515, 1007431, 1006438, 1058496, 1029891, 1068328, 1102670, 1055131, 1031339, 1049615, 1079482, 1016928, 1055422, 1059137, 1046746, 1019364, 1037999, 999098, 934412, 940379, 1011813, 954442, 925280, 953809, 942133, 943811, 922703, 950665, 940713, 959187, 998411, 1051070, 1102600, 1057621, 1053324, 998778, 966839, 924388, 941689, 931100, 936759, 983219, 921924, 885315, 1007781, 991756, 945506, 1014469, 968527, 935901, 904691, 914395, 915148, 897614, 911659, 915822, 939134]
6086I39134p015K4671j9731j1865j6912n3977j5087J6828m7704m5885p714K4223
6074G78966J5633m8097o0238N0672l9770k8906L5772o0819J0747L4604n8140J6329
6062F46753J9515J5117N879k3080k1138J7372L9235J7893n1226p3067Q365O731
6050F08349k8462l2885N8437j02678m9436O2308j3542m0859O8453P3147j4433
6039E88399j8344k5058L5086m362j3841m7759r059N6648j8052l482J8090p7226
6027D81040j0193R2369L7855m5276j375K2392M3505J2965P367K7656J848N6900
6015G27053j381O129o643J08162L5009L290M1056M4396K7045o3265N8747L4183
6003A013781M9867L8181p0285L2677p0105q1005l0397o7904O6896n8852p5456
$$ y = [939134, 932119, 956790, 937059, 925194, 908282, 854305, 839218, 856046, 808342, 762457, 754743, 778966, 794599, 746502, 686264, 736936, 697166, 668260, 704032, 643213, 653960, 688564, 630424, 646753, 666268, 681385, 687264, 664184, 643046, 660418, 699653, 717546, 666320, 593253, 601618, 608349, 579887, 547002, 605439, 502761, 453325, 515633, 502091, 461232, 529685, 602832, 588399, 570055, 544997, 580083, 575721, 561880, 514121, 505062, 561710, 543658, 540176, 558266, 481040, 470847, 563216, 601071, 555795, 554420, 576812, 620317, 633282, 640649, 668305, 670153, 727053, 725672, 731801, 725158, 833320, 868329, 871619, 912675, 957071, 984116, 920851, 979598, 1013781, 1063648, 1101829, 1031544, 1064221, 994116, 913111, 882714, 814810, 881706, 822854, 747398]
5992G47398j1948l8439q5523j2900L149r0170l8883m348Q1694K5816l5351k5467
5980E15028k794P558l8044l9860M6672L7164n1464k2255P775j6853j8165k6988
5968C97774N004j8088M0341l4370K5562k4483k1254L641m0209L8317L7256q927
5956D00564k1320K2013L3625R553m8858K3707L7327k7295J4641o4289m5429k416
5944C31823k2901N3034R2849l0461N541m530j8083L894m2050M0343P3519k2175
5932D60803j8247J09409m5513K0804M5116j3224K3741M116k27k9406j8333P0988
5920F10027k3336r0974j4471J02219o436l9088n5485J2932L092P4343P1816m7540
5908E97099r4299o094N8326L2961j2743j6660j4987m6183l3847L8480K1971q4393
$$ y = [747398, 735450, 697011, 611488, 598588, 601737, 511567, 472684, 468336, 550030, 575846, 540495, 515028, 512234, 519792, 481748, 441888, 488560, 525724, 474260, 452005, 459780, 442927, 424762, 397774, 402778, 384690, 425031, 390661, 416223, 391740, 370486, 374127, 333918, 372235, 409491, 400564, 379244, 401257, 434882, 444435, 395577, 419284, 456611, 429316, 443957, 379668, 334239, 331823, 308922, 361956, 454805, 424344, 429885, 425355, 407272, 411166, 369116, 409459, 482978, 460803, 442556, 551965, 506452, 527256, 572372, 559148, 582889, 587005, 586778, 557372, 539039, 610027, 586691, 495717, 481246, 583465, 577029, 537941, 482456, 495388, 498480, 572823, 644639, 597099, 502800, 496706, 555032, 587993, 575250, 558590, 543603, 497420, 463573, 502053, 524024, 439631]
5896D39631N9625r254m4116j6210O7751Q039M7379k3705m82j3202k5133M3798
5884E34121R669L1916L8940o1755j3927M6852N2050O0455m1198K488N8404l3531
5872F84484m1676Q5056J1365n7560J3790k6293n3286J5879m202p7806q1196J12531
5860E81086O5685k9814n099j7189n4643L069J8187L4558O4827l0296Q627J3074
5848F52072n5905j4629j8499M4752N5620L3240o4136M6265l689p0154j8946K7648
5836F13639K13L6673k1458J3024j8503j8288N3791P7915K5692o5722K6069J7360
5824G40405O6377L3436N1433m1548m5138K6935L0534M0451K8895L183O098K2845
5812I63906O400P467O6365k8713j5780K8587M6313K8530j5427M0245J6907j2437
$$ y = [439631, 499256, 490002, 445886, 429676, 497427, 505466, 552845, 529140, 528658, 515456, 490323, 534121, 543790, 575706, 614646, 552891, 538964, 585816, 637866, 698321, 657123, 659611, 718015, 684484, 642808, 727864, 739229, 681669, 695459, 669166, 615880, 631759, 627557, 549751, 468555, 581086, 646771, 616957, 611858, 594669, 540026, 543095, 561282, 595840, 660667, 630371, 638998, 652072, 596167, 581538, 563039, 607791, 663411, 696651, 632515, 678780, 675091, 604937, 585991, 613639, 613852, 650525, 629067, 642091, 623588, 605300, 659091, 737006, 762698, 696976, 723045, 740405, 806782, 840218, 891651, 850103, 804965, 831900, 862434, 902885, 931780, 934963, 941061, 963906, 970306, 977773, 1044138, 1015425, 999645, 1028232, 1074545, 1103075, 1087648, 1127893, 1144800, 1132363]
5800A132363J6966k209M686o1939K5353j1336j562Q447N6898P2618K8357r969
5788A258673N550Q5685P1789K8438J4709K382J4387L1095L4381M3790L5560K9147
5776A655586J04291J24174J13301O3359p291M0619p094J18172N5914J13133J40179
5765B514343J38464M1232J01804J21343Q1700J30859J13064N2351R6692K12945
5755C604797J90278K70755J35804J40840J71269K77523K28438K48104K72693K23166
5745E763667L87057L38999L37296K85133K64559L40570L11797L71241M73071M35358
5735I308748N13456O57191O44506O80731P38640P55370Q09471R57586J159497
5726A6225196J287043J399183J475191J602004J865115K115207K324374K588317
$$ y = [1132363, 1149329, 1147120, 1151806, 1089867, 1115220, 1103884, 1102322, 1110769, 1167667, 1240285, 1268642, 1258673, 1264223, 1349908, 1421697, 1450135, 1464844, 1467226, 1481613, 1512708, 1547089, 1590879, 1626439, 1655586, 1759877, 1884051, 1997352, 2060711, 2053420, 2094039, 2086945, 2205117, 2261031, 2374164, 2514343, 2652807, 2694039, 2795843, 2917186, 2998886, 3129745, 3242809, 3295160, 3391852, 3604797, 3795075, 4065830, 4201634, 4342474, 4513743, 4791266, 5019704, 5267808, 5540501, 5763667, 6150724, 6489723, 6827019, 7112152, 7376711, 7717281, 8029078, 8400319, 8873390, 9308748, 9822204, 10479395, 11123901, 11804632, 12543272, 13298642, 14108113, 15065699, 16225196, 17512239, 18911422, 20386613, 21988617, 23853732, 25968939, 28293313, 30881630]
5718C0881630K884574L253596L683339M056928M525469M993471N565385O171720
5710F6016112O738303P395986P765948P584924O859610N901387N117784M823203
5702A18203257N177308N511178N336990L625090N47572l158811o049546o906935
5694A22286103o739311o259172n925088o141330o734480p297368p347282p003025
5686F8839047o311796n460333m829617m227946l696967l183991k841365k565320
5678C5721712k301348k032170j926574j678686j518571j369260j277655j228732
5670B2388716j021241q96041p54790p35247q13395p76127o90535q79446p20373
5661A5101521o15555n86322n21542m93532m54822m87799m34163l63197k78490
$$ y = [30881630, 33766204, 37019800, 40703139, 44760067, 49285536, 54279007, 59844392, 66016112, 72754415, 80150401, 87916349, 95501273, 102360883, 108262270, 113380054, 118203257, 123380565, 128891743, 134228733, 137853823, 138401395, 135242584, 129193038, 122286103, 115546792, 109287620, 103362532, 97221202, 90486722, 83189354, 75842072, 68839047, 62527251, 57066918, 52237301, 48009355, 44312388, 41128397, 38287032, 35721712, 33420364, 31388194, 29461620, 27782934, 26264363, 24895103, 23617448, 22388716, 21367475, 20471434, 19716644, 18981397, 18168002, 17391875, 16701340, 15821894, 15101521, 14485966, 13899644, 13378102, 12884570, 12429748, 11941949, 11507786, 11144589, 10866099]
5652A0866099k91096l17404l48426l32846k68648j93411j96208j86610k02779
5643H528671j40208j94694p3131r0551j35650p1070n4192j5357J4200o2734j12796
5632G592488k08197k65999j78483j80733j41439k09882j70750j23143j36320j13650
5622E863892j33689p0631r6102r6870p6960o2434p5328j32380j50879o6339l9713
5611D862567j06943q7616r6778K3937j25804k1523l8527j69126n6884k8379p5963
5600D078961o6943j41743p4439j28076l6220p1388m3015k2152m8630n008J6147
5589C457494J0527j24128m1017J010Q0101J6703L3004n6463o1307k9092L7106
5578C323938j9242M3124Q174J3872j02494K452o178p0207k4430j24738j04191
$$ y = [10866099, 10575003, 10257599, 9909173, 9576327, 9307679, 9114268, 8918060, 8731450, 8528671, 8388463, 8193769, 8120638, 8030087, 7894437, 7823367, 7769175, 7753818, 7768018, 7705284, 7592488, 7384291, 7118292, 6939809, 6759076, 6617637, 6407755, 6237005, 6113862, 5977542, 5863892, 5730203, 5659572, 5563470, 5466600, 5389640, 5327206, 5251878, 5119498, 4968619, 4902280, 4862567, 4755624, 4668008, 4571230, 4595167, 4469363, 4447840, 4409313, 4240187, 4183303, 4154924, 4078961, 4012018, 3870275, 3795836, 3667760, 3631540, 3560152, 3517137, 3494985, 3446355, 3441347, 3457494, 3468021, 3343893, 3302876, 3303886, 3383987, 3400690, 3433694, 3377231, 3315924, 3286832, 3323938, 3304696, 3347820, 3355994, 3369866, 3267372, 3269824, 3263646, 3193439, 3169009, 3044271, 2940080]
5567B940080l4110q7102j19823l3394l3361j8704j6785o1218k8149p37j49133
5556B357564p2284P399p5218l5575J2146m6399k3012j0715k1479o2035o4235m6268
5544A919889o935o208j4560p183O429K7258q3757p1223O3450j5609p5471J177
5532A737257k0983l9939o4246k0572M688m555j07871q4296L4426n113M384N2816
5520A485996K6596o7354L9187n506o9922J0461K2025l1407l9000L3565m4350k2612
5508A337679L3691n1059n6897m5456K0835j2702J6724p635m4735q2047L1848O307
5496A146553o0246o2396l55P1956K0143J5346o7232m2104J2410J1423j108l4321
5484A010069j2681K4666k1245p1790j189j137k2436M6193L4443o2156n8573O2616
$$ y = [2940080, 2905970, 2818868, 2699045, 2665651, 2632290, 2613586, 2596801, 2535583, 2507434, 2506697, 2357564, 2285280, 2292679, 2217461, 2181886, 2194032, 2147633, 2124621, 2113906, 2092427, 2030392, 1966157, 1919889, 1912954, 1906746, 1892186, 1885003, 1891432, 1918690, 1834933, 1763710, 1827160, 1811551, 1736080, 1737257, 1716274, 1676335, 1612089, 1591517, 1596205, 1591650, 1483779, 1399483, 1433909, 1428796, 1433180, 1485996, 1512592, 1445238, 1484425, 1478919, 1408997, 1419458, 1441483, 1410076, 1371076, 1404641, 1360291, 1337679, 1371370, 1320311, 1263414, 1217958, 1238793, 1226091, 1242815, 1235180, 1190445, 1108398, 1140246, 1146553, 1086307, 1023911, 1023556, 1095512, 1115655, 1131001, 1063769, 1021665, 1034075, 1045498, 1044390, 1010069, 997388, 1022054, 1000809, 929019, 927830, 926693, 904257, 950450, 984893, 922737, 864164, 926780]
5472I26780M8228l6731J2897N951J2466n6474M065k2177M0165l9266j9582k583
5460H73739m5089J9411l075N429O0384k8519r333J6353p0515K8609r342K7272
5448H65324K2474m4987r980O9969j086n7408K0147L9308n895O3330J1749j7497
5436I55448Q132n0324n1365P5990m6989m7876M9565K6626P6756K2648L3016j3887
5424A037740n0009N9814p9688j229O4605k9737M2785J12764N7529p590m3809m0469
5412A122706O4960J9360J9034l6996K1252J22395N5010J955K050Q4218M5006M2707
5400A563657J1930M9622N6066j2658q971L9915m3690k5194q365k4712j24381l2937
5388A440282q0120M4433o1013n5027M1327o9747R612j9280r7405n0664n2248q9731
$$ y = [926780, 975008, 938277, 951174, 957125, 969591, 913117, 917182, 895005, 935170, 895904, 876322, 873739, 828650, 848061, 844986, 850415, 910799, 882280, 872947, 889300, 818785, 847394, 838052, 865324, 887798, 842811, 832831, 902800, 901714, 844306, 864453, 903761, 897866, 961196, 972945, 955448, 963580, 913256, 861891, 937881, 890892, 843016, 892581, 919207, 995963, 1018611, 1051627, 1037740, 987731, 1047545, 967857, 966628, 1031233, 1001496, 1044281, 1157045, 1214574, 1206984, 1163175, 1122706, 1187666, 1207026, 1226060, 1189064, 1210316, 1332711, 1387721, 1389676, 1391726, 1475944, 1520950, 1563657, 1575587, 1625209, 1681275, 1668617, 1659646, 1699561, 1655871, 1630677, 1622312, 1597600, 1473219, 1440282, 1360162, 1404595, 1343582, 1288555, 1329882, 1260135, 1269747, 1250467, 1153062, 1102398, 1050150, 960419]
5376I60419j9213j0977k8867N7802J5437M5180n6708J0907m8564L2843J7863o1064
5364I15058J0528j3164P2054p895j0039j3488j3448K5441L8331l2633o8560m0133
5352H62052K3549q8307k6771J5360K8113N39J6681o0176r602o1010j2561j498
5340F86369J20471n4539l2777m4666M4570J9680o104l7113k1073o2515N0938K6345
5328F89586k9151K9966n5630J2972k1141l9895O3349L462p0268j532j9885K0582
5316E82415N8173L0783o5279j008n4958N1103j1758L790J340p9966j6161J2035
5304E10509O2881J0464o3800K1438K3644m4995L3450n982o041N9408n5516L774
5292E49234j187O0878L7264j0331k5340l7951m2060K6437R498o9048K4684K1403
$$ y = [960419, 941206, 930229, 901362, 959164, 974601, 1019781, 963073, 973980, 925416, 958259, 976122, 915058, 925586, 912422, 984476, 976581, 966542, 953054, 939606, 965047, 1003378, 970745, 902185, 862052, 885601, 797294, 770523, 785883, 813996, 814535, 831216, 771040, 761438, 700428, 687867, 686369, 806840, 752301, 719524, 674858, 719428, 739108, 733004, 695891, 674818, 612303, 663241, 689586, 660435, 690401, 634771, 647743, 626602, 586707, 650056, 653518, 583250, 581718, 561833, 582415, 640588, 671371, 606092, 605084, 550126, 601229, 589471, 593261, 594601, 514635, 498474, 510509, 573390, 583854, 520054, 541492, 565136, 520141, 553591, 547609, 541568, 600976, 545460, 549234, 548047, 608925, 646189, 635858, 610518, 572567, 530507, 556944, 566442, 497394, 522078, 543481]
5280E43481k2169k3356J342N4291o2587j6063j5807P9259J4378n3326j9228p032
5268D73183R6401r0047K6350J9099j9480K8260m0941N0860j884M0711l9r0225
5256D92248L4016N0283M4198Q428o4681j5191J926o116J20015l5209q3538J152
5244E47531L2992j3815P6311M0740l3674n2719q009M203M6611J27435l46l8260
5232G29000K1496L0449o6300l1099j1044p0161m4467K6177O193Q048L135l9297
5220E62130Q1576k5482m1952n444J3766M1036l1663N5384r10K5602P098j0185
5208F70956K1767J4636l6039n9709O1341L3335k0458L1735k9855K9657L0957Q385
5196G56708J4436k9104j1950K9005K5243K0030l8678J21339J6702k2336O3557
$$ y = [543481, 521312, 497956, 499298, 553589, 491002, 474939, 459132, 538391, 552769, 499443, 480215, 473183, 569584, 479537, 505887, 524986, 505506, 533766, 492825, 543685, 541801, 582512, 582473, 492248, 526264, 576547, 620745, 629173, 564492, 549301, 551227, 545111, 665126, 629917, 546379, 547531, 580523, 566708, 643019, 683759, 650085, 597366, 589357, 593560, 640171, 767606, 767260, 729000, 750496, 780945, 714645, 683546, 672502, 602341, 557874, 584051, 590244, 598292, 601427, 562130, 643706, 618224, 576272, 570828, 584594, 625630, 593967, 649351, 648441, 674043, 681141, 670956, 692723, 707359, 671320, 611611, 672952, 706287, 685829, 717564, 687709, 717366, 748323, 756708, 771144, 742040, 730090, 759095, 784338, 804368, 765690, 887029, 903731, 881395, 944952]
5185I44952k4720k9261J0366J2174K0571l2668K1575L1516J0315K3239L3326Q3371
5173A104756L1589L132M2200l2207J7004l533o0692N7715N3823N3416q115L8578
5161A297666L81O013N1045M6776k0175K5421J9787n7274o1574K7220M066r7064
5149A242288l2902p917J619J957j06655m422n7217M6301Q066m4099m452m93L1693
5136A073767j3525K8728P5513m94k1909L521n0013K7623N0073k6836l8226M6044
5124A154266n1638k0391M2338O8490N0046K6352K3055K5121m0894p3117J2824
5113A216452M0703K5909J09014O5875l479J02533J07392J37272J21588R2935K16655
5102B232849K30859L37967M25636M83015L91135O6314k84333m91931n51061l83943
$$ y = [944952, 920232, 890971, 901337, 913511, 934082, 901414, 922989, 954505, 964820, 988059, 1021385, 1104756, 1136345, 1139477, 1181677, 1149470, 1166474, 1162941, 1102249, 1159964, 1213787, 1267203, 1259088, 1297666, 1298047, 1304060, 1355105, 1401881, 1381706, 1407127, 1426914, 1369640, 1308066, 1335286, 1339352, 1242288, 1209386, 1201469, 1203088, 1205045, 1098390, 1093968, 1036751, 1083052, 1091118, 1047019, 1042567, 1042074, 1073767, 1060242, 1088970, 1164483, 1163989, 1142080, 1145601, 1095588, 1123211, 1173284, 1146448, 1108222, 1154266, 1102628, 1082237, 1124575, 1193065, 1243111, 1269463, 1292518, 1317639, 1276745, 1203628, 1216452, 1257155, 1283064, 1392078, 1457953, 1454474, 1557007, 1664399, 1801671, 1923259, 2016194, 2232849, 2463708, 2801675, 3227311, 3710326, 4101461, 4167775, 3883442, 3391511, 2840450, 2456507]
5092B456507k58691k05373j85356j04465n0361o6882l3593l0551l7015q2856m6785
5081A354579k0027K9594m7983k5068M529m391k5208n59J5697J9414k8797q786
5069A262994P9722N9410o5159r606P6287k2048q5910K1132J9238r6088n621K7701
5057A262052L7383l5761q142k3623j12R1060K8793l764N8867j8229J5719L0067
5045A434310n2044R5131P945K8983L2405PN843J0827L1N2346M1958K1029K018
5032A680789L8134O9155q860L5472J08540Q912M51O0732L6586M5645l803L7655
5020B109408Q3326L3038L9795N8826Q5877J29591J16989J65518J38511J46761
5010C107640K01621J95100K86931K58019L18224M72525O05443O21961O00564M76607
$$ y = [2456507, 2197816, 1992443, 1807087, 1702622, 1652261, 1585379, 1551786, 1521235, 1484220, 1401364, 1354579, 1334552, 1364146, 1316163, 1291095, 1295624, 1291233, 1266025, 1265466, 1281163, 1300577, 1271780, 1262994, 1342716, 1402126, 1336967, 1327361, 1403648, 1381600, 1295690, 1316822, 1336060, 1239972, 1234351, 1262052, 1299435, 1263674, 1255532, 1231909, 1231797, 1322857, 1351650, 1347886, 1406753, 1388524, 1404243, 1434310, 1382266, 1477397, 1485342, 1514325, 1546730, 1546737, 1552580, 1563407, 1563438, 1615784, 1657742, 1678771, 1680789, 1718923, 1788078, 1779218, 1814690, 1923230, 1932142, 1932593, 1993325, 2029911, 2075556, 2071753, 2109408, 2192734, 2225772, 2265567, 2324393, 2410270, 2539861, 2656850, 2822368, 2960879, 3107640, 3309261, 3504361, 3791292, 4049311, 4367535, 4840060, 5445503, 6067464, 6668028, 7144635]
5000G144635N3052k70895n16361n60619n58132l44893k45626j37318j98998j83130
4990D181715n3009k6536l9887k3470k5959l3889k3081K7525J24935Q9759J36205
4979D334308R8899J38520R2721q5960q0390j0924n7854l1869P5617R0856O2651
4968D626575J21472J36893K95790L35300L53912N25526O42919N87739M97587J68129
4958H291842j02540k13850l97977m62673l88110m23393l78955k74010k09142j34630
4948E306562j26923j22424r9230o9435J3658J7916M2226P1425L8713J8381N3314
4937E144183J06955J11192J39373J01248O4246J64165K39629J92569J72059K27769
4927F663388K14092K45874K87007L57415L85076M25316N03056N50687O14424O69681
$$ y = [7144635, 7197687, 6926792, 6410431, 5849812, 5291680, 4946787, 4701161, 4563843, 4364845, 4181715, 4128706, 4102170, 4062283, 4038813, 4012854, 3978965, 3955884, 3983409, 4108344, 4198103, 4334308, 4433207, 4571727, 4664448, 4578488, 4498098, 4487174, 4429320, 4397451, 4473068, 4563924, 4626575, 4748047, 4884940, 5180730, 5516030, 5869942, 6395468, 7038387, 7626126, 8123713, 8291842, 8189302, 7975452, 7577475, 7114802, 6726692, 6303299, 5924344, 5650334, 5441192, 5306562, 5179639, 5057215, 4957985, 4888550, 4902208, 4920124, 4962350, 5033775, 5072488, 5090869, 5144183, 5251138, 5362330, 5501703, 5602951, 5667197, 5831362, 6070991, 6263560, 6435619, 6663388, 6877480, 7123354, 7410361, 7767776, 8152852, 8578168, 9081224, 9631911, 10246335, 10916016]
4917A0916016P95321P96557R40870J062838J329334J424233J546404J738421J807143
4908B2357137J671687J470455J108136R87899Q27184M65554P0009k26469m32357
4899B8299235n35759n20000m58352l70058k74242j24821J16562L67486N83857
4890B7083908Q58103J111339J200133J437793J565308J565695J529043J133393
4882C7484715Q45524N88443J80944j17467l75486n61443o86967o00381l86023
4873C6371859j04673O7945L77527Q30235J150138J334646J754133K139758K426564
4864D6348132K900193L280845L717696M127366M249409M275191M030863L732305
4856G6662000L327434K315727J152209n92766k601598m296492n255768n371484
$$ y = [10916016, 11711337, 12507894, 13448764, 14511602, 15840936, 17265169, 18811573, 20549994, 22357137, 24028824, 25499279, 26607415, 27595314, 28422498, 28888052, 28958061, 28731592, 28299235, 27763476, 27243476, 26785124, 26415066, 26140824, 26016003, 26132565, 26500051, 27083908, 27942011, 29053350, 30253483, 31691276, 33256584, 34822279, 36351322, 37484715, 38330239, 38918682, 39099626, 38982159, 38606673, 38045230, 37358263, 36757882, 36371859, 36267186, 36335131, 36712658, 37542893, 38693031, 40027677, 41781810, 43921568, 46348132, 49248325, 52529170, 56246866, 60374232, 64623641, 68898832, 72929695, 76662000, 79989434, 82305161, 83457370, 82864604, 80263006, 75966514, 70710746, 65339262]
4848F5339262m800930l952751l034088k289933j642880j109768p22283k04104
4840D7582525K26103O12716J011559J428626J981186K253484K586252K686747
4832F0369198K397544J659003N80790p58208j838004k752095l346116l730835
4824E2581277l831279l762103l418470l124038k772205k413773k177916j957599
4816B9123894j770460j518010j480913j321039j069051j060560r82406r10015
4808A9011440q41821p02335o61114o23389m95969m82351m11256m60008m53173
4799A3880024l67519k82874k55620l60398k47672j96735k28104j89538j54086
4790A1597478j24087j32555j59954j22131j56222o5036n3329p7476j7459J5737
$$ y = [65339262, 60538332, 56585581, 53551493, 51261560, 49618680, 48508912, 47786629, 47582525, 47808628, 48421344, 49432903, 50861529, 52842715, 55096199, 57682451, 60369198, 62766742, 64425745, 65006535, 64248327, 62410323, 59658228, 56312112, 52581277, 48749998, 44987895, 41569425, 38445387, 35673182, 33259409, 31081493, 29123894, 27353434, 25835424, 24354511, 23033472, 21964421, 20903861, 19921455, 19011440, 18169619, 17467284, 16806170, 16182781, 15686812, 15204461, 14793205, 14333197, 13880024, 13512505, 13229631, 12974011, 12613613, 12365941, 12169206, 11941102, 11751564, 11597478, 11473391, 11340836, 11180882, 11058751, 10902529, 10837493, 10784164, 10706688, 10689229, 10704966]
4780A0704966J9062j4230o9979L2838L3222m9078N3371R66R511P7761R7934Q4477
4768A0980821J27183J96621J22889K34850K67444L05746L16704L04702L37058
4759A3194018L51214L77006N36187N24299N44206N54509O66021Q64906Q91340
4750A8503706R56612J233289J203409J306143J514463J594025J685164J903167
4742B9899978K047141K158424K218865K345770K286382K248561K249501K149967
4734D7604589J980885J924534J871774J785226J718740J386712J175608Q24868
4726F0272936M94731M14506K93205L09133K70223J37881L00079N31142P03761
4717F3727597J031637J330883J707563J950698K038804K111335K316615K599344
$$ y = [10704966, 10724028, 10709798, 10639819, 10672657, 10705879, 10656801, 10710172, 10711138, 10720649, 10798410, 10896344, 10980821, 11108004, 11304625, 11427514, 11662364, 11929808, 12235554, 12552258, 12856960, 13194018, 13545232, 13922238, 14458425, 14982724, 15526930, 16081439, 16747460, 17612366, 18503706, 19460318, 20693607, 21897016, 23203159, 24717622, 26311647, 27996811, 29899978, 31947119, 34105543, 36324408, 38670178, 40956560, 43205121, 45454622, 47604589, 49585474, 51510008, 53381782, 55167008, 56885748, 58272460, 59448068, 60272936, 60767667, 61182173, 61475378, 61784511, 62054734, 62192615, 62492694, 63023836, 63727597, 64759234, 66090117, 67797680, 69748378, 71787182, 73898517, 76215132, 78814476]
4709G8814476K766584K708504K557977K333096K067543J685379J533884J429602
4701I5897045J349762J326378J275580J269246J326017J528290K062345K746409
4693A08781072L516393M249539N214736O323304P363928Q597807R805922J0512436
4685A64365137J0870761J1380713J3260671J6535732K0666709K5137469K8118472
4678B90335664K5230480J2428061q573581k7775597l4497675l2060856k7175446
4671A97911050k2298557j8018113j4803498j2430354j0502776r039606p950379
4664A02867767p082334o474610n976606n533376m972931m582073m004659l667986
4656F0573192l331475k852997k627784k360660k116695k049940j869744j685817
$$ y = [78814476, 81581060, 84289564, 86847541, 89180637, 91248180, 92933559, 94467443, 95897045, 97246807, 98573185, 99848765, 101118011, 102444028, 103972318, 106034663, 108781072, 112297465, 116547004, 121761740, 128085044, 135448972, 144046779, 153852701, 164365137, 175235898, 186616611, 199877282, 216413014, 237079723, 262217192, 290335664, 315566144, 327994205, 319420624, 291645027, 257147352, 225086496, 197911050, 175612493, 157594380, 142790882, 130360528, 119857752, 110818146, 102867767, 95785433, 89310823, 83334217, 77800841, 72827910, 68245837, 64241178, 60573192, 57241717, 54388720, 51760936, 49400276, 47283581, 45233641, 43363897, 41678080]
4648D1678080j504836j374254j322881j168195j006281q08419q00226q23860q49393
4639C2019735j006076j097755j153053j192478j147407j043713r32451q61960
4631B3584842q79001p97190p37334n87596n36430m91817n10141n24857m26593
4622A8093883m25593m21955m03992m90662m10470l23214l80123l26783l81023
4613A4530068m12300k44507k39401k85723k36598k30218j73975j38364j79627
4604A2389355k05166k13075j52801j59235j78415j59782j77815k36239j50467
4595A0756360j30393r5033j75904j55211j09666q3913r8517j22585q0188p3021
4585I631929m7211j36568q7699o5044j25515n5664j1844j02299Q309K9128Q5768
$$ y = [41678080, 40173244, 38798990, 37476109, 36307914, 35301633, 34493214, 33692988, 32869128, 32019735, 31013659, 29915904, 28762851, 27570373, 26422966, 25379253, 24446802, 23584842, 22705841, 21908651, 21171317, 20583721, 20047291, 19555474, 19045333, 18520476, 18093883, 17668290, 17246335, 16842343, 16351681, 15941211, 15617997, 15237874, 14911091, 14530068, 14117768, 13873261, 13633860, 13348137, 13111539, 12881321, 12707346, 12568982, 12389355, 12184189, 11971114, 11818313, 11659078, 11480663, 11320881, 11143066, 10906827, 10756360, 10625967, 10530934, 10355030, 10199819, 10090153, 10006240, 9907723, 9785138, 9704950, 9631929, 9584718, 9448150, 9360451, 9295407, 9169892, 9114228, 9102384, 9000085, 9008394, 9037522, 9123290]
4574I123290l6297L4458J62283J78349J86733J53717J10135K18548K58379L19385
4564A0708980L03307L25197M12705N74184N59592O50064P21380Q21202J051128
4555A6127739J345285J568632J845546J990656J858197J384858P20123j02141
4547B6738895q84659j593269j855638k056197k039203j816291j527337j125981
4539A3840320q78632p34847o72430n55491n02310m50201m31844k49892l00214
4530I064459l07204m04036l31150l30398l22228j91477j98663j85413j37536j16940
4520F539414j83220j78103j04865p6301j11233p5673n8326q9781j77531j42940
4510E341441m7821j25823j11646j02630j23812q0341k03836q1824o3548p1583
$$ y = [9123290, 9086993, 9121451, 9283734, 9462083, 9648816, 9802533, 9912668, 10131216, 10389595, 10708980, 11012287, 11337484, 11750189, 12324373, 12883965, 13534029, 14255409, 15076611, 16127739, 17473024, 19041656, 20887202, 22877858, 24736055, 26120913, 26841036, 26738895, 25854236, 24260967, 22405329, 20349132, 18309929, 16493638, 14966301, 13840320, 12961688, 12226841, 11554411, 10998920, 10496610, 10046409, 9614565, 9364673, 9064459, 8757255, 8353219, 8022069, 7691671, 7369443, 7177966, 6979303, 6793890, 6656354, 6539414, 6356194, 6178091, 6073226, 5996925, 5885692, 5810019, 5751693, 5661912, 5484381, 5341441, 5293620, 5167797, 5056151, 4953521, 4829709, 4749368, 4545532, 4463708, 4400160, 4328577]
4500D328577n2619o9178n0711o583m4983m5113J1409n3224m5851l407L746J3269
4488C985332l6227j9806l8083p4906j2835l0127r543M5291J021q2221l3053j3431
4476C681412j0463m1171J3721j21622o2178K3900K5009j3294K3053J0565k1079
4465C507853j7432k541M3762l5079q1387J9897o0702p469M806r4609j3242n4042
4453C209815n1956j0594m101M0205j5657n9075j0085P7869L4146k8500J5292M5071
4441C242430l77o258K7158J3327l9890K958l4221n4930K167m3305k5187j887Q321
4428C090306J16858k553o3671l2097J7851J799K0925k8903l2647O1382L1661Q4436
4416C265347P2278j8126q7900q0403n3611M1087m026J0591J5701n0765M3923j0796
$$ y = [4328577, 4275958, 4206780, 4156069, 4149486, 4104503, 4059390, 4070799, 4017575, 3971724, 3968317, 3972063, 3985332, 3949105, 3929299, 3891216, 3816310, 3803475, 3773348, 3763805, 3809096, 3810117, 3727896, 3694843, 3681412, 3670949, 3629778, 3643499, 3521877, 3459699, 3483599, 3508608, 3495314, 3518367, 3528932, 3507853, 3490421, 3487880, 3531642, 3496563, 3415176, 3435073, 3374371, 3366902, 3371708, 3277099, 3263857, 3209815, 3157859, 3147265, 3143164, 3183369, 3167712, 3108637, 3098552, 3176421, 3210567, 3182067, 3197359, 3242430, 3242053, 3235795, 3262953, 3276280, 3236390, 3239348, 3205127, 3150197, 3152364, 3109059, 3083872, 3081985, 3090306, 3207164, 3204611, 3140940, 3108843, 3126694, 3128493, 3149418, 3120515, 3087868, 3149250, 3180911, 3265347, 3337625, 3319499, 3231599, 3151196, 3097585, 3138672, 3134646, 3145237, 3160938, 3110173, 3154096, 3143300]
4404C143300N3649P0005L2940j8167M1361O6411Q276M1195l5295N5699P3715P7760
4392C610849J1895k0065p8836O256J0869n2166P205J7830n0705L0827j1110J9929
4380C502778M5721K2182J07559J2069J45723J21628J05312J30487n1773j26796
4370D014890q7627p1603j17596p8418L7810M1055J2851J10520L2394J1389k4518
4359C881147k9311m3896j48254j17803r6938j28436r5659p8155j07307n3271j15584
4348B866533o1949o7693j13703q844m5023o5510j9054l6345J3252j7991j40028
4337B303645k4656j803M8608O4789l1193q566L9162Q1000L4673n350J29608J46064
4325B775981Q5455M6082M1732j5324r8348j16311j46515j25593j18925j42441
$$ y = [3143300, 3196949, 3266954, 3299894, 3281727, 3323088, 3389499, 3397775, 3438970, 3403675, 3459374, 3533089, 3610849, 3622744, 3602679, 3523843, 3530099, 3540968, 3488802, 3496007, 3513837, 3463132, 3493959, 3482849, 3502778, 3548499, 3570681, 3678240, 3690309, 3836032, 3957660, 4062972, 4193459, 4141686, 4014890, 3927263, 3855660, 3738064, 3659646, 3697456, 3738511, 3751362, 3861882, 3894276, 3905665, 3881147, 3851836, 3807940, 3659686, 3541883, 3444945, 3316509, 3220850, 3142695, 3035388, 2982117, 2866533, 2804584, 2736891, 2623188, 2614344, 2569321, 2503811, 2484757, 2448412, 2461664, 2443673, 2303645, 2278989, 2277186, 2325794, 2390583, 2359390, 2350824, 2389986, 2470986, 2505659, 2500309, 2629917, 2775981, 2861436, 2907518, 2949250, 2933926, 2835578, 2719267, 2572752, 2447159, 2328234, 2185793]
4315B185793j09200K8499p5779p3931J6361p9802o2117p1216m2334M7532q2754
4304A681052k0896O0954m2682k2473L2732j0996Q171K262n5833M1790L0804m1559
4292A663326K1425l1167q7503o740k8912p1549n6250n5151q393J167k5252J4679
4280A329680K0875n4370q3443L404J5664N08o4403Q6449j5071l7238l4622j5155
4268A152278L0656N2315m255K94j3652j9862M4475k9796n6628l587J6477N373
4256A174088K1685l7771q9636J7507M555k2003L9897o7214k4994q257p738L5055
4244A035174n328k3870o0812M842M7822o3563J0231K3054K7167K4282K8560K4365
4232A071924k9291O3455K3267p4591n4791M5271O0096o8253K8010M304l1814m4563
$$ y = [2185793, 2076593, 2105092, 2029313, 1955382, 1971743, 1891941, 1829824, 1758608, 1716274, 1763806, 1681052, 1660156, 1721110, 1678428, 1655955, 1688687, 1677691, 1685862, 1688124, 1632291, 1674081, 1704885, 1663326, 1684751, 1653584, 1566081, 1559341, 1530429, 1458880, 1402630, 1347479, 1339086, 1340253, 1315001, 1329680, 1350555, 1296185, 1212742, 1216146, 1231810, 1232318, 1167915, 1254364, 1239293, 1202055, 1167433, 1152278, 1182934, 1235249, 1230994, 1231288, 1217636, 1197774, 1242249, 1212453, 1155825, 1152238, 1168715, 1174088, 1195773, 1158002, 1068366, 1085873, 1090428, 1068425, 1108322, 1041108, 1016114, 1007857, 1000119, 1035174, 1029846, 1005976, 945164, 950006, 997828, 934265, 944496, 967550, 994717, 1018999, 1047559, 1071924, 1042633, 1106088, 1129355, 1054764, 999973, 1045244, 1105340, 1037087, 1065097, 1069401, 1037587, 993024]
4220I93024m2479M5297O6946o2907l1575P3905n5644p9850L4602J5898N393K070
4208I64680L5333m7168K3895L2649k9022k8157J5152k0731M1152M661q012l4110
4196I50322n0258L2685P3611j6688l1888j5158j0224M2128j2321j1738J7476P457
4184I75404j6293K1724J9432m3062M7458P8454K2084q1368n830M0335j1142K7041
4172A074237K6766p8165L554K9531l2966M1431M7111l300l1932l3582K1460J3042
4160A077187K7741L3495l708L6009l0124O8570J1497l8012J8966N3226l0445j324
4148A223078J6778J612m9508K7621N3275l2933O664l3871M1919m8155o5350J45582
4136A286712l736j142M2386L460j1223o818M5753J4201r2036k1516k6331k0532
$$ y = [993024, 950545, 995842, 1062788, 999881, 968306, 1042211, 986567, 906717, 941319, 957217, 962610, 964680, 1000013, 952845, 976740, 1009389, 980367, 952210, 967362, 946631, 987783, 992444, 984432, 950322, 900064, 932749, 1006360, 989672, 957784, 942626, 932402, 974530, 962209, 950471, 967947, 975404, 959111, 980835, 1000267, 957205, 1004663, 1083117, 1105201, 1023833, 1018003, 1058338, 1047196, 1074237, 1101003, 1022838, 1026392, 1055923, 1022957, 1064388, 1111499, 1108199, 1076267, 1042685, 1064145, 1077187, 1104928, 1138423, 1134715, 1170724, 1140600, 1209170, 1220667, 1182655, 1201621, 1254847, 1224402, 1223078, 1239856, 1241468, 1191960, 1219581, 1272856, 1239923, 1246587, 1212716, 1254635, 1206480, 1141130, 1286712, 1282976, 1281834, 1324220, 1327680, 1316457, 1309639, 1355392, 1369593, 1277557, 1256041, 1229710, 1209178]
4124A209178m375L636l8744R0606m128k3812J6266k7045m257J2218j9228r09J9641
4111A229047k4842r496M386L1587N9502L9368n4479k5799l8052J8343J8764k6489
4099A221840J0607r3335p7984l4982N4789j4284P1962N2167m4056K5835k7548
4088A145011K0179n8862j9079N8620J3323r7578n8957K4881k33N7795K3751k6720
4076A082131m5535O2908L333p4788j67m4882o0661m976K5752m6680R612o9632
4064H36415o2930J9125L5789j9444P5139k1448q5784O4806L1930L690M2626k4835
4052H95079o4919m663j6577l1639k3379N607P4819k2388l6861N9759l5669l6729
4040G62440J7633p548j7432r797K4365M4986K5806J8098j2962p5361K2287q1857
$$ y = [1209178, 1204803, 1208439, 1169695, 1260301, 1256173, 1232361, 1248627, 1221582, 1217325, 1229543, 1210315, 1209406, 1229047, 1204205, 1194709, 1199095, 1230682, 1290184, 1329552, 1275073, 1249274, 1211222, 1229565, 1248329, 1221840, 1232447, 1139112, 1061128, 1026146, 1080935, 1066651, 1138613, 1190780, 1146724, 1172559, 1145011, 1165190, 1106328, 1087249, 1145869, 1159192, 1061614, 1002657, 1027538, 1027305, 1085100, 1108851, 1082131, 1036596, 1099504, 1102837, 1028049, 1027882, 983000, 922339, 917363, 943115, 896435, 906047, 836415, 773485, 792610, 828399, 808955, 884094, 862646, 776862, 841668, 873598, 877288, 919914, 895079, 830160, 825497, 808920, 777281, 753902, 759509, 834328, 811940, 775079, 834838, 799169, 762440, 780073, 772525, 755093, 745296, 769661, 814647, 840453, 858551, 845589, 770228, 792515, 710658]
4028G10658q833k0411j1041K1796l3746k5002K5192m4083q688K7384j1068l471
4016F18687n8296j683k945P4015K5088o704O0911k5376k4508j7413n4469J8096
4004F05403L8071O4176K3270l1518J2573N860l3712M1676q3475R627L5671j5312
3992F72310N859O7065J3932n7374K50M988n5100l3234J0967L1836j3753M8114
3980F95860N9561l0393p0654r9495L5880L1766m0759o3910M0265P1754J4983o4309
3968E80549K4485N4195N6131o1461o9706l9801j5521k2681K3149P3281J1808N4262
3956F68690k5800l7487M5919r056m4607n1295j3962k943j8704j8022L2992l7778
3944D87947j5853L888J5295k8649J7162O7731M9020j8619m6868L0715J7984K1486
$$ y = [710658, 701825, 681414, 670373, 692169, 658423, 633421, 658613, 614530, 605842, 633226, 622158, 618687, 560391, 558708, 555763, 629778, 654866, 648162, 709073, 683697, 659189, 641776, 587307, 605403, 643474, 707650, 730920, 699402, 711975, 717835, 684123, 725799, 642324, 651951, 687622, 672310, 678169, 745234, 759166, 701792, 702042, 707030, 651930, 618696, 629663, 661499, 647746, 695860, 755421, 725028, 654374, 554879, 590759, 622525, 581766, 517856, 558121, 629875, 644858, 580549, 605034, 659229, 715360, 653899, 584193, 544392, 528871, 506190, 529339, 602620, 614428, 668690, 642890, 605403, 651322, 642266, 597659, 546364, 532402, 529459, 510755, 492733, 525725, 487947, 472094, 475982, 491277, 462628, 479790, 547521, 596541, 577922, 531054, 561769, 579753, 601239]
3932F01239o0633j9169N4504O8129k9357p4533K459J4695m2311L6196L4067K0992
3920F06278R879q372q631L3894J5446l9400l4665J9799J8143O2645m8155K2181
3908F49042J4632m6349M500K5713n4142p116j5006J6657M135N3401M3495l1305
3896F57657O2166K8821l9517n9126N3130J7294J3810o1721n3235K5607J0477M7827
3884G03190n8530n993Q9850J5792P446j2877K03J8964J0287r5914R640L8976L4892
3871G55926J1571J2381J098l7953J2007K5530J5334J6621N3815M7257k1991l4142
3859H57454O9587K9321l2990K6367N7283K3608j8578k0659L7142K5591k1280J2949
3847A045795K7445J9016M0420k8475j6757R5721J6731j8935k0999J4919K7689
$$ y = [601239, 540606, 521437, 575941, 644070, 614713, 540180, 542639, 557334, 515023, 551219, 585286, 606278, 616157, 607785, 599154, 633048, 648494, 609094, 574429, 594228, 612371, 675016, 626861, 649042, 663674, 617325, 621825, 647538, 593396, 586280, 571274, 587931, 592066, 645467, 688962, 657657, 719823, 748644, 709127, 650001, 703131, 720425, 734235, 672514, 619279, 644886, 655363, 703190, 644660, 638667, 728517, 744309, 751755, 738878, 739081, 758045, 768332, 672418, 682058, 721034, 755926, 767497, 779878, 780976, 743023, 755030, 780560, 795894, 812515, 866330, 913587, 891596, 857454, 927041, 956362, 923372, 949739, 1007022, 1030630, 1012052, 991393, 1028535, 1054126, 1032846, 1045795, 1073240, 1092256, 1132676, 1104201, 1087444, 1183165, 1199896, 1180961, 1159962, 1174881, 1202570]
3836A202570l5732L7890m442K5342j8336L6973R9700n9513J398K0148O2341O2391
3824A430730n36O0077J1331k1552L1373L5027k6113M5001j8741J4457M5073J1384
3812A617511k0417j7393K7820J6004k548M9549K7909k1803m9352O1608J6885l8491
3800A667282N9343J5836P593J0873L8487j815M4152j2974M4008n6549J5523J5388
3788A847147n782R143N1985O1449n0973j7838j1482N9879r809M648J7239p5249
3776A880357j8546K2310l3767r559l1828l2909p050k514K80l81k4286m6440Q8032
3763A783699o7949k2681O1962J03017J6089j7495L1048q9729l1016r046N0907
3752A808806J9129J7608l4511N418R819p5330r346M5291L0123l2457p9799n8085
$$ y = [1202570, 1166838, 1204728, 1200286, 1225628, 1207292, 1244265, 1343965, 1284452, 1285850, 1305998, 1368339, 1430730, 1430194, 1490271, 1501602, 1480050, 1511423, 1546450, 1520337, 1565338, 1546597, 1561054, 1606127, 1617511, 1597094, 1579701, 1607521, 1623525, 1620977, 1670526, 1698435, 1676632, 1627280, 1688888, 1705773, 1667282, 1726625, 1742461, 1750054, 1760927, 1799414, 1797599, 1841751, 1828777, 1872785, 1816236, 1831759, 1847147, 1841365, 1850508, 1902493, 1963942, 1912969, 1895131, 1883649, 1943528, 1933719, 1938367, 1955606, 1880357, 1861811, 1884121, 1850354, 1840795, 1808967, 1776058, 1769008, 1766494, 1766774, 1766393, 1742107, 1695667, 1783699, 1715750, 1693069, 1755031, 1858048, 1874137, 1856642, 1887690, 1797961, 1766945, 1757899, 1808806, 1827935, 1845543, 1811032, 1816450, 1826269, 1750939, 1741593, 1786884, 1817007, 1784550, 1704751, 1646666]
3740A646666K6283L4376l9851j8427j8201N701N0280p1727n7655J6334J8683K938
3728A595400j9262K3274N2783k3808p1670l9438N1051j1094Q9805n4753m9324
3717A542964j4309k1718J6124J2243l5992L594m718J1996L8100K1162j4588n8035
3705A496823M4641k2877j8532k095n1452M5634J13k3098J9523n9665P6273r900
3693A495388o6096k4671R0759r824k6663j2481O5100K2609m1506J789K798L8427
3681A535629K9106L8642K9712k3465n4976P3711j5349o502M5869p5800Q5116j2102
3669A649591n82k4351j9617k7715P2052L9510o273k4050o478k1336J5998O2807
3657A709556l3817j9683R652M0981Q5557r176m1706L7988M4513n167J4854j7814
$$ y = [1646666, 1672949, 1707325, 1667474, 1649047, 1630846, 1636547, 1686827, 1615100, 1557445, 1573779, 1592462, 1595400, 1576138, 1599412, 1652195, 1628387, 1556717, 1517279, 1568330, 1557236, 1647041, 1592288, 1542964, 1528655, 1506937, 1523061, 1535304, 1499312, 1502906, 1498188, 1510184, 1548284, 1569446, 1554858, 1496823, 1541464, 1518587, 1500055, 1497960, 1446508, 1492142, 1492255, 1469157, 1488680, 1429015, 1505288, 1495388, 1429292, 1404621, 1495380, 1485556, 1458893, 1446412, 1511512, 1534121, 1492615, 1494404, 1497202, 1535629, 1564735, 1603377, 1633089, 1609624, 1554648, 1628359, 1613010, 1606508, 1652377, 1576577, 1661693, 1649591, 1649009, 1624658, 1605041, 1577326, 1649378, 1688888, 1682615, 1658565, 1652087, 1630751, 1646749, 1709556, 1675739, 1656056, 1665708, 1706689, 1792246, 1783070, 1741364, 1779352, 1823865, 1818698, 1833552, 1815738]
3645A815738l8464L041k5255M1948P988L7345K3615L4610q4973n1016N7591k050
3633A820118N7030R6397n1004o2207O1022n007n3277M8208j3483J5093K0554j4382
3621A919062Q617J6595J00220N6525m5573K6505K3324o328L2568N6826N1234n4454
3609B185121K982K169L9935Q1732J9536M9563j4672P492N7111N913J3069L6305
3597B486256M8680O3351q11P1J2789Q8823K1158n1048P6446k1007J1553O5786
3585B802047p4259q754J26889M521p6585N8480K5441O8199L8486K1195R6337M8130
3573C130127P3517K8604R172Q0814Q1668k2236J3655O5158J29347J18553j4422
3562C693957J7501M5055M6999N4004j8691J7213J48702P5413N8390O7849R5509
$$ y = [1815738, 1777274, 1780315, 1755060, 1797008, 1804996, 1842341, 1865956, 1900566, 1815593, 1764577, 1822168, 1820118, 1877148, 1973545, 1922541, 1860334, 1921356, 1916349, 1863072, 1911280, 1897797, 1912890, 1933444, 1919062, 1927679, 1944274, 2044494, 2101019, 2055446, 2081951, 2105275, 2098947, 2131515, 2188341, 2239575, 2185121, 2188103, 2190272, 2230207, 2311939, 2331475, 2381038, 2366366, 2373858, 2430969, 2436882, 2449951, 2486256, 2534936, 2598287, 2597476, 2597547, 2610336, 2699159, 2720317, 2669269, 2745715, 2724708, 2736261, 2802047, 2727788, 2719034, 2845923, 2850444, 2773859, 2832339, 2857780, 2925979, 2964465, 2985660, 3081997, 3130127, 3203644, 3232248, 3241420, 3322234, 3403902, 3381666, 3395321, 3460479, 3589826, 3708379, 3693957, 3711458, 3756513, 3803512, 3857516, 3838825, 3856038, 4004740, 4080153, 4138543, 4206392, 4301901]
3551D301901M2001P2953Q5900K3348N7301J28475N9892J16619J18738J22003O6757
3540E195888J18975J57530J31269R7575K02150J28245J25101J35554J48913K45170
3530F686370K02177J87327K64732K26880K68234L09295L16739L48858L59473M52832
3520I622917N07111M60932N63325N87824O32774P48385P36653P87391P86577P92387
3510A6226276Q70976R29697Q74171P70022N56486M81102L76093K41100M7199m4534
3500B1328588j32663j82869k95616l38719l11011k86700k69855l77593l07067
3491A8826495k26428k68883k25429k41316j65963j41460n0557n6209L6463k0073
3481A7466640L9200J5983M9130O7609Q4285J0396m3590O5195M8023p1956r6651
$$ y = [4301901, 4343902, 4416855, 4502755, 4526103, 4583404, 4711879, 4771771, 4888390, 5007128, 5129131, 5195888, 5314863, 5472393, 5603662, 5701237, 5903387, 6031632, 6156733, 6292287, 6441200, 6686370, 6888547, 7075874, 7340606, 7567486, 7835720, 8145015, 8461754, 8810612, 9170085, 9622917, 10130028, 10590960, 11154285, 11742109, 12374883, 13123268, 13859921, 14647312, 15433889, 16226276, 17097252, 18026949, 18901120, 19671142, 20227628, 20708730, 21084823, 21325923, 21373122, 21328588, 21195925, 21013056, 20717440, 20378721, 20067710, 19781010, 19511155, 19133562, 18826495, 18600067, 18331184, 18105755, 17864439, 17698476, 17557016, 17506459, 17450250, 17486713, 17466640, 17505840, 17521823, 17570953, 17638562, 17722847, 17733243, 17689653, 17754848, 17802871, 17730915, 17634264]
3470A7634264j70601l20796m16339m01406o60101p32462p16056p11287p40460
3461A2764756o01733m97807m87325m16447l92540l77616m37543m66603m84435
3452H602707m28817l98985k87494k62164k77638k47080k08725j79650j54923j32035
3442F025196j62393j61249p8474j35454j46677j77884p6125l2137o9218k6408
3432D959177j4782J1746k0827p8001L5206J54210O6870R5247J35473j67189l44780
3421D832350l35290j92441j82189j81259j50123r6403k5706J1002j09361j03512
3411C467068m3703r3437j4872m884j09295p1822o0208j3190o9263r5686l601m2436
3399B844671L160k6114j2178M3297J9021P5158P216L8537j612j42123k18846q8215
$$ y = [17634264, 17463663, 17142867, 16726528, 16325122, 15665021, 14932559, 14216503, 13505216, 12764756, 12163023, 11665216, 11177891, 10761444, 10368904, 9991288, 9553745, 9087142, 8602707, 8173890, 7774905, 7487411, 7225247, 6947609, 6700529, 6491804, 6312154, 6157231, 6025196, 5862803, 5701554, 5623080, 5487626, 5340949, 5163065, 5086940, 5054803, 4985585, 4959177, 4944395, 4956141, 4935314, 4857313, 4892519, 5046729, 5113599, 5208846, 5344319, 5177130, 4832350, 4497060, 4304619, 4122430, 3941171, 3791048, 3694645, 3668939, 3679941, 3570580, 3467068, 3423365, 3329928, 3315056, 3310172, 3200877, 3129055, 3068847, 3055657, 2986394, 2890708, 2887107, 2844671, 2847831, 2821717, 2809539, 2852836, 2871857, 2947015, 2954231, 2992768, 2991156, 2849033, 2630187, 2541972]
3387B541972q4886m1802j25332l0164o526l6433l3771p2794O179k7022k2764n5885
3375B010772k6138R798k9785j03404o1256k8786k1705n2716m0790J2387j8076
3364A650301K8027J199p7704o2277j5665K5080J9553p0395j11959l0946M6769
3353A401983K2241J9761J079o1809j5233l2737m9353O9283L2756p0293m2519m1693
3341A233466r885j9908M648l4516o690n9379M9565P868n2848J0149n0589k0854
3329A051027r261N6611j9488l8834O12j2941n0134n4339k2742P8225k3124J7184
3317I72796K8702p3158L7018k2j8824m5792J4993J3642m2231p8416M8832K7922
3305H85462l1654p732M6289j6274K0944k7786j1988J6765N1343J6414p2567n0876
$$ y = [2541972, 2457086, 2415284, 2289952, 2259788, 2253262, 2216829, 2183058, 2110264, 2116443, 2089421, 2066657, 2010772, 1984634, 1994432, 1964647, 1861243, 1799987, 1771201, 1749496, 1696780, 1655990, 1668377, 1650301, 1678328, 1679527, 1601823, 1539546, 1523881, 1548961, 1568514, 1498119, 1386160, 1355214, 1401983, 1424224, 1443985, 1445064, 1383255, 1368022, 1335285, 1285932, 1355215, 1387971, 1317678, 1275159, 1233466, 1223581, 1203673, 1208321, 1173805, 1167115, 1107736, 1157301, 1165169, 1112321, 1122470, 1071881, 1051027, 1041766, 1098377, 1078889, 1040055, 1040667, 1027726, 977592, 923253, 900511, 978736, 955612, 972796, 1001498, 928340, 965358, 965336, 946512, 900720, 915713, 929355, 887124, 808708, 857540, 885462, 853808, 846076, 892365, 876091, 897035, 869249, 857261, 874026, 925369, 941783, 869216, 818340]
3293H18340P1065K9564j0501k4957j2763r951q0762L3890n2180L4469R7290l074
3281H90430L5978p5468J01M6643n4164L3226l9810k1317L7688O2974O1815p986
3269I70110j07441N6646o229P4066n837p2720K0281N5135L8056M7498L3731l6643
3257A066653j9914K3586L8528l0584L1447M8981O4125M0565K4017K9595P352J8806
3245A343157L0042M4602j8023K1549M1634R119K6931k226L89j0912J62984M0900
3233A690146K9529j2764k7369R3291Q4192j5629n1268P0524R6528J14883j725
3222B070338L1026P6405R8155o746R199J10404J7066P5240J09914R7738L1633
3211B720372N3320L672P258P5654J09627R5756K9865O1296J04726R2898J94336
$$ y = [818340, 889405, 918969, 908468, 883511, 870748, 860797, 780035, 813925, 761745, 796214, 893504, 890430, 926408, 850940, 851041, 897684, 843520, 876746, 836936, 815619, 853307, 916281, 978096, 970110, 862669, 919315, 913086, 987152, 981315, 908595, 928876, 984011, 1022067, 1069565, 1103296, 1066653, 1046739, 1070325, 1108853, 1078269, 1109716, 1158697, 1222822, 1263387, 1287404, 1316999, 1324351, 1343157, 1373199, 1417801, 1399778, 1421327, 1462961, 1472080, 1499011, 1496785, 1497174, 1486262, 1649246, 1690146, 1719675, 1706911, 1679542, 1772833, 1857025, 1841396, 1790128, 1860652, 1957180, 2072063, 2070338, 2101364, 2177769, 2275924, 2269178, 2278377, 2388781, 2405847, 2481087, 2591001, 2688739, 2720372, 2773692, 2777364, 2784622, 2860276, 2969903, 3065659, 3095524, 3156820, 3261546, 3354444, 3548780]
3200C548780J47563R2355O8422J63751P5884P2442Q5308K9714J3230P4112O5231
3189D436792M8469k3354K9134M3032L7523O6405M8366J48764J9830O1666N4341
3178D970968R4031Q061K0297J66505N2960K7479J13161P4298J33707J78483K25052
3167F065002K35754J43375j9610j14157k44702k24838j58538j69601j88825j18734
3157E205126j67984q9931j11162J718j28008j19628q2904l4309r252j19968K4026
3146D367724Q3986n2348q154o3288o0405L537m6754J1498q0749l644p5768k0026
3134D055609j128p9716o2061j14476q9757j39860p3256j8971p6457q8448n8098
3123C253381j7986l2442j7731j39712p8937m5119l1862j26143m5372j25765j22919
$$ y = [3548780, 3696343, 3788698, 3857120, 4020871, 4096755, 4169197, 4254505, 4284219, 4297449, 4371561, 4436792, 4485261, 4461907, 4491041, 4534073, 4571596, 4638001, 4686367, 4835131, 4854961, 4916627, 4970968, 5064999, 5073060, 5093357, 5259862, 5312822, 5340301, 5453462, 5527760, 5661467, 5839950, 6065002, 6300756, 6444131, 6424521, 6310364, 6065662, 5840824, 5682286, 5512685, 5323860, 5205126, 5037142, 4947211, 4836049, 4837767, 4709759, 4590131, 4507227, 4472918, 4463666, 4343698, 4367724, 4451710, 4399362, 4391208, 4327920, 4267515, 4271052, 4224298, 4235796, 4155047, 4151403, 4075635, 4055609, 4054481, 3974765, 3912704, 3798228, 3708471, 3568611, 3495355, 3476384, 3399927, 3311479, 3253381, 3235395, 3202953, 3185222, 3045510, 2966573, 2921454, 2889592, 2763449, 2718077, 2592312, 2469393]
3112B469393N111p7096J5739l5264n0280n1114n2120j4751j1274k0490r6065m0119
3100B041670m4581j5122k6707L160q4413l1904N8078J8029j3903j4365o274j3663
3088A870005K7920k0926L7054L292K4976R5777p888L7126L0292L2616L6842o9076
3076B098010J0821m7128m133j8089r9663o1306k498l4457j9522k0726l747r889
3064A787673n8999q598j7732k4134J3897L1489J2954j0548J8397L3718L3320K7292
3052A838729O1871O4616Q3915N9262Q3293J38014Q408m8041j60949j12232n9870
3041A957016j13949j76251n1587q0784n2807O999M2192m2150p7317q2765o8339
3030A260258L2365p9434m766N383n067J5293o6656N2476M4197q3910m4018K862
$$ y = [2469393, 2474504, 2397408, 2413147, 2377883, 2327603, 2276489, 2224369, 2209618, 2198344, 2177854, 2081789, 2041670, 1997089, 1981967, 1955260, 1958420, 1874007, 1842103, 1900181, 1918210, 1904307, 1889942, 1883668, 1870005, 1897925, 1876999, 1914053, 1917345, 1942321, 2038098, 2030210, 2067336, 2097628, 2130244, 2167086, 2098010, 2108831, 2061703, 2057570, 2039481, 1939818, 1878512, 1876014, 1841557, 1822035, 1801309, 1797562, 1787673, 1728674, 1720076, 1702344, 1678210, 1692107, 1723596, 1736550, 1726002, 1744399, 1778117, 1811437, 1838729, 1900600, 1965216, 2049131, 2108393, 2191686, 2329700, 2338108, 2290067, 2129118, 2016886, 1957016, 1843067, 1666816, 1615229, 1534445, 1481638, 1488637, 1530829, 1488679, 1411362, 1328597, 1260258, 1292623, 1213189, 1208423, 1213806, 1208739, 1224032, 1157376, 1209852, 1254049, 1170139, 1126121, 1128983]
3018A128983P7254k5320j3565L703j7964L9439k8597L422o8500p7481j2704k4483
3006I84187l1572j21471o9161R619o0789n7712N9690K8277j19745n0606j6500
2995E54217k6237J4676j1041M234K0763K422j02410N76l1621p322K0994J9834
2983D59085M5944m1009J2795K6755j5822m5831k2069P627k013O1881o1449n6739
2971C69155M7669M2630l2461o9413K4583K1521o7815L4174K0990o2511l443J8226
2959C43305J5146k8864O2846m0334o6313n445R963K1603o7186R5472M7780p8990
2947C08983J2686k2970r952l3249j0228O5144k504K8548k4329n0064J938j1966
2935B52037j0535o4020j6449M5183N3569J449q690j082L6865k4289L7015j4460
$$ y = [1128983, 1206237, 1180917, 1167352, 1171055, 1153091, 1192530, 1163933, 1167355, 1098855, 1021374, 1008670, 984187, 952615, 831144, 761983, 771602, 710813, 653101, 712791, 741068, 621323, 570717, 554217, 527980, 542656, 531615, 535849, 556612, 559034, 456624, 457200, 425579, 418257, 439251, 459085, 505029, 464020, 476815, 503570, 487748, 441917, 419848, 427475, 425462, 487343, 425894, 369155, 416824, 459454, 426993, 357580, 382163, 403684, 335869, 370043, 391033, 328522, 325079, 343305, 358451, 329587, 392433, 352099, 285786, 280341, 290304, 311907, 244721, 340193, 387973, 308983, 321669, 298699, 288747, 255498, 245270, 310414, 307910, 336458, 312129, 262065, 264003, 252037, 241502, 177482, 161033, 206216, 259785, 261234, 252544, 251462, 288327, 264038, 301053, 286593]
2923B86593Q338M7032p2937j3962N6263n6478N986L7769l4977k3460p1912K4143
2911A92398R0853j43930k1210L1116O617N2520m517n1574m993M6134m6754P0095
2899B16755M4134k3958l7163l678J6850N3536m4073j5151N461K9541p5755l1334
2887A35165J8872K655j3831o2662Q689Q2036n0243l8383L2570L5360l6815p931
2875A05482K1036j3374R725k2548N0880N782j6205k7805j6029L3640l711K7012
2863A53885Q479l2089m7557l6136O7749O5805m43l3569n3648N2081N2148n3169
2851A43536q488M0023o0887j6618q285k7560K5008P606m7938k079K2598P2320
2839A39236M3511k8106m8692k9805l5327l3625J2620R793K4437j1925n6342m284
$$ y = [286593, 294931, 341963, 269026, 255064, 311327, 254849, 260835, 298604, 263627, 240167, 168255, 192398, 283251, 139321, 118111, 149227, 155844, 208364, 203847, 152273, 147280, 193414, 146660, 216755, 260889, 236931, 199768, 196090, 212940, 266476, 222403, 207252, 212713, 242254, 166499, 135165, 154037, 156692, 142861, 80199, 88888, 170924, 120681, 82298, 114868, 150228, 113413, 105482, 126518, 113144, 122869, 100321, 151201, 156983, 140778, 112973, 96944, 130584, 126873, 153885, 162364, 130275, 82718, 46582, 114331, 180136, 179693, 146124, 92476, 144557, 196705, 143536, 135048, 175071, 114184, 97566, 89281, 61721, 86729, 94335, 46397, 44318, 66916, 139236, 182747, 154641, 105949, 76144, 40817, 7192, 19812, 29605, 54042, 42117, -14225, -18509]
2827a8509L1614L5615n7786l627N982L116L4508n9349K7006P477O9306o494Q473
2814G7332k1399m4214M3328L4603k5120r22m7660J00773l1936l0100K9868M3541
2802A28094q8143n0253m861M3729m01j4607m758M9705k1084J5216K092j7207J8853
2789E6375k752j2062k1218N2732j2164j8381K2882N06m1990M5285k2247m288l8449
2776D229j2925l369O4725l860m4962l5318L118M4740r24O4006k3898n0986N662
2763A0238L6238K2168k8672L2541J0095L9219k6090m251O434k0696p9561k9775
2751c2112L0563L9149m7422n48J0114K661k7610N185K3874m135k62J00811L71
2738A00639k9518O419k8047O252o341K6951p8415p3781l1528K2018L5699L4482
$$ y = [-18509, 13105, 48720, -9066, -12693, -6711, -3595, 30913, -28436, -1430, 6047, 75353, 68859, 77332, 55933, 11719, 55047, 89650, 64530, 63608, 15948, 116721, 84785, 54685, 84553, 128094, 39951, -10302, -15163, 28566, 28165, 13558, 8800, 58505, 37421, 52637, 54729, 37522, 56375, 53623, 41561, 20343, 73075, 60911, 42530, 65412, 65918, 23928, 69213, 46966, 42678, 4229, -8696, -12065, 52660, 48800, 3838, -31480, -28362, 16378, 15454, 79460, 55562, 4576, 10238, 46476, 68644, 39972, 72513, 82608, 121827, 95737, 91486, 97920, 77224, -2337, -32112, -1549, 37600, -9822, -10370, -256, 2405, -25205, -20020, 3854, -281, -543, 100268, 100639, 71121, 77540, 49493, 55745, 49404, 76355, -2060, -75841, -107369, -85351, -49652, -15170]
2726a5170M6956k5218k003k9879r6406m4785M2203Q6063M0691J532K5399l5559
2714f176k4439L9867K5794K7828j0254L467l3820o5358J3000O7482O77o993l4905
2701c830l0193q0097J6790R4504M1287J2096R495L3045J5438k0858j07854N527
2689a4650j9593N0646Q352m5820M86JO0612k979p551K1576R038L580o7090L0447
2675B7055N1137k9874k9872J04225n4368k1860j8076p4738J5075O1060K003j04695
2663g2928M7650P8413L5495o0167l1948O6386o4494O982J00512K1178l5873n9454
2651C1752M3105j1187K5970K3720l2215l9978j9157j7336L903K9140J29643k4549
2639A42811j8487l19P7717k2076m0204n7933l1781k4780j8804M4467O463j4194
$$ y = [-15170, 31786, 6568, 4565, -25314, -121720, -166505, -124302, -38239, 2452, 3984, 29383, -6176, -30615, 9252, 35046, 62874, 52620, 56087, 22267, -43091, -30091, 37391, 38068, 31075, -3830, -34023, -114120, -97330, -2826, 38461, 50557, 60052, 93097, 108535, 87677, -20177, -14650, -34243, 16403, 24755, -21065, -20579, -20578, 40034, 37055, 29504, 51080, 60118, 63698, -3392, 27055, 78192, 48318, 18446, 122671, 68303, 46443, 28367, -46371, -31296, 29764, 31767, -72928, -25278, 53135, 88630, 28463, -3485, 62901, -1593, 5389, 105901, 127079, 91206, 31752, 74857, 63670, 89640, 113360, 81145, 41167, 22010, 4674, 8577, 37717, 167360, 142811, 124324, 124005, 201722, 179646, 139442, 81509, 49728, 24948, 6144, 50611, 57074, 42880]
2627D2880M6250L5129l4529k8178j7885M9365j3739K1398m916O479m511q3067
2615A4676j9645N6004p885J3518l8061o4967j8592M9131K5909M943l6420o205
2603b7594L8238j9693Q6149l2951p0131K8976j605N5862l1126m2232P5566k0767
2591C8692M175M1530r057l2571l7802n3024K4323L5718l3930M9188o274k4280
2579c312j798o1594K7923J746l354K1435K5288l3377J7747M9940j4752k4698K8757
2566B9951r425j6120L2906L892O446j9852J322k5221l041K2192M6145k4926l2750
2553A1519p066L8018l2222o464L4408L0722L6280k8177p4759l3393J893K1331
2541g910l358P5834M4749m5871l2917r110J3507l6641k747m0245n435L6721K22
$$ y = [42880, 89130, 124259, 89730, 61552, 43667, 93032, 79293, 100691, 95775, 102254, 97743, 14676, -4969, 51035, 43150, 56668, 18607, -46360, -64952, -15821, 10088, 15031, -21389, -27594, 10644, -9049, 77100, 44149, -25982, 2994, 1389, 57251, 26125, -16107, 59459, 38692, 42867, 84397, 75340, 42769, 4967, -48057, -23734, 11984, -21946, 27242, 20968, -3312, -5110, -66704, -38781, -37035, -40389, -18954, 6334, -27043, -9296, 40644, 25892, 1194, 29951, 20526, 4406, 37312, 41204, 47650, 27798, 29120, 3899, 858, 23050, 69195, 44269, 11519, 4453, 42471, 10249, 3785, 38193, 68915, 105195, 77018, 2259, -31134, -29241, -7910, -11268, 64566, 109315, 63444, 30527, 21417, 34924, -1717, -4464, -44709, -50144, -13423, -13201]
2528a3201j0995J9797j299o7972N3472M1836j094J729o364j575N0728m2620J1778
2515C4220n613o8522J5251J3276N1145k4537j7859N0985n7223j2707J19154J4617
2503A12187k6991J1153p500k1006K1412l308k5198k0336P9488j7362l4536k6254
2491D1749M812L4392J595n5930l0767m3281K8171N9779m0746J3458K0866q056
2479B6042K181N6544j0240N4564L5259K4907N671n5070J9494j95J4235k3957n783
2466A43652k7195n7257k906o2320J6566M5492j8499R4375m5475m1596N504q406
2454D1935J05103k7413l1044l5201j1712m4084J5432L7229K713n5541J20981m4583
2442G3815n6054K2728M2373J958k0847M7815J01583j2226m0555N0732j7451j7576
$$ y = [-13201, -24196, -4399, -5698, -73670, -20198, 21638, 20544, 22273, 15909, 14334, 65062, 22442, 34220, 28607, -39915, -24664, -11388, 39757, 15220, -2639, 48346, -8877, -21584, 97570, 112187, 85196, 96349, 88849, 67843, 89255, 85947, 60749, 40413, 119901, 102539, 68003, 41749, 46561, 80953, 82548, 26618, -4149, -47430, -19259, 40520, -226, 13232, 34098, 26042, 28223, 84767, 74527, 129091, 164350, 189257, 194928, 139858, 159352, 159157, 173392, 149435, 143652, 116457, 59200, 56294, -6026, 10540, 56032, 37533, 131908, 86433, 44837, 50341, 41935, 147038, 119625, 88581, 53380, 41668, -2416, 13016, 50245, 52958, -2583, 118398, 73815, 17761, 40489, 82862, 84820, 63973, 111788, 213371, 201145, 160590, 211322, 193871, 176295]
2430A76295N0739J1221m6370O6856m7009j5834r119R2531o00J3090O653L5680
2418C34133K1115j6746k1745p693Q2799P9070L2983j3032J9691L6387j5557R8680
2406F30085M1044P418M8598P1503L6179K9092O0154Q3104P7774L9988O2147O0050
2394A247136J16302J58046K27820J92720K19054K44533J93641K43614L39395M00443
2384C582704M24351L40097K84505L79646N07729M89072N46625P77597R47435J343120
2374I622881J661178K054956K799509M074880M192330P26322m028532m672942
2366A6430582l163393k203672j568703j293398r55382p96953n91013m94424l70613
2357D993031l87086k23375j84653k54590k99029k54141k93115k67047k44447j57193
$$ y = [176295, 227034, 238255, 191885, 258741, 211732, 195898, 186779, 279310, 278710, 291800, 298453, 334133, 355248, 338502, 316757, 309064, 391863, 470933, 503916, 490884, 510575, 546962, 531405, 630085, 671129, 678547, 727145, 798648, 834827, 863919, 924073, 1007177, 1084951, 1124939, 1187086, 1247136, 1363438, 1521484, 1749304, 1942024, 2161078, 2405611, 2599252, 2842866, 3182261, 3582704, 4007055, 4347152, 4631657, 5011303, 5519032, 6008104, 6554729, 7332326, 8279761, 9622881, 11284059, 13339015, 16138524, 20213404, 24405734, 25132056, 21103524, 16430582, 13267189, 11063517, 9494814, 8201416, 7246034, 6449081, 5858068, 5363644, 4993031, 4605945, 4382570, 4197917, 3943327, 3644298, 3390157, 3097042, 2829995, 2585548, 2428355]
2347B428355r0878j45192j46198r0118j16548l5123j44484p9475m2170r2824q6792
2336A358553j02524J4031m4049o2669j8008n8194p2255o9112k4956j0247m6629
2325H63941O724j09609q5188k4344M0843j6505j095l5263m1047J6126M00J2307
2313F27290m5977n2072r008r133j1793k8258o6760M1543R093r6399Q229M601K2169
2300C93525J2513j07231O369N3209L1983j432l6226J7521n2095m9266N3875j3875
2288C08870n9635M2692L803o7436k644K1026n474K1697K8881n1271k8132O4618
2276B76995N499p4281n6871k7648M250K299R600j4844J11831K6417l473m8196
2264B11578m4888o834l9013M4127K000n010k0946K0304m5268P27P9424l3294n3887
$$ y = [2428355, 2337477, 2192285, 2046087, 1955969, 1839421, 1804298, 1659814, 1580339, 1538169, 1445345, 1358553, 1256029, 1270060, 1226011, 1163342, 1145334, 1087140, 1014885, 945773, 920817, 910570, 863941, 870665, 761056, 675868, 651524, 692367, 675862, 674767, 639504, 598457, 614583, 614983, 627290, 581313, 529241, 520233, 511100, 499307, 471049, 404289, 445832, 454925, 358526, 366755, 371356, 393525, 406038, 298807, 305176, 358385, 390368, 388936, 352710, 370231, 318136, 268870, 322745, 308870, 249235, 291927, 295730, 228294, 225650, 246676, 241202, 262899, 291780, 240509, 212377, 276995, 282494, 208213, 151342, 123694, 127944, 130243, 139843, 124999, 236830, 263247, 259774, 211578, 166690, 159856, 120843, 164970, 166970, 161960, 141014, 161318, 116050, 116777, 196201, 162907, 109020]
2251A09020M5026K0247K2639o7403n733j2894L3770L7586m1637J7262o054L8186
2239A90015k5796l9529J9118O961m8031j9460J4902O8633j6740j1528J6052l0248
2227A24349n5987P2524k1406l9728J8039J0907j4651K7218K5662l0826K3753p5904
2215F3950n440l6903o132l9701k6R1145Q5012p7903J8989r325j7442L3505m6197
2202E3532J4383j8957L4201p4361j4633j2641L9119r024k5653M2875M0975O748
2190G6564j2089N611o579k504N5547k9493K622L3549r7468o0598j8141K3332P2761
2177D3114O4679l4471L211J0220j8057O524j101m3406n7354L404j3930K9470L6385
2164B8688Q561Q7306n2107q499M6493l8951m8811k8300K7426M13Q189l1387P176
$$ y = [109020, 154046, 174293, 196932, 129529, 123796, 110902, 144672, 182258, 140621, 157883, 151829, 190015, 164219, 124690, 143808, 150769, 102738, 83278, 98180, 166813, 150073, 138545, 154597, 124349, 68362, 140886, 119480, 79752, 97791, 108698, 94047, 121265, 146927, 116101, 139854, 63950, 58510, 21607, 15475, -24226, -24252, 66893, 151905, 74002, 92991, 83666, 66224, 99729, 53532, 67915, 48958, 83159, 8798, -5835, -18476, 20643, 11619, -14034, 28841, 69816, 76564, 64475, 70086, 63507, 61003, 116550, 87057, 89679, 123228, 25760, -34838, -52979, -29647, 43114, 107793, 73322, 76533, 86753, 68696, 75220, 74119, 30713, -26641, -23237, -37167, -7697, 28688, 37249, 124555, 72448, 63949, 110442, 71491, 22680, -5620, 21806, 22219, 30408, -979, 6197]
2151F197L6471k5291J4054j3397k9398l613L3041N3657j2338K3554K6519m7363
2139F2093l5920p322L4027j9710J9649m1876p148J3274j4782j6684K1630l5925
2127b8694O5474J9228q502j3194J3335j4372k5203P8751J2596K6117p4910j2640
2115C7986n9878j6296M3417j4662J8285M831J7486M781M7117O297j0817j7422
2103F1125K8273Q35k9197O2664K4333m1784m7461K3603K529n4273R381L695P4
2090D3797P116O278N473K0531k3708M260L2773M4438n3846n2802J8887k7110k8079
2077a992j8657m9548M6981o136j4140O8461m9485J2785k4835k0866R4148L4562
2065G1278k2366K1136o3580J0301P6714k3691L929j9462j27107K1334J4965Q864
$$ y = [6197, 42668, 17377, 31431, 18034, -11364, -14977, 18064, 71721, 59383, 82937, 109456, 62093, 26173, 18851, 52878, 33168, 52817, 10941, 3793, 17067, 2285, -14399, 7231, -28694, 36780, 56008, 47506, 34312, 47647, 33275, 8072, 86823, 99419, 125536, 50626, 37986, -21892, -38188, 5229, -9433, 8852, 13683, 31169, 35950, 83067, 89364, 78547, 61125, 89398, 90233, 61036, 123700, 148033, 106249, 58788, 82391, 84920, 30647, 40028, 43723, 43797, 50913, 57191, 62664, 83195, 59487, 63747, 96520, 140958, 87112, 34310, 53197, 26087, -1992, -20649, -70197, -23216, -29352, -43492, 24969, -24516, -11731, -36566, -57432, 36716, 71278, 48912, 70048, 6468, 16769, 93483, 69792, 73721, 54259, -72848, -51514, -36549, -27685]
2053b7685K0052m555o5187K8027O810M0294k946L3123N030J406o6108q781j01973
2040a42493K4587J43435n3903N0422J7804n1320K1679J2035K2957j9780K8147
2029E3570m1453j4537k7127O670k6230L54P287K474K7740m7598m5764O2062O9250
2016B6698J2083L2718n7920o5580Q0649O7863m2245j8189j16816L4514L6945K8610
2004A9330J5272K031m4642m987l7887J4220k255J8354L954L1049K015N5275m9550
1991B2179q015m195o9291n3694k9263L8583M5936j9836J8960M1276m1240O244
1979e2356K2457M8065K6428k2541M0507j5645l2732n1722j4764j7446k1510P132
1967h4127j4885L6559L6035M8470l123n4869j3221K449J0654n1242K0955M6164
$$ y = [-27685, -7633, -12188, -77375, -49348, -42538, -2244, -5190, 27933, 32963, 34369, -31739, -40520, -142493, -117906, 25529, -28374, 22048, 39852, -11468, 10211, 22246, 45203, 25423, 53570, 12117, -2420, -29547, -22877, -49107, -48753, -41466, -38992, -11252, -58850, -104614, -42552, 26698, 38781, 71499, 13579, -52001, 28648, 96511, 54266, 36077, -80739, -46225, -9280, 19330, 34602, 36633, -8009, -12996, -50883, -36663, -38918, -20564, -16610, 14439, 16454, 71729, 22179, 14164, 9969, -59322, -113016, -142279, -103696, -57760, -77596, -58636, -17360, -58600, -52356, -29899, 18166, 44594, 22053, 62560, 46915, 14183, -37539, -52303, -69749, -91259, -84127, -99012, -62453, -26418, 22052, 18929, -35940, -49161, -46712, -36058, -87300, -66345, -20181]
1955b0181J2845l6745k7056K4991L7707K2634k494J9746j7638K8434m9882m6171
1943e3810o981j6065m1564M326M9809L8405L9249J8485o6010k6033L2507o339
1931c4021J8340k8430n0727l11J807J2652M4547L4140o07l0470o985K2718J2940
1918d407j1680J8025k29p2389K6332O3151J3256o8119j948J16815J5055j18291
1906b4429P239j2731m3177N4855L7448K7728k338r7887p574J2715L6815L0907
1894A9571n1613q673j5176M304M2975J382j4784L5135p0526j0260O6163M1503
1882D0001j9209q4819M509L0505Q804j5436l5017j52L2788K432J3053O4646O5078
1869A07183m3149k9933j6700r0892o9065K9489N2546J1497J3267j0806l8213L160
$$ y = [-20181, -7336, -44081, -71137, -46146, -8439, 14195, 11701, 31447, 13809, 42243, -7639, -53810, -60791, -76856, -118420, -114094, -64285, -25880, 13369, 31854, -34156, -60189, -27682, -34021, -15681, -44111, -94838, -95149, -93342, -80690, -36143, -2003, -2610, -33080, -40065, -17347, -4407, -16087, 1938, 1709, -70680, -44348, 18803, 32059, -36060, -38008, 78807, 93862, -24429, -17190, -29921, -73098, -18243, 19205, 46933, 44595, -53292, -60866, -48151, -11336, 19571, -32042, -40715, -55891, -51587, -8612, -7230, -22014, 13121, -57405, -67665, -1502, 40001, 20792, -64027, -59518, -29013, -20209, -35645, -70662, -70814, -38026, -35594, -22541, 42105, 107183, 64034, 34101, 17401, -73491, -142556, -113067, -60521, -49024, -35757, -46563, -84776, -81616]
1857h1616L5575K1974L5826p474j4717l4303j6072M171J0074K3625O1819J5099
1845E3981j9463J940l0532m277l0380k3998L2466l828R991N2180l6821n1841J5810
1832c4772N3344r18o139Q786j7301n4109k4325j483K3773o8M8317P771q904j2954
1818a8982k5675k1016n3413N0933J8649n993P2382k44m0512l2398K1398L2287
1806b584l1817N588M2214l1879L4118J682N914N5J0867M3100l8281m9447k465
1793a2935Q9591k4407n4535k9500j9565J9037j0940J2881m3172m9608P4256M7346
1781a551k4695N0981j9608j2448J5020j9460m5451r397K2495j0937j1406j1793
1769g8250P5333M596p4613k0579J2909J4215K6279l1872k3789M6614P3764j12880
$$ y = [-81616, -46041, -24067, 11759, 4285, -10432, -44735, -60807, -56636, -46562, -22937, 38882, 53981, 34518, 36458, 5926, 1649, -28731, -52729, -20263, -24091, -14100, 38080, 1259, -50582, -34772, 18572, 17654, 11515, 20301, 3000, -51109, -75434, -76917, -53144, -53212, -4895, 2876, -6028, -18982, -44657, -65673, -119086, -68153, -49504, -55497, 16885, 16641, -23871, -56269, -34871, -2584, -34401, -28813, 13401, -18478, 15640, 17322, 23236, 23291, 34158, 77258, 38977, -10470, -12935, 76656, 52249, -2286, -31786, -51351, -32314, -43254, -30373, -73545, -123153, -48897, -1551, -26246, 24735, 5127, -7321, 7699, -11761, -57212, -66609, -44114, -55051, -66457, -78250, -2917, 1679, -72934, -93513, -80604, -66389, -40110, -71982, -95771, -49157, 24607, -88273]
1757h8273j3682O3847M989m0577M5436l7660K5915m9390O3416O4275l5660l9332
1745c6696L637L331J1989J8335n2363j2065M2995O0258n2681L6995j0076J95k4676
1732a0822k8075J7514n3842j8761N7911M4130M3407j340j2203k5029k8962R764
1720f308l4051L6211Q8342k5027j3555M4215j05858J4374L7555Q443k1613n3788
1708c1060Q700m4698l870L3090J4390l6460J1241J9881K6599J5809k2581l7868
1696d6827L4585m1658n3592O2317Q7796m1887k4028K570O8128j3398o974J5989
1684D3021J6277K7568P546l9027k2996j0896r336j6958m9046j4288K7119l331
1672d4347J9075l2135K8257M8904M2529l5154Q11M560n5458K1906K8435k2306
$$ y = [-88273, -101955, -38108, -33119, -73696, -28260, -65920, -40005, -89395, -25979, 38296, 2636, -36696, -33059, -29728, -17739, 596, -51767, -63832, -20837, 39421, -13260, 23735, 13659, 13854, -10822, -38897, -21383, -75225, -93986, -36075, 8055, 51462, 50122, 37919, 12890, -16072, -6308, -40359, -4148, 84194, 59167, 45612, 89827, -16031, -1657, 35898, 44341, 22728, -31060, -22360, -67058, -70928, -37838, -23448, -59908, -48667, -28786, -2187, 13622, -8959, -46827, -12242, -53900, -107492, -45175, 42621, 734, -23294, -20724, 47404, 34006, 27032, 43021, 59298, 86866, 94412, 55385, 32389, 21493, 12157, -4801, -53847, -68135, -41016, -44347, -25272, -57407, -29150, 19754, 62283, 27129, 27940, 32500, -22958, -1052, 27383, 5077]
1660E077j8015N3650o8250K7865L7005o1038J0174P1373l2737k5557l837j0135
1648a4425n2919o753j1021M4319L7890m8193K0199M397J0223k3949N1900L4336
1636D6004k909k5086o2881k6581J116L5590K474p1828N1821L7740o0159K7332
1624d7367l2099L7197R375K6965M603k8458O1094L2465m8101J6996p1646j98N619
1611c3555j0885p276J8000Q3953K280N0966k5496j07702M580K9952K1234n5894
1599b9843L1050P2752J0199q5737n7636L8461M0926o4563L4215L8105l0406n998
1587h475n7127N4953k680m2078n157L5998M1906K5004o7731j4047l9037L65q3255
1574a61361N6546Q9480J3108L4372k2067l3080p506N0662k58J3181M635O999L0854
$$ y = [5077, -12938, 40712, -27538, 327, 37332, -23706, -13532, 57841, 25104, -453, -4290, -14425, -67344, -74097, -85118, -40799, -2909, -51102, -30903, -26506, -16283, -40232, 11668, 46004, 43095, 18009, -44872, -71453, -70337, -34747, -32273, -104101, -52280, -14540, -74699, -47367, -79466, -42269, -32894, -5929, -1326, -29784, 31310, 63775, 15674, 32670, -38976, -39174, -33555, -44440, -51716, -33716, 50237, 52517, 103483, 77987, -29715, -25135, 4817, 26051, -29843, 1207, 73959, 84158, -1579, -59215, -20754, 20172, -44391, -10176, 27929, -2477, -8475, -65602, -10649, -13329, -55407, -60564, -24566, 17340, 42344, -25387, -39434, -78471, -78106, -161361, -104815, -15335, -2227, 32145, 10078, -23002, -30508, 20154, 19896, 33077, 37712, 44711, 75565]
1561G5565r7478l4250L4467L9016j8860l0763K4188J3579l0371j2944J3174J7733
1549f944j4201r482M7216L61k2110l4564p337J4722M2612n1132K9305K8288j8365
1536a631P428m0092N4924j7706L2436J2334q2017J3033K3314M970L5667o4881
1524b2221O3964L4229m6221k4446l1633k5611N543J02352k7340N257q3700j639
1512e1466J0854p2731J8237q719N5230K4367J1211L036n664M2118K2847j9665
1500B9655p643L8225k8521K9706l4110n4968l486N621q2036N3210K8521k6286
1488e2112K844p7558Q687Q7407o054l8581J6825j3464L2444j7065M7256P963n679
1475g087j5911l4058J9366m5294R0840L6178K1135m9253n020P105l603m9655L2316
$$ y = [75565, -21913, -56163, -21696, 17320, -1540, -32303, -8115, 5464, -24907, -37851, -24677, -6944, -21145, -30627, 16589, 16950, -5160, -39724, -47061, -32339, 10273, -40859, -11554, 16734, -1631, 5797, -34295, 20629, 2923, 35359, 47693, -34324, -21291, 2023, 6993, 42660, -22221, 41743, 75972, 29751, 5305, -26328, -51939, -46396, 55956, 28616, 33873, -49827, -51466, -40612, -113343, -95106, -103825, -48595, -24228, -13017, -9981, -15645, 26473, 49320, 29655, 22012, 60237, 31716, 61422, 27312, -27656, -31142, -25521, -107557, -54347, -25826, -52112, -49268, -126826, -118139, -30732, -36786, -75367, -58542, -72006, -39562, -56627, -9371, -1408, -7087, -22998, -57056, -37690, -82984, 7856, 44034, 65169, 15916, 10896, 18001, 14398, -35257, -2941]
1462b941M7096k6730L3986J110k1301k7769n5302o8205L7779N7853N943k1278
1450c9759O7904J620l1134l6094M294L402N3555N9922j6512m3296p364J5790o9639
1437c7311m0201L3020R973K5995J0586j397j3588k466J0638L7601L0448J1047
1425G4345M2679q1417l5240q865r2699K9147M2452N897K1762J0712n3472J6137
1413b8562M9338j9456m4158n3599M3572O3435k7977l6742m1600P7637M3005L3819
1401E8712J6142o00q0929j7088J0456l3031m8019M7835O1036m6231K8627J8249
1389A5159P001k2521l119P525K9196m893p4252M855K8587N0232j5159j9000Q183
1376A1794n6166K5851l0868P4642l7493k2082M6916J7788k4229j9706m9104j9165
$$ y = [-2941, 44155, 17425, 51411, 52521, 31220, 3451, -51851, -120056, -82277, -24424, -18481, -39759, 28145, 29765, -1369, -37463, -33169, -29767, 23788, 83710, 67198, 23902, 16538, 32328, -37311, -77512, -44492, -34519, -8524, 2062, 665, -12923, -15389, -4751, 32850, 63298, 74345, 117024, 35607, 367, -8498, -101197, -72050, -29598, -23701, -1939, 8773, -44699, -28562, 20776, 1320, -42838, -96437, -52865, 10570, -17407, -54149, -95749, -18112, 24893, 58712, 74854, 74254, -6675, -23763, -13307, -46338, -94357, -46522, 14514, -31717, -3090, 15159, 22160, -361, -3480, 4045, 33241, 28348, -45904, -41049, -12462, 37770, 22611, 3611, 11794, -44372, -18521, -49389, 25253, -12240, -34322, 12594, 30382, 6153, -13553, -62657, -81822]
1364h1822l314j2544K6417K4805j2618l6907J09026k7508o1536P107N0318L46
1352a8230K8310o3250k3356M1397o3420K7485L4115J7379k522L2029M9482o2386
$$ y = [-81822, -85136, -97680, -71263, -46458, -59076, -95983, 13043, -14465, -76001, -68894, -18576, -18230, 10080, -53170, -76526, -35129, -98549, -71064, -36949, -19570, -22092, 9937, 59419, -2967]
$$ [...]
##END NTUPLES=NMR SPECTRUM
##END=
