##TITLE=1H_DE-80H_X3
 200.13MHz, d2o
 8 sc
 
 19ns.26.2.2025
##JCAMPDX= 6.0         $$ Bruker NMR JCAMP-DX V2.0
##DATA TYPE= NMR SPECTRUM
##DATA CLASS= NTUPLES
##ORIGIN= UXNMR, Bruker Analytische Messtechnik GmbH
##OWNER= pz
$$ XWIN-NMR		Version 3.5
$$ Tue Jun 24 12:22:42 2025 Russian Standard Time (UT+4h)  Yarkov@DPX200
##.OBSERVE FREQUENCY= 200.1313
##.OBSERVE NUCLEUS= ^1H
##.ACQUISITION MODE= SIMULTANEOUS
##.ACQUISITION SCHEME= undefined
##.AVERAGES= 8
##.DIGITISER RES= 18
##SPECTROMETER/DATA SYSTEM= spect
##.PULSE SEQUENCE= zg30
##.SOLVENT NAME= CDCl3
##.SHIFT REFERENCE= (INTERNAL, CDCl3, 0, 15.5056)
##AUDIT TRAIL= $$ (NUMBER, WHEN, WHO, WHERE, WHAT)
$$ ##TITLE= Audit trail, XWIN-NMR		Version 3.5
$$ ##JCAMPDX= 5.01
$$ ##ORIGIN= Bruker BioSpin GmbH
$$ ##OWNER= Yarkov
$$ C:/Bruker/XWIN-NMR/data/yarkov2/nmr/H-C/1/pdata/1/auditp.txt
$$ ##AUDIT TRAIL=  $$ (NUMBER, WHEN, WHO, WHERE, WHAT)
(   1,<2025-06-24 12:21:44.95 +0400>,<Yarkov>,<DPX200>,
      <created by zg, POWCHK disabled, PULCHK disabled
       configuration hash MD5:
       00 E9 B6 7A A2 85 ED C7 34 08 36 98 17 FE 4E 26
       data hash MD5: 16K
       97 46 70 06 C0 CF 31 AC 3D 59 80 40 D5 E3 9A 2C>)
(   2,<2025-06-24 12:21:53.28 +0400>,<Yarkov>,<DPX200>,
      <Start of raw data processing
       efp BC_mod = 2 LB = 0.25 FT_mod = 6 PKNL = 1 PHC0 = -1713.766 PHC1 = 10.1666 SI = 16K 
       data hash MD5: 16K
       A0 0A 4F F8 B8 80 12 4C B8 77 26 72 FB B6 99 08>)
(   3,<2025-06-24 12:22:01.32 +0400>,<Yarkov>,<DPX200>,
      <abs ABSG = 5 
       data hash MD5: 16K
       0D 6F C0 FE E3 CF AA 18 D7 75 D9 98 D8 A5 05 03>)
$$ ##END=
$$ 
$$ hash MD5
$$ 37 B1 4D 81 ED BA BA 89 37 97 46 D6 75 DF 9E 02
##$RELAX= 
##$RELAX= 
##$RELAX= 
##$RELAX= 
##$RELAX= 
##$RELAX= 
$$ Bruker specific parameters
$$ --------------------------
##$DU= <C:/Bruker/XWIN-NMR>
##$EXPNO= 1
##$NAME= <H-C>
##$PROCNO= 1
##$TYPE= <nmr>
##$USER= <yarkov2>
##$AMP= (0..31)
100 100 100 100 100 100 100 100 100 100 100 100 100 100 100 100 100 100 
100 100 100 100 100 100 100 100 100 100 100 100 100 100 
##$AQSEQ= 0
##$AQ_mod= 1
##$AUNM= <au_zg>
##$AUTOPOS= <>
##$BF1= 200.13
##$BF2= 200.13
##$BF3= 200.13
##$BF4= 200.13
##$BF5= 200.13
##$BF6= 200.13
##$BF7= 200.13
##$BF8= 200.13
##$BYTORDA= 1
##$CFDGTYP= 0
##$CFRGTYP= 5
##$CHEMSTR= <none>
##$CNST= (0..31)
1 1 145 1 1 1 1 1 1 1 1 1 1 1 1 1 1 1 1 1 1 1 1 1 1 1 1 1 1 1 1 1 
##$CPDPRG= <>
##$CPDPRG1= <>
##$CPDPRG2= <>
##$CPDPRG3= <>
##$CPDPRG4= <mlev>
##$CPDPRG5= <mlev>
##$CPDPRG6= <mlev>
##$CPDPRG7= <mlev>
##$CPDPRG8= <mlev>
##$CPDPRGB= <>
##$CPDPRGT= <>
##$D= (0..31)
0 0.7 0 0 0 0 0 0 0 0 0 0.03 0 0 0 0 0 0 0 0 0 0 0 0 0 0 0 0 0 0 0 0 
##$DATE= 1750753304
##$DBL= (0..7)
120 120 120 120 120 120 120 120 
##$DBP= (0..7)
150 150 150 150 150 150 150 150 
##$DBP07= 0
##$DBPNAM0= <>
##$DBPNAM1= <>
##$DBPNAM2= <>
##$DBPNAM3= <>
##$DBPNAM4= <>
##$DBPNAM5= <>
##$DBPNAM6= <>
##$DBPNAM7= <>
##$DBPOAL= (0..7)
0.5 0.5 0.5 0.5 0.5 0.5 0.5 0.5 
##$DBPOFFS= (0..7)
0 0 0 0 0 0 0 0 
##$DE= 6
$$ [...]
##$SUBNAM3= <"">
##$SUBNAM4= <"">
##$SUBNAM5= <"">
##$SUBNAM6= <"">
##$SUBNAM7= <"">
##$SUBNAM8= <"">
##$SUBNAM9= <"">
##$SW= 18.0517328524113
##$SWIBOX= (0..15)
0 0 2 0 0 0 0 0 0 0 0 0 0 0 0 0 
##$SW_h= 3612.71676300578
##$TD= 16384
##$TD0= 1
##$TE= 0
##$TE2= 300
##$TE3= 300
##$TEG= 300
##$TL= (0..7)
0 120 120 120 120 120 120 120 
##$TP= (0..7)
150 150 150 150 150 150 150 150 
##$TP07= 0
##$TPNAME0= <>
##$TPNAME1= <>
##$TPNAME2= <>
##$TPNAME3= <>
##$TPNAME4= <>
##$TPNAME5= <>
##$TPNAME6= <>
##$TPNAME7= <>
##$TPOAL= (0..7)
0.5 0.5 0.5 0.5 0.5 0.5 0.5 0.5 
##$TPOFFS= (0..7)
0 0 0 0 0 0 0 0 
##$TUNHIN= 0
##$TUNHOUT= 0
##$TUNXOUT= 0
##$USERA1= <user>
##$USERA2= <user>
##$USERA3= <user>
##$USERA4= <user>
##$USERA5= <user>
##$V9= 5
##$VALIST= <valist>
##$VCLIST= <CCCCCCCCCCCCCCC>
##$VD= 0
##$VDLIST= <DDDDDDDDDDDDDDD>
##$VPLIST= <PPPPPPPPPPPPPPP>
##$VTLIST= <TTTTTTTTTTTTTTT>
##$WBST= 1024
##$WBSW= 4
##$XGAIN= (0..3)
0 0 0 0 
##$XL= 0
##$YL= 0
##$YMAX_a= 194531
##$YMIN_a= -160660
##$ZGOPTNS= <>
##$ZL1= 120
##$ZL2= 120
##$ZL3= 120
##$ZL4= 120
##$ABSF1= 15.51001
##$ABSF2= -2.54184
##$ABSG= 5
##$ABSL= 3
##$ALPHA= 0
##$AQORDER= 0
##$ASSFAC= 0
##$ASSFACI= 0
##$ASSFACX= 0
##$ASSWID= 0
##$AUNMP= <proc_1d>
##$AZFE= 0.1
##$AZFW= 0.1
##$BCFW= 0
##$BC_mod= 2
##$BYTORDP= 0
##$COROFFS= 0
##$CY= -3
##$DATMOD= 1
##$DC= 0
##$DFILT= <>
##$DTYPP= 0
##$F1P= 0
##$F2P= 0
##$FCOR= 1
##$FTSIZE= 16384
##$FT_mod= 6
##$GAMMA= 0
##$GB= 0
##$INTBC= 1
##$INTSCL= 3.241238e-09
##$ISEN= 128
##$LB= 0.25
##$LEV0= 0
##$LPBIN= 0
##$MAXI= 10000
##$MC2= 0
##$MEAN= 0
##$ME_mod= 0
##$MI= 1.114404
##$NCOEF= 0
##$NC_proc= -7
##$NLEV= 6
##$NOISF1= 3.799351
##$NOISF2= 2.8
##$NSP= 0
##$NTH_PI= 0
##$NZP= 0
##$OFFSET= 15.5056
##$PC= 1
##$PHC0= -1713.766
##$PHC1= 10.1666
##$PH_mod= 1
##$PKNL= yes
##$PPARMOD= 0
##$PSCAL= 0
##$PSIGN= 0
##$REVERSE= no
##$SF= 200.130003224283
##$SI= 16384
##$SIGF1= 3
##$SIGF2= 2
##$SINO= 0.751879
##$SIOLD= 32768
##$SREGLST= <19F.Aceton>
##$SSB= 0
##$STSI= 16384
##$STSR= 0
##$SW_p= 3612.71676300578
##$SYMM= 0
##$S_DEV= 0
##$TDeff= 16384
##$TDoff= 0
##$TI= <>
##$TILT= no
##$TM1= 0
##$TM2= 0
##$TOPLEV= 0
##$USERP1= <user>
##$USERP2= <user>
##$USERP3= <user>
##$USERP4= <user>
##$USERP5= <user>
##$WDW= 1
##$XDIM= 16384
##$YMAX_p= 339111244
##$YMIN_p= -219182
$$ End of Bruker specific parameters
$$ ---------------------------------
##NTUPLES= NMR SPECTRUM
##VAR_NAME=  FREQUENCY,     SPECTRUM/REAL,   SPECTRUM/IMAG
##SYMBOL=    X,             R,               I
##VAR_TYPE=  INDEPENDENT,   DEPENDENT,       DEPENDENT
##VAR_FORM=  AFFN,          ASDF,            ASDF
##VAR_DIM=   16384,         16384,           16384
##UNITS=     HZ,            ARBITRARY UNITS, ARBITRARY UNITS
##FACTOR=    0.220516191357247, 1,           1
##FIRST=     3103.13577310846, 0,            0
##LAST=      -509.580989897324, 0,           0
##MIN=       -509.580989897324, -219182,     0
##MAX=       3103.13577310846, 339111244,    0
$$ Real data points
##PAGE= N=1
##DATA TABLE= (X++(R..R)), XYDATA
$$ [...]
8152F55022k5953N0990O6626L3315Q2704J41806J79572J16349J28428K713M4850
8141A476422l4314m7130l6817j88230j35345n8336j09232r5995j04427j26833
8131E39763M0706O8828j02963j16785n6537k8941p3432n6718J5546r937j9626
8120A99904O989J8787N5816l8169J3083p2610j3997P1280J0395q3218q8891N5736
8108A35105j7389p2489j6368N1514L3129k9216K8834J8442k8051l8007l413k9248
8096C2843J7301M6850K7061m8153j6497J6683k5963o719n0086K8361K3200l8896
8084E985l3674K165Q558K3114k9582J6068P4787o4424k6502M5082N6635k4629
8072E3583o583k7816O942k0082J9828l1323P048J5289l5950R923o160N9761o066
$$ plain form
8152 655022 629069 680059 746685 780000 862704 1004510 1184082 1300431 1428859 1431572 1476422
8141 1476422 1442108 1394978 1358161 1169931 1034586 976250 867018 771023 666596 539763
8131 539763 580469 649297 546334 429549 373012 344071 270639 213921 229467 219530 199904
8120 199904 206893 225680 281496 243327 256410 183800 169803 241083 251478 168260 79369 135105
8108 135105 117716 45227 28859 80373 113502 84286 113120 131562 103511 65504 62091 32843
8096 32843 50144 96994 124055 75902 59405 76088 50125 43406 -6680 21681 44881 5985
8084 5985 -27689 -25524 -16966 6148 -23434 -7366 67421 2997 -23505 21577 78212 53583
8072 53583 47000 19184 26126 6044 25872 -5451 1597 16886 -19064 -9141 -15301 44460 38394
8059C8394k2362q7561M8858N849J4297k9306j8834K3755n5131R041R7953j7701
8047G252o0656P3839R8259k0996j32209m8857N8179K6286q415Q2176n783n3351
8035A5724n7125k6301Q2961j0167K5716K6849M589J8187j5496N372M6098l7465
8023G8942l5962O3944L5640k7945j9330q7525K6955K5752J588L5878q3940l5528
8011b1531k1620O1821m1868k414M3178J7401n626m5705J0987L2060R637o0413
7999b4093N8596k3106J4841j9169L8208K4163k8646j7201l7380l56L5466L7900
7987E9223n791l799M2917J02283n879m9709J975M8495N6662L8474q3296m0640
7975A60915j2510q1267K2954n4991m4872J7815J7479k170k6564K3023n6023N5391
$$ plain form
8059 38394 16032 -71529 -22671 -16822 -2525 -31831 -50665 -26910 -82041 -73000 24953 7252
8047 7252 -53404 20435 118694 97698 -34511 -83368 -25189 1097 -7318 74858 69075 15724
8035 15724 -41401 -67702 15259 5092 30808 57657 62246 80433 64937 70309 116407 78942
8023 78942 42980 106924 142564 114619 95289 7764 34719 60471 62059 97937 13997 -21531
8011 -21531 -43151 18670 -23198 -25612 17566 34967 29341 -16364 -5377 26683 36320 -24093
7999 -24093 34503 11397 26238 7069 45277 69440 40794 23593 -13787 -14143 21323 59223
7987 59223 53432 49633 92550 194833 188954 139245 141220 189715 246377 284851 201555 160915
7975 160915 148405 67138 90092 35101 -9771 8044 25523 23353 -3211 19812 -36211 19180
7963A9180k2210j00880K2062R6281l8571k9251j1866l913J7821Q857q764j6288
7951f7542L7873P2232n7457J560K5346q3316j3168O0251J9052N545L7973m4512
7939f163j3360k3418j211R76j869Q941j1197m0294L177K4751k987o663l0700M421
7925i5596K2019K7271J7536j7734j7921P108K4467K1449J01243l1434o5033k0705
7913b7330K7649o88O890l2586o4185M5181J3049K6949o7606k8451M0881N1501
7901h746j5132N4455O352o1255O2453k0629k4849p0903M6435N2866Q637M2768
7889G2452J4237j8961o6088J5251R3336L2237n4059N3547p752M3541O1745k9266
7877B10220q408M0060J22408O5590K0994j3952o4058j7878l5364n7994l2425K4126
$$ plain form
7963 19180 -3030 -103910 -81848 14433 -24138 -53389 -65255 -69168 -51347 -42490 -51254 -67542
7951 -67542 -29669 42563 -14894 -13334 12012 -71304 -84472 -24221 -5169 376 38349 -6163
7939 -6163 -19523 -42941 -44152 -43176 -45045 -36104 -47301 -87595 -84418 -59667 -62654 -69317 -100017 -95596
7925 -95596 -73577 -46306 -28770 -46504 -64425 -57317 -32850 -11401 89842 58408 -6625 -27330
7913 -27330 319 -369 6521 -26065 -90250 -45069 -32020 -5071 -72677 -101128 -60247 -8746
7901 -8746 -23878 30577 36929 -24326 38127 17498 -7351 -78254 -31819 21047 29684 72452
7889 72452 86689 67728 1640 16891 110227 142464 88405 141952 134200 177741 239486 210220
7877 210220 201812 241872 364280 429870 450864 436912 372854 354976 319612 261618 229193 253319
7865B53319K1130q6904n233M760o8563l8311J179L6404k5745k5742K0029r521
7853G6802n2728j7994N0399r070j5373L5025j4299l3596k7484L8826m5569K52
7841a4809k1073n3172N6477L3239j3978L9951k8988j2288k187L5127L9852m8180
7829I971j0841L0284P159l2150k5412K9394l7101m362N6090n374K8177J404J4421
7816F1660p3358O3200m8604j9589O6536O604O0670r913k0607P3816K4458M7524
7804B32397P691K15325L0817p7137N3505n6451l2539q7456l5323K1193P065j3128
7792B65959q6931j38752L4689l2296L2986m2769K0380o335p0535k3739P5590L3227
7780F1474o279O6732k7350l2527j870j09510O643J49227l5372P767J8727m5811
$$ plain form
7865 253319 274449 187545 182312 187072 118509 80198 81377 117781 92036 66294 86323 76802
7853 76802 24074 6080 56479 47409 32036 67061 52762 19166 -8318 30508 -15061 -14809
7841 -14809 -35882 -89054 -32577 662 -13316 26635 -2353 -14641 -16828 18299 58151 9971
7829 9971 -870 29414 36573 4423 -20989 8405 -28696 -33058 23032 17658 45835 47239 61660
7816 61660 -11698 51502 2898 -16691 49845 56449 117119 107206 86599 160415 184873 232397
7804 232397 240088 455413 486230 409093 462598 406147 373608 286152 250829 272022 279087 265959
7792 265959 179028 40276 74965 42669 75655 32886 53266 46931 -23604 -47343 28247 61474
7780 61474 55195 121927 94577 62050 60180 -49330 -42687 106540 71168 78935 97662 51851
7768E1851l73n392p0056N617J6068j885J7453R1395M0606K289k6984r817o5573
7755D5199J0374N3533l7193k948M5879L7717p723j3191L1473p2626k8549P6020
7743A37965j5494n3424J1504o4083R315J12458k9161m8615j2168l8900j8829j5183
7731b4615O620P773k0722M0047n4634N249K9698n6301m1253O176L0943j518L5288
7718c7249K0801k037L178k9717J9659Q1890k1662k1831O700l7420L0433j3596
7706h51j5n173p300j5187p985j5376K2694N3047N6355j6073l7256P882k5305J7335
7692B6792l1447L217o2492o8385L3069M0013k3278L7792L1148J7324j1158J1309
7680C904N833l564N707n2769j8282m599j4160m2077O0715P961J5278K8686m8718
$$ plain form
7768 51851 51478 46086 -23970 -18353 -2285 -4170 13283 104678 145284 147573 120589 110772 45199
7755 45199 55573 109106 71913 68965 114844 152561 144838 131647 163120 90494 61945 137965
7743 137965 122471 69047 80551 16468 25783 138241 109080 60465 48297 9397 -9432 -24615
7731 -24615 -17995 -10222 -30944 9103 -45531 -40282 -10584 -66885 -108138 -101962 -71019 -72537 -37249
7718 -37249 -16448 -18485 -15307 -45024 -25365 56525 34863 13032 19732 -17688 12745 -851
7706 -851 -866 -6039 -13339 -28526 -36511 -51887 -29193 23854 80209 64136 26880 34762 9457 26792
7692 26792 -4655 -1438 -63930 -132315 -99246 -59233 -82511 -44719 -13571 3753 -7405 3904
7680 3904 9737 6173 11880 -40889 -59171 -63770 -77930 -120007 -59292 -51331 -36053 -7367 -56085
7667e6085m9653N1172M0555l8744j8480l5904k1870J25340K1271o7070l5299K7354
7655e7413l0354J5251k2674K5871n4744L9537M9166o1539J2360R22M4634J5511
7643b3472J834m2288j0153O4657K4939l6957m2488k1265K7314k4485l9654k1564
7631a43582O2676L5921O0020J2374k6422j4771m1743k5417o495K1889m9909j4337
7619a29796J851K4361k3454n5011R8982k6180J3743M3185J1455l0542n5705L1074
7607i6037j5926L8055M0501M4377p1276k9234L6299J1397K1629L90L399l8881
7595e5307L9966P7264q6424L7941j6209m5243K8290j846o169Q050L2290M2777
7583E5380M2883n5934L1835j7708M9823r469q2131j447M1935O8213J8332K904
$$ plain form
7667 -56085 -105738 -54566 -14011 -52755 -71235 -107139 -129009 -3669 17602 -49468 -84767 -57413
7655 -57413 -87767 -72516 -95190 -69319 -124063 -84526 -35360 -96899 -84539 -83617 -38983 -23472
7643 -23472 -21638 -63926 -74079 -9422 15517 -21440 -63928 -85193 -57879 -82364 -122018 -143582
7631 -143582 -80906 -44985 15035 27409 987 -13784 -55527 -80944 -87439 -65550 -115459 -129796
7619 -129796 -127945 -103584 -127038 -182049 -83067 -109247 -95504 -52319 -40864 -71406 -127111 -96037
7607 -96037 -111963 -73908 -33407 10970 -60306 -89540 -53241 -41844 -20215 -19825 -16426 -55307
7595 -55307 -15341 61923 -24501 13440 -2769 -48012 -19722 -21568 -27737 -19687 12603 55380
7583 55380 98263 42329 74164 56456 106279 96810 14679 13232 55167 123380 141712 144616
7571A44616N6671o5271O1625N5028P371J1131L8389L877K2060r3463m5917N077
7559B01194L9751J3371r359j032k8689N0320M1436j8151k5619q905M8198M9911
7547C52426Q509K6160k8455k8122P0779n3746n2492J8500n883K5220k0967q9053
7535B22876l0133L2115J5091R0965j9802N364M7174o000M00m410l3400k8670o6099
7522B25471N4922r823k6793J0079n6875l2593K2263m3341n3883j0668M4186m4822
7510G8123K9389j9624k3039l5542J494l3901q041K3823M2650N8200Q712l2095
7498I0149m5052J9522j5711Q01M6119N5014n2065r1708M9622M3844o5677j1190
7486B3668J3489j8490k0530J0162l1826L7459L8769n1395K521k8816R3716P7560
$$ plain form
7571 144616 201287 136016 197641 252669 260040 271171 309560 313437 335497 242034 196117 201194
7559 201194 240945 254316 244957 243925 215236 265556 306992 288841 263222 254317 302515 352426
7547 352426 360935 387095 358640 330518 401297 347551 295059 313559 307676 332896 311929 222876
7535 222876 192743 224858 239949 330914 311112 316476 363650 357650 358050 353640 320240 291570 225471
7522 225471 280393 270570 243777 253856 196981 164388 186651 143310 89427 78759 122945 78123
7510 78123 107512 87888 64849 29307 30801 -3100 -11141 12682 55332 113532 122244 90149
7498 90149 45097 64619 48908 49709 95828 150842 98777 7069 56691 100535 34858 23668
7486 23668 37157 18667 -1863 8299 -23527 13932 52701 1306 3827 -24989 68727 146287
7474A46287j17332K7302K1093J7726l0060m7622Q431K6568J3002M7303J8841K3048
7462A54587K4721J2397l8235N7026Q7671j7441L5117j3943O1215m929Q7226L9693
7450D85105j10969K2776m045n4080q0095l3611L7813J9937k1951p4117P1219N4417
7438C12399P876K4072L798J488M8642o775j4142N0851O1538J20473N0327Q2537
7426G43084J2384L7691J66656R6231j8612j739L7610p5067j06464p7804r9883
7415G14087j7744p5032n6599m9384L4028p2384j03332K1147n4413K1736J5294
7404C77404k6437l2075k7246K5136k5182m468M8155M4822N6020K6825L711k451
7392D64214J7209m0605o4284k4426L7443q2862k0260j5940m6781K8450L028p925
$$ plain form
7474 146287 28955 56257 77350 95076 65016 17394 25825 52393 65395 112698 131539 154587
7462 154587 179308 191705 153470 210496 298167 280726 315843 301900 363115 358186 445412 485105
7450 485105 374136 396912 392867 338787 258692 225081 262894 282831 260880 186763 257982 312399
7438 312399 320275 344347 348145 349633 398275 391500 377358 428209 489747 610220 660547 743084
7426 743084 755468 793159 959815 1056046 1037434 1035695 1073305 998238 891774 813970 714087
7415 714087 696343 621311 564712 515328 549356 476972 373640 394787 340374 362110 377404
7404 377404 350967 318892 291646 316782 291600 287132 335287 380109 436129 462954 466665 464214
7392 464214 481423 440818 376534 352108 389551 306689 286429 270489 223708 252158 255186 247261
7380B47261l3897o8609L8950m763o3995o29l6811P8766L6360j1770K2244J3281
7368B16388Q4550r332n19L3185O9014P4474R05L1584k3971K8737k2094k2403l759
7355D56759q5286l9932j7340o9945O7019k6276j201p1726j0857o3795m1076R4024
7343A90368n5431o024m432m2624O9939p4402j6618R842p7615M3038p905j7966
7331A0170j3382K9827n7450K0532r613k9614J2082L7203N052o601j920k0347j6048
7318d0109O3977j2812o6106o1878O6750J1338O367P2341k8425j7668L8290M15
7306C2480O0261j0640j01405m9167l4107K8804j5544P2810k5794k1989j2223L6939
7294c9575m7015L6335o244m1548M8170O207J2956j7250p743k8465M134Q6301k4935
$$ plain form
7380 247261 213364 144755 183705 178942 114947 114318 77507 156273 192633 180863 203107 216388
7368 216388 300938 291606 291087 324272 393286 467760 468665 500249 476278 505015 482921 460518 456759
7355 456759 371473 331541 314201 244256 311275 284999 283798 212072 201215 137420 96344 190368
7343 190368 134937 128913 124481 81857 151796 77394 60776 70618 -6997 36041 28136 10170
7331 10170 -3212 26615 -30835 -10303 -19916 -49530 -37448 -245 4807 -1794 -3714 -24061 -40109
7318 -40109 23868 11056 -55050 -116928 -50178 -38840 -32473 39868 11443 -6225 32065 32480
7306 32480 92741 82101 -19304 -68471 -102578 -73774 -89318 -16508 -42302 -64291 -76514 -39575
7294 -39575 -86590 -50255 -56499 -98047 -49877 -43670 -30714 -47964 -55707 -84172 -80038 6263 -18672
7281a8672l6233Q0735l0601k0315J815Q0756m5094J918k8933k9954P8186m0461
7269f853o5825l498L1768j6862J6780N6277q9007m5453Q3875M4708l3004m6891
7257g3985O7488K4982j401M9880k1012k8299j0053k1264l703l3358j5782J2221
7245e4286J3839L3703M2966k6001p4494j5140j5542j2694M5111l0477K0943J0310
7233f1762m6291K1671l0871j0353M1322M5879P3383o5375m2002N8252O5476K6303
7221G5632m1336k2958m7442o767k059l5452K8902L3153l8267L0409m3544r806
7209g9535M2277Q596p521m4426j3134j7875j3295n957K2248N463n356l3108L5992
7196a05631O8450o5062N228o808N1631L5407n7018l7087L5139l1459Q685M1876
$$ plain form
7281 -18672 -54905 25830 -4771 -25086 -23271 57485 12391 14309 -14624 -44578 33608 -6853
7269 -6853 -72678 -76176 -44408 -61270 -44490 11787 -77220 -122673 -38798 5910 -27094 -73985
7257 -73985 -6497 18485 17084 66964 45952 17653 7600 -13664 -17367 -50725 -66507 -54286
7245 -54286 -40447 -6744 36222 10221 -64273 -79413 -94955 -107649 -62538 -93015 -72072 -61762
7233 -61762 -108053 -86382 -117253 -127606 -86284 -40405 32978 -32397 -74399 -16147 49329 75632
7221 75632 34296 11338 -36104 -42871 -44930 -80382 -51480 -18327 -56594 -26185 -69729 -79535
7209 -79535 -37258 -28662 -36183 -80609 -93743 -111618 -124913 -130870 -108622 -103159 -108515 -141623 -105631
7196 -105631 -37181 -102243 -97015 -103823 -52192 -16785 -73803 -110890 -75751 -107210 -98525 -56649
7184e6649p683L0709l9275n4710j6776L9604p829M037J3488O8201m1622r6865
7172a65370J5093q162P3424M9554j07038o4599M0441N1046O4140P831l9512M357
7160g8795K570m835o0355p7248Q2983m181l578J2739l7038J29174j2311k6467
7148g7342L8290j8415R583j7593K3509j2716j5548M429q734O5070m6616j5772
7136g1855J9188m0604m1301N9460L8366o983j9153J722M8047o2636o8185o81J3961
7123a30654J8867m5427M2250L6870j8145m966M5910L08J3001o7537M3202O0464
7111e857m3463n4125K5282J06103n1956j5371l3733O260k964J7858O6594j9402
7099d774p6954J3443M1392N8413n1114r5728J1245N4620l8995m0781j4784j8439
$$ plain form
7184 -56649 -64332 -33623 -72898 -127608 -144384 -104780 -112609 -108572 -95084 -26883 -68505 -165370
7172 -165370 -150277 -158439 -85015 -35461 -142499 -207098 -166657 -115611 -51471 -43640 -83152 -78795
7160 -78795 -76225 -81060 -141415 -218663 -135680 -139861 -143439 -130700 -167738 -38564 -50875 -77342
7148 -77342 -39052 -57467 -47884 -65477 -41968 -54684 -70232 -65803 -74537 -9467 -56083 -71855
7136 -71855 -52667 -93271 -134572 -75112 -36746 -43729 -62882 -61160 -13113 -75749 -143934 -144615 -130654
7123 -130654 -111787 -157214 -114964 -78094 -96239 -101205 -55295 -54987 -41986 -109523 -66321 -5857
7111 -5857 -49320 -103445 -78163 27940 -24016 -39387 -73120 -66860 -69824 -51966 14628 -4774
7099 -4774 -81728 -68285 -26893 31520 -19594 -115322 -104077 -49457 -88452 -129233 -144017 -162456
7087a62456J01549R643N8156J6243q9338l5151L7229l3275k2849q269k816J3604
7075a17730J1798N7424j9529k3316N407L945J4858o277q658r879N5979o1387o9400
7062a66765R766j0452J7965j1640P0758P001o0377J9726R899k0208P4684P73J1707
7049d7163o423j6303N3089r691j05660N028K3837J01116l8681k2386M3846J63
7037a9228k8437n642k1724J5430Q5711j4985N4745m2852P679l2856n1855J7467
7025c6547j3642P609k7760O319p351L2204n2455O9950J00277j0305J1313m4738
7013C4874N8876k8761K3214L7903n113J4619l3666j3604L0204K0257L6784o899
7001A68688o6302q73k4719K2271R1994m3023J46541N5527m5570M4996M5169N8372
$$ plain form
7087 -162456 -60907 -51264 6892 23135 -66203 -101354 -64125 -97400 -120249 -128518 -131334 -117730
7075 -117730 -105932 -48508 -68037 -91353 -85946 -82001 -67143 -73420 -82078 -91957 -35978 -97365 -166765
7062 -166765 -156999 -167451 -149486 -161126 -90368 -83367 -143744 -124018 -114119 -134327 -59643 -58870 -47163
7049 -47163 -53586 -69889 -16800 -26491 -132151 -127123 -103286 -2170 -40851 -63237 -19391 -19228
7037 -19228 -47665 -53307 -75031 -59601 26110 11125 65870 23018 30697 -2159 -54014 -36547
7025 -36547 -50189 -42580 -70340 -64021 -71372 -39168 -91623 -21673 78604 68299 79612 34874
7013 34874 93750 64989 88203 126106 120993 135612 101946 88342 118546 138803 175587 168688
7001 168688 102386 101513 76794 99065 191059 148036 294577 350104 304534 349530 394699 453071
6989D53071R126O7904J1372M3324O0496N6528j6572M4890k7876o4190m4664j8199
6977E75210L6185M0891L0204M0124m0300O245K6130m0438M3004r0505k0101N1880
6965F58529j2103r873j0550N4123j8341L823K6157j5505L7702o448k3038k1774
6953F62702j845O2498N8844M3110r409j5824L2079J7467K6539L6490k3670J2399
6941I01380K4228m762L1845j0351J01022K3358q3114j1630m011P1633l5007p2525
6929I32066k0379j7791j314p845J5153n2602L3146j3289k984O4207M8529n4928
6917I21969m0973j7070M8501l6391M8137K3858j16950j5315n9836Q047P166p6719
6905F94424n1361l0852J0631n3506l0916M8475j0229j8844J046J1877k137L3444
$$ plain form
6989 453071 462197 530101 541473 584797 645293 701821 685249 730139 702263 638073 593409 575210
6977 575210 611395 652286 682490 722614 682314 688559 714689 674251 717255 626750 606649 658529
6965 658529 646426 636553 626003 680126 661785 665608 691765 676260 713962 707514 684476 662702
6953 662702 660857 723355 782199 825309 815900 800076 832155 849622 876161 912651 888981 901380
6941 901380 925608 920846 952691 942340 1043362 1066720 983606 971976 967965 1039598 1004591 932066
6929 932066 911687 893896 892582 884737 899890 847288 880434 867145 864161 928368 976897 921969
6917 921969 880996 863926 912427 876036 924173 948031 831081 815766 755930 763977 771143 694424
6905 694424 643063 612211 622842 569336 538420 586895 576666 557822 558868 570745 568608 602052
6893F02052j7895j2550j1125J4387N6549r4264n0645K7016q171k5568K5512K6937
6881E32235J4689K2013o073N5425N4528q061J0834M9495K9970l4995j023L1354
6869G50391l1234M9955R7185K4062K321n9863l0842J6702m3041n5258L9855j4949
6857G45284m7471j6463m8650J209k9888n6222L6679N363l8924L6079O5014p3285
6845E78725o838R5642j3881N4697J5976q8263N5544J14108N05K5836J1833o0973
6833G82911l2597q072j05997O0511P6358l5709m5281o1369M7567M1385l4294l5555
6821F49858N945J19597L6548j0095k0278P8108M0862L2070M2202J68700N1578
6810A195095K4145Q5545P3182M5859l5598j1488K375k7919l6218K0224o5777l2097
$$ plain form
6893 602052 584157 571607 560482 574869 631418 537154 486509 513525 505354 479786 505298 532235
6881 532235 546924 568937 562864 618289 672817 664756 675590 725085 755055 720060 719037 750391
6869 750391 719157 769112 866297 890359 892680 832817 801975 818677 775636 720378 760233 745284
6857 745284 697813 681350 632700 633909 604021 547799 584478 589841 550917 586996 652010 578725
6845 578725 571887 667529 653648 708345 724321 636058 691602 805710 806215 832051 843884 782911
6833 782911 750314 742242 636245 696756 773114 737405 692124 630755 678322 719707 685413 649858
6821 649858 655803 775400 811948 801853 781575 859683 900545 932615 974817 1143517 1195095
6810 1195095 1219240 1304785 1377967 1423826 1388228 1376740 1379115 1351196 1314978 1335202 1269425 1237328
6798A237328k8987q1761j3033n6921n8460k7298p8327l0427K3033M562n270K7121
6786I11560p0077l7645m977q610r303L6655L9975q0026m6032r0243r056k6323
6774F05898o5284l5038n7133k065n4385k6052o3254l5189L1275Q0285P89k0752
6762C59095k4727M2988k4212R961k7838O735R017m6590K8514k3709n7072L722
6750B55884j307Q2391Q8240r755l8591q0715K0408m2102J5344k1855m8220m4476
6738A75246P0068O5152o7953l901n5618o5335K801O0905P98K0519m17k698K406
6725B01973J5587l4204M2239M3748l3589K5111l4550j297L1163k8132L428p189
6713B24288k5761k7545L6558M1399k0074M5587n1136L5028M0278j9954M5661Q325
$$ plain form
6798 1237328 1208341 1126580 1113547 1056626 998166 970868 892541 862114 885147 889709 884439 911560
6786 911560 841483 803838 798861 790251 780948 817603 857578 777552 731520 641277 632221 605898
6774 605898 540614 505576 448443 446378 391993 365941 302687 267498 298773 379058 379847 359095
6762 359095 334368 377356 353144 363105 335267 342002 351019 304429 332943 309234 252162 255884
6750 255884 254577 336968 425208 415453 376862 296147 316555 274453 289797 267942 219722 175246
6738 175246 245314 310466 242513 238612 182994 117659 120460 181365 182163 202682 202265 199567 201973
6725 201973 217560 183356 225595 269343 235754 260865 226315 225018 256181 228049 231477 224288
6713 224288 198527 170982 207540 248939 228865 274452 223316 258344 298622 278668 324329 332654
6701C32654p1883M3179J1299N5085k237L7226j9469l2360l9380l8267M9272j4511
6689C10608L3937N6707N9664k2404J8456p0835l1250p672j2948K9102L767K6421
6677C93553K4553l2414L7270k0837M2504L6520m9775J593k4733N6016m71n1945
6665D11834q549q4402q3071l117J8390N243N1325P4865J3451j18307J9908m9576
6653B47994L1573m250J7052m0335J3156K0928l3686n468n3478M0054R7246n587
6641C25199l0740p7780p8035L9208j7029J5908N1813L5043l4665o893m2966M1224
6629B20287l3437R756j076j2015K5369J5326J3055m4864m7287O2205n6818j3959
6617A36542J424N4246J4323j4233K3298Q0304L6000j43298l7338M5607M2548K8589
$$ plain form
6701 332654 260771 303950 315249 370334 368097 405323 385854 353494 314114 275847 325119 310608
6689 310608 344545 401252 460916 438512 456968 386133 354883 347211 334263 363365 367132 393553
6677 393553 418106 385692 422962 402125 444629 481149 431374 432967 408234 464250 463779 411834
6665 411834 403285 318883 235812 232695 251085 256328 307653 382518 395969 277662 297570 247994
6653 247994 279567 275317 292369 252034 265190 286118 252432 246964 193486 233540 330786 325199
6641 325199 294459 216679 138644 177852 160823 176731 228544 263587 228922 222029 179063 220287
6629 220287 186850 196606 195530 183515 208884 224210 237265 192401 145114 207319 150501 136542
6617 136542 137966 192212 206535 192302 215600 295904 331904 188606 151268 196875 239423 268012
6605B68012j4029j1437j387L6937J798n2063R049k5220J7511J5916M7333k7605
6593B64815n409O1159L71J6710l2412P6634L1753M933j9207p9248j6468M3049
6581C46680n7346k8103q422j1920l6364k9355o217P3624K066m5180m4300L7859
6569A93022Q3032K7077K8391j8776J4630k2757o0229k8946K4003N4799o6417r3205
6557A34624M2861P1396R728l70k8200n6426K5355Q480M161k3036L3906k348k6890
6544A93241L8299Q8674m7484j5919K1675K1774n1024J7338M0778J4136o9163J4763
6532B67088Q334R3943j544j05909Q808r290l4785O1725k3464j719P2471q6241
6520B49417n875M7936j4282n7266J31155k0622Q359K6780K4976m6840L7309k7472
$$ plain form
6605 268012 253983 242546 241159 278096 279894 227831 236880 211660 229171 245087 292420 264815
6593 264815 259406 320565 320936 337646 305234 381868 413621 418554 399347 320099 303631 346680
6581 346680 289334 261231 252809 240889 204525 175170 168953 242577 244643 199463 155163 193022
6569 193022 276054 303131 331522 312746 327376 304619 244390 215444 239447 294246 227829 134624
6557 134624 177485 248881 258609 258239 230039 173613 198968 207448 211609 188573 222479 220131 193241
6544 193241 231540 320214 272730 256811 278486 300260 249236 266574 307352 321488 252325 267088
6532 267088 275422 369365 367821 261912 270720 261430 226645 288370 264906 263187 335658 249417
6520 249417 243542 291478 277196 219930 351085 330463 338822 365602 390578 343738 381047 353575
6508C53575p0676M3391K8947j9461K9345j4671o2430Q1884O7257j1983n2161l3012
6496C40005K919O275O725o421j7681O4550K2745n8782m2137L2754J4669j4134
6484C51487O0584O312j09146l4685m9404M2864j1756p343N3014p662n0028L5190
6472B79427l8842J457K3807n0986N0659N7529m2341n9237o262K4275p6692N8013
6460B20807k9963m6044j2004M0962O22q6249J3498L9227M6043O171k4740R681
6448A78011O2595K430L3670k2868r2149j0167K8702L1021n630q0810k1642O082
6436A09245O5434j634j9118o673K4378R100M5222K1126N1175o2811j15236K9728
6424A49936O7589j0486J6332q177k6133l738M3063O0712j428l9739n9391L3151
$$ plain form
6508 353575 282899 326290 355237 335776 365121 350450 288020 369904 437161 425178 373017 340005
6496 340005 342924 349199 355924 349503 331822 396372 419117 360335 318198 350952 365621 351487
6484 351487 412071 418383 309237 274552 225148 268012 256256 248913 301927 294265 244237 279427
6472 279427 240585 242042 265849 214863 265522 323051 280710 221473 215211 239486 162794 220807
6460 220807 190844 144800 132796 173758 174380 88131 101629 140856 186899 193070 168330 178011
6448 178011 240606 243036 276706 253838 161689 151522 180224 211245 205615 124805 103163 109245
6436 109245 174679 173045 153927 147254 171632 180732 225954 247080 298255 235444 120208 149936
6424 149936 217525 207039 223371 215194 189061 185323 228386 289098 287670 247931 188540 221691
6412B21691O0060K7312L2441n3984j5980m1002j440L8383N5465m298M3003j7114
6400C44537n4956K7251j792k1365K7197J2487l1640l3350O0994q77L8947j1279
6388C56154p9081M7136j0879o2500r973J6674n470O9203n375J3716J2821m7076
6376B95350n9790J5398l6963K7733K4656M0203K0579l0244j6263J6676k7166k9696
6364B40473K2959L6235P0559L1862M1308K7960j58690L8768J40860M065M2979
6353E39338k6539r6476K464L7387K3542K1591l1264R052K2520k9008J00660M8135
6341F21402J055n0097K5451O8850m7156K4720J05769m2987L751N6452M3252O186
6329H16648k3736N2777r229P0602P8161l3295N3949P3447J0072P0462M5102N0319
$$ plain form
6412 221691 281751 309063 341504 287520 271540 230538 229098 267481 322946 318648 361651 344537
6400 344537 289581 316832 315040 293675 320872 333359 301719 268369 329363 328486 367433 356154
6388 356154 277073 324209 313330 250830 240857 257531 252061 321264 315889 329605 342426 295350
6376 295350 235560 250958 213995 241728 266384 306587 327166 296922 280659 297335 270169 240473
6364 240473 263432 299667 370226 402088 443396 471356 312666 351434 492294 496359 539338
6353 539338 512799 416323 418787 456174 479716 501307 470043 479095 501615 472607 573267 621402
6341 621402 622457 572360 597811 666661 619505 644225 749994 707007 710758 767210 810462 816648
6329 816648 792912 845689 836460 907062 985223 951928 1005877 1079324 1089396 1159858 1204960 1255279
6317A255279N8902M9001N1960P8896M5362J01886J677P0445K3956M3047M0952
6306A821363K4414J04210O5277R2937J34775P1843Q4175J38660J37298J38949
6296B813901J49799K19986K15153L12819L64087K77606L30472K94912J41427L4230
6286E154392l631N92J47858K13590K98371M06856M28861N04323O22563O61764
6276H435539P23338P07796R11367J190617J403925J682925J869454J969462J922552
6267B0816975J345890N6037j075312j606618j379861p83063k79580J39877M69234
6258A7703579P28651J127398J287468J136393O60348K45566J03409N12987J091572
6249B4597371J334338J058678L11310q36522j725119j794741j410096p90888l05758
$$ plain form
6317 1255279 1314181 1363182 1415142 1494038 1539400 1641286 1642963 1713408 1737364 1780411 1821363
6306 1821363 1845777 1949987 2015264 2108201 2242976 2314819 2398994 2537654 2674952 2813901
6296 2813901 2963700 3183686 3398839 3711658 4075745 4353351 4683823 4978735 5120162 5154392
6286 5154392 5150761 5151353 5299211 5512801 5811172 6218028 6646889 7151212 7773775 8435539
6276 8435539 9158877 9866673 10778040 11968657 13372582 15055507 16924961 18894423 20816975
6267 20816975 22162865 22218902 21143590 19536972 18157111 17374048 17094468 17234345 17703579
6258 17703579 18432230 19559628 20847096 21983489 22643837 22889403 22992812 23505799 24597371
6249 24597371 25931709 26990387 27301697 26465175 24740056 22945315 21535219 20744331 20438573
6240B0438573J63261N26401J76088m95669j097038j184262o87913p9176M34923
6231A8195188Q58428J147352J420419J333629O00624o78478k186100k883088k563104
6222A5244870j994790j539025j076316q93153p80165n52690n42342m87347l73623
6213G005419m08474m19830l87796k69297k60941k02555k42680k07176k30510j79592
6203D196568j36083j77411j21272j26662j13436o7455j05924p8924k4218m6215
6193C198968p8781p9689o0717k8455J8229J7469r449J04951L4161M4228M9322
6182C210237j26130j37970j51178m1489j15259r7759r2648N1454J8010k6203k3832
6171B467233l9064j660N7523J8138L4038K2774r065l3572j4758J8145l5014r3901
$$ plain form
6240 20438573 20601834 21128235 21304323 20808654 19711616 18527354 17839441 17760265 18195188
6231 18195188 19053616 20200968 21621387 22955016 23555640 22877162 20691062 17807974 15244870
6222 15244870 13250080 11711055 10634739 9741586 8961421 8408731 7866389 7379042 7005419
6213 7005419 6596945 6177115 5789319 5520022 5259081 5056526 4813846 4606670 4376160 4196568
6203 4196568 4060485 3883074 3761802 3635140 3521704 3454249 3348325 3269401 3245183 3198968
6193 3198968 3120187 3040498 2979781 2951326 2969555 2987024 2977575 3082526 3116687 3160915 3210237
6182 3210237 3084107 2946137 2794959 2753470 2638211 2540452 2447804 2499258 2517268 2491065 2467233
6171 2467233 2428169 2426509 2484032 2502170 2536208 2558982 2549917 2516345 2501587 2519732 2484718 2390817
6159B390817m1079M9623k2202K6645L8066P0674l4641J44293M0916O1750J30847
6148B855709L8201J02197L4908Q4126J13957K8523J3123M7348P459R0143P2936
6137C488630R4757J38023R7753R3156K215m5547j25661j33874j23022o1025p1170
6126C354235m3129j3243K4292K51O0330K8666J07633J80048J03772J09895J33516
6115D046266J31257J34949J68511K9930j8637p0223k32284j95961r0997p3184
6105C829627l3277j5919M8062O5932R4801R9924J05054J21527J67397R864P6389
6094D569381L777m2872o4827j48030j74097k27930k99220k26338j45375m9979
6084C194490j12234j22023M180m8549q7821l1870p806j0192M9294P0307P5330
$$ plain form
6159 2390817 2349738 2399361 2377159 2403804 2441870 2512544 2477903 2622196 2663112 2724862 2855709
6148 2855709 2893910 2996107 3031015 3115141 3229098 3257621 3270744 3318092 3325551 3415694 3488630
6137 3488630 3583387 3721410 3819163 3912319 3914534 3868987 3743326 3609452 3486430 3425405 3354235
6126 3354235 3311106 3297863 3322155 3322406 3382736 3411402 3519035 3699083 3802855 3912750 4046266
6115 4046266 4177523 4312472 4480983 4510913 4492276 4422053 4189769 3993808 3902811 3829627
6105 3829627 3796350 3780431 3828493 3894425 3989226 4089150 4194204 4315731 4483128 4492992 4569381
6094 4569381 4573158 4530286 4465459 4317429 4143332 3915402 3616182 3389844 3244469 3194490
6084 3194490 3082256 2960233 2964413 2915864 2828043 2796173 2788367 2778175 2827469 2897776 2973106
6073B973106J16907M8105J28469J58144J26644J79613R3572Q5419N317j9904l1219
6062C864173l0491r0780k04710j83615j61930j87300r3190j32591r6056j01866
6052B581644n8108o9112o7292J8515Q272n5476K0858J2664J17305j0558K5370
6041B524082k8986o829P7079O316m3696K3230M8488N1175J23201R4330J41024
6030C009414J00016P6078J9633k4364r7249j03708j22792j01174j12879n5618
6020B587357p479L1706k6953K1627o0396k639L443P113Q1885K8211Q3549J36506
6008B883930J74356J30195J31108P9877n0260p0293j28317k57950k18444o0641
5998B613561r2067k09801j29087o3957l8691m7345p8228p9210j06412m338r489
$$ plain form
6073 2973106 3090013 3138118 3266587 3424731 3551375 3730988 3824560 3909979 3915296 3895392 3864173
6062 3864173 3833682 3742902 3538192 3354577 3192647 3005347 2912157 2779566 2683510 2581644
6052 2581644 2523536 2454424 2387132 2405647 2413919 2358443 2379301 2391965 2509270 2498712 2524082
6041 2524082 2495096 2488267 2565346 2571662 2527966 2551196 2599684 2650859 2774060 2868390 3009414
6030 3009414 3109430 3185508 3205141 3180777 3083528 2979820 2857028 2755854 2642975 2587357
6020 2587357 2579878 2611584 2584631 2606258 2545862 2543223 2546666 2553779 2635664 2663875 2747424 2883930
6008 2883930 3058286 3188481 3319589 3399466 3349206 3278913 3150596 2892646 2674202 2613561
5998 2613561 2521494 2311693 2182606 2118649 2079958 2032613 1954385 1875175 1768763 1764425 1754936
5987A754936o0605L872Q115j5263J169K7990O134K1899J05390J592m0223J6m8015
5974A767007J347j33158n6085M2314m0291o4157k6382m0602j910J2903m5476K5693
5962A441203M306N4126J12072Q1556k1040O974K5029L5983j8457j3112r1436l5548
5950A581656o4702k248j3187L7636M363J6916Q0050L9178L3179k2400r325M5832
5938A726948J318n065j8160k5244o1726m6165k5672k6003k8466n6434l2754m7135
5926A355442k9226q4458L5261K2482m5903n7639o1371m989J6951o973Q422q969
5914A139030q072k1080m6273L6554M4371r590N332n2984M9213k1993n9828p0553
5902I84127L4243l4107j0716L2439j9384K0801K2472m6744j1367j127J285j8737
$$ plain form
5987 1754936 1694331 1698203 1706318 1691055 1692224 1720214 1726348 1748247 1853637 1855229 1815006 1815022 1767007
5974 1767007 1768354 1635196 1579111 1621425 1581134 1516977 1490595 1449993 1448083 1460986 1415510 1441203
5962 1441203 1445509 1499635 1611707 1693263 1672223 1679197 1704226 1740209 1721752 1708640 1617204 1581656
5950 1581656 1516954 1514706 1501519 1539155 1543518 1560434 1640484 1679662 1712841 1690441 1681116 1726948
5938 1726948 1728266 1723201 1705041 1679797 1618071 1571906 1546234 1520231 1491765 1435331 1402577 1355442
5926 1355442 1326216 1241758 1277019 1299501 1253598 1195959 1134588 1129599 1146550 1139577 1147999 1139030
5914 1139030 1130958 1109878 1063605 1100159 1144530 1134940 1140272 1087288 1136501 1114508 1054680 984127
5902 984127 1018370 984263 973547 1005986 986602 1007403 1029875 983131 971764 970637 971922 953185
5890I53185J5003P073N2973L7025L0k7386n2951K7799Q426k8523m1325L0368Q2857
5877A064554q4918L4372o318L4291N6752M9185M9633n1261k2131j8051N4670o2578
5865A098200N4638J00588O4243j6825M7399j7321k6311J2363L3313O3273n4877
5854A358683N865P6131K7083N7220k620L187Q8329O0209m4147P0040J5210m0163
5842A675027K2767L1746k894j629M7744M6156k575l4518K4739K695m4733K3100
5830A787625J1512O398R5457M270K7984M0845J5577q076L853l3596J5398J9886
5818A987133M2732P0889K3503k7183J7150L6194o6381J1415L4007j0088P9367
5807B198738m6388J953M943k8800l434R607P7825O61K8041L1149L6266K5678l7645
$$ plain form
5890 953185 968188 975261 1028234 1065259 1065289 1037903 984952 1012751 1021177 992654 951329 981697 1064554
5877 1064554 979636 1014008 1007690 1041981 1098733 1147918 1197551 1146290 1124159 1106108 1160778 1098200
5865 1098200 1152838 1253426 1317669 1300844 1348243 1330922 1304611 1316974 1350287 1413560 1358683
5854 1358683 1364548 1440679 1467762 1524982 1522362 1525549 1613878 1674087 1629940 1699980 1715190 1675027
5842 1675027 1697794 1729540 1726646 1725017 1772761 1818917 1816342 1781824 1806563 1809258 1764525 1787625
5830 1787625 1799137 1805535 1900992 1905262 1933246 1974091 1989668 1981592 1985445 1951849 1967247 1987133
5818 1987133 2029865 2100754 2124257 2097074 2114224 2150418 2084037 2095452 2129459 2119371 2198738
5807 2198738 2152350 2154303 2159246 2130446 2127012 2136619 2214444 2215105 2243146 2274295 2310561 2336239 2298594
5794B298594P3416M0364j0161M9553J5147K7028K7902J36942P8251M0065q850
5783B768251K6154J40744J4729Q059R2563L8663J03481P9011J226m9611J6932
5772C240202N9624J10805M3188N4583O0452M4249P8045O1155J6860R9213M7249
5761C915625L2254O8267P1367J21538J07594P2503R8320J63476P7610K08661J68330
5750E105545J46236K48667K30712K32133J54984K07155K33905K35686K77328L05701
5740G378052L48502L88197M74055N01320O17364O76413O31871O77633P10981P02245
5730A3106633O61569P73176J054064J364020J727341J918081K164952K459918
5722B5229754K136537J218568k14007j377312j644186j156900n23966J43211O39072
$$ plain form
5794 2298594 2372010 2412374 2402213 2451766 2466913 2493941 2521843 2658785 2737036 2777101 2768251
5783 2768251 2794405 2935149 2949878 2957937 3050500 3089163 3192644 3271655 3272881 3223270 3240202
5772 3240202 3299826 3410631 3453819 3508402 3568854 3613103 3691148 3752303 3769163 3868376 3915625
5761 3915625 3947879 4016146 4087513 4209051 4316645 4389148 4487468 4650944 4728554 4937215 5105545
5750 5105545 5251781 5500448 5731160 5963293 6118277 6325432 6559337 6795023 7072351 7378052
5740 7378052 7726554 8114751 8588806 9090126 9707490 10383903 11015774 11693407 12404388 13106633
5730 13106633 13768202 14541378 15595442 16959462 18686803 20604884 22769836 25229754
5722 25229754 27366291 28584859 28370852 26993540 25349354 24192454 23668488 23811699 24450771
5713B4450771P81612J083825J088733O08564j9117m81577m53295K9794O68963
5704B7758273J009475J291263J099190M86893l95784j156824j417132j021708
5696B7653646l47379J45972M59984K36325l18650r20834j060536q40758m10184
5687B4597586L8604N64679P72385R05776J083447P58878j56660j292854k168100
5678B5103741k192129j827908j328726q57389o42350l73082k01279j59589K8667
5669A7549956J01777J07835J86485K44432K01365L06606M33023M98190M90833
5660B0120502N95152O90285Q07752R06235R71163J258364J523498J631398J903683
5651C0408032K308404K783288K980238L433287L888870M303840M755420N059213
$$ plain form
5713 24450771 25232383 26316208 27404941 28013505 27994388 27512811 27059516 27089310 27758273
5704 27758273 28767748 30059011 31158201 31645094 31249310 30092486 28675354 27653646
5696 27653646 27306267 27452239 27912223 28148548 27829898 26909064 25848528 25007770 24597586
5687 24597586 24636190 25200869 25973254 26879030 27962477 28721355 28564695 27271841 25103741
5678 25103741 22911612 21083704 19754978 18897589 18255239 17882157 17680878 17521289 17549956
5669 17549956 17651733 17759568 17946053 18190485 18391850 18698456 19131479 19629669 20120502
5660 20120502 20715654 21405939 22213691 23119926 24091089 25349453 26872951 28504349 30408032
5651 30408032 32716436 35499724 38479962 41913249 45802119 50105959 54861379 59920592
5643E9920592N113871N012252M698588M448966M157910L838777L474585K497221
5635I3162762Q56067j138789k946555m285623n069776n199869n195257n191580
5627F4991380n108639m812082m383017l973378l449578l270261k783895k446536
5619C4763994k203874k018600j881286j708106j490773j282360j170628j081255
5611B1927112q94321p70629o64503o56464m54039l58906l18508l65254l88740
5602A7055748l88833l71798k86666k90809k97739j99147k06715l15798l93540
5593A4304703l17258l32881k93398k10226l73284l66356k60994k87859k81165
5584A1581282k19991k25945j85619r5606q1474o8689o6776N839k201n2808r2744
$$ plain form
5643 59920592 65034463 70046715 74745303 79194269 83352179 87190956 90665541 93162762
5635 93162762 94018829 92880040 89933485 85647862 80578086 75378217 70182960 64991380
5627 64991380 59882741 55070659 50687642 46714264 43264686 39994425 37210530 34763994
5619 34763994 32560120 30541520 28660234 26952128 25461355 24178995 23008367 21927112
5611 21927112 21032791 20262162 19597659 18941195 18487156 18128250 17809742 17444488 17055748
5602 17055748 16666915 16295117 16008451 15717642 15419903 15220756 15014041 14698243 14304703
5593 14304703 13987445 13654564 13361166 13150940 12777656 12411300 12150306 11862447 11581282
5584 11581282 11361291 11135346 10949727 10854121 10772647 10703958 10637182 10643021 10640820 10588012 10495268
5573A0495268j63733j88913j32674j59788j62040j79538j97691j39998j17573
5564I053320J3096m0422Q386P7917O2156j3149r0226n2650q5272p9240q6716j33801
5552H633399n6167K13j0346L6588o7728q7938l1332J206r2173j19959q1564j29227
5540G994972l3908q2892m5491o8203j0741k3071q0097l941N76j6444K1471k3328
5528G628903r0414n4650p2750j69946j52834j21469j13243k8557r0066p3309p3548
5517F588117N19p1343j03840m1241J5570j06387r2415M0960J9545m0151m2571
5506F166763o444K514j1455Q1048K4689l247N375o1751o764P874k2029m9138K0750
5493F148185k0216L4554o6207l7823n4847j3312o8688j7643k3228j01591r0851
$$ plain form
5573 10495268 10331535 10142622 10009948 9850160 9688120 9508582 9310891 9170893 9053320
5564 9053320 9066416 9025994 9034380 9112297 9174453 9161304 9071078 9018428 8933156 8853916 8767200 8633399
5552 8633399 8577232 8577445 8567099 8603687 8535959 8448021 8416689 8417895 8325722 8205763 8124199 7994972
5540 7994972 7961064 7878172 7832681 7764478 7753737 7730666 7650569 7646628 7647204 7630760 7652231 7628903
5528 7628903 7538489 7483839 7411089 7241143 7088309 6966840 6853597 6825040 6734974 6661665 6588117
5517 6588117 6588636 6517293 6413453 6372212 6387782 6281395 6188980 6229940 6249485 6209334 6166763
5506 6166763 6160319 6162833 6151378 6232426 6257115 6253868 6259243 6197492 6190728 6198602 6176573 6127435 6148185
5493 6148185 6127969 6162523 6096316 6058493 6003646 5990334 5921646 5904003 5880775 5779184 5688333
5482E688333l4332r9872j25968q1945m6774n6434o2015p3369k245L173j13874
5471D994678n2155p2207q3305j34901j3931p1557l5772l3210p4244r5660j58648
5460D169088j51138n0565l7922n9852r1602j07889j4754q6509j00838j13875n0184
5449C303960n4714n608o1167m8533j5225p6163m0985k6194p3761q6682o9126K5080
5437B770882l8738n0037n6652n0345j6021k456m0046n361p5203n059k684k3103
5425B405177j6199l3863k7470j0709J298n2811m8753O2559k402K068O3475m7705
5413B294665j5637n3294L4640o2851M9577q8850q435P2852p4443m5487N1099M6978
5401B200814k4749j4914O4842N7697j0529k2514m5866J3824N2241j2892m8404
$$ plain form
5482 5688333 5654001 5554129 5428161 5346216 5299442 5243008 5180993 5107624 5105379 5108552 4994678
5471 4994678 4942523 4870316 4787011 4652110 4638179 4566622 4530850 4497640 4423396 4327736 4169088
5460 4169088 4017950 3967385 3929463 3869611 3778009 3670120 3655366 3568857 3468019 3354144 3303960
5449 3303960 3249246 3243638 3182471 3133938 3118713 3042550 3001565 2975371 2901610 2814928 2745802 2770882
5437 2770882 2732144 2682107 2625455 2575110 2559089 2556633 2516587 2511226 2436023 2430964 2428280 2405177
5425 2405177 2388978 2355115 2327645 2316936 2318234 2265423 2216670 2279229 2276827 2278895 2342370 2294665
5413 2294665 2279028 2225734 2260374 2197523 2247100 2158250 2149815 2222667 2148224 2102737 2153836 2200814
5401 2200814 2176065 2161151 2225993 2283690 2273161 2250647 2204781 2218605 2270846 2257954 2209550
5390B209550N3574N2544J8053J6568N2269P0777P2200J24046P516p8000j09636
5379B489461n6485m8441n4560q935K786n2766l2225m9494j8703j788m5380j7985
5367B105485j7790K0001n4727K8160n6473o2383n7662m7989M7429R290O0305j4822
5355A958824k3256p3912J2437K9781j7847l654q558O1136o186p1011L3261P1951
5343A962966K6861Q3809P9886q8182Q2368P9185O5361R8900K079j6237M3560M7298
5331B467854O921k339P6771O072l4532P1421R287Q6258Q3926K8951L2305O2178
5319B895073J9168M6043K664p8803n4352j17900j12005r8357p263m8870j01345
5308B344053q220k2543q4594k2491J0181M2579P7272n6817j9598m5004P122O6251
$$ plain form
5390 2209550 2263124 2315668 2333721 2350289 2402558 2473335 2545535 2669581 2677097 2599097 2489461
5379 2489461 2432976 2384535 2329975 2321040 2323826 2271060 2238835 2189341 2170638 2168850 2123470 2105485
5367 2105485 2087695 2107696 2052969 2081129 2024656 1962273 1904611 1856622 1904051 1913341 1973646 1958824
5355 1958824 1935568 1861656 1874093 1903874 1886027 1882373 1873815 1934951 1928765 1857754 1891015 1962966
5343 1962966 1989827 2073636 2153522 2065340 2147708 2226893 2292254 2391154 2393233 2376996 2420556 2467854
5331 2467854 2474775 2472436 2549207 2555279 2520747 2592168 2601455 2687713 2771639 2800590 2832895 2895073
5319 2895073 2914241 2960284 2962948 2884145 2829793 2711893 2599888 2501531 2494268 2445398 2344053
5308 2344053 2335833 2313290 2228696 2206205 2216386 2258965 2336237 2279420 2259822 2214818 2221940 2288191
5296B288191L5723J05661J45953P4496Q1124J55328K10295J89837J28973K04973
5286C620554L08649J90714J31956j8447K7668J13448R8657N6082J26777N5719
5276D711777k05591k93207k79793j95633j43240j21692r0476k2789l8365k6681
5266C294310L7914q6611n4855J2134K493K023j6622L2868J09249J13027R0613
5255C536543J76853K17628M7717M2642j44361j77047k12492k40567o5872q7462
5245C093582m9825k8268q3104m482q69L8379n629L3228Q7774J2534O8837R500
5233C171657P6308P2262J31481K07699J73239J90447K60049K59326K68276K04742
5223E015486J21818p9668j40738k12387k68669k18858j96552j64394j32369p1533
$$ plain form
5296 2288191 2323914 2429575 2575528 2650024 2731148 2886476 3096771 3286608 3415581 3620554
5286 3620554 3929203 4119917 4251873 4233426 4261094 4374542 4473199 4529281 4656058 4711777
5276 4711777 4506186 4212979 3933186 3737553 3594313 3472621 3382145 3359356 3320991 3294310
5266 3294310 3332224 3245613 3190758 3202892 3205385 3207408 3190786 3223654 3332903 3445930 3536543
5255 3536543 3713396 3931024 3978741 4021383 3877022 3699975 3487483 3246916 3181044 3093582
5245 3093582 3043757 3015489 2932385 2927903 2927034 2965413 2959784 2993012 3080786 3093320 3162157 3171657
5233 3171657 3247965 3320227 3451708 3659407 3832646 4023093 4283142 4542468 4810744 5015486
5223 5015486 5137304 5057636 4916898 4704511 4435842 4216984 4020432 3856038 3723669 3652136
5213C652136p370o8698O347l1754n1719O7240jm8445m9378k1538J9084l8620q243
5200C419041j0978r552n5192J6484N2885L5566o6967l96l9321J448L9228M3237
5188C425483M6289N5325M720P5130N7736K9253R3547m5653K223n478n197L8648
5176C772026J8622J9625M0493j7809P1869J5809L9186K2975m3027L0267K0804
5165C990840q588R4277k378J7915K6193o515K8855J8045J5271K4637j3530J2160
5153D197182O858j962K1057J05439J239O104N7111N4535L0953P9347Q6650J16603
5141D761116Q3942J07118P4027K3576N3515P9764O0199R9138N5462J25713J66359
5130E689929O3334N0889P2125P3223J08341L5269Q3640J52922R6613J53518N4458
$$ plain form
5213 3652136 3644766 3576068 3582415 3550661 3498942 3566182 3566181 3517736 3468358 3446820 3465904 3427284 3419041
5200 3419041 3408063 3398511 3343319 3359803 3412688 3448254 3381287 3380891 3341570 3343018 3382246 3425483
5188 3425483 3471772 3527097 3531817 3606947 3664683 3693936 3787483 3741830 3744053 3738575 3733378 3772026
5176 3772026 3790648 3810273 3850766 3832957 3904826 3920635 3959821 3982796 3939769 3970036 3990840
5165 3990840 3982252 4076529 4074151 4092066 4118259 4111744 4140599 4158644 4173915 4198552 4185022 4197182
5153 4197182 4204040 4202078 4223135 4328574 4329813 4335917 4393028 4447563 4478516 4557863 4644513 4761116
5141 4761116 4845058 4952176 5026203 5049779 5103294 5183058 5243257 5342395 5397857 5523570 5689929
5130 5689929 5753263 5804152 5876277 5949500 6057841 6093110 6176750 6329672 6426285 6579803 6634261
5119F634261J77439J38928J47533J70191J20638J84182K70005K11330J69791J55359
5109H379657K09927K51987K79534K89162K97371L16256M38619L56893M76700N66722
5099A1862828N52933O50525P49029Q88987R69111J047954Q41765R73191J124196
5090A9660519J286503J498294J911497J874955J098550j1201p66635k79385L48918
5081B6622015Q38300J249662J588962K178798K891862L653506M609102O256229
5073D9888436Q110324R823366J0438851J2467352J4266532Q954862k082164j4725298
5065I7142261j9064808j4729005j0070357p227994n469902m075377l151987k487941
5057C0864890j957973j730223j629226j498333j178709j059487r09616p08645
$$ plain form
5119 6634261 6811700 6950628 7098161 7268352 7388990 7573172 7843177 8054507 8224298 8379657
5109 8379657 8589584 8841571 9121105 9410267 9707638 10023894 10462513 10819406 11296106 11862828
5099 11862828 12415761 13066286 13815315 14704302 15673413 16721367 17563132 18536323 19660519
5090 19660519 20947022 22445316 24356813 26231768 27330318 27319117 26552482 26273097 26622015
5081 26622015 27460315 28709977 30298939 32477737 35369599 39023105 43632207 49888436
5073 49888436 57998760 67822126 78260977 90728329 104994861 113949723 111867559 97142261
5065 97142261 78077453 63348448 53278091 46050097 40580195 36504818 33352831 30864890
5057 30864890 28906917 27176694 25547468 24049135 22870426 21810939 20901323 20192678
5049B0192678o75107o89723p29453o65305n79563m78510l91282l89324m70835
5040A5123576k97946j86007j80402j13665r7738r0298M1641q2229K5303O4013
5030A4206248J32928J30678Q9800J30764J03854J64555J58472K23754L83828L18980
5020A6043861L66413J36115j76549k32146j07406l4009p3560O6695J96326K37647
5010A6423387K71562L84593M59209N04962N70521O83481Q41110Q75180R59988
5001B1973993J060991J209969J249106J350488J534436J807115K038209J866157
4993C4090464J631900J242750Q95557Q00999R46299J389733J742419K496506L143929
4984D8380556L673359M359552M886194N450801O120937P207094Q353005R661982
$$ plain form
5049 20192678 19517571 18827848 18098395 17433090 16853527 16375017 15983735 15594411 15123576
5040 15123576 14825630 14639623 14459221 14345556 14247818 14157520 14199161 14116932 14142235 14206248
5030 14206248 14339176 14469854 14559654 14690418 14794272 14958827 15117299 15341053 15724881 16043861
5020 16043861 16410274 16546389 16369840 16137694 16030288 15996279 15922719 15989414 16185740 16423387
5010 16423387 16694949 17079542 17538751 18043713 18614234 19297715 20138825 21014005 21973993
5001 21973993 23034984 24244953 25494059 26844547 28378983 30186098 32224307 34090464
4993 34090464 35722364 36965114 37860671 38661670 39607969 40997702 42740121 45236627 48380556
4984 48380556 52053915 56413467 61299661 66750462 72871399 80078493 88431498 98093480
4976I8093480J1407173J4077572J8181422K3091141K7899998L3036418L8956136
4969B64743340L8166515K8427819P773570j8431384l7574958m6941693m3113440
4962A93049769l1978057k2596546j6434848j2318914r591640p759724o612617
4955H5757423n767111n176545m618830l840435l175724k698291k264916j952089
4947E6263482j571820j434748j181559q50577m66651j97664P9298M56261O71213
4938E1767235M54809L32931L69485J23065n2247O9586N74584R49301J468542K080920
4928E8138211K609745L214462L779813M182551M942672N883218P108284Q747350
4920I8606306J0970639J3927200J8075659K2433113K6291609L1745048L8127396
$$ plain form
4976 98093480 109500653 123578225 141759647 164850788 192750786 225787204 264743340
4969 264743340 302909855 331337674 339111244 320679860 283104902 236163209 193049769
4962 193049769 161071712 138475166 122040318 109721404 100129764 92370040 85757423
4955 85757423 79990312 74813767 70194937 66354502 63178778 60480487 58215571 56263482
4947 56263482 54691662 53256914 52075355 51224778 50758127 50560463 50639761 51096022 51767235
4938 51767235 52222044 52554975 52924460 53047525 52995278 53064864 53639448 54588749 56057291 58138211
4928 58138211 60747956 63962418 67742231 71924782 76867454 82750672 89858956 98606306
4920 98606306 109576945 123504145 141579804 164012917 190304526 222049574 260176970
4913B60176970L5368264K2846026N017333j2116931k3898745l7102790m2797798
4906B07492329l4812283k4419195j7419613j3025204r819830p752550o417820
4899I3825834n634816n437634n293455m964336m371161l686170l217135k971507
4891E8249620k689605k441335k189838j989132j698789j463167j202528r92057
4883D3583169r55355r38055q03062p24551o73047o63938o40014n92920n73884
4874C7018343m30022m43357l61262j75822j93606j59630J5192K08938K05680L21678
4864C6006132M12502M43943K79337K3194k11934l12084k40291l0319N6949J70151
4854C6597580J76376K73981L57105M25458O70096P90154R68433J157387J242673
$$ plain form
4913 260176970 295545234 318391260 323408593 311291662 287392917 250290127 207492329
4906 207492329 172680046 148260851 130841238 117816034 107996204 100243654 93825834
4899 93825834 88191018 82753384 77459929 72495593 68124432 64438262 61221127 58249620
4891 58249620 55560015 53118680 50928842 48939710 47240921 45777754 44575226 43583169
4883 43583169 42627814 41689759 40886697 40162146 39489099 38825161 38185147 37592227 37018343
4874 37018343 36588321 36144964 35783702 35607880 35414274 35254644 35269836 35478774 35684454 36006132
4864 36006132 36418634 36862577 37141914 37165108 36953174 36641090 36400799 36370480 36427429 36597580
4854 36597580 36773956 37047937 37405042 37830500 38500596 39290750 40259183 41416570 42659243
4845D2659243J336794J480436J653503J784739K117448K433544K913635L399028
4837E9778370L881602M326919M673380M717386M401518L708678K865600K185178
4829I0538631J901661K467935L393909M472066N636188O309727O395541N931295
4821A27046953M705089L033781J091979p16519k276748l462567m380820n087442
4813A19953706n488543n551185n389304n153108m793170m360108l981292l550611
4805H1686385l445087l279126l278260l235453l281457l274015l046298k842989
4797E6003700k614349k425828k350699k368557k355894k229209j935396j799447
4789C7924321j567893j386442j394110j213629r54290q99595q43045p02081q04317
$$ plain form
4845 42659243 43996037 45476473 47129976 48914715 51032163 53465707 56379342 59778370
4837 59778370 63659972 67986891 72660271 77377657 81779175 85487853 88353453 90538631
4829 90538631 92440292 94908227 98302136 102774202 108410390 114720117 121115658 127046953
4821 127046953 131752042 134785823 135877802 135161283 132884535 129421968 125041148 119953706
4813 119953706 114465163 108913978 103524674 98371566 93578396 89218288 85236996 81686385
4805 81686385 78241298 74962172 71683912 68448459 65167002 61892987 58846689 56003700
4797 56003700 53389351 50963523 48612824 46244267 43888373 41659164 39723768 37924321
4789 37924321 36356428 34969986 33575876 32362247 31407957 30508362 29665317 28963236 28158919
4780B8158919p68600p34237o92671n95528n19566n40719m84790n05004m94871
4771B2822933m17378m50535n01646m79882m88556m12322l72052l53373m11483
4762A8935706l64613l66599m44335l54839l49304l90924l12382k44446l33739
4753A5774525k57238j30157k28809k85917l11069l36495k93355k62861k49659
4744A3418965j93883k29539j54790j15449o5697j02109o6081n3748j74516j51246
4734A2111907j09963j0719q1666o6444j64616j37405j81469j56138l1459j36031
4724A1035997j13063l0216k7985r5821j97432j54651j76752r6130m0172j61328
4714I942447j16157q1973j14190j05141n5144o0511q8485J2541L718J4814J1588
$$ plain form
4780 28158919 27390319 26656082 25963411 25367883 24848317 24307598 23822808 23317804 22822933
4771 22822933 22405555 21955020 21453374 20973492 20484936 20072614 19700562 19347189 18935706
4762 18935706 18571093 18204494 17760159 17405320 17056016 16665092 16352710 16108264 15774525
4753 15774525 15517287 15387130 15158321 14872404 14561335 14224840 13931485 13668624 13418965
4744 13418965 13225082 12995543 12840753 12725304 12659607 12557498 12491417 12437669 12263153 12111907
4734 12111907 12001944 11991225 11909559 11843115 11678499 11541094 11359625 11203487 11172028 11035997
4724 11035997 10922934 10892718 10864733 10768912 10571480 10416829 10240077 10143947 10103775 9942447
4714 9942447 9826290 9744317 9630127 9524986 9469842 9409331 9320846 9333387 9337105 9351919 9363507
4703I363507j03144m9984P9339n0117O6367O4167l2644j3490J14818J03521N7295
4692I599635N7945J7231J08726Q4345M1873M0830j8899L2656j2092N8719Q6643
4681A0097612P1200p698N6846K5275R6557Q5565J35522K24181J71971J65488K22156
4670A1344675K56100K82355K31346K57259L13284K99503L63946L23372M27201
4661A4099041N44147N63154N05838P06447P58710Q19740Q80302R20131Q30463
4652B0627973P30373P37581P80445R36489J056842J019926Q83483Q20903P77088
4643B8371103R02806J110094J308874J623459J860287K267578K685893L085489
4635D3215583L510614M023599M487823N017126N790531O772424Q066475R617451
$$ plain form
4703 9363507 9260363 9210379 9289718 9239601 9305968 9370135 9337491 9324001 9438819 9542340 9599635
4692 9599635 9657580 9674811 9783537 9867882 9909755 9950585 9931686 9964342 9952250 10010969 10097612
4681 10097612 10168812 10161114 10217960 10243235 10339792 10425357 10560879 10785060 10957031 11122519 11344675
4670 11344675 11600775 11883130 12114476 12371735 12685019 12984522 13348468 13671840 14099041
4661 14099041 14643188 15206342 15712180 16418627 17177337 17997077 18877379 19797510 20627973
4652 20627973 21358346 22095927 22876372 23812861 24869703 25889629 26773112 27594015 28371103
4643 28371103 29273909 30384003 31692877 33316336 35176623 37444201 40130094 43215583
4635 43215583 46726197 50749796 55237619 60254745 66045276 72817700 80884175 90501626
4627I0501626J1483095J3437725J4877617J5814931J6400638J5482576J0293343
4620A88291551Q9932j1938174k0113928k1334456j8402847j4876121j1810550
4613H9905407r270387p426638o024435n043591m295822l710129l384545k985971
4605D7763889k732885k373173k024082j685937j474414j355450j064040p64223
4597C4289685o93125p63650q40617r44213j229244j459507j539038j471035j343038
4588B4006218j162063j026527r43243p69212o80376o13539o37872n70889n12863
4579A7089634n23279m52083m98757l94563m31874n11053l66399l01091k41322
4570A3369213k95483k73894k01922k76126j35816j60721j95737j54643k55978
$$ plain form
4627 90501626 101984721 115422446 130300063 146114994 162515632 177998208 188291551
4620 188291551 188381483 176443309 156329381 134994925 116592078 101715957 89905407
4613 89905407 80635020 73208382 67183947 62140356 57844534 54134405 50749860 47763889
4605 47763889 45031004 42657831 40633749 38947812 37473398 36117948 35053908 34289685
4597 34289685 33596560 32832910 31992293 31048080 29818836 28359329 26820291 25349256 24006218
4588 24006218 22844155 21817628 20874385 20105173 19424797 18811258 18173386 17602497 17089634
4579 17089634 16566355 16114272 15615515 15220952 14789078 14278025 13911626 13610535 13369213
4570 13369213 13073730 12799836 12597914 12321788 12185972 12025251 11829514 11674871 11418893
4561A1418893k14193k64442j79320k41246k14839j23073n4938P543j07797m7770
4551I978818J988K2801m1333j8483j8353n5188n7053O9292J21628l3295M3417
4540A0014239N6343J47786J73446K55373L09072L26561N30580N28331O44181P99889
4530A3785801P34601Q02707Q14972P19914M09173J66966j81415n23405p35781
4521A5993533p77392q79953o78391m53961l88660k47197k33966k55832l39254
4512A1738927l56283k32553j38618k37973k65869j29103p5138P9203J09259K04978
4502A0696830K56709J78684K59452K39924J44833J5986l5502j12007j86833k54466
4492A1203610k34660j99274j40033p5420j3900J48923K37395K81671K43069J75286
$$ plain form
4561 11418893 11204700 10940258 10760938 10519692 10304853 10181780 10126842 10134385 10026588 9978818
4551 9978818 9980806 10003607 9962274 9943791 9925438 9870250 9813197 9882489 10004117 9970822 10014239
4540 10014239 10070582 10218368 10391814 10647187 10956259 11282820 11813400 12341731 12985912 13785801
4530 13785801 14520402 15323109 16138081 16857995 17267168 17434134 17252719 16729314 15993533
4521 15993533 15216141 14336188 13657797 13203836 12815176 12567979 12334013 12078181 11738927
4512 11738927 11382644 11150091 11011473 10773500 10507631 10378528 10303390 10382593 10491852 10696830
4502 10696830 10953539 11132223 11391675 11631599 11776432 11792418 11756916 11644909 11458076 11203610
4492 11203610 10968950 10769676 10629643 10554223 10540323 10689246 10926641 11208312 11451381 11626667
4482A1626667k8072j58258k44044l18756k10486k52966o6126j94012j34612p6277
4472I943058p7358K6485J02626K33725K60034J75144J97091P6088n5595o6126
4462A0815172j59267k39906j88853j01297j10771l4425O9256n1190M3792J02936
4452A0145447Q5582J70502K79888J71654l6447j33615q5982j07547j36393O6265
4442A0419354K25676K73876K05542J66661L9753j07602j18890n8301m3657M1693
4432A1044105p4629r9293n6628j08658k15222j72266j19227q8974l5371j3126
4422A0060711k2085k2916q3195k8687R78q1958q8519k2773N0175K13524L35032
4411A0310287L81925M69797M71131N67831L54032J72856m9765l54879m06010k60468
$$ plain form
4482 11626667 11598595 11440337 11196293 10877537 10667051 10414085 10347959 10153947 10019335 9943058
4472 9943058 9865700 9892185 9994811 10228536 10488570 10663714 10860805 10936893 10881298 10815172
4462 10815172 10655905 10415999 10227146 10125849 10015078 9980653 10049909 9998719 10042511 10145447
4452 10145447 10231029 10401531 10681419 10853073 10816626 10683011 10597029 10489482 10353089 10419354
4442 10419354 10645030 10918906 11124448 11291109 11330862 11223260 11104370 11046069 11002412 11044105
4432 11044105 10969476 10870183 10813555 10704897 10489675 10317409 10198182 10109208 10073837 10060711
4422 10060711 10038626 10015710 9932515 9903828 9904806 9822848 9734329 9711556 9761731 9975255 10310287
4411 10310287 10692212 11162009 11633140 12200971 12555003 12727859 12678094 12323215 11917205 11656737
4401A1656737k97733l74610l03688m71098l45616m01475l52521k28301k64190
4392H617505k13313q8245q674k3912J2137p347j24125r3628p4544o7572p3224
4381G855058n6773M1768J08593J35395L09341L45715L22834M59901M51554L30933
4371A0304319P5742j15111k36044l07373l04619k81371j79145j32064j40777m0804
4361H642753n6732m3556k7361p3295j08824k14847j85069k91712l10331k01985
4351G129041j59862j27763r7908j43146j1941L6069j379m3401n2216M2256J7318
4340F587068Q3729O0277L9483J6044K13554K34876L11170L29396L17397L69830
4330H562824K79888K90279J83594K10983K36208J71294J12695M9201J65796K11827
$$ plain form
4401 11656737 11359004 10984394 10680706 10209608 9863992 9462517 9109996 8881695 8617505
4392 8617505 8404192 8315947 8307273 8283361 8295498 8288151 8164026 8070398 7995854 7928282 7855058
4381 7855058 7798285 7840053 7948646 8084041 8393382 8739097 9061931 9521832 9973386 10304319
4371 10304319 10380061 10264950 10028906 9721533 9416914 9135543 8956398 8824334 8683557 8642753
4361 8642753 8586021 8542465 8515104 8441809 8332985 8118138 7933069 7641357 7331026 7129041
4351 7129041 6969179 6841416 6743508 6600362 6588421 6624490 6623111 6579710 6527494 6569750 6587068
4340 6587068 6670797 6731074 6770557 6786601 7000155 7235031 7546201 7875597 8192994 8562824
4330 8562824 8842712 9132991 9316585 9527568 9763776 9935070 10047765 10096966 10262762 10474589
4320A0474589K04385L30705L58719L53548L21411M80685N66686M22034L84863
4311A3897625O09722R33275J170921J442621J414958J232652K75071j214619k241388
4302A7520838k179906j628510j216449q58474o40539n90773l86566k63316l60023
4293I396282k86080r0783m0882m5036l6663m4991j52214k22578k08962k14903
4283H053190j78691k59363j41119k7470m0770l7429L7746K8163r7760k65292l36715
4272F734490l92376m62321l56685k58552l32766k26371j26932j84966k00124j10848
4262D082549o5859j30200j45995p1002j11209j33720k2132m0471o8227j29538
4252C164196J7251j7108r50Q369j9087o4187k7279l4051o8377n7492p8833k7774
$$ plain form
4320 10474589 10678974 11009679 11368398 11721946 12043357 12524042 13090728 13512762 13897625
4311 13897625 14507347 15440622 16611543 18054164 19469122 20701774 20976845 19762226 17520838
4302 17520838 15340932 13712422 12495973 11637499 10996960 10406187 10019621 9756305 9396282
4293 9396282 9110202 9019419 8978537 8933501 8896838 8851847 8699633 8477055 8268093 8053190
4283 8053190 7874499 7615136 7474017 7446547 7405777 7368348 7406094 7434257 7336497 7071205 6734490
4272 6734490 6342114 5879793 5523108 5264556 4931790 4705419 4578487 4393521 4193397 4082549
4262 4082549 4016690 3886490 3740495 3669493 3558284 3424564 3402432 3361961 3293734 3164196
4252 3164196 3181447 3164339 3163389 3171758 3152671 3088484 3061205 3027154 2958777 2901285 2822452 2794678
4240B794678p2206j3094K3605r0060j29168j7592j6130m1872j7885o2466k8246
4229B329564j772k0217K1031J1196r615Q257p9176l9220l5667J9353O578j14316
4217B095996K9341J5106J0281p4675p83J9919l1921p3733J197J420N763M4089
4205B042000K2057P196N58p144J2043J2324M439l4241M0133j1505L6912L0887
4193B155659n2113N3085l2510K498N9804l0259L49k839N1507R0548J549m185l7507
4180B255586L6073j9249Q2482n1976j12487k7361K2235k5903m5685K9587K2400
4169B165702Q4544O16l2290j1197K8774J4227J0319R770P2523O617P0492j0533
4157B409564Q606j460N0284K7053l2022j0656k0178O738p796n2757J7181O6932
$$ plain form
4240 2794678 2722472 2709378 2732983 2642923 2513755 2496163 2480033 2438161 2420276 2357810 2329564
4229 2329564 2327792 2307575 2328606 2339802 2330187 2338444 2259268 2220048 2184381 2203734 2210312 2095996
4217 2095996 2125337 2140443 2150724 2076049 2075266 2095185 2063264 1989531 1990728 1992148 1997911 2042000
4205 2042000 2064057 2071253 2071811 2064667 2076710 2089034 2093473 2059232 2099365 2087860 2124772 2155659
4193 2155659 2103546 2156631 2124121 2126619 2186423 2156164 2156513 2153674 2205181 2295729 2297278 2293093 2255586
4180 2255586 2291659 2272410 2354892 2302916 2190429 2163068 2185303 2159400 2113715 2143302 2165702
4169 2165702 2250246 2250862 2218572 2207375 2236149 2250376 2260695 2270465 2342988 2349605 2420097 2409564
4157 2409564 2418170 2416710 2466994 2494047 2462025 2451369 2431191 2437929 2430133 2377376 2394557 2461489
4145B461489j10699n67j2124k9294J2104O985N052n8777K7313L9690L653K1128
4133B365953L3517p0383j3340Q03n9466r811l6903L3795N4446N8777k1149n8316
4121B277923J662N952o1764m8431R1214J1400j7963n7839q4218k3103q7059O3095
4109B070869M1338j23150j1728L1375m2467N4263O0871p4888p1310j1860l2520
4098A890793m1126R895J2483r8749k7680n7978R3521J5414p5401J5878m3891Q7517
4086A780676l8180o8059J3357l4419M1783n3437l0268M3494J3068o3272j1411
4075A593332q5762J446L889l2516J3718k2394k4637j8127l4306O0295p216m0552
4063A407170p5452k7837l3021k7220J12075L9545n855j6705l6410K7716o0799
$$ plain form
4145 2461489 2350790 2350223 2338099 2308805 2320909 2327894 2332946 2274169 2301482 2341172 2344825 2365953
4133 2365953 2399470 2329087 2315747 2316550 2257084 2247273 2210370 2244165 2298611 2357388 2336239 2277923
4121 2277923 2279585 2285537 2223773 2175342 2266556 2277956 2259993 2202154 2117936 2094833 2007774 2070869
4109 2070869 2112207 1989057 1977329 2008704 1966237 2020500 2081371 2006483 1935173 1923313 1890793
4098 1890793 1849667 1859562 1872045 1773296 1745616 1687638 1781159 1796573 1721172 1737050 1693159 1780676
4086 1780676 1742496 1674437 1687794 1653375 1695158 1641721 1611453 1654947 1668015 1604743 1593332
4075 1593332 1507570 1509016 1512905 1480389 1494107 1471713 1447076 1428949 1394643 1454938 1447722 1407170
4063 1407170 1331718 1303881 1270860 1243640 1355715 1395260 1389405 1372700 1336290 1364006 1303207
4052A303207k8130J3925P010k165l3093n732n3424j1662J8947j8181p7803k4953
4040A087946j3660N6398L6651k3479k8062R51j4081N752L185K8677n0242k48j8382
4027A071406j5130M9641Q414o8310j7011K0701p545J5368N5474K4804L0197o6897
4015A101112r9845j9565P0173M1646J1960m8226K8457Q9588M0509n6367J7073
4004A176515k8899n4442J4427p590l4136q956k2490Q8179L6815n5902k1173l3439
3992A048909O7918j2351N7809p4631o40k1396j7593k4246R466P8907K8976o2837
3980A078291O109N2163l2737N3370M8253L0068n7909m1075K5079L3757Q246M726
3968A208341j3243K580L9109J3083K1603J1488m7356K1433N6470p627M1854L4344
$$ plain form
4052 1303207 1275077 1289002 1296012 1293847 1260754 1255022 1201598 1189936 1208883 1190702 1112899 1087946
4040 1087946 1074286 1130684 1167335 1143856 1115794 1116745 1102664 1108416 1111601 1140278 1090036 1089788 1071406
4027 1071406 1056276 1105917 1114331 1046021 1029010 1049711 1042166 1057534 1113008 1137812 1168009 1101112
4015 1101112 1001267 981702 1051875 1093521 1105481 1057255 1085712 1175300 1215809 1159442 1176515
4004 1176515 1147616 1093174 1107601 1100011 1065875 1056919 1034429 1122608 1159423 1103521 1082348 1048909
3992 1048909 1116827 1104476 1162285 1087654 1087014 1065618 1048025 1023779 1033245 1112152 1141128 1078291
3980 1078291 1084400 1136563 1103826 1157196 1205449 1235517 1177608 1136533 1161612 1195369 1203615 1208341
3968 1208341 1195098 1197678 1236787 1249870 1271473 1282961 1235605 1257038 1313508 1305881 1347735 1382079
3956A382079J4210J6122q9551M0596L9858J06818j6217n3489K11K5374L3871K8371
3944A528253O9586l5568N3757O184j8596R293N6695M2081k0767O6395l4111J1495
3932A734697N7108P2013O1569m4062L2086P8643P1550o1276l1454K8472J4387
3921B013733N3576N7086J8429L5351O1364J06840J6872o3858M5537P7311n4583
3910B367658M8130L9160m8415N3138Q7166O3689P1747l6532L2021M5134M9011
3899B771907K931K1078M6583J8973P9821Q5315K2736K158K3685L4357J12744J9585
3887C241873P9917k6606k6545P1384P0335N3603O0938R9449O4900N9118N1694
3876C800060K1107M3804L0702J20529O3121P9052L8244J1189L3206l2141M7928
$$ plain form
3956 1382079 1396289 1412411 1322860 1363456 1403314 1510132 1493915 1440426 1440637 1466011 1499882 1528253
3944 1528253 1597839 1562271 1616028 1622212 1603616 1612909 1669604 1711685 1690918 1757313 1723202 1734697
3932 1734697 1791805 1863818 1925387 1881325 1913411 1992054 2063604 2002328 1970874 1999346 2013733
3921 2013733 2067309 2124395 2142824 2178175 2239539 2346379 2363251 2299393 2344930 2422241 2367658
3910 2367658 2415788 2454948 2406533 2459671 2546837 2610526 2682273 2645741 2677762 2722896 2771907
3899 2771907 2774838 2795916 2842499 2861472 2941293 3026608 3049344 3051502 3075187 3109544 3222288 3241873
3887 3241873 3321790 3295184 3268639 3340023 3410358 3463961 3524899 3624348 3689248 3748366 3800060
3876 3800060 3821167 3864971 3895673 4016202 4079323 4158375 4196619 4207808 4241014 4208873 4256801
3865D256801J04325O8600K6878P8424R0367N9884j182R3247P2100J3430L2047
3854D894921R1190J13015J30181R5418R8832M6573J80740P0594M5836J57781J20990
3843F046071N1416Q1718M8811J20971J99643O8064K6491R9273J14962J37910J04912
3832G100242M5670j1099Q199Q9633Q63q5360m5375J09572L1445O163N7229J14548
3820G421730J57649J37295J89142J80668K48399L48528K08691K89545L05040K41432
3810I728119K19008J07184J55982J83415J23102J11057J47788J48946J34386Q2885
3800A1141872J25678J41844k6796r7973j95754r2186j30495n8517K8960j181L3248
3789A0868700J1570J83646J63809J17127J41197J94554K61565K43206K68448K34090
$$ plain form
3865 4256801 4361126 4429726 4456604 4535028 4625395 4685279 4684097 4777344 4849444 4862874 4894921
3854 4894921 4986111 5099126 5229307 5324725 5423557 5470130 5650870 5721464 5767300 5925081 6046071
3843 6046071 6097487 6179205 6228016 6348987 6548630 6616694 6643185 6742458 6857420 6995330 7100242
3832 7100242 7145912 7134813 7143012 7232645 7233508 7148148 7102773 7212345 7243790 7249953 7307182 7421730
3820 7421730 7579379 7716674 7905816 8086484 8334883 8683411 8892102 9181647 9486687 9728119
3810 9728119 9947127 10054311 10210293 10393708 10516810 10627867 10775655 10924601 11058987 11141872
3800 11141872 11267550 11409394 11382598 11284625 11088871 10996685 10866190 10807673 10836633 10835452 10868700
3789 10868700 10880270 11063916 11227725 11344852 11486049 11680603 11942168 12185374 12453822 12687912
3779A2687912K72375L39888K29480J66481L05077K39649J49540Q3644L6827J39687
3769A4650560L5828M9232J02663N489K8605r2916j84421m5433k6778j32830j56559
3758A4233440j20303q5926r3719j1513j3398O3240J81727J98169J99961J37345
3748A4689023Q7609J52589Q3677J28618K5252O5476R9889J9871J6795Q1832M4335
3737A5494966j1554J86J9818n8174M575J9980j05402k1908k5885M0263r8443k01787
3725A5056635l07786k04393p3639n0667R6591J69674R7567J61964J58556K6765
3715A5131267J5686r693o5295q4692r2330K7425P5290M59j7977j13648m5463N921
3703A4826950q449P4893j3503K3403J40745J17428J4001O5730O7563n971K3867
$$ plain form
3779 12687912 12960287 13300175 13529655 13696136 14001213 14240862 14390402 14474046 14510873 14650560
3769 14650560 14686388 14735620 14838283 14843772 14872377 14779461 14595040 14549607 14522829 14389999 14233440
3758 14233440 14113137 14027211 13933492 13921979 13908581 13971821 14153548 14351717 14551678 14689023
3748 14689023 14776632 14929221 15012898 15141516 15166768 15232244 15332133 15352004 15368799 15450631 15494966
3737 15494966 15483412 15483598 15503416 15445242 15449817 15469797 15364395 15342487 15316602 15356865 15258422 15056635
3725 15056635 14748849 14544456 14470817 14420150 14516741 14686415 14783982 14945946 15104502 15131267
3715 15131267 15146953 15137260 15071965 14987273 14894943 14922368 14997658 14998117 14980140 14866492 14821029 14826950
3703 14826950 14818501 14893394 14879891 14903294 15044039 15161467 15175468 15241198 15308761 15302790 15326657
3692A5326657O730O5753p98O613J30788J62384L24137K83851J77842J55942J75414
3681A6815313J11957J45003Q0599L0935j3210k7127p7082l6862q4015o0515O8893
3670A6953889J07227J39909J61960R7827N3929J50961J36724J82564J75099K18718
3660A8378807J42692J02833J80129J28230J85359K50452K83512K06325K33600
3651B0091939K21698K24172K15200K87564K26874R3772R0491O6314j4015o0349
3641B1443660J6281L608P0941K6574J14524J8080J35093K89111K49515K43605
3631B2610992K35580J95465K40456J90815K66086K31039K88520K83310K37162
3622B4779425K57028M21340M15393M76755M63442M34495L84461K86044K03821
$$ plain form
3692 15326657 15333387 15399140 15398342 15404955 15535743 15698127 16022264 16306115 16483957 16639899 16815313
3681 16815313 16927270 17072273 17152872 17183807 17170597 17143470 17066388 17029526 16945511 16884996 16953889
3670 16953889 17061116 17201025 17362985 17460812 17514741 17665702 17802426 17984990 18160089 18378807
3660 18378807 18521499 18624332 18804461 18932691 19118050 19368502 19652014 19858339 20091939
3651 20091939 20313637 20537809 20753009 21040573 21267447 21361219 21451710 21518024 21504009 21443660
3641 21443660 21459941 21463549 21534490 21561064 21675588 21693668 21828761 22117872 22367387 22610992
3631 22610992 22846572 23042037 23282493 23473308 23739394 23970433 24258953 24542263 24779425
3622 24779425 25036453 25457793 25873186 26349941 26813383 27247878 27632339 27918383 28122204
3613B8122204J62179J87768J47659J69486R8941J33061n2373J4017P596o2121
3603B8928417p0794k691n3336m6176M0076N1332M7895R7440J23597R3102K12009
3592B9420871L04940K51417L39449N25591M94205M74918M32609N00482M39225
3583C3183707K71990K11874J04606K21948K54531K66712K14018Q5840o8408j18715
3573C4628103l34726l28939l28357l22781k74592j87378n0917L9921O5044J29315
3563C3034693K05791K83622L50433L83191L93682M57736N31163N26196M44216
3554C6610723N12956M76282M56745M28971K80415K79732K95184L36358L71572
3545D0048938L91349L57729M03278K90076J82948M5844j24234k55915k97165l08252
$$ plain form
3613 28122204 28284383 28472151 28619810 28789296 28888237 29021298 28968925 28982942 28990538 28928417
3603 28928417 28857623 28854932 28801596 28755420 28795496 28846828 28894723 28992163 29115760 29208862 29420871
3592 29420871 29725811 29977228 30316677 30842268 31336473 31811391 32244000 32744482 33183707
3583 33183707 33455697 33667571 33772177 33994125 34248656 34515368 34729386 34815226 34746818 34628103
3573 34628103 34293377 33964438 33636081 33313300 33038708 32851330 32800413 32840334 32905378 33034693
3563 33034693 33240484 33524106 33874539 34257730 34651412 35109148 35640311 36166507 36610723
3554 36610723 37123679 37599961 38056706 38485677 38766092 39045824 39341008 39677366 40048938
3545 40048938 40440287 40798016 41201294 41491370 41674318 41720162 41595928 41340013 41042848 40734596
3535D0734596j75984k12600j14690q6720l6060n0070o1585O0972J10501J01963
3525D0270323J68272J24522J82467L19681L94122L41125L10247L52149L53733
3516D2816641L63092L62026K62375L24398K48391J93774K88258J51894R7235O5368
3506D5173452j0325k57325l94610l77084n01258n16341m39020l88899l84079l35471
3496D1569040j94564j47278k02460j07966J1133M7971J55181J50080K25744K34221
3486D1741102J74434J23168N2933L7668R4051J4473N711j5932m2888M7489j14567
3475D2117642q7657k61967l10232l43160n14641o00612n43785n55212n73489m13904
3465C7912983m12110l80245l27510k53716k10168j37767j96169r0893j23891j50498
$$ plain form
3535 40734596 40558612 40346012 40231322 40144602 40108542 40058472 39996887 40057859 40168360 40270323
3525 40270323 40438595 40563117 40745584 41065265 41459387 41800512 42110759 42462908 42816641
3516 42816641 43179733 43541759 43804134 44128532 44376923 44570697 44858955 45010849 45108084 45173452
3506 45173452 45163127 44905802 44511192 44134108 43632850 43116509 42677489 42288590 41904511 41569040
3496 41569040 41374476 41227198 41024738 40916772 40927905 40975876 41131057 41281137 41506881 41741102
3486 41741102 41915536 42038704 42091637 42129305 42223356 42237829 42243540 42227608 42184720 42232209 42117642
3475 42117642 42029985 41768018 41457786 41114626 40599985 39999373 39455588 38900376 38326887 37912983
3465 37912983 37500873 37120628 36793118 36539402 36329234 36191467 35995298 35904405 35780514 35630016
3455C5630016o3123o7301j78444j99978l15955l21746l32879m26743l99664l50526
3445C2973657l29361k72302k98123l67689m77449m91689m99481o33674m48297
3436B9155592l95414l83514l56861l07117k12025k17848k37281k93863l87270
3427B6364399m14203l81431m20002m09422l49612l32198m52846l87297l79204
3418B2838184m64633l99281l63857l67164k80910l50695k42145j87509k54913
3409A9927077j75591j32065j16633k09884j29844m3780l887N7659J26771K14044
3399A9513867Q3984J4044p5757l36221l94804m25018m89683l75422l20114k89064
3389A6905812k98706l69849m25195m32431m28006l16247k61969l33964k41053
$$ plain form
3455 35630016 35566893 35499592 35321148 35121170 34805215 34483469 34150590 33723847 33324183 32973657
3445 32973657 32644296 32371994 32073871 31706182 31228733 30737044 30237563 29603889 29155592
3436 29155592 28760178 28376664 28019803 27712686 27500661 27282813 27045532 26751669 26364399
3427 26364399 25950196 25568765 25148763 24739341 24389729 24057531 23604685 23217388 22838184
3418 22838184 22373551 21974270 21610413 21243249 20962339 20611644 20369499 20181990 19927077
3409 19927077 19751486 19619421 19502788 19292904 19163060 19119280 19115393 19173052 19299823 19513867
3399 19513867 19597851 19611895 19536138 19199917 18805113 18380095 17890412 17514990 17194876 16905812
3389 16905812 16607106 16237257 15812062 15379631 14951625 14635378 14373409 14039445 13798392
3380A3798392k56890j94599k12155j90485j88176j34753m7959n2342q2434l1659
3370A2406940K7820K4714j2819n5739l3414m7159j67724k18667k61171k83636
3360A1379145k66192j90254j17394k38876j71117k07388k91188k17221j70303
3351I509212k45368j15905r2833j31676j16115j35322p8071n6656j54570j23164
3341H259532j11320j08981J6244r4520j35364j03084j28039j00698o6643j09002
3331G318125j08778r7759m9798p6587l8405j00529p2613q2798l9116K9836p9133
3320F602445j58945n8250N462j6932j28848n4559r8599o7050j182n5802n2747
3309E914993j07115o3887j2434k4530l8113L5429l4168p1549l4532K5425j03156
$$ plain form
3380 13798392 13541502 13346903 13134748 12944263 12756087 12621334 12573375 12521033 12438599 12406940
3370 12406940 12434760 12459474 12446655 12390916 12357502 12310343 12142619 11923952 11662781 11379145
3360 11379145 11112953 10922699 10805305 10566429 10395312 10187924 9896736 9679515 9509212
3351 9509212 9263844 9147939 9055106 8923430 8807315 8671993 8593922 8537266 8382696 8259532
3341 8259532 8148212 8039231 8055475 7960955 7825591 7722507 7594468 7493770 7427127 7318125
3331 7318125 7209347 7111588 7061790 6985203 6946798 6846269 6773656 6690858 6651742 6681578 6602445
3320 6602445 6443500 6385250 6390712 6373780 6244932 6190373 6091774 6024724 6023542 5967740 5914993
3309 5914993 5807878 5743991 5731557 5707027 5668914 5704343 5670175 5598626 5564094 5589519 5486363
3298E486363L820J684m8516j07096j43048m6708j8941m050o8874P896n9619N290
3286E008201k864l5387j0711p6413K779N113o469k5581O395K0757k5303m8671
3274D811846l1927K024J4544o3887m8399m3716K1133k0573M860J4063j11641r1754
3262D456573q932j3607o7808j456j8993J0783Q9720j8411p091m2694P239M4744
3250D430067M2526K6888m3048M3315J0308K8490M69M4917J27284Lk7293O9786
3238D753712Q7732K6556R3091R0229K3418L8126J7160N0885R3251J02525L5562
3227E412247J6577R0710J40366R6505N7324J58084J73442R3730J23703R5110J37203
3216F595001P0343J70315J44512J40277J43141K10032K24674J65948K03333K49899
$$ plain form
3298 5486363 5490183 5491867 5443351 5336255 5193207 5146499 5127558 5123508 5054634 5062530 5002911 5008201
3286 5008201 5005337 4969950 4959239 4882826 4885605 4890718 4884249 4858668 4865063 4885820 4860517 4811846
3274 4811846 4779919 4781943 4796487 4732600 4684201 4640485 4661618 4641045 4645905 4659968 4548327 4456573
3262 4456573 4447641 4434034 4366226 4364770 4345777 4356560 4446280 4427869 4420778 4378084 4385323 4430067
3250 4430067 4472593 4499481 4456433 4499748 4510056 4538546 4539015 4583932 4711216 4711219 4683926 4753712
3238 4753712 4841444 4868000 4961091 5051320 5074738 5112864 5130024 5180909 5274160 5376685 5412247
3227 5412247 5428824 5519534 5659900 5756405 5813729 5971813 6145255 6238985 6362688 6457798 6595001
3216 6595001 6665344 6835659 6980171 7120448 7263589 7473621 7698295 7864243 8067576 8317475
3206H317475K96454K88887L20577L52216M19648M72636M96117O13037P38219P27073
3196A3042339Q98776R81452R02504Q41697O91804N01316K73764M3081r743N3986
3186A8220976K45296L90055M53974N56467P39874Q11696R53694J112118J108137
3177B4592287J066108J056354J018562J166325J238538J301264J350100J259209
3169C4048747J116644J005541J112166J298936J523870J824795K207987K634682
3161D6773368K789414K501472J949940J435016J090845Q41396M06500J77274J29221
3152E8094446j2657J15780J84240L57995N79842Q49539J062799R78114Q59241
3143F3069339P49648Q42541J095540J491416J609117J570986J251390P75306M98409
$$ plain form
3206 8317475 8613929 8902816 9223393 9575609 9995257 10467893 10964010 11577047 12315266 13042339
3196 13042339 13941115 14922567 15825071 16666768 17358572 17859888 18133652 18176733 18166990 18220976
3186 18220976 18466272 18856327 19310301 19866768 20606642 21418338 22372032 23484150 24592287
3177 24592287 25658395 26714749 27733311 28899636 30138174 31439438 32789538 34048747
3169 34048747 35165391 36170932 37283098 38582034 40105904 41930699 44138686 46773368
3161 46773368 49562782 52064254 54014194 55449210 56540055 57381451 57787951 57965225 58094446
3152 58094446 58081789 58197569 58381809 58739804 59319646 60169185 61231984 62210098 63069339
3143 63069339 63818987 64661528 65757068 67248484 68857601 70428587 71679977 72455283 72953692
3134G2953692N46700P98378J209137J407663J616726J925685K033319J847362
3126H4338662J449960R63082K16587m72555r72410j218354j344547j475840j814877
3117G9669708j892845j777408j743468j664607j401975j294445j224325j083925
3109F7586710j059113r64102q28943q93857q95010q81816q07369p77218p29436
3100E9749846o55671o50392p48418o91314o55866o71087p32355p02902r06562
3091E3335279r89551j086968j237017j317523j506709j509337j602434j707510
3083D2378230j696155j602883j575972j465212j390392j272213j165720j038447
3075C1171236j061540j038701r07457p79462o84773o72518o85924o07021n07249
$$ plain form
3134 72953692 73500392 74298770 75507907 76915570 78532296 80457981 82491300 84338662
3126 84338662 85788622 86751704 86968291 86495736 85523326 84304972 82960425 81484585 79669708
3117 79669708 77776863 75999455 74255987 72591380 71189405 69894960 68670635 67586710
3109 67586710 66527597 65563495 64734552 63840695 62945685 62063869 61256500 60479282 59749846
3100 59749846 59094175 58443783 57695365 57004051 56348185 55677098 54944743 54241841 53335279
3091 53335279 52345728 51258760 50021743 48704220 47197511 45688174 44085740 42378230
3083 42378230 40682075 39079192 37503220 36038008 34647616 33375403 32209683 31171236
3075 31171236 30109696 29070995 28163538 27384076 26699303 26026785 25340861 24733840 24226591
3066B4226591n93942n77213o47353o93585o06779p14146o07496n87860n51413
3057A8646804n44589n13684n33400m34727m64154m17390k79445l21957k89899
3048A4847559k44286l41594l28052k81811l82553l18130l80977l18907l32899
3039A1918350k78297k70415k09528j89020j95493j08159j79791k11899j69477
3030A0106271p0634j73786j70330n5854j80336k48179j85644j30634q0254k7124
3020H783496r016j3772N6403M8886j2513q8183k43141k76681k50559l11291k43424
3009G440205j91436j26204k38333k48912j63547j31146q0112j71591q3694j13240
2999E891990j51526p4213j02540r2672n2049n8294l3554o5479j11651j5481Q760
$$ plain form
3066 24226591 23632649 23055436 22408083 21714498 21107719 20393573 19786077 19198217 18646804
3057 18646804 18102215 17588531 17055131 16620404 16156250 15738860 15459415 15137458 14847559
3048 14847559 14603273 14261679 13933627 13651816 13269263 12951133 12570156 12251249 11918350
3039 11918350 11640053 11369638 11160110 10971090 10775597 10667438 10487647 10275748 10106271
3030 10106271 10035637 9861851 9691521 9635667 9455331 9207152 9021508 8890874 8810620 8783496
3020 8783496 8774480 8760708 8817111 8865997 8853484 8765301 8522160 8245479 7994920 7683629 7440205
3009 7440205 7248769 7122565 6884232 6635320 6471773 6340627 6260515 6088924 6005230 5891990
2999 5891990 5740464 5666251 5563711 5471039 5418990 5360696 5327142 5261663 5150012 5134531 5143291
2988E143291o631m5048o3528L8423K2946K9257l6487j17513p4501q6599j36672
2977D666938j73951k85120j74642j24312j65434r4171j38226j134K84j53497l9171
2966C317564j16914j7614k9241r7564p6157o5654p207p3535j9621r022l2694n9268
2954B713073l1537m2658m2844m2167l0333N9353K094Q626p0090q8833m2243l0024
2942B362417M431r8375r7467k5552L6855k6034q7055l5967n2652l8486j956K0878
2930A961037j16829k7327m2748k7164L2610l4373l7767K172M415k581O2338n0141
2918A723642n9228M5220L1305m2066p4611p6530L478k5476K5774j3398m4340p9530
2906A414240r787J4815k8272r2472J4960m2335P8122m163l466K7184n2941j5557
$$ plain form
2988 5143291 5136660 5091612 5028084 5066507 5089453 5118710 5082223 4964710 4890209 4803610 4666938
2977 4666938 4492987 4207867 4033225 3908913 3743479 3649308 3511082 3509948 3510232 3356735 3317564
2966 3317564 3200650 3183036 3153795 3056231 2980074 2914420 2907213 2833678 2814057 2805035 2772341 2713073
2954 2713073 2681536 2638878 2596034 2553867 2523534 2582887 2584981 2593607 2523517 2434684 2392441 2362417
2942 2362417 2366848 2268473 2171006 2145454 2182309 2156275 2069220 2033253 1980601 1942115 1940159 1961037
2930 1961037 1844208 1816881 1774133 1746969 1779579 1745206 1707439 1709611 1714026 1711445 1773783 1723642
2918 1723642 1664414 1709634 1740939 1698873 1624262 1547732 1551210 1525734 1551508 1538110 1493770 1414240
2906 1414240 1404453 1419268 1390996 1298524 1313484 1271149 1349271 1345108 1341642 1368826 1315885 1300328
2894A300328l9747L442p907M0711j0042j5668Q724n132M0664M4788j00478o0697
2882A198986L3113N4144J8375l8255n9572Q574Q5166M827r102L3196m3559k0046
2870A265847m7123M3423M2031k0970J8046j4290n043q5458m5478J5841L750j1473
2858A159103K857K8638R39m7085N0081M855j8925j7685k9627K374k6622O6152
2846A175055L6379k8337k9651N116j7164l4286M3165P6696L9345n463r2421K5603
2834A194037o4330o5k8976o2621L1112k7597J0908o0743N1248K4936j7108o3773
2822I87028o218Q9626P34q2194p217L9090l2839k0495m1008N2223J8710o4761
2810I32679q3634L8760J3808L6816m2635L3627r538m5270J1307j15697N0141j1257
$$ plain form
2894 1300328 1260581 1264023 1256116 1296827 1286785 1271117 1279841 1274709 1315373 1360161 1259683 1198986
2882 1198986 1232099 1286243 1304618 1266363 1206791 1215365 1300531 1305358 1296256 1329452 1285893 1265847
2870 1265847 1218724 1262147 1304178 1283208 1301254 1286964 1281921 1196463 1150985 1166826 1170576 1159103
2858 1159103 1161960 1190598 1191537 1144452 1194533 1199388 1180463 1162778 1133151 1135525 1108903 1175055
2846 1175055 1211434 1183097 1153446 1158562 1141398 1107112 1150277 1226973 1266318 1260855 1168434 1194037
2834 1194037 1129707 1129642 1100666 1038045 1069157 1041560 1052468 991725 1042973 1067909 1050801 987028
2822 987028 980810 1070436 1071170 988976 981759 1020849 988010 967515 926507 978730 997440 932679
2810 932679 849045 887805 901613 938429 895794 929421 919883 874613 885920 770223 820364 809107
2798H09107j0466n9208j8368Q5726m8184n2128m864q454j0364N432m3075L701
2786F48855l5943j08787M592R3617j391M0532r400m6985J7727L771l0269o3354
2774E12965J4163j1258K8575q222m4363l1444Q0510R778j5153p4986N9106J09586
2762F29257j18601j3731O489L7359K6717l5478k8198O7751m9978J3225K8974o0054
2750E03732m034n1709m3220N9050K7600n4005k0167l5375N7984L8286l7136J231
2738D42237q57J7007N9410j09372j0908K3031O052N597m7827l1502k8890K1000
2726C44978k0537L9809l2552J2640m1547R642o4597k384L4057j113J8642J3498
2714C10536o1141o3461N7452j1208m4890L6959N6537l8404l1447L6200P5757J5295
$$ plain form
2798 809107 798641 739433 721065 806791 758607 706479 701615 693161 682797 688229 645154 648855
2786 648855 612912 504125 508717 602334 600943 641475 632075 585090 602817 606588 576319 512965
2774 512965 527128 515870 544445 536223 491860 460416 540926 550704 535551 460565 519671 629257
2762 629257 510656 496925 503414 540773 567490 532012 503814 571565 521587 534812 563786 503732
2750 503732 499698 447989 404769 463819 491419 437414 417247 381872 439856 478142 441006 442237
2738 442237 441380 458387 517797 408425 397517 420548 426600 432197 384370 352868 323978 344978
2726 344978 324441 364250 331698 344338 302791 312433 247836 245452 279509 278396 297038 310536
2714 310536 249395 185934 243386 232178 187288 224247 280784 242380 210933 247133 322890 338185
2702C38185k3329q0329J6652O5829J8322o7832K8156l4381r053K8549J1644R650
2690C02063l5397m0102K5001k7471J487K2294l3970j5994N0450J8462O33j2280
2678B55176n6887K975Q648K4484L8855L255J6911l2103o1500N3547l848l1197
2666B18316L5668M086m3070J2285j7624m7577M2641k7497J4869M0629m3173K8118
2654B17671O7430K5983m9392p9887O8285O1724n8596m4979m8983J8822M9970Q783
2642B36831m1341m0376J6987K190L2617m5496k5620j6739P8969O6491k6944o2516
2630A75053l1424Q3225J1918L5632P243n9284p5441m5013J1438L7803O6511J0181
2618B27842N0760L394k7314j6266o3510j8070L7282L9984k9681k2882K4259P3851
$$ plain form
2702 338185 314856 234527 251179 317008 335330 267498 295654 261273 252220 280769 292413 302063
2690 302063 266666 226564 251565 224094 225581 247875 213905 197911 248361 266823 267456 255176
2678 255176 198289 201264 209912 234396 273251 276506 293417 261314 199814 253361 249513 218316
2666 218316 253984 258070 215000 227285 209661 162084 204725 177228 192097 232726 189553 217671
2654 217671 285101 311084 261692 181805 250090 311814 253218 208239 159256 178078 228048 236831
2642 236831 195490 155114 172101 174291 206908 161412 135792 119053 198022 264513 237569 175053
2630 175053 143629 226854 238772 274404 281647 222363 146922 101909 113347 151150 217661 227842
2618 227842 278602 281996 254682 238416 174906 156836 194118 234102 204421 181539 205798 279649
2606B79649J4755j12510p9891P9090O087L3089j1670j1085m7650M0740N3140q196
2594B35548K929j3758J4826k9255j4044k9092J5746o829m2226M2339Q7585N117
2582B68886J7L0126K2947k4910m1217M3031P055m1115j4976p6781Q660L0841q1194
2569A31370m6749J21943M4183m8685l9126p3067K1716K7184N8717k1535N871k9719
2557A52103k4069m6179N268Q2693J4932n3250m9685k697P7624j1966r660n3783
2545H1331O7174Q609K4426l6137K3159L1172l2830r732l7437N5850l2238l3321
2533A10026j1315L5320j5043K0539J9014N450j8562Q306M5932M0968o5517k6774
2521A48344K9522m2730L619m1859K4164N1129m0559J8686J9366o5665J55Q2398
$$ plain form
2606 279649 294404 181894 102003 181093 187180 220269 208599 197514 149864 190604 243744 235548
2594 235548 238477 224719 239545 210290 196246 167154 182900 176071 133845 176184 263769 268886
2582 268886 268903 299029 321976 297066 255849 298880 305935 264820 249844 173063 181723 212564 131370
2569 131370 84621 206564 250747 202062 162936 89869 111585 138769 197486 175951 181822 152103
2557 152103 128034 81855 87123 169816 184748 131498 81813 79116 156740 144774 135114 81331
2545 81331 148505 157114 181540 145403 168562 199734 166904 157172 119735 175585 143347 110026
2533 110026 98711 134031 118988 139527 158541 163991 145429 153735 199667 240635 175118 148344
2521 148344 177866 135136 138755 96896 121060 172189 131630 150316 169682 104017 104172 186570
2509A86570P986j08724l8688P9609l0463K4943J6636j6007k1740M1753J0468p286
2497A45057p5179r415K8523l9591p993N9208m0795O8607l9487l3595k2274l877
2485B9189O116K8470J4845K8339K9920Q560l4643k4146M3569J7064N9672n2235
2473A54720L4395p317m1121m6293N710L299L41L525L3872L831J3307J1930k2322
2460A47877J4474m0815k3638K59k4124j0332N3471K5476K4391N2779m0953k6901
2448A51964J3378m2603J8495K388k5732j8115N5537R1693o1119j7266k7461k053
2436A39106R841p7906O811L492k3620J2177R3184K9621o0498J0432j3071J1135
2424A40704K314M3668n8384p3309Q1347N0095k9069j0100M5899o4892M0349M3307
$$ plain form
2509 186570 194556 85832 47144 126753 96290 121233 137869 121862 100122 141875 152343 145057
2497 145057 69878 60463 88986 49395 41402 100610 59815 128422 88935 55340 33066 29189
2485 29189 35305 63775 78620 106959 136879 145439 110796 86650 130219 147283 206955 154720
2473 154720 189115 181798 140677 94384 100094 103393 103734 107259 141131 144962 158269 170199 147877
2460 147877 162351 121536 97898 98157 74033 63701 117172 142648 167039 219818 178865 151964
2448 151964 165342 122739 141234 143622 117890 99775 155312 247005 185886 168620 141159 139106
2436 139106 148947 71041 77852 81344 57724 69901 163085 192706 132208 142640 129569 140704
2424 140704 143018 186686 128302 54993 136340 186435 157366 147266 193165 128273 168622 211929
2412B11929k0147j1763o3920P7597J18123p4645j8356m3771P569j5080J0211m343
2400A73404q0306M1374M4143l0637o24L2674n59K5351k6445j4678j0267P434R1119
2387B51983n760K1359K9044m0316R258Q5K9772O229L9579k6452K8210n284L8802
2374C76509M0863J9739P547j9740K4156l2461o3223L0924N0257L3832Q616J3711
2362D90730m773L2918m570O1245M1627J4837M6391O4218R0906J4969L296M702
2350H56496P7327L9275M5453Q3987J21362J36592L8752L6675J75069J50495O2334
2339A823817J44664K39033J38255K3270K486R8808J11005J68621J11225J53350
2329C014534L02809L89075L90797K70369K92958K60329M19401M78040O62705Q99173
$$ plain form
2412 211929 191782 180019 116099 193696 311819 237174 218818 175047 182616 167536 177747 173404
2400 173404 93098 134472 178615 147978 147354 180028 179469 204820 178375 163697 153430 160864 251983
2387 251983 246223 267582 296626 256310 265568 265653 295425 301654 341233 314781 342991 337707 376509
2374 376509 417372 437111 444658 424918 449074 416613 353390 384314 434571 468403 477019 490730
2362 490730 485957 518875 514305 575550 617177 632014 678405 742623 833529 848498 851794 856496
2350 856496 933823 973098 1018551 1102538 1223900 1360492 1399244 1435919 1610988 1761483 1823817
2339 1823817 1968481 2207514 2345769 2369039 2371525 2470333 2581338 2749959 2861184 3014534
2329 3014534 3317343 3706418 4097215 4367584 4660542 4920871 5340272 5818312 6481017 7380190
2319G380190J132762J373192J972085K329784K775590L054784L978860L514261
2311B7511508J366019k900512n691057m308609k924464j929238j517391j225236
2303H381020r15023n84843n28058m80225l84141k16265k24085k63523l68516l55924
2293D060417m00696k65268k73311k49950k16324j54289j82202r9993j8713p5653
2283B124018j27179j23752p5629j03812o3718j17203k984k4570j22669o4317j9126
2272A279059j5034j4627m6069p9675j7723j9246j0986o8477l4517j20993k5172
2261H26540J0642J97o3534n1540K6618l1451J2843l3287p956j1245k9300L5446
2249F83973k1337K3214k2181l6169O0277m9732p2817o9624N847O9498r8778L459
$$ plain form
2319 7380190 8512952 9886144 11858229 14188013 16963603 20018387 23997247 27511508
2311 27511508 28877527 25977015 20285958 15977349 13052885 11123647 9606256 8381020
2303 8381020 7465997 6881154 6353096 5872871 5488730 5272465 5048380 4784857 4416341 4060417
2293 4060417 3659721 3394453 3121142 2871192 2654868 2500579 2318377 2218384 2199671 2124018
2283 2124018 1996839 1873087 1797458 1693646 1629928 1512725 1509741 1485171 1362502 1298185 1279059
2272 1279059 1264025 1249398 1203329 1123654 1105931 1086685 1075699 1007222 972705 851712 826540
2261 826540 837182 837379 773845 722305 748923 717472 730315 697028 689072 677827 648527 683973
2249 683973 662636 685850 663669 627500 687777 638045 565228 495604 501451 570949 472171 475630
2237D75630j8493M2870n4693k6252k1464K2290K2336k4945M211K051L958o1489
2225C66010J07336o7345m6988l9494M2005O5954L8510p9307j3221L7830q9903
2214C21387J3143M7083K9146j10420J1081L0680l2254k840k5264M3006J1775n3035
2202B83488k9983q2311K4030M6707k5939O5411J2476n1079l5657j5612o4751K9485
2190A56265N7559l9139n2413P3853M0020J3938j7501J4116o4711l6591N170n6184
2178I4382K6701m516M8433N8568l7781J4001R16r335r738p7353m6528M5530k9011
2165G4269N5159O6756O853l8191l3682M2529k2848O0743N748o2735p575r692N6040
2152A93374J1592m4636n4415L48K7285R9558m8352p4098n821Q2894m632J6240
$$ plain form
2237 475630 457137 500007 445314 419062 397598 419888 442224 417279 421490 423541 427499 366010
2225 366010 473346 406001 359013 319519 361524 427478 465988 386681 373460 411290 321387
2214 321387 334530 381613 410759 300339 311420 342100 309846 307006 281742 324748 336523 283488
2202 283488 253505 171194 195224 241931 215992 281403 293879 242800 207143 191531 126780 156265
2190 156265 213824 174685 122272 196125 236145 250083 232582 246698 181987 145396 150566 94382
2178 94382 121083 116567 165000 223568 185787 199788 200704 191369 181631 104278 57750 103280 74269
2165 74269 129428 196184 203037 164846 131164 173693 150845 211588 217336 154601 147026 137334 193374
2152 193374 204966 160330 105915 106263 133548 233106 184754 110656 104835 187729 183097 199337
2140A99337M9942j06554K32K8890j4880o0792L5969K0052m4511J9579j04238K3766
2128D6792P0038m3494L7559l7600J7238J5803k0169K4572J1613r410n0879n317
2116E6746l9634P984M2505J6562N0205n3934R784l299r89N0335Q19k4356m7148
2103F5580K7514m0227J0072K9155l1894k4732L442J7265p3531j0479M3684k753
2091A3096L597J5812j3843K5460j5241j2268J1172L3810O015j3660K0983K3127
2079I8060k9627n6932L8951o557k9881L7182O4945j6579k2190n3391L3748Q0357
2067A38086J1109k3133k6111R293J0113o7052j15793P2667J0152j7986K4962N1882
2055G8189j3158k5954M0328M266M01k0933j0711N8295j8815n3347m5556M1805
$$ plain form
2140 199337 249279 142725 142957 171847 156967 96175 132144 152196 107685 127264 23026 46792
2128 46792 116830 73336 110895 73295 90533 106336 86167 110739 122352 112942 62063 56746
2116 56746 17112 25096 67601 84163 134368 80434 90218 86919 85930 136265 137084 112728 65580
2103 65580 93094 52867 62939 92094 60200 35468 38910 56175 -17356 -27835 15849 13096
2091 13096 16693 32505 18662 44122 28881 16613 27785 61595 67610 53950 74933 98060
2079 98060 68433 11501 50452 43895 14014 51196 116141 99562 77372 23981 57729 138086
2067 138086 149195 126062 99951 109244 119357 52305 -63488 9179 19331 1345 26307 78189
2055 78189 65031 39077 79405 83671 84072 63139 52428 110723 91908 38561 -6995 34810
2043C4810P5543L2103k9777k8730j8293r364o9157n270P6339L3336m2960j5698
2031C2882O5476p0010n2259P3818k2850N7828o0941M0247j4629n6011O6723m3641
2019A6633J089K2522k7100L1323M1840q2489O818N9451j1384m858m546N469l2885
2006B1883p544l6151J4170L9653j8520J8652K6892j9041M3180k7657o2610K9985
$$ plain form
2043 34810 110353 142456 112679 83949 65656 56292 -12865 -18135 58204 91540 48580 32882
2031 32882 98358 28348 -23911 49907 27057 84885 23944 64191 49562 -6449 60274 16633
2019 16633 17722 40244 13144 44467 86307 3818 10636 70087 58703 53845 49299 54768 21883
2006 21883 14339 -21812 -7642 32011 13491 32143 59035 39994 83174 55517 -7093 22892
$$ [...]
##END NTUPLES=NMR SPECTRUM
##END=
