##TITLE=1H_DE-80H_X3
 200.13MHz, d2o
 8 sc
 
 19ns.26.2.2025
##JCAMPDX= 6.0         $$ Bruker NMR JCAMP-DX V2.0
##DATA TYPE= NMR SPECTRUM
##DATA CLASS= NTUPLES
##ORIGIN= UXNMR, Bruker Analytische Messtechnik GmbH
##OWNER= pz
$$ XWIN-NMR		Version 3.5
$$ Mon Jun 23 11:33:47 2025 Russian Standard Time (UT+4h)  Yarkov@DPX200
##.OBSERVE FREQUENCY= 200.1313
##.OBSERVE NUCLEUS= ^1H
##.ACQUISITION MODE= SIMULTANEOUS
##.ACQUISITION SCHEME= undefined
##.AVERAGES= 8
##.DIGITISER RES= 18
##SPECTROMETER/DATA SYSTEM= spect
##.PULSE SEQUENCE= zg30
##.SOLVENT NAME= CDCl3
##.SHIFT REFERENCE= (INTERNAL, CDCl3, 0, 15.4836)
##AUDIT TRAIL= $$ (NUMBER, WHEN, WHO, WHERE, WHAT)
$$ ##TITLE= Audit trail, XWIN-NMR		Version 3.5
$$ ##JCAMPDX= 5.01
$$ ##ORIGIN= Bruker BioSpin GmbH
$$ ##OWNER= Yarkov
$$ C:/Bruker/XWIN-NMR/data/yarkov2/nmr/H-C/1/pdata/1/auditp.txt
$$ ##AUDIT TRAIL=  $$ (NUMBER, WHEN, WHO, WHERE, WHAT)
(   1,<2025-06-23 11:32:52.43 +0400>,<Yarkov>,<DPX200>,
      <created by zg, POWCHK disabled, PULCHK disabled
       configuration hash MD5:
       00 E9 B6 7A A2 85 ED C7 34 08 36 98 17 FE 4E 26
       data hash MD5: 16K
       7D 59 C6 9B B8 87 3F AF D3 CA 64 73 7D D0 7C F8>)
(   2,<2025-06-23 11:32:56.79 +0400>,<Yarkov>,<DPX200>,
      <Start of raw data processing
       efp BC_mod = 2 LB = 0.25 FT_mod = 6 PKNL = 1 PHC0 = -1713.766 PHC1 = 10.1666 SI = 16K 
       data hash MD5: 16K
       47 A3 A3 29 37 85 5F 12 76 E7 0E 1A D6 06 05 99>)
(   3,<2025-06-23 11:33:03.01 +0400>,<Yarkov>,<DPX200>,
      <abs ABSG = 5 
       data hash MD5: 16K
       05 04 44 6D 23 86 9B DF AE FB 8A A5 45 AD 13 31>)
$$ ##END=
$$ 
$$ hash MD5
$$ 32 7F 4D 7B 6D 94 15 8D DB DC D8 66 B7 F0 D2 54
##$RELAX= 
##$RELAX= 
##$RELAX= 
##$RELAX= 
##$RELAX= 
##$RELAX= 
$$ Bruker specific parameters
$$ --------------------------
##$DU= <C:/Bruker/XWIN-NMR>
##$EXPNO= 1
##$NAME= <H-C>
##$PROCNO= 1
##$TYPE= <nmr>
##$USER= <yarkov2>
##$AMP= (0..31)
100 100 100 100 100 100 100 100 100 100 100 100 100 100 100 100 100 100 
100 100 100 100 100 100 100 100 100 100 100 100 100 100 
##$AQSEQ= 0
##$AQ_mod= 1
##$AUNM= <au_zg>
##$AUTOPOS= <>
##$BF1= 200.13
##$BF2= 200.13
##$BF3= 200.13
##$BF4= 200.13
##$BF5= 200.13
##$BF6= 200.13
##$BF7= 200.13
##$BF8= 200.13
##$BYTORDA= 1
##$CFDGTYP= 0
##$CFRGTYP= 5
##$CHEMSTR= <none>
##$CNST= (0..31)
1 1 145 1 1 1 1 1 1 1 1 1 1 1 1 1 1 1 1 1 1 1 1 1 1 1 1 1 1 1 1 1 
##$CPDPRG= <>
##$CPDPRG1= <>
##$CPDPRG2= <>
##$CPDPRG3= <>
##$CPDPRG4= <mlev>
##$CPDPRG5= <mlev>
##$CPDPRG6= <mlev>
##$CPDPRG7= <mlev>
##$CPDPRG8= <mlev>
##$CPDPRGB= <>
##$CPDPRGT= <>
##$D= (0..31)
0 0.7 0 0 0 0 0 0 0 0 0 0.03 0 0 0 0 0 0 0 0 0 0 0 0 0 0 0 0 0 0 0 0 
##$DATE= 1750663971
##$DBL= (0..7)
120 120 120 120 120 120 120 120 
##$DBP= (0..7)
150 150 150 150 150 150 150 150 
##$DBP07= 0
##$DBPNAM0= <>
##$DBPNAM1= <>
##$DBPNAM2= <>
##$DBPNAM3= <>
##$DBPNAM4= <>
##$DBPNAM5= <>
##$DBPNAM6= <>
##$DBPNAM7= <>
##$DBPOAL= (0..7)
0.5 0.5 0.5 0.5 0.5 0.5 0.5 0.5 
##$DBPOFFS= (0..7)
0 0 0 0 0 0 0 0 
##$DE= 6
$$ [...]
##$SUBNAM3= <"">
##$SUBNAM4= <"">
##$SUBNAM5= <"">
##$SUBNAM6= <"">
##$SUBNAM7= <"">
##$SUBNAM8= <"">
##$SUBNAM9= <"">
##$SW= 18.0517328524113
##$SWIBOX= (0..15)
0 0 2 0 0 0 0 0 0 0 0 0 0 0 0 0 
##$SW_h= 3612.71676300578
##$TD= 16384
##$TD0= 1
##$TE= 0
##$TE2= 300
##$TE3= 300
##$TEG= 300
##$TL= (0..7)
0 120 120 120 120 120 120 120 
##$TP= (0..7)
150 150 150 150 150 150 150 150 
##$TP07= 0
##$TPNAME0= <>
##$TPNAME1= <>
##$TPNAME2= <>
##$TPNAME3= <>
##$TPNAME4= <>
##$TPNAME5= <>
##$TPNAME6= <>
##$TPNAME7= <>
##$TPOAL= (0..7)
0.5 0.5 0.5 0.5 0.5 0.5 0.5 0.5 
##$TPOFFS= (0..7)
0 0 0 0 0 0 0 0 
##$TUNHIN= 0
##$TUNHOUT= 0
##$TUNXOUT= 0
##$USERA1= <user>
##$USERA2= <user>
##$USERA3= <user>
##$USERA4= <user>
##$USERA5= <user>
##$V9= 5
##$VALIST= <valist>
##$VCLIST= <CCCCCCCCCCCCCCC>
##$VD= 0
##$VDLIST= <DDDDDDDDDDDDDDD>
##$VPLIST= <PPPPPPPPPPPPPPP>
##$VTLIST= <TTTTTTTTTTTTTTT>
##$WBST= 1024
##$WBSW= 4
##$XGAIN= (0..3)
0 0 0 0 
##$XL= 0
##$YL= 0
##$YMAX_a= 125742
##$YMIN_a= -76887
##$ZGOPTNS= <>
##$ZL1= 120
##$ZL2= 120
##$ZL3= 120
##$ZL4= 120
##$ABSF1= 15.53535
##$ABSF2= -2.516501
##$ABSG= 5
##$ABSL= 3
##$ALPHA= 0
##$AQORDER= 0
##$ASSFAC= 0
##$ASSFACI= 0
##$ASSFACX= 0
##$ASSWID= 0
##$AUNMP= <proc_1d>
##$AZFE= 0.1
##$AZFW= 0.1
##$BCFW= 0
##$BC_mod= 2
##$BYTORDP= 0
##$COROFFS= 0
##$CY= -3
##$DATMOD= 1
##$DC= 0
##$DFILT= <>
##$DTYPP= 0
##$F1P= 0
##$F2P= 0
##$FCOR= 1
##$FTSIZE= 16384
##$FT_mod= 6
##$GAMMA= 0
##$GB= 0
##$INTBC= 1
##$INTSCL= 3.241238e-09
##$ISEN= 128
##$LB= 0.25
##$LEV0= 0
##$LPBIN= 0
##$MAXI= 10000
##$MC2= 0
##$MEAN= 0
##$ME_mod= 0
##$MI= 1.114404
##$NCOEF= 0
##$NC_proc= -10
##$NLEV= 6
##$NOISF1= 3.799351
##$NOISF2= 2.8
##$NSP= 0
##$NTH_PI= 0
##$NZP= 0
##$OFFSET= 15.48356
##$PC= 1
##$PHC0= -1713.766
##$PHC1= 10.1666
##$PH_mod= 1
##$PKNL= yes
##$PPARMOD= 0
##$PSCAL= 0
##$PSIGN= 0
##$REVERSE= no
##$SF= 200.130007634153
##$SI= 16384
##$SIGF1= 3
##$SIGF2= 2
##$SINO= 0.751879
##$SIOLD= 32768
##$SREGLST= <19F.Aceton>
##$SSB= 0
##$STSI= 16384
##$STSR= 0
##$SW_p= 3612.71676300578
##$SYMM= 0
##$S_DEV= 0
##$TDeff= 16384
##$TDoff= 0
##$TI= <>
##$TILT= no
##$TM1= 0
##$TM2= 0
##$TOPLEV= 0
##$USERP1= <user>
##$USERP2= <user>
##$USERP3= <user>
##$USERP4= <user>
##$USERP5= <user>
##$WDW= 1
##$XDIM= 16384
##$YMAX_p= 438316089
##$YMIN_p= -2320700
$$ End of Bruker specific parameters
$$ ---------------------------------
##NTUPLES= NMR SPECTRUM
##VAR_NAME=  FREQUENCY,     SPECTRUM/REAL,   SPECTRUM/IMAG
##SYMBOL=    X,             R,               I
##VAR_TYPE=  INDEPENDENT,   DEPENDENT,       DEPENDENT
##VAR_FORM=  AFFN,          ASDF,            ASDF
##VAR_DIM=   16384,         16384,           16384
##UNITS=     HZ,            ARBITRARY UNITS, ARBITRARY UNITS
##FACTOR=    0.220516191357247, 1,           1
##FIRST=     3098.72490264486, 0,            0
##LAST=      -513.991860360923, 0,           0
##MIN=       -513.991860360923, -2320700,    0
##MAX=       3098.72490264486, 438316089,    0
$$ Real data points
##PAGE= N=1
##DATA TABLE= (X++(R..R)), XYDATA
$$ [...]
7413A5013908k6761J5366R05114M89551q2740l97315R8794o2849k94786N9608
7403A5717890o09229r7789N23445M53856l8296Q8151J43830K5565P8908r9634
7393A6186697L61906k5519K33213k45584J99855Q56431m7797L17035L96353p11796
7383A7520794O6582K06823n16058N75988o0980J85639n72853Q0772R04330K84718
7373A8675755O3425k52497J63412J67026m4594j9004J79133O908l74152p6276
7363A8489136Q2306R6106l74765L88901P80132k12262m6541L47755N09512k6307
7353B0033973J30569P0560r8169n29885j60853N78849K76685k6360M74474j1598
7343B0738245m59579M14522j7447o5369q88999L89821J42148M02731M72323j06333
$$ y = [15013908, 14987147, 15002513, 15907627, 16397178, 16314438, 15917123, 16015917, 15953068, 15658282, 15717890, 15108661, 15010872, 15534317, 15988173, 15949877, 16038028, 16181858, 16207423, 16286331, 16186697, 16548603, 16523084, 16756297, 16510713, 16710568, 17566999, 17519202, 17836237, 18232590, 17520794, 17587376, 17794199, 17278141, 17854129, 17793149, 17978788, 17405935, 17486707, 18391037, 18675755, 18739180, 18486683, 18650095, 18817121, 18772527, 18753523, 18932656, 18939564, 18565412, 18489136, 18571442, 18667548, 18292783, 18681684, 19461816, 19249554, 19203013, 19550768, 20060280, 20033973, 20164542, 20235102, 20136933, 19607048, 19446195, 20025044, 20301729, 20275369, 20749843, 20738245, 20278666, 20693188, 20675741, 20610372, 19721373, 20111194, 20253342, 20656073, 21128396, 21022063]
7333B1022063j93379J30647m16547L86061K51372M32806j1179J69088j0944j72567
7323B1587421M26680n1539k25366q9581j84761N798P83108P8765J25295J6200
7313B2472020M77828P4677L65382l30692l58266Q93545K81938k80932M1903M33050
7303B4070453l06473P70260j54400j02585k01212N34042l60392j94142L03944
7294B4359495L06193Q3132M16675J49515m41988k70407J68317J52088L93957J60488
7284B5477465k72800L69648L69640k91347N42417O4166n397L5773L79073L32801
7274B7001439P4838J17694k65837K45004m91762O45072M57872m16775k61926J53041
7264B7258660K07057k43940o77564L14374L73082N310k66334q3653k70217j94594
$$ y = [21022063, 20828684, 20959331, 20542784, 20928845, 21180217, 21613023, 21601844, 21770932, 21759988, 21587421, 22014101, 21962562, 21737196, 21647615, 21462854, 21468652, 22251760, 22330525, 22455820, 22472020, 22949848, 23024525, 23389907, 23059215, 22700949, 23594494, 23876432, 23595500, 23637403, 24070453, 23763980, 24534240, 24379840, 24277255, 24076043, 24610085, 24249693, 24055551, 24359495, 24665688, 24748820, 25165495, 25315010, 24873022, 24602615, 24770932, 24923020, 25316977, 25477465, 25204665, 25574313, 25943953, 25652606, 26195023, 26259189, 26253792, 26289565, 26668638, 27001439, 27076277, 27193971, 26928134, 27173138, 26681376, 27326448, 27784320, 27367545, 27105619, 27258660, 27465717, 27221777, 26544213, 26858587, 27231669, 27236979, 26970645, 26886992, 26616775, 26422181]
7254B6422181p26367Q6424J92214L22289j25239L68688k38459k51762J35991n4605
7244B6131355o9706J11091l56083L21313j63280J84684K94467o6234m62567k29133
7234B5695907j63325k91260n34092O20960O73821l24633K26318k65295l2998j67135
7224B5438268l15703K20443N6675r7055L62697o4235j00038l70969P5986n17949
7214B4688120P8860M67358k41353k59535j5473N41127m14723n12501K32176M08680
7204B4972736n11175J26722j41491K66823m73396o7896M73634M44479j7627k2426
7194B5050383N9459q05709j15965m3204J90240J48194m45697J69676J71198j76279
7184B4202296J26100m62053n90545K8889J02119L30678J15365k99379K91714k3540
$$ y = [26422181, 25695814, 25782238, 25974452, 26296741, 26171502, 26540190, 26301731, 26049969, 26185960, 26131355, 26061649, 26172740, 25816657, 26137970, 25974690, 26159374, 26453841, 26387607, 25925040, 25695907, 25532582, 25241322, 24707230, 25328190, 26002011, 25677378, 25903696, 25638401, 25605403, 25438268, 25122565, 25343008, 25399683, 25302628, 25665325, 25601090, 25501052, 25130083, 25206069, 24688120, 24766980, 25234338, 24992985, 24733450, 24717977, 25259104, 24844381, 24331880, 24564056, 24972736, 24461561, 24588283, 24446792, 24713615, 24240219, 24172323, 24645957, 25090436, 25072809, 25050383, 25109842, 24304133, 24188168, 24144964, 24335204, 24483398, 24037701, 24207377, 24378575, 24202296, 24328396, 23866343, 23275798, 23304687, 23406806, 23737484, 23852849, 23553470, 23845184, 23821644]
7174B3821644P94253j81047m46204k35571l49473P0779M75365l52447m93446l11064
7164B2792789Q3434N33664n55340j43657j43170o74840l63339j98925M8694J95896
7154B1575206M63478m28624m48043j01505J05750l06122L42944j06590r54198
7145B0142296J21601J98143J06634p4296m78299l80109r3151k20443o6475J40003
7135A9395904J41197p012N50381K95510j94684K80224m24092j98408N77232j09833
7125B0306419L40216J42455l29276M2426Q9123K99105l99918k71889J23128j79378
7115B0162411l77256l74133M31778N0281m4937K56478l54338o99529K12877R894
7105A9273526j32184j84405j4196M21794o58550n04295l51533J08265l22565K47900
$$ y = [23821644, 24615897, 24434850, 23988646, 23753075, 23403602, 23474381, 23949746, 23597299, 23103853, 22792789, 22876223, 23409887, 22854547, 22710890, 22567720, 21892880, 21529541, 21330616, 21379310, 21575206, 22038684, 21610060, 21162017, 21060512, 21166262, 20860140, 21203084, 21096494, 20142296, 20263897, 20462040, 20568674, 20494378, 20016079, 19635970, 19542819, 19322376, 19255901, 19395904, 19537101, 19530089, 20080470, 20375980, 20181296, 20461520, 20037428, 19839020, 20416252, 20306419, 20646635, 20789090, 20459814, 20502240, 20591363, 20890468, 20490550, 20218661, 20341789, 20162411, 19785155, 19411022, 19842800, 19893081, 19848144, 20104622, 19750284, 19050755, 19263632, 19273526, 19141342, 18956937, 18942741, 19364535, 18705985, 18201690, 17850157, 17958422, 17635857, 17883757]
7095A7883757K95919n41420l80673K85177j75720Q1938k80858q3033K23685K9406
7085A7338178K06652j27621m71122j25853r1432p47018M11115R05805o17356J30872
7075A6812220O0975K14354K64981l16524J25820J54137k08654n94867L43869L25456
7065A7181767K27627J62991k00449k40545j71274P46094l381o61300j39098J08945
7055A7011377K05061L08623m72604k6879L27157J10579L7181l53317K74211j79867
7045A7241522P29860l5632q15183J34265k95787n6029N30292J94421L8397J14418
7035A7780544J99082J32393K55337m40946k17661j73086N67784M7807M8262q155
7025A8191361J13069m76949j34549J99978j69621M89647M9670n10436o27429L27327
$$ y = [17883757, 18179676, 17638256, 17257583, 17542760, 17367040, 17448978, 17168120, 17085087, 17308772, 17338178, 17544830, 17417209, 16946087, 16820234, 16728802, 15981784, 16392899, 17298704, 16681348, 16812220, 16873195, 17087549, 17352530, 17036006, 17161826, 17315963, 17107309, 16512442, 16856311, 17181767, 17409394, 17572385, 17371936, 17131391, 16960117, 17706211, 17702830, 17041530, 16902432, 17011377, 17216438, 17525061, 17052457, 17025578, 17352735, 17463314, 17500495, 17147178, 17421389, 17241522, 17971382, 17935750, 17120567, 17254832, 16959045, 16903016, 17433308, 17627729, 17666126, 17780544, 17979626, 18112019, 18367356, 17926410, 17708749, 17535663, 18103447, 18151254, 18199516, 18191361, 18304430, 17827481, 17692932, 17892910, 17723289, 18212936, 18262606, 17752170, 17124741, 17452068]
7015A7452068K69792k07263k75974r15783o36595K45464k953j53897m25718n6073
7005A5293068j22012k15778o13186J87915J50035j236017K36590K12726k49217
6996A3644124m86993m58105k08114l97430J19453j77975n46793n66979J48559
6987A1069747M14233l02286l03208k42038k17686M13791K9754j25325j5336J65260
6977A0886906l21573q12251l12342K78568k91333l2816K11460j46270k2606k15549
6967I222194l73313j7796k9648P29558J92542m50683o140l47525k83236J11353
6957H747306j55100N55998L43120n44250l15350m18757P4967j34573J81281J25418
6947H460060j4769k46440j60623N61299R7099n47261L41340j032850K39063L33138
$$ y = [17452068, 17721860, 17514597, 17238623, 16322840, 15686245, 15931709, 15928756, 15774859, 15349141, 15293068, 15171056, 14955278, 14342092, 14530007, 14680042, 13444025, 13680615, 13893341, 13644124, 13157131, 12699026, 12490912, 12093482, 12212935, 12034960, 11488167, 10921188, 11069747, 11483980, 11181694, 10878486, 10636448, 10418762, 10832553, 10862307, 10736982, 10721646, 10886906, 10565333, 9753082, 9440740, 9719308, 9427975, 9395159, 9606619, 9460349, 9437743, 9222194, 8848881, 8831085, 8801437, 9530995, 9723537, 9272854, 9266714, 8919189, 8635953, 8747306, 8592206, 9148204, 9491324, 8947074, 8631724, 8212967, 8287934, 8153361, 8334642, 8460060, 8445291, 8198851, 8038228, 8599527, 8696626, 8149365, 8490705, 7457855, 7696918, 8030056]
6937H030056l7813l8869k40341k46633K52071P3625L96034p0396k84391l94724
6927G438619m26865k32919l6409J50277l05806K99612N6239k38411j45633L8287
6917F596991l7996k44627l77788K37707N07262k6294l36529k04125m12783K34034
6907E935852K01351L85520O19356j4738l93847j82917O8595j12369o8952j99290
6897F238561K43338M31330l23944n39387j93920L02616M38459K26816n6871p4906
6887F692092J34502J20099q5748k02952k47740j52346j47449M61719O08277k44960
6877F935494j82933k44586j18460K0872J35230j01287j68145L23318R2111K72350
6867F963964r63874O79281l77676j71639J8708j361m08190O67522J6824l31371
$$ y = [8030056, 7992243, 7953374, 7713033, 7466400, 7718471, 7792096, 8188130, 8117734, 7833343, 7438619, 7011754, 6778835, 6742426, 6892703, 6586897, 6886509, 6942748, 6704337, 6558704, 6596991, 6558995, 6314368, 5936580, 6174287, 6681549, 6655255, 6318726, 6114601, 5701818, 5935852, 6137203, 6522723, 7142079, 7127341, 6733494, 6550577, 6619172, 6506803, 6437851, 6238561, 6481899, 6913229, 6589285, 6049898, 5855978, 6158594, 6597053, 6823869, 6766998, 6692092, 6826594, 6946693, 6860945, 6657993, 6410253, 6257907, 6110458, 6572177, 7180454, 6935494, 6752561, 6507975, 6389515, 6410387, 6545617, 6444330, 6276185, 6599503, 6691614, 6963964, 6000090, 6679371, 6301695, 6130056, 6148764, 6147403, 5739213, 6406735, 6423559, 6092188]
6857F092188j23861J33767p57430j39274O33946J25460J42299K58968k11702p75409
6847E378952R22482L17360o25833O3632N8467K56728J37903m05078L4315n25630
6837E613298J99507k33571p580K42592m18002M72128m3649j40137k1622J56026
6827E818990n7135k35806J32336O1364L83393k8345l11723j99863M69081n3327
6817E978965j46263k82830J64950M24516J79667o49223K16434J14650J65405m80660
6807E685611J27322N90496M514K7790o17774p01858O57367L10854J36235l55446
6797E865111o23074k4604q8400L14609k5916j07291J28694p2808M8553j07587
6787E307287k09245J96942K27841l40888J63227J16001p22854m473J79498J93427
$$ y = [6092188, 5968327, 6102094, 5344664, 5205390, 5839336, 5964796, 6107095, 6366063, 6154361, 5378952, 6301434, 6618794, 5992961, 6056593, 6115060, 6371788, 6509691, 6104613, 6138928, 5613298, 5812805, 5579234, 5571654, 5814246, 5396244, 5868372, 5824723, 5684586, 5662964, 5818990, 5761855, 5526049, 5658385, 5719749, 6103142, 6074797, 5763074, 5563211, 6032292, 5978965, 5832702, 5549872, 5714822, 6139338, 6319005, 5669782, 5886216, 6000866, 6166271, 5685611, 5812933, 6403429, 6407943, 6435733, 5817959, 5116101, 5773468, 6084322, 6220557, 5865111, 5242037, 5217433, 5129033, 5443642, 5417726, 5310435, 5439129, 5366321, 5414874, 5307287, 5098042, 5294984, 5522825, 5181937, 5345164, 5461165, 4738311, 4733838, 4913336, 5106763]
6777E106763R1084M2453J95149K47099p7293m49184K45731K18157j61012k66811
6767E192136l68868K38183L40725r2600o52219K34882K84868L29593n48249k4152
6757D934299L76314L27105K43200m12928J29832k43553l40030m4155N14880j53382
6747E331582l5497J66695J32922J78933j82699R5962j76946l66189K638K00382
6737E347783K92243l2747j34841j0010L6615K04271K47894q2865L66042j01911
6727F132474l27263J86406J91366j43329K71929O2864L09481k11535L15355o9094
6717F718654n62425J3535K86598L72747j40395p25976N27625K36053J19332P36967
6707G582715j76680J55078j52991q4533N125l20368M2116M9930o2041P22012L79879
$$ y = [5106763, 5197847, 5240300, 5435449, 5682548, 5605255, 5156071, 5401802, 5619959, 5458947, 5192136, 4823268, 5061451, 5402176, 5309576, 4657357, 4892239, 5177107, 5506700, 4958451, 4934299, 5310613, 5637718, 5880918, 5467990, 5597822, 5354269, 5014239, 4970084, 5484964, 5331582, 5296085, 5462780, 5595702, 5774635, 5591936, 5687898, 5510952, 5144763, 5147401, 5347783, 5640026, 5607279, 5472438, 5462428, 5499043, 5703314, 5951208, 5868343, 6234385, 6132474, 5805211, 5991617, 6182983, 6039654, 6311583, 6374447, 6683928, 6472393, 6787748, 6718654, 6156229, 6169764, 6456362, 6829109, 6688714, 5962738, 6490363, 6726416, 6845748, 7582715, 7406035, 7561113, 7408122, 7323589, 7328714, 7008346, 7050462, 7100392, 7038351, 7760363, 8140242]
6696H140242n7029J67426j95956J42010P3060J50418j36013k28859J65793l59428
6686G861664J31883j98189J141644m46468o66725O0265M44800k93826j34395R58812
6676H859465r845o59991k26041N78248M31829O9291K1330m6986L43937L32914
6666I694151j425514L99895O21226J44015M7213m6981J6693m16071q5256o538
6656H942833O31922l2326k30290L17702N80580l11704j0195q8727l25623M00662
6646I874834J72690P18093l18567o77766M90863k160j30453n3021m5930L83283
6636A0411866K10245k96860N65212N1208m86121l7101L40451j68295m85720P2218
6626A0177103N2717J50922J29509j48293K70586k4031O21897J5462l51622L75194
$$ y = [8140242, 8083213, 8250639, 8054683, 8196693, 8269753, 8420171, 8284158, 8055299, 8221092, 7861664, 7993547, 7795358, 8937002, 8490534, 7823809, 7884074, 8328874, 8035048, 7900653, 8859465, 8849620, 8189629, 7963588, 8541836, 8973665, 9042956, 9064286, 9017300, 9361237, 9694151, 8268637, 8668532, 9289758, 9433773, 9480986, 9434005, 9450698, 9034627, 8949371, 8942833, 9574755, 9542429, 9312139, 9629841, 10210421, 9898717, 9888522, 9799795, 9474172, 9874834, 10047524, 10765617, 10447050, 9769284, 10260147, 10257987, 10127534, 10074513, 10028583, 10411866, 10622111, 10325251, 10890463, 10941671, 10455550, 10418449, 10758900, 10590605, 10104885, 10177103, 10229820, 10380742, 10510251, 10361958, 10632544, 10608513, 11230410, 11245872, 10894250, 11269444]
6616A1269444L79791K02868K80437m85577k08462J92595M1411O56478M29845j48678
6606A2610152M35397l49092n68594k23145N31048O30525J18124L76842l42581
6597A3218676m02783r4297N55616M16643j02109J19883j96264j22050J31022L88194
6587A3912531p7191J16581J00848k95925p0023k71703K94025O07004K75375l68545
6577A4222977l44861k5944M47327m9456L53735L63936j82503j010715J29351N41199
6567A4445046l5172K98860j50516o30218L41679R55203J29595j71505L06100L44096
6557A5833168J98027p27277J79881J39803j56630M30200L97902o62560K10180
6548A5842694Q02108Q6301Q8195k27552K85209M55322J16224O341j93983M95191
$$ y = [11269444, 11649235, 11852103, 12132540, 11646963, 11438501, 11631096, 11672507, 12328985, 12758830, 12610152, 13045549, 12696457, 12127863, 11904718, 12435766, 13066291, 13184415, 13561257, 13218676, 12815893, 12721596, 13277212, 13693855, 13591746, 13711629, 13515365, 13393315, 13524337, 13912531, 13835340, 13951921, 14052769, 13756844, 13686821, 13415118, 13709143, 14316147, 14591522, 14222977, 13878116, 13852172, 14299499, 14250043, 14603778, 14967714, 14785211, 13774496, 13903847, 14445046, 14409874, 14708734, 14558218, 13928000, 14269679, 15224882, 15354477, 15182972, 15489072, 15833168, 16031195, 15303918, 15483799, 15623602, 15466972, 15897172, 16295074, 15632514, 15842694, 16644802, 16731103, 16819298, 16591746, 16876955, 17332277, 17448501, 17454842, 17260859, 17756050]
6538A7756050M2828k40515N17183L68833K5414Q77055l4165M08769K04886P1786
6528A9998124k82063l14777J059132m0229L55127n57245P34943M69467l62135
6519B1060344J11526J79225R85565J87505J28955J8542r7355k29741j37123p1727
6509B2135716L08576L01182L48446j7499Q1259J54597j4568j77978J76209L21372
6499B3617312k77963l37217r5258p92951P4801J99218K01564K29565l57405J27200
6489B2588866m308J30675K11756L6679l64792k63323J84716L55532j495M49201
6479B3323507j64253Q8993k55577m37457J47840O630n0557k24825o02360M55764
6469B2287705m32739l35585M56113J80292N7392m7121k52408n96815J89025M4978
$$ y = [17756050, 17798878, 17558363, 18075546, 18444379, 18469793, 19346848, 19312683, 19721452, 19926338, 19998124, 19716061, 19401284, 20460416, 20420187, 20775314, 20218069, 20953012, 21422479, 21060344, 21171870, 21351095, 22336660, 22524165, 22653120, 22671662, 22574307, 22344566, 22207443, 22135716, 22444292, 22745474, 23093920, 23076421, 23157680, 23312277, 23297709, 23119731, 23295940, 23617312, 23339349, 23002132, 22906874, 22113923, 22188724, 22387942, 22589506, 22819071, 22461666, 22588866, 22584558, 22715233, 22926989, 22963668, 22598876, 22335553, 22520269, 22875801, 22874306, 23323507, 23159254, 23248247, 22992670, 22555213, 22703053, 22709683, 22659126, 22434301, 21831941, 22287705, 21854966, 21519381, 21975494, 22155786, 22213178, 22166057, 21913649, 21316834, 21505859, 21550837]
6459B1550837o77517J41739K48387j82880K01760L01258o58158k74199N16695
6450B1167922j72281o20575m3231k2711K74865K28112M5258p8850k0828K20194
6440B0977875r3473J93488q5983K69131k44936m56988J025914j24441k18734K60562
6430B1502415k05874p3141K5074l44737O9967K98751n09608o04582L74292j66645
6420B0365912M59533N94452P1990k66249k97185L86895k57735m01876L5708k44528
6410B0446917J68161M98652O8245L54127J18382o7589N23214N72704m34554J59160
6400B2407419l30023j85894M45740L25848J82101m39722j74594J9804K65671J47291
6390B2663641j15975j75452Q3238O28028j100J96386K96233j43651K84905J61751
$$ y = [21550837, 20873320, 21015059, 21263446, 21080566, 21282326, 21583584, 20925426, 20651227, 21167922, 20995641, 20375066, 20331835, 20309124, 20583989, 20812101, 20857359, 20778509, 20757681, 20977875, 20884402, 21077890, 20991907, 21261038, 21016102, 20559114, 21585028, 21460587, 21241853, 21502415, 21296541, 21223400, 21248474, 20903737, 20973704, 21272455, 20762847, 20158265, 20532557, 20365912, 20825445, 21419897, 21491887, 21225638, 20928453, 21315348, 21057613, 20655737, 20691445, 20446917, 20615078, 21113730, 21181975, 21536102, 21654484, 21586895, 22110109, 22682813, 22248259, 22407419, 22077396, 21891502, 22337242, 22663090, 22845191, 22405469, 22230875, 22250679, 22516350, 22663641, 22547666, 22372214, 22455452, 23083480, 23082380, 23278766, 23574999, 23431348, 23716253, 23878004]
6380B3878004j01103k97282k90292j80081L56219M16245k28400L04899K12076
6371B4070285M0496M53362M14092l18819K40475O3349L2783K57842m58046k73909
6361B4521910p2967K47606K74236K15643o9905J21271K98857l33478O66073K55400
6351B6124646n00998l37456j62993N3915j93938j07369k1534j77979Q3216N40568
6341B5300078J88500n12181M52664K21253k53907J77184M2659O29819J15214L29014
6331B6690297M00208L73532J67056j72474j5101m1181l7513J7273O16559M60767
6321B8459423J73574l03141L28456L93998K06912K99098l7205m23864K54799L81087
6311B9733137K62119L17868M59910P61453J84431m44988K51910J4406L66040O68362
$$ y = [23878004, 23776901, 23479619, 23189327, 23009246, 23365465, 23781710, 23553310, 23858209, 24070285, 24110781, 24564143, 24978235, 24659416, 24899891, 24963240, 24996023, 25253865, 24795819, 24521910, 24448943, 24696549, 24970785, 25186428, 25116523, 25237794, 25536651, 25203173, 25869246, 26124646, 25623648, 25286192, 25123199, 25177114, 24983176, 24875807, 24854273, 24676294, 24759510, 25300078, 25488578, 24976397, 25429061, 25650314, 25396407, 25573591, 25616250, 26246069, 26361283, 26690297, 27090505, 27464037, 27631093, 27458619, 27443518, 27402337, 27364824, 27382097, 27998656, 28459423, 28632997, 28329856, 28658312, 29052310, 29259222, 29558320, 29521115, 29097251, 29352050, 29733137, 29995256, 30313124, 30773034, 31534487, 31718918, 31273930, 31525840, 31540246, 31906286, 32574648]
6301C2574648k15687M51545L13868K12110L86640L49611j67836p0599l58795j99892
6291C3275613J58289J9566j55008L99380J9952J8541L95162O38449J73743J94415
6281C5138102N47403r6802N02314K92111M5209K49889J37065p0759O86471l6740
6271C7394263J75506K94882J148691N24868k72338K37575M17422l63178L83218
6262C9940909M20736k6035O54084M84575L80794J07452K59102N62382O29048j95883
6252D3217164L27640L41875L18564M13420O91592m23067j38616O70362O33308
6243D6052242K83509N99517L88042m46593N89424N86036O41634j60404l23893
6234D8209514Q19385P75496L30652M42811N08118J044111N24846k64867O27158
$$ y = [32574648, 32358961, 32810506, 33124374, 33336484, 33723124, 34072735, 33904899, 33834300, 33475505, 33275613, 33433902, 33453468, 33298460, 33697840, 33717792, 33736333, 34131495, 34769944, 34943687, 35138102, 35685505, 35588703, 36091017, 36383128, 36428337, 36678226, 36815291, 36744532, 37431003, 37394263, 37569769, 37864651, 39013342, 39538210, 39265872, 39503447, 39920869, 39557691, 39940909, 40361645, 40335610, 40989694, 41474269, 41855063, 41962515, 42221617, 42783999, 43413047, 43217164, 43544804, 43886679, 44205243, 44618663, 45310255, 44887188, 44748572, 45418934, 46052242, 46335751, 46935268, 47323310, 46876717, 47466141, 48052177, 48693811, 48533407, 48209514, 49028899, 49804395, 50135047, 50577858, 51085976, 52130087, 52654933, 52390066, 53017224]
6225E3017224Q48044J53015L70574J037136O37403P7565k71685O42254j82599
6216E6328931M42803L64490L25721R596J65164L87140M25813j54813L01616M31994
6206E9028455M46502j50055L70081j05538J02450P5647m0011L66567K15202M40592
6196F0749892J89029o1690L807M2097J35394M37606n62462q6177n4418o31639
6186F0161439L95868J001964j14578j18852j47328j57464o32029k70773L96172
6177F0514419P49527n08986k40333k49257L23294r618J37208K07210j57384K96880
6167F1062960L83619J74512j64980L01510L86955m84185j16879O72978R6701M75821
6157F2789012K65189M59462N09559n18058L6059M03001P30914L24611M51630J11310
$$ y = [53017224, 53865268, 54018283, 54388857, 55425993, 56063396, 56140961, 55869276, 56511530, 56328931, 56771734, 57136224, 57461945, 57471541, 57636705, 58023845, 58449658, 58294845, 58596461, 59028455, 59474957, 59324902, 59694983, 59589445, 59691895, 59767542, 59727531, 60094098, 60309300, 60749892, 60938921, 60877231, 60881038, 60923135, 61058529, 61496135, 60933673, 60847496, 60793078, 60161439, 60557307, 61559271, 61444693, 61325841, 61178513, 61021049, 60389020, 60118247, 60514419, 61263946, 60754960, 60514627, 60265370, 60588664, 60579046, 60716254, 60923464, 60766080, 61062960, 61446579, 61621091, 61456111, 61757621, 62144576, 61660391, 61543512, 62216490, 62313191, 62789012, 63054201, 63513663, 64023222, 63505164, 63541223, 63944224, 64675138, 64999749, 65451379, 65562689]
6147F5562689k48954k73309Q43236K79653J32230M00429J74771K68511Q1879N07239
6137F7728374J13110M92399P90020N0203L70942N24566O77552K85761K40652L35124
6127G1608703P45778P39527l88529K69076L85183L58418O02423O63652L42978
6118G5327209N34134q14038J90148K25274Q5245j01611J19110J043500M70676
6109G7079647L42569K29902L93580K1553k3023L0800J7528L9231K70923M97666
6099G8900376J58481k94061l97971k7213K60142J36285R6799j01026K40451j48720
6089G8823543N97927l43052l75822J62449K5056k18329l20535M15043j53489m67897
6079G8144894n4590n70436l82559K12720K25354o38036o55496J77279k08077l55631
$$ y = [65562689, 65313735, 65040426, 65883662, 66163315, 66295545, 66695974, 66870745, 67139256, 67221135, 67728374, 67841484, 68333883, 69123903, 69174106, 69545048, 70069614, 70747166, 71032927, 71273579, 71608703, 72354481, 73094008, 72705479, 72974555, 73359738, 73718156, 74320579, 74984231, 75327209, 75861343, 75047305, 75237453, 75462727, 75547972, 75446361, 75565471, 76608971, 77079647, 77422216, 77652118, 78045698, 78067251, 78044228, 78075028, 78092556, 78131787, 78402710, 78900376, 79058857, 78764796, 78366825, 78339612, 78599754, 78736039, 78832838, 78731812, 78972263, 78823543, 79421470, 79078418, 78702596, 78865045, 78890101, 78671772, 78351237, 78766280, 78612791, 78144894, 78090304, 77519868, 77137309, 77350029, 77575383, 76937347, 76281851, 76459130, 76251053, 75895422]
6069G5895422j16109k80331k2393r8105p77729m61939m00646J64010j65909o68343
6059G3067928j38592j82709K35366M18786q45480o65021N4751j43242q20642n00131
6049G0481014m2010K38430j65709J29868r45592o76130o75731k78989m68918p18525
6039F6877708R2797n9851o32316j11737m52992m77154n62184n81554q6992r0944
6029F3914781n9577M3449m9949m06492o19958q2351K66942M3330m05384L3883
6019F2678674n14097J04977n48173o47288n14224l65389k07623l86716Q7043l21071
6009E9366113m71162r53676J45738L07486O6796q82578k02078o32145M47259M0971
5999E7232724N3640L22980P4836n94168j64926k71470o95518m51597o526j8778
$$ y = [75895422, 75779313, 75498982, 75476589, 75378484, 74600755, 74138816, 73738170, 73902180, 73736271, 73067928, 72929336, 72746627, 72981993, 73400779, 72555299, 71890278, 71945029, 71801787, 70981145, 70481014, 70439004, 70677434, 70511725, 70641593, 69696001, 69019871, 68344140, 68065151, 67596233, 66877708, 66970505, 66910654, 66278338, 66166601, 65713609, 65236455, 64674271, 64092717, 64005725, 63914781, 63855204, 63898653, 63848704, 63442212, 62822254, 62739903, 63006845, 63050175, 62644791, 62678674, 62164577, 62269554, 61721381, 61074093, 60559869, 60194480, 59986857, 59600141, 59687184, 59366113, 58894951, 57941275, 58087013, 58394499, 58461295, 57578717, 57376639, 56744494, 57191753, 57232724, 57286364, 57609344, 57684180, 57090012, 56925086, 56653616, 55958098, 55506501, 55499975, 55481197]
5989E5481197J820l23012o72261M9845K51462k82003L48394o26441m71434m75544
5979E3282023j01172L02628j00958k77814k18668j18529l45170l29604Q0198J53977
5969E2326911l45671j96692J60713L53946k44818k46590J89835L140q38798o14571
5959E0547405j98933P1177K95836L80548j48903k55279m68985m22476k81277m00796
5949D9118317m76483l64397J21672o80704p9053O04936L46026J10208o96225K61962
5939D8266259J5324J81709M1714q6699l84928n37019l8490O38605j88541m78790
5929D7429144l15414J23352N8223J70784J16094l42244j42736J26920j81569J60933
5919D7203487J00196p5591j97894k78959K3792o4754k65287K05459o9830J00449
$$ y = [55481197, 55483017, 55160005, 54487744, 54537589, 54789051, 54507048, 54855442, 54229001, 53757567, 53282023, 53180851, 53483479, 53382521, 53104707, 52886039, 52767510, 52422340, 52092736, 52172934, 52326911, 51981240, 51784548, 51945261, 52299207, 52054389, 51807799, 51997634, 52000774, 51161976, 50547405, 50348472, 50419649, 50715485, 51096033, 50947130, 50691851, 50222866, 49800390, 49519113, 49118317, 48641834, 48277437, 48399109, 47718405, 47639352, 48244288, 48590314, 48700522, 48004297, 48266259, 48281583, 48463292, 48505006, 48418307, 48033379, 47496360, 47457870, 48096475, 47907934, 47429144, 47113730, 47237082, 47295305, 47466089, 47582183, 47239939, 47097203, 47224123, 47042554, 47203487, 47303683, 47228092, 47030198, 46751239, 46775031, 46710277, 46444990, 46650449, 46580619, 46681068]
5909D6681068L51997J53370K85332l20015l55340k7072M12686L59077K3108k59365
5899D7304846j4643l05831L1995M44358L89196L42182o30744M48992K92366J42162
5889D8444879k85095j19159K66545N55160j90986k25469L96515L78678K12588
5880D9433656P8193m7382L70578J38352m38887R03079k70966L27423P94768L8362
5870E1327176J24902M00854K42411N21159M61527p5665J4602N30646J00919J30187
5860E3778718N77166M62477k53255L44842K70978P71098L79014n1178j76633M81769
5850E6584996N59388L27764J34389N56345j65087o6021L33491m0351P91281N7392
5840E9073587K38219P79786M51385P23318m9330k95227P93338L87837o22P5860
$$ y = [46681068, 47033065, 47186435, 47471767, 47151752, 46796412, 46769340, 47182026, 47541103, 47564211, 47304846, 47290203, 46984372, 47016367, 47460725, 47849921, 48192103, 47561359, 48010351, 48302717, 48444879, 48159784, 48040625, 48307170, 48862330, 48671344, 48445875, 48842390, 49221068, 49433656, 49511849, 49464467, 49835045, 49973397, 49534510, 50437589, 50166623, 50494046, 51288814, 51327176, 51452078, 51852932, 52095343, 52616502, 53078029, 53002364, 53016966, 53547612, 53648531, 53778718, 54355884, 54818361, 54565106, 54909948, 55180926, 55952024, 56331038, 56279860, 56103227, 56584996, 57144384, 57472148, 57606537, 58162882, 57997795, 57931774, 58265265, 58224914, 59016195, 59073587, 59311806, 60091592, 60542977, 61266295, 61216965, 60921738, 61715076, 62102913, 62102291, 62178151]
5830F2178151K29999K88610r0303R24231o9529P6414L14602k7618N88110M49125
5820F4861792K16819R9750K72318K07718L02972K11757N7989N55046L24321k19744
5810F6890738J49996l9781M32043O65191J21474K63122O30601N31262M11304O22089
5800G0678039K53730j66467P34557K72203L95950O85568O9864J58630P50832N34928
5790G4367834L27505J28345P04523N12910j07633K95778J138170M54393N78079
5781G8399904N26514J049215L73287R72463R59168N46041N20886O61550P56748
5772H4765776M18782Q35988J051109R00254R61068O04406Q46042Q24863L72102
5763I1580390P40326R49774J005063Q81751P10091K93024J394252J372957J099667
$$ y = [62178151, 62408150, 62696760, 62606457, 63530688, 63461159, 63537573, 63852175, 63824557, 64412667, 64861792, 65078611, 65178361, 65450679, 65658397, 65961369, 66173126, 66231115, 66786161, 67110482, 66890738, 67040734, 67000953, 67432996, 68098187, 68219661, 68482783, 69113384, 69644646, 70055950, 70678039, 70931769, 70765302, 71499859, 71772062, 72168012, 72853580, 72923444, 73082074, 73832906, 74367834, 74695339, 74823684, 75528207, 76041117, 75933484, 76229262, 77367432, 77821825, 78399904, 78926418, 79975633, 80348920, 81321383, 82280551, 82826592, 83347478, 84009028, 84765776, 85184558, 86020546, 87071655, 87971909, 88932977, 89537383, 90383425, 91208288, 91580390, 92320716, 93270490, 94275553, 95157304, 95867395, 96160419, 97554671, 98927628, 100027295]
5754A00027295P85914J018452O25072R20406J480256J89806R21910J404115J405953
5745A08779179J191068J419042Q09691R82222J204158P53836J863893J635725
5737A18638814J198832P50104J941457K115226K457026K236601J487044R33054
5729A31758158J292904Q25519J606576K130166J926583K754909L041168L045810
5721A48381793K361872L206958L695947L862677M589735M860954O064097P518469
5713A84542502P691589L576328p56310j723521k275831k210168k084899j898513
5705A84861177j389120Q19133R64623J563143K557584L353279K979604J410830
5697A97120253P12845N76262J244164K492301K921586L797615M978657M587241
$$ y = [100027295, 100813209, 101831661, 102456733, 103377139, 104857395, 105047201, 105969111, 107373226, 108779179, 109970247, 111389289, 112198980, 113181202, 114385360, 115139196, 117003089, 118638814, 119837646, 120587750, 122529207, 124644433, 127101459, 129338060, 130825104, 131758158, 133051062, 133876581, 135483157, 137613323, 139539906, 142294815, 145335983, 148381793, 150743665, 153950623, 157646570, 161509247, 166098982, 170959936, 177024033, 184542502, 192234091, 195810419, 195054109, 193330588, 191054757, 188844589, 186759690, 184861177, 183472057, 184291190, 185255813, 186818956, 189376540, 192729819, 195709423, 197120253, 197833098, 198409360, 199653524, 202145825, 205067411, 208865026, 213843683, 218430924]
5689B18430924N099992O475238P408197Q776173J1377768J3902018J6937030J9639212
5681C08046552J9579136N936592q730624j1059888j2589545j3201064j1824032
5674B76157127r864211p792200n925105l339498k531292n81723L18514N0480j416635
5665B45075457j117818m31566o20804K75015O18674P24404J933889K834721L624443
5656B52916415M141728N428165O697946R485760J2406733J5981535J8661704J5807140
5648C41527126M30147j2454107j3467199j5638899j6753377j4806480j2485006
5641B56352205j0855021q350554p087539n288542l616330l197047k812239k382344
5633B12762589k628048j984782j752402j660729j984924r76156o30956p64016
$$ y = [218430924, 223530916, 230006154, 237414351, 246190524, 257568292, 271470310, 288407340, 308046552, 327625688, 333562280, 324831656, 313771768, 301182223, 287981159, 276157127, 266292916, 258500716, 252575611, 249236113, 246704821, 246123098, 246441612, 246492092, 245075457, 243957639, 243526073, 242905269, 243180284, 243798958, 244523362, 246457251, 249291972, 252916415, 257058143, 262486308, 269184254, 278670014, 291076747, 307058282, 325719986, 341527126, 341957273, 329503166, 316035967, 300397068, 283643691, 268837211, 256352205, 245497184, 237146630, 230059091, 224770549, 221154219, 217957172, 215144933, 212762589, 210134541, 208149759, 206397357, 204736628, 202751704, 201775548, 201144592, 200380576]
5625B00380576m47555O67861J041621J270320K327921L464544M337618M589547
5617B17632453L035372k160875n492823n652893o429820o394303n665846m143188
5609A84728077m644734l841497l107198k257469j689908k117034j318496j072093
5601A64679648j415422j093351j076376j373285j198264n87788j072359j127031
5593A55735772j392823l10270m93307k82008n85716q70421o63278k81129n70272
5584A50286548l39620J862n34341p25089p05589m47401m51451k70637k32722N91416
5574A47172976m5983o78670n47229R0955j0043k77232q54946j84559p75511k80263
5564A43609495J85418J08395j62460k59842o04776j93441k67790J21716l66675
$$ y = [200380576, 199933021, 200600882, 201642503, 202912823, 205240744, 208705288, 213042906, 217632453, 220667825, 218506950, 213014127, 207361234, 200931414, 194537111, 188871265, 184728077, 180083343, 176241846, 173134648, 170877179, 169187271, 167070237, 165751741, 164679648, 163264226, 162170875, 161094499, 159721214, 158522950, 157935162, 156862803, 155735772, 154342949, 154032679, 153539372, 153257364, 152671648, 151801227, 151137949, 150856820, 150286548, 149946928, 149948790, 149414449, 148689360, 147983771, 147536370, 147084919, 146814282, 146581560, 147172976, 147126993, 146448323, 145901094, 145992049, 145982006, 145704774, 144849828, 144665269, 143889758, 143609495, 143794913, 143903308, 143740848, 143481006, 142876230, 142682789, 142414999, 142536715, 142170040]
5555A42170040J27279K04074p31403l69180L31911j75190K98j55148J20115m65447
5545A41057349K68073L40381J36823J83523j43587K88025n0761n43830M55468
5536A41991464K68978k59139j77886J90645L11083j46775K93132K0005L8189O96732
5526A43226428K1741o27151O53567J311794M43831k98861M94093l78149J90113
5517A45037406M72314K87991N12284K27051M05716L52422j44124l72056n11735
5508A46267269k77133O205n21731j49197M62110p10917r75103m54872n9433q6899
5498A43500299p91442q02396k73614j88906k56752m59806j96431r11776n13665
5489A39105511l45354m02091k62198l31799l29166P7172m43533m76401j155006
$$ y = [142170040, 142297319, 142501393, 141769990, 141400810, 141732721, 141557531, 141557829, 141402681, 141522796, 141057349, 141325422, 141665803, 141802626, 141986149, 141842562, 142130587, 142079826, 141535996, 141991464, 142260442, 142001303, 141823417, 142014062, 142325145, 142178370, 142471502, 142491507, 142529696, 143226428, 143248169, 142621018, 143274585, 144586379, 145030210, 144731349, 145225442, 144847293, 145037406, 145509720, 145797711, 146309995, 146537046, 146942762, 147295184, 147151060, 146779004, 146267269, 145990136, 145996341, 145474610, 145325413, 145787523, 145076606, 144101503, 143646631, 143587198, 143500299, 142708857, 141906461, 141632847, 141443941, 141187189, 140727383, 140530952, 139619176, 139105511, 138760157, 138358066, 138095868, 137764069, 137434903, 137512075, 137068542, 136592141, 135437135]
5480A35437135k77875k20022p81510k95125J61554J36976j22217P0158l84551
5471A33724523K08009R74008N53229Q48969Q57152J255749J321669J017692J356851
5462A42117851N66287R03801p6287R39929J025083Q12188N87361J050834J295455
5453A49222502J573039J932938J638250K529079K361211J518946J813248m289
5445A62584924p60141p72035o41556m88800L14753N60125J371473N30410J083096
5436A63782249K588982J978836K987004L418696M732531O146560Q090525J0751764
5428B04477147J4413905J8786362K3139603K6873299J0800896j5155686j5415385
5421B67920141j2792764j9592516k1351348j8814150j6018556j3898054j1183334
$$ y = [135437135, 135159260, 134939238, 134157728, 133862603, 134024157, 134161133, 134038916, 134109074, 133724523, 133932532, 134906540, 135459769, 136308738, 137165890, 138421639, 139743308, 140761000, 142117851, 142684138, 143587939, 143511652, 144451581, 145476664, 146288852, 146876213, 147927047, 149222502, 150795541, 152728479, 154366729, 156895808, 159257019, 160775965, 162589213, 162584924, 161824783, 161052748, 160411192, 159922392, 160237145, 160797270, 162168743, 162699153, 163782249, 166371231, 168350067, 171337071, 174755767, 179488298, 185634858, 193725383, 204477147, 218891052, 237677414, 260817017, 287690316, 298491212, 283335526, 267920141, 255127377, 235534861, 214183513, 195369363, 179350807, 165452753, 154269419]
5414A54269419q298576o088528m801163l806175l315068l371070k627632k336216
5406A19624991j941989k282895j636872j747920j793954j860876j421280p01509
5398A06237696o79149j609016j317957j156238j64604k523n44106j409069p51852
5389I8603182j05480j01866q13441n24275j9658l23212o70087q2982q5009r26559
5379I4950613p5571l21999k26892k32830n49153o25592K15323k72344m48883k07637
5369I2205035j43346k60674K85770o03761m11859O5921J84858l7927n85697l37156
5359I0361164P965j19135m15846m23997M5997j40017m86852N4490L917o58696
5349H8228990j22428P0780l89765k07856k13664P2343K70521p29988k54821J54058
$$ y = [154269419, 145970843, 139882315, 135081152, 131274977, 127959909, 124588839, 121961207, 119624991, 117683002, 115400107, 113763235, 112015315, 110221361, 108360485, 106939205, 106237696, 105558547, 103949531, 102631574, 101475336, 101310732, 101308209, 100764103, 99355034, 98603182, 98497702, 98395836, 97582395, 97058120, 97038462, 96715250, 96045163, 95962181, 95877172, 94950613, 94875042, 94553043, 94326151, 94093321, 93544168, 92918576, 93133899, 92861555, 92412672, 92205035, 92061689, 91801015, 92086785, 91483024, 91071165, 91137086, 91321944, 91284017, 90698320, 90361164, 90369129, 90249994, 89834148, 89410151, 89456148, 89316131, 88829279, 88883769, 88887686, 88228990, 88106562, 88177342, 87787577, 87579721, 87366057, 87438400, 87708921, 86978933, 86724112, 86878170]
5339H6878170o04823m26435J76217l60660N53835m32075m97434Q5275N4761K39864
5329H5666695N21106n11370J96219N1461m32723j60085m4502o17066K8096o7752
5319H4630079j80169k1801k70126j23374j12988k626o1136P6599k97511J48140
5309H3785087J48052p56301k40384N25292K16168Q7170l89644M39628L25064K94436
5299H4434568j72424j17975L02859J71829M007K80347J4055j96659m84090l94797
5289H3841720M42188k58999j34400M02424k6939N99059J68493l51050m18665m98902
5279H3764929k00292M72030K12217J24620k26427Q3535O13272m75754k27901P38263
5269H4878492n55625J77370o6655K29842M87366N1849n66396k23679K51476J61808
$$ y = [86878170, 86273347, 85846912, 86023129, 85662469, 86216304, 85784229, 85286795, 85372070, 85426831, 85666695, 86187801, 85676431, 85872650, 85924111, 85491388, 85331303, 85286801, 84669735, 84697831, 84630079, 84449910, 84428109, 84157983, 84034609, 83921621, 83918995, 83857859, 83934458, 83636947, 83785087, 83933139, 83176838, 82936454, 83461746, 83677914, 83765084, 83375440, 83815068, 84140132, 84434568, 84262144, 84144169, 84447028, 84618857, 84622864, 84903211, 84917266, 84720607, 84236517, 83841720, 84283908, 84024909, 83890509, 84292933, 84265994, 84865053, 85033546, 84682496, 84263831, 83764929, 83564637, 84036667, 84248884, 84373504, 84147077, 84230612, 84843884, 84368130, 84140229, 84878492, 84322867, 84500237, 84433582, 84663424, 85150790, 85202639, 84636243, 84412564, 84664040, 84825848]
5259H4825848k16344p9682M15216k50762R24023Q552m97931M88444P73722J48437
5249H6539523k3599j53114k92490J81221K35763L61762K32375j00530L1889K41533
5239H7254333M47784J80760r0174J167739J02953p0033P30232M64363L22061m71373
5229I0038645K34356J106402M75785K15418L09132M27439j36684M69284P58951
5220I3898728K47891L24348J9369r0539J64648L29395M92802O24817O71758j4072
5210I6669145M42539L13097K73536L19065P85926K36707O93562N37712N82809
5201A00854098P47130Q42862N59878L45343O22609M90187R54236o1211K18066
5192A05573198P86471j77882L30189J87035k95284k3761q43226n3829n39957n42799
$$ y = [84825848, 84609504, 84529822, 84945038, 84694276, 85618299, 85626851, 85128920, 85617364, 86391086, 86539523, 86515924, 86362810, 86070320, 86251541, 86487304, 86849066, 87081441, 86980911, 87012800, 87254333, 87702117, 87882877, 87792703, 88960442, 89063395, 88993362, 89723594, 90187957, 90510018, 90038645, 90273001, 91379403, 91855188, 92070606, 92379738, 92807177, 92670493, 93139777, 93898728, 94146619, 94470967, 94490336, 94399797, 94564445, 94893840, 95386642, 96011459, 96683217, 96669145, 97111684, 97424781, 97698317, 98017382, 98803308, 99040015, 99733577, 100271289, 100854098, 101601228, 102444090, 103003968, 103349311, 103971920, 104462107, 105416343, 105355132, 105573198, 106359669, 106181787, 106511976, 106699011, 106403727, 106379966, 105536740, 105482911, 104942954, 104400155]
5182A04400155m20244Q4519q95144m33574l55513l58166q10802o46541o50473
5173I9914217N6443L17920r6333r38183N5264k41724j1834n73203k52705m55090
5163I7774772r98709l28269K71048k07882r31196j77299j97410r741m78331q4200
5153I4632783J00142o61791q49312N69199k71474k10175M00549j85372j20318
5144I3404231J23388N43987l15892n47189M0831N8886j79495j72208j19148O02746
5134I3440137N72835q0906m1797k18081o347j74842M01533q1889j24721M34164
5124I4120086L80476k15357k53257L93232K03261l88733o1098M40488M14816J69837
5114I5203751O1990J6408O15894l09074m60650p770J475428o0074K19724P29348
$$ y = [104400155, 103979911, 104064430, 103169286, 102735712, 102380199, 102022033, 101211231, 100564690, 99914217, 99970660, 100288580, 100192247, 99254064, 99309328, 99067604, 99055770, 98482567, 98229862, 97774772, 96776063, 96447794, 96718842, 96510960, 95579764, 95402465, 95205055, 95195314, 94716983, 94632783, 94732925, 94071134, 93221822, 93791021, 93519547, 93309372, 93709921, 93524549, 93404231, 93527619, 94071606, 93755714, 93208525, 93249356, 93308242, 93128747, 92956539, 92837391, 93440137, 94012972, 93932066, 93890269, 93672188, 93665841, 93490999, 93892532, 93810643, 93685922, 94120086, 94500562, 94285205, 94031948, 94425180, 94628441, 94239708, 94178610, 94619098, 95033914, 95203751, 95265741, 95282149, 95898043, 95588969, 95128319, 95120549, 96595977, 96535903, 96755627, 97484975]
5104I7484975K94234M95972P091M2432L0190J73082m2568J147773J76790k54209
5094I9555762J50573K73520M52898L32589p6845J032390j06251n21504M11191
5085A01504323Q0272L86530J33228j9389k2203O044j79427O10899k21094k02539
5075A02076644K5588l08823J22614N45868M90312M15802J22095Q3274p6730j65111
5065A03331533N84456M12357Q89625Q13499L87726Q68451J74893n05134P38590
5056A07695996J328473N63024O07885N51044L02390L23625L14132J228134O11134
5047A13525837L33216N11706L18128J236465P69505Q66187O04401O58304R79521
5038A19803270J041021Q82955P31006O18663P18740R68072L87902M21687J438824
$$ y = [97484975, 97779209, 98275181, 98282272, 98324704, 98354894, 98527976, 98485408, 99633181, 99809971, 99555762, 99706335, 99979855, 100432753, 100765342, 100688497, 101720887, 101614636, 101093132, 101504323, 101584595, 101971125, 102104353, 102084964, 102062761, 102068805, 101889378, 102500277, 102279183, 102076644, 102102232, 101793409, 101916023, 102461891, 102952203, 103368005, 103490100, 103573374, 103496644, 103331533, 103915989, 104328346, 105217971, 106031470, 106419196, 107287647, 107462540, 106957406, 107695996, 109024469, 109587493, 110195378, 110746422, 111048812, 111372437, 111686569, 112914703, 113525837, 113859053, 114370759, 114688887, 115925352, 116694857, 117561044, 118165445, 118823749, 119803270, 120844291, 121727246, 122458252, 123076915, 123795655, 124763727, 125151629, 125573316, 127012140]
5029A27012140J204119Q36464J053814J396691K205495J755428J012783J894508
5021A38371442L170507L617150L161944K543426J075998o78806j889282j331420
5013A48040959o47704m82787R3337Q22065J83156q97315p53939q90411j070367
5004A44396994k122400j318790j343378j030589n84642m83467J19007l74532k93349
4995A36964854m1669L2420M54522l2043P13410J30057R29517M24291K41603R51650
4985A40768612L06944N99012P16404M83130J021816N74544o3642L33046L62005
4976A45101871M71909L27916k0934N64457O96242K45573N74895J176309O62317
4967A49800555O81172O92373k33231O05992O58451J73861L95978J044805R62564
$$ y = [127012140, 128216259, 129052723, 130106537, 131503228, 133708723, 135464151, 136476934, 138371442, 141541949, 145159099, 148321043, 150864469, 151940467, 151261661, 149372379, 148040959, 147393255, 146910468, 147003805, 147825870, 148009026, 147111711, 146357772, 145467361, 144396994, 142274594, 140955804, 139612426, 138581837, 137997195, 137513728, 137632735, 137258203, 136964854, 136923185, 136955605, 137410127, 137378084, 138091494, 138221551, 139151068, 139575359, 139816962, 140768612, 141075556, 141674568, 142390972, 142874102, 143895918, 144470462, 144406820, 144739866, 145101871, 145573780, 145901696, 145880762, 146445219, 147141461, 147387034, 147961929, 149138238, 149800555, 150481727, 151174100, 150940869, 151546861, 152205312, 152379173, 152775151, 153819956, 154782520]
4958A54782520O55220O91685N97116J372045J480771J734232K018866J556402
4950A64888857R18206J271585J013517J26323j421611r33122j410741n81143n58564
4941A63313307q81402o53867n27064o09718j79176q942j003177P15592q6920K37137
4931A60315770J1073O36301n3533m83809M59107L88317m27591j88054L97306L43263
4921A61398150l53364L88363N41841R6951l79229j05827K56558P56107j74506
4912A62425044J27978k63193P7886o0129N49562M29666L14835K44422O05130R06447
4902A65357648O30100P68687P19043O57688O21353P2604P66739Q62905j19091
4893A70337676Q75992M95872J016818j04474m8795M44436P62594M96498K42173
$$ y = [154782520, 155437740, 156129425, 156726541, 158098586, 159579357, 161313589, 163332455, 164888857, 165807063, 167078648, 168092165, 168218488, 166796877, 165863755, 164453014, 163871871, 163313307, 162431905, 161778038, 161250974, 160641256, 160462080, 160453138, 159449961, 160165553, 160078633, 160315770, 160326843, 160963144, 160909611, 160425802, 160884909, 161273226, 160845635, 160657581, 161054887, 161398150, 161044786, 161433149, 161974990, 162071941, 161692712, 161586885, 161843443, 162599550, 162425044, 162553022, 162289829, 162367715, 162307586, 162857148, 163286814, 163601649, 163846071, 164451201, 165357648, 165987748, 166756435, 167475478, 168133166, 168754519, 168827123, 169593862, 170456767, 170337676, 171213668, 171709540, 172726358, 172621884, 172573089, 173017525, 173780119, 174276617, 174518790]
4884A74518790j55010N31814J136464Q09474N50101R16994J281436P93440Q76961
4875A81260464P91335Q59117Q28778j05778J151091J212393J499228J021686J552009
4866A90070323J764651J289214J912459J789272K912207L058429K945278L684436
4858B09426269J917178m34050j477148k046054k263839k821264k316543k252716
4850A97731833j943753j774591q86532j220698q01086n98380l29273j66866J34054
4841A90144708J02703l35213J10133N75428J634513L21539Q61537J099082J608231
4832A96122661J578561J692389J204559R12395R76114Q99600J171922M95016O13090
4823B05666307P01897J403274J548675J277882J125057J970098K193223J526993
$$ y = [174518790, 174363780, 174895594, 176032058, 176841532, 177391633, 178308627, 179590063, 180383503, 181260464, 182051799, 182910916, 183739694, 183633916, 184785007, 185997400, 187496628, 188518314, 190070323, 191834974, 193124188, 195036647, 196825919, 199738126, 202796555, 205741833, 209426269, 211343447, 210909397, 209432249, 207386195, 205122356, 202301092, 199984549, 197731833, 195788080, 194013489, 193126957, 191906259, 191105173, 190506793, 190177520, 190010654, 190144708, 190247411, 189912198, 190022331, 190597759, 192232272, 192553811, 193415348, 194514430, 196122661, 197701222, 199393611, 200598170, 201510565, 202486679, 203386279, 204558201, 205053217, 205666307, 206368204, 207771478, 209320153, 210598035, 211723092, 213693190, 215886413, 217413406]
4815B17413406K276053K514193K705837L288053M002556L805756M190919M758272
4807B44955045N128703N787668N609837N705254O954417O738946O146139O788594
4799B93814603P227249O213843O288804O677755Q148994R454525J0926999J1967083
4791C60719855J3003682J4434243J5620407J5310265J2714795O512842k500426
4784D35815663j1613088j8535380k1904064k3855126k3160668k1475488j9666612
4777B95605237j8087813j5589760j3923167j2205972j1135921r661042p779226
4770B07222336p342472o768781n945914n189272m719165m605726m253538l908155
4762A64489313l452698l434306l356869k781205l285387k690380j463233j786463
$$ y = [217413406, 219689459, 222203652, 224909489, 228197542, 232200098, 236005854, 240196773, 244955045, 250083748, 255871416, 261481253, 267186507, 274140924, 280879870, 287026009, 293814603, 301041852, 307255695, 313544499, 320222254, 328371248, 337825773, 348752772, 360719855, 373723537, 388157780, 403778187, 419088452, 431803247, 438316089, 435815663, 424202575, 405667195, 383763131, 359908005, 336747337, 315271849, 295605237, 277517424, 261927664, 248004497, 235798525, 224662604, 215001562, 207222336, 199879864, 193111083, 187165169, 181975897, 177256732, 172651006, 168397468, 164489313, 161036615, 157602309, 154245440, 151464235, 148178848, 145488468, 144025235, 142238772]
4754A42238772k209184k100350j721225j584382j659486k172931m17489q29268
4746A29544457j104247r63398j153176n44272j354148p87044o21160j95011r09532
4737A21912469j099544j36687q47056k90352o59303l61156j034464j48210J91183
4728A17526880o20141o51197n87362k21404n91851p33784k78379L14739o5461
4719A14092040n13862j91420n62859n7350M1720o31315n79159l30986O71778L72014
4709A12310601l29842k28824m77457Q1022K84932J3320L1047l1193J68436J10955
4699A11932997j3087K15244p3102l23417j6852k42014N68323J19762K13593K01826
4689A12583273n80433L93602N46953J146429K77872M74891L11367j46246m5364
$$ y = [142238772, 140029588, 137929238, 136208013, 134623631, 132964145, 130791214, 130373725, 129544457, 128440210, 127476812, 126323636, 125779364, 124425216, 123638172, 123017012, 122822001, 121912469, 120812925, 120676238, 119829182, 119538830, 118879527, 118518371, 117483907, 117335697, 117526880, 116906739, 116255542, 115668180, 115446776, 114854925, 114121141, 113842762, 114157501, 114092040, 113578178, 113386758, 112823899, 112766549, 112808269, 112176954, 111597795, 111266809, 111938587, 112310601, 111980759, 111751935, 111274478, 111355500, 111640432, 111653752, 111684799, 111653606, 111822042, 111932997, 111919910, 112135154, 112062052, 111738635, 111721783, 111479769, 112048092, 112167854, 112381447, 112583273, 112002840, 112396442, 112943395, 114089824, 114367696, 114842587, 115153954, 115007708, 114962344]
4680A14962344K2036j64485N61631L02946q9659N84553m06180K47958Q48939J245436
4670A18115519k2183L70666K0076M53757O31076Q93357J126600Q90098J262023
4661A23740989J438893J307206J213707M20190J330510P27480J717854J647698
4653A33544527N05077Q72509R90290K253473J445406J594289J130102J848271
4645A44183944J738598J647034J572964J862091J170408P34054P34855L75018
4637A54018966l21039j199144q80554q93866j670527j008996l36420r61540p2223
4628A46674657j45706l46252n4721P00625J82960M84674M86023q2199l13631P61352
4618A48347782L69289L28482K1947J20395L04119l26401J46223J05352L70392
$$ y = [114962344, 114984380, 114819895, 115381526, 115684472, 115594813, 116179366, 115773186, 116021144, 116870083, 118115519, 118093336, 118464002, 118484078, 118937835, 119568911, 120462268, 121588868, 122478966, 123740989, 125179882, 126487088, 127700795, 128120985, 129451495, 130178975, 131896829, 133544527, 134049604, 134922113, 135912403, 138165876, 139611282, 141205571, 142335673, 144183944, 145922542, 147569576, 149142540, 151004631, 152175039, 152909093, 153643948, 154018966, 153697927, 152498783, 151618229, 150724363, 149053836, 148044840, 147708420, 146746880, 146674657, 146528951, 146182699, 146127978, 146828603, 147011563, 147496237, 147982260, 147900061, 147586430, 148347782, 148717071, 149045553, 149067500, 149187895, 149492014, 149165613, 149311836, 149417188, 149787580]
4609A49787580k0155l68781n93596L4386q8361r52793n86013o821n72240j63668
4599A46469538q34773j516178j2888j128826n87018p71306j256448j206634j672034
4590A37483433j655301j465532j546426j700508j343839j492601j391845j062229
4582A25825152j228411j789686j290496r20606q95086j607147r15890j195104
4574A15982726o29585o18972o78675j092028j279003j23203j075220p83145j023928
4565A08678967j092928o43399q87001j052262j051264q00659n00324j078825p25341
4556A00846964K8551m46298J24978n02275k90862m01668k14298n01083J36154
4547I8780163K47857m16581n14877m18820m98797p65047j24120m24955p42566
$$ y = [149787580, 149767425, 149398644, 148805048, 148839434, 148751073, 147798280, 147212267, 147205446, 146633206, 146469538, 145634765, 144118587, 144105699, 142976873, 142389855, 141618549, 140362101, 139155467, 137483433, 135828132, 134362600, 132816174, 131115666, 129771827, 128279226, 126887381, 125825152, 124596741, 122807055, 121516559, 120595953, 119700867, 118093720, 117177830, 115982726, 115353141, 114734169, 114055494, 112963466, 111684463, 111561260, 110486040, 109702895, 108678967, 107586039, 106942640, 106055639, 105003377, 103952113, 103151454, 102651130, 101572305, 100846964, 100875515, 100429217, 100554195, 100051920, 99761058, 99359390, 99145092, 98644009, 98780163, 99028020, 98611439, 98096562, 97677742, 97178945, 96413898, 96289778, 95864823, 95122257]
4538I5122257n07786r31136p96707j102895p72833j018349q08284o7596o16934
4529H8499737m74316p31278p46881r91038j267607j065434j77304n77132r49295
4520H1519452p08394o17225L99482l95210m20069k63104j100289k36597r2264
4511G8085782m59794l34003m62672n63850o81528l36536k18079j51360l63880
4502G4514080j14365k76287o69931l89578m37059L1646j90406o07097n39015r5269
4492G1226719j66568j07278j74231n2440m0533r3164J04397m96333L33431o67075
4482F9866925J16115J4937n23282n4680o00409m6718K44981k2088r04061j67172
4472F7924548k7692L66737j04332l3583p98157L0628N1329m49966m53678K03202
$$ y = [95122257, 94614471, 93683335, 92886628, 91783733, 91010900, 89992551, 89184267, 89116671, 88499737, 88025421, 87294143, 86547262, 85556224, 84288617, 83223183, 83045879, 82468747, 81519452, 80811058, 80193833, 80593315, 80198105, 79778036, 79514932, 78414643, 78178046, 78085782, 77625988, 77291985, 76829313, 76265463, 75583935, 75247399, 75029320, 74877960, 74514080, 74399715, 74123428, 73453497, 73063919, 72626860, 72658506, 72468100, 71861003, 71321988, 71226719, 71060151, 70952873, 70778642, 70726202, 70685669, 70592505, 70696902, 70200569, 70534000, 69866925, 69983040, 69997977, 69474695, 69420015, 68819606, 68772888, 69017869, 68995781, 68091720, 67924548, 67896856, 68263593, 68159261, 68125678, 67327521, 67358149, 67409478, 66959512, 66505834, 66709036]
4462F6709036k46669j77567L06299k31333j92187l97638l3358j53559O083M5568
4452F5634675J05573m68493J92056K03897m01638o0415k52833n61825j23818M88411
4442F4755590J67664o8097K86364m86978j52789l43202J10517O04741m457l70755
4432F4498598j92833L39846J68237r8099K6462Q3623Q6175L02651K82702n18864
4422F4978498j70697l68882J50130Q17617j20268k66147m51915L27639p8339M53849
4412F5271485N37893m2877j52657j79950O08414L75852m84340K4832k87791M1790
4402F5712651n0300L43925M59665o3210j68694K47182J0631l83728M35877m51567
4392F6092432k24964l51867n09024L1541N28263L02182O8661L551J11102K93896
$$ y = [66709036, 66462367, 66284800, 66591099, 66359766, 66167579, 65769941, 65736583, 65583024, 65589107, 65634675, 65740248, 65271755, 65463811, 65667708, 65266070, 65205655, 64952822, 64390997, 64267179, 64755590, 64923254, 64855157, 65141521, 64654543, 64501754, 64158552, 64269069, 64873810, 64869353, 64498598, 64305765, 64645611, 64813848, 64715749, 64742211, 64825834, 64912009, 65214660, 65497362, 64978498, 64807801, 64438919, 64589049, 65406666, 65286398, 65020251, 64568336, 64895975, 64817636, 65271485, 65809378, 65766501, 65613844, 65433894, 66042308, 66418160, 65933820, 65958652, 65670861, 65712651, 65662351, 66006276, 66465941, 66402731, 66234037, 66481219, 66491850, 66108122, 66543999, 66092432, 65867468, 65515601, 65006577, 65038118, 65566381, 65868563, 65937224, 65940775, 66051877, 66345773]
4382F6345773K39240m71294m37637p23588Q1753Q8398n10033J35919l91168J21509
4372F4478872J80668j33921j9453k46212j80867J73549Q4171L14795p05172p66860
4362F3179570l7868J41194J50407k1329M19936L53181k12710o8443p3802J13071
4352F3943207K29508k20753k0777q6833k14059k95830L89257P64960j30040n25332
4342F3833308r7427j0049N71486J86737r1903K133n15568l05241K5711N45350
4332F4144537K4354J64469l3165j08309l62414j30483M97662J35546o73609k40477
4322F3418111J18330L58473l02980O5028J80120J8573n16525j28100j75086m41779
4312F2594165k42611k78291L50751j5864L78170L0406K06545k16229n60444l6371
$$ y = [66345773, 66585013, 66113719, 65676082, 64952494, 65034247, 65122645, 64612612, 64748531, 64357363, 64478872, 64659540, 64525619, 64506166, 64259954, 64079087, 64252636, 64336807, 64651602, 63946430, 63179570, 63141702, 63282896, 63433303, 63411974, 63831910, 64185091, 63972381, 63903938, 63830136, 63943207, 64172715, 63951962, 63931185, 63844352, 63630293, 63334463, 63723720, 64488680, 64358640, 63833308, 63735881, 63725832, 64297318, 64484055, 64392152, 64394285, 63878717, 63573476, 63599187, 64144537, 64168891, 64333360, 64300195, 64191886, 63829472, 63698989, 64196651, 64332197, 63658588, 63418111, 63536441, 63894914, 63591934, 63656962, 63837082, 63855655, 63339130, 63211030, 63035944, 62594165, 62351554, 62073263, 62424014, 62408150, 62786320, 62816726, 63023271, 62807042, 62246598, 62210227]
4302F2210227j1612k73968j87276p5718K60902m16866j28630l11374k63158j07153
4292F0695374k21908l73606l42939L08934k76748m77013K66439k71920k04167
4283E9102446o00173o2416K0381l81473r8757M73573l62314k59004j03040l8727
4273E7690496m78885q67604j5629K47813M71246N29305O3728n43554n64230K45445
4263E6778131k57616m95899o91473l74717M8845L0025n41422j12382K85083k98601
4253E4369974j01859o5046k42779l05007m21802n23396j1680o18728n45865J9423
4243E1553235L80963l60807k7331j00800p64970m69953m95849J82410L21906m60379
4233D9758425o14894o38962k8041L85875j77305k30932j53661k38616m43782l01903
$$ y = [62210227, 62198615, 61924647, 61737371, 61661653, 61922555, 61505689, 61377059, 61065685, 60802527, 60695374, 60473466, 60099860, 59756921, 60065855, 59789107, 59312094, 59578533, 59306613, 59102446, 58502273, 58439857, 58460238, 58078765, 57980008, 58453581, 58091267, 57832263, 57729223, 57690496, 57211611, 56344007, 56328378, 56576191, 57047437, 57576742, 57640470, 57096916, 56532686, 56778131, 56520515, 56024616, 55333143, 54958426, 55007271, 55037296, 54495874, 54383492, 54668575, 54369974, 54268115, 54203069, 53960290, 53655283, 53233481, 52710085, 52698405, 52079677, 51533812, 51553235, 51934198, 51573391, 51546060, 51445260, 50680290, 50210337, 49714488, 49896898, 50218804, 49758425, 49143531, 48504569, 48476528, 48862403, 48685098, 48454166, 48300505, 48061889, 47618107, 47316204]
4223D7316204K47265l61095j13884k47142o00965n94391k91996K70339M9530k81526
4213D5392339r5450K15721q02103m6045J31366p63651l05402N7585j50655P1715
4203D3705420q6463k71102j24142k76795m848O13457q6041o82137O59108j50868
4193D3295589M54965q14516j72890K63841k32812j32225k96194n30228K3754N3133
4183D1912417q5866n05711J44867M9574K26271m96719j91902J26362M7937l644
4173D1223586p21093n87997l39353L56159K92599l65374N2827r7743o33155M69466
4163C9649922j98334M7268K94423m43000m40828J25696j76624j72391n25537o38795
4153C7521800J48088m46788m51923J93641R6048J07782m65991l71420m6732J04438
$$ y = [47316204, 47563469, 47202374, 47088490, 46841348, 46240383, 45645992, 45353996, 45624335, 45673865, 45392339, 45296889, 45512610, 44710507, 44664462, 44795828, 44032177, 43726775, 43784360, 43633705, 43705420, 43618957, 43347855, 43223713, 42946918, 42942070, 43555527, 43469486, 42787349, 43446457, 43295589, 43750554, 42936038, 42763148, 43026989, 42794177, 42661952, 42365758, 41835530, 41859284, 41912417, 41826551, 41320840, 41465707, 41515281, 41741552, 41244833, 41052931, 41179293, 41227230, 41223586, 40502493, 39914496, 39575143, 39931302, 40223901, 39858527, 39911354, 39813611, 39180456, 39649922, 39451588, 39498856, 39793279, 39350279, 38909451, 39035147, 38858523, 38686132, 38160595, 37521800, 37669888, 37223100, 36771177, 36964818, 37060866, 37168648, 36702657, 36331237, 36284505, 36388943]
4143C6388943m50677m18799k38485j21893M04488j63157M34759j6719o48095J03474
4133C5273839m51671o16514j18853J62038j59580k40699k90740L29600m00248
4124C3487172k39471k06442K70178o4258L55765j4318n19970O45147j26794k846
4114C3584163K31033l91042m27958k17274L63706m13494k1062q22030j49634j62951
4104C1573457J92870J6527j77122L4614J38213k8902j35766k96646k48375O28792
4094C1697662m88275l25348K26476J42732m80841k21469J63096j61269j29718
4085C0423046j39249J38424j63282j31474O19287L12430k02400j59674l19680
4076C0377428m31844j0536k00593j76874k05926M58767J4112n7566M15842m2275
$$ y = [36388943, 35938266, 35519467, 35280982, 35159089, 35563577, 35400420, 35835179, 35818460, 35170365, 35273839, 34822168, 34205654, 34086801, 34248839, 34089259, 33848560, 33557820, 33887420, 33487172, 33247701, 33041259, 33311437, 33247179, 33602944, 33588626, 33068656, 33713803, 33587009, 33584163, 33815196, 33424154, 32996196, 32778922, 33142628, 32729134, 32708072, 31886042, 31736408, 31573457, 31766327, 31782854, 31605732, 31640346, 31778559, 31749657, 31613891, 31317245, 31068870, 31697662, 31209387, 30884039, 31110515, 31253247, 30772406, 30550937, 30714033, 30552764, 30423046, 30283797, 30422221, 30258939, 30127465, 30746752, 31059182, 30856782, 30697108, 30377428, 29945584, 29935048, 29734455, 29557581, 29351655, 29810422, 29824534, 29766968, 30182810, 30140535]
4066C0140535m54458j17401k45766n46021l98399O47928l29966j3850M10097q36285
4056B8256414K8313K8854l11721M0270M11218P134l6586N11405l863J0468o63727
4045B8278179J07121L59335m25195j35344K51231K86920l70472n40504M01632
4036B8212903p29465N78359j00975p18301K18798l37175J1785l47075M49476L67735
4026B7606065J84024k39810k09939n90336k33564P11338K02202K0522Q5674L69815
4016B7905991n06517o95541N48685k09635K5061o51927L8690K71848j92061M1241
4006B6575835N977J93302j65775l95668N00197O0040l46538n68597R2090O10589
3996B6561452p866o8197l96620O1202j74484O15125l25225M4981k27390m22345
$$ y = [30140535, 29686077, 29568676, 29322910, 28776889, 28378490, 29026418, 28696452, 28682602, 29092699, 28256414, 28284727, 28313581, 28001860, 28042130, 28453348, 28460482, 28423896, 28935301, 28931438, 28941906, 28278179, 28385300, 28744635, 28319440, 28184096, 28435327, 28722247, 28351775, 27811271, 28212903, 27483438, 28061797, 27960822, 27242521, 27461319, 27124144, 27135929, 26788854, 27238330, 27606065, 27790089, 27550279, 27340340, 26750004, 26516440, 27227778, 27429980, 27450502, 27536176, 27905991, 27399474, 26703933, 27252618, 27042983, 27068044, 26416117, 26454807, 26726655, 26534594, 26575835, 26581812, 26775114, 26609339, 26213671, 26713868, 26773908, 26427370, 25858773, 25950863, 26561452, 26553586, 26485389, 26088769, 26149971, 25975487, 26590612, 26265387, 26310368, 26082978, 25660633]
3986B5660633M33187j45991L49097P0394m16103L71158J56544l67472M9417K62375
3976B6423239m85963k80393L0919J11026l10903j61112p4188J66500J91171K1197
3966B5631493M72493r8287l34062m82519l92426r2478J30657J14434L74184j78698
3956B5144791L86783j42395l39811J26820o50752O23764J96556o37965K59925
3947B4967716J90533K44929l02922k18073k7379q48507L22715O99810l65349N1401
3937B4714874O98862o39390k74874O3867J97614l80518j15024k02050q7162L13955
3927B4290154J74997J28782K83819k32739m76383o4925k34276L85488L21383L4395
3917B4610695K02664l507m85199N5969m39042j51615K43689M08430J52398l40820
$$ y = [25660633, 26093820, 25947829, 26296926, 26367320, 25951217, 26322375, 26478919, 26111447, 26160864, 26423239, 25937276, 25656883, 25687802, 25798828, 25487925, 25326813, 25252625, 25419125, 25610296, 25631493, 26103986, 26005699, 25671637, 25189118, 24796692, 24704214, 24834871, 24949305, 25323489, 25144791, 25531574, 25389179, 25049368, 25176188, 24525436, 25149200, 25345756, 24707791, 24967716, 25158249, 25403178, 25100256, 24882183, 24854804, 24006297, 24329012, 25028822, 24663473, 24714874, 25413736, 24774346, 24499472, 24563339, 24760953, 24380435, 24265411, 24063361, 23976199, 24290154, 24465151, 24593933, 24877752, 24645013, 24168630, 24103705, 23869429, 24254917, 24576300, 24610695, 24813359, 24809852, 24324653, 24380622, 23941580, 23789965, 24033654, 24442084, 24594482, 24253662]
3907B4253662k25428l6936m06449K98218J21209M71820L15674q38288j95057P74582
3897B4533007m19316l22915r1427j57482N51146K92184m80304M76099J6362k68212
3887B4129142k87943L8716M51799n5942O2715L15045m23003J4868P3220k37181
3877B4081436l66598L9784K39821l38892k68441m9999P35087p87308j30186o5002
3867B3089702K27993L76092k78228K79566l90830k62885Q01453j54088L95003
3858B4083778l40437n43016O62858j00684J87272j98256m57545Q7907j93571K22359
3848B3410665K61872K2463P1639k13307j61272L37222M78894n33315k65782r2663
3838B3316416L94435j34818L6795R10911j02027k57863J06498J11948m34990K24419
$$ y = [24253662, 24028234, 23991298, 23584849, 23883067, 24004276, 24476096, 24791770, 23953482, 23758425, 24533007, 24113691, 23790776, 23699349, 23541867, 24093013, 24385197, 23904893, 24380992, 24397354, 24129142, 23841199, 23879915, 24331714, 24275772, 24338487, 24653532, 24230529, 24245397, 24318617, 24081436, 23714838, 23754622, 23994443, 23655551, 23387110, 23337111, 24072198, 23284890, 23154704, 23089702, 23317695, 23693787, 23415559, 23695125, 23304295, 23041410, 23842863, 23688775, 24083778, 23743341, 23200325, 23863183, 23762499, 23949771, 23751515, 23293970, 23381877, 23188306, 23410665, 23672537, 23695000, 23766639, 23553332, 23392060, 23729282, 24208176, 23674861, 23409079, 23316416, 23710851, 23576033, 23612828, 24523739, 24421712, 24163849, 24270347, 24382295, 23947305, 24171724]
3828B4171724L0822J62059k32307p24934k10588P05571n0047J45758K1995o99012
3818B3321041L79934O78650k11042J60207j09734j67793J29121j85470L27770
3809B4322684r1251J55752o246j89810j21133n0377k90700k30285K06089L59994
3799B4064717j30670o0636o7190j08342R9956K30759k21124L04707q4212k39032
3789B3788933N59117O2148j54364Q274p1715l39915k62455M79763N69583o8432
3779B4570937m38704j1357j53154J96381O35029m78563l13632M06770J61474l29311
3769B4245870O3036K21715J6926m81547J81686N40594N8048k81007J6427k9926
3759B4551822J82520N67363k2786l74033L26266J98261m29844k358m88755K31400
$$ y = [24171724, 24202546, 24364605, 24132298, 23407364, 23196776, 23902347, 23852300, 23998058, 24020053, 23321041, 23700975, 24379625, 24168583, 24328790, 24219056, 24051263, 24180384, 23994914, 24322684, 24231433, 24387185, 24380939, 24191129, 24069996, 24019619, 23728919, 23498634, 23704723, 24064717, 23934047, 23873411, 23806221, 23697879, 23797835, 24028594, 23807470, 24112177, 24027965, 23788933, 24348050, 24410198, 24255834, 24264108, 24192393, 23852478, 23590023, 24069786, 24639369, 24570937, 24132233, 24120876, 23967722, 24164103, 24799132, 24320569, 24006937, 24413707, 24575181, 24245870, 24308906, 24530621, 24547547, 24066000, 24247686, 24788280, 24846328, 24565321, 24581748, 24551822, 24734342, 25301705, 25278919, 24904886, 25231152, 25429413, 24999569, 24997211, 24508456, 24739856]
3749B4739856J03140L35823J80552l84122M93508P1825l97835k15104J31444L16893
3739B5375980K14403K44056Q651l79061m31731M1823P16569N6743l46818l76609
3729B5124006J60546k70193P8365Q10944j79463n02381K23808P8281J33221O30693
3719B6287827k80530n70963n38649j81188n23379J59412L19479L32585O44326
3710B5648920N85543l67388K01446m533J31051M43241m43109J66243j71130k13668
3700B5976616l01600N9796l17737K44560L7799j6998k80239k29364M10576N6304
3690B5639713k39566K62905j61487l204j29365K85536R7701q34700K10606J09811
3680B5237950l53492J07198M48430K73611j8144l6480K91396K30906k16504j56357
$$ y = [24739856, 24842996, 25178819, 25359371, 24975249, 25468757, 25540582, 25142747, 24927643, 25059087, 25375980, 25590383, 25834439, 25843090, 25464029, 25032298, 25074121, 25790690, 25847433, 25500615, 25124006, 25284552, 25014359, 25092724, 25903668, 25724205, 25221824, 25445632, 25523913, 25657134, 26287827, 26007297, 25436334, 24897685, 24716497, 24193118, 24352530, 24672009, 25004594, 25648920, 26234463, 25867075, 26068521, 26063988, 26195039, 26638280, 26195171, 26361414, 26190284, 25976616, 25675016, 25734812, 25417075, 25661635, 25699434, 25682436, 25402197, 25172833, 25583409, 25639713, 25400147, 25663052, 25501565, 25498361, 25368996, 25654532, 25752233, 24917533, 25128139, 25237950, 24884458, 24991656, 25440086, 25713697, 25695553, 25659073, 25950469, 26181375, 25964871, 25808514]
3670B5808514K56071m53450L56550p1579N5027j58626j94993K48458J07816j0000
3660B5943788q7482K74852k08921p3375n1060J62601k00715m35769L01238K52236
3650B5877393J26845j75888k08073K08051M68442J91041J13903L4385K85235J36188
3640B7057522k75599K69657O04482R7627r33076N7716O64328o2354L01917o0450
3630B7721770k39921P19606M04908k59544j21328j60250k25352j52697K38870
3621B7926062L96049J62382J79833M04324R51022j85694n86116n24444O49481
3612B9372899L91408J38319N64419l0722O8468k15584k73475P31208N00086l68255
3602C0878771Q9484L40328K82470P9100k78206J29281N52206n47274N10361Q63765
$$ y = [25808514, 26064585, 25611135, 25967685, 25896106, 25951133, 25792507, 25597514, 25845972, 25953788, 25943788, 25856306, 26131158, 25922237, 25848862, 25797802, 25960403, 25759688, 25323919, 25625157, 25877393, 26004238, 25828350, 25620277, 25828328, 26296770, 26487811, 26601714, 26636099, 26921334, 27057522, 26781923, 27051580, 27656062, 27753689, 26820613, 26878329, 27542657, 27480303, 27782220, 27721770, 27481849, 28201455, 28606363, 28346819, 28225491, 28065241, 27839889, 27687192, 27926062, 28322111, 28484493, 28664326, 29068650, 30019672, 29833978, 29247862, 28723418, 29372899, 29764307, 29902626, 30467045, 30436323, 30504791, 30289207, 30015732, 30746940, 31247026, 30878771, 30968255, 31308583, 31591053, 31670153, 31391947, 31521228, 32073434, 31526160, 32036521, 32900286]
3592C2900286k2896M56114k01546J15678L80042q4116k4366K68017L93790J05807
3582C4286810k094L21858P61562q44N04641M53901l8107M39837J86488K11935
3572C7125987K59684J4676J56033m2223K30356Q2419J28103M42796K44705Q02070
3562C9444606N28768j11425q2062K11053O21623M96975O28007L33420m8474M17232
3552D2439723K82111M332Q78228n9093M85886Q12774L12694N32751N06242R44801
3542D7140449O47186K55539J14466P21873Q55258J93964L02957K56143N45132
3533E1032967L17844L38105O00251O75173J124570Q1833N65923K71229N36447
3524E5544342J96594O78795R11773j34905P25610J439085O50525L59906Q25688
$$ y = [32900286, 32877390, 33333504, 33131958, 33247636, 33627678, 33543562, 33519196, 33787213, 34181003, 34286810, 34284716, 34606574, 35368136, 35367292, 35871933, 36325834, 36287727, 36727564, 36914052, 37125987, 37385671, 37400347, 37556380, 37514157, 37744513, 37826932, 37955035, 38397831, 38642536, 39444606, 39973374, 39861949, 39779887, 39990940, 40612563, 41109538, 41737545, 42070965, 42022491, 42439723, 42721834, 42726166, 43604394, 43545301, 44031187, 44843961, 45156655, 45689406, 46195648, 47140449, 47787635, 48043174, 48157640, 48879513, 49734771, 49928735, 50231692, 50487835, 51032967, 51350811, 51688916, 52289167, 52964340, 54088910, 54170743, 54736666, 55007895, 55544342, 55740936, 56419731, 57331504, 57196599, 57922209, 59361294, 60011819, 60371725, 61197413]
3515F1197413P65766R66654Q63791J251994Q14016J109262J079422J188621R4791
3506F9331730J384333J203885Q20647J805535J090248O33449J353139K644260
3498H0267226K812184J714984J147440J426095J121909J261177R93244J261022
3490I2005281R05301R15245J789073J735643J341403K098815K403318K466217
3482A05660296J952486K807110K323169K055442L294680M291153M068046M593308
3474A31045690L864051L972253M331516K214456R86117J337390J704119L098691
3466A52554283L639605L427049M563916M224419N437777P248539Q051403J0499996
3458A99646987J3895803J8595796K1998073J8008214M288j2173231j3829382j5218968
$$ y = [61197413, 61963179, 62929833, 63793624, 65045618, 65859634, 66968896, 68048318, 69236939, 69331730, 70716063, 71919948, 72740595, 74546130, 75636378, 76269827, 77622966, 80267226, 83079410, 84794394, 85941834, 87367929, 88489838, 89751015, 90744259, 92005281, 92910582, 93825827, 95614900, 97350543, 98691946, 100790761, 103194079, 105660296, 107612782, 110419892, 112743061, 114798503, 118093183, 122384336, 126452382, 131045690, 134909741, 138881994, 143213510, 145427966, 146414083, 147751473, 149455592, 152554283, 156193888, 159620937, 164184853, 168409272, 173847049, 181095588, 189146991, 199646987, 213542790, 232138586, 254136659, 272144873, 272149161, 259975930, 246146548, 230927580]
3450B30927580j3856734j2073529r528020p283648m429890k035923J243926L042044
3442A86005806L113698K783770K086619j160962k315251j647201J38542J253708
3434A90258729L777888N149327N778063O510305Q791551J0739916J4973768K0030421
3426B66009968K6774966L5328997M4343838K8236733j4634428k8123909l2183642
3419C25752523l4491352l0328833k7226388k1487998j8285261j4406080r636419
3412A69890192o226032m465830l495426k255085l240872l962684m148016l140140
3404A38956107k295848j786321l77643l07326J095719J898283K560430M309482
3396A44052883O969103Q925482J2570502J6121662J7845545Q403400q533419j4958998
$$ y = [230927580, 217070846, 204997317, 195469297, 188185649, 183755759, 181719836, 182963762, 186005806, 189119504, 191903274, 193989893, 192828931, 190513680, 188866479, 189005021, 190258729, 194036617, 199185944, 204964007, 211474312, 220265863, 231005779, 245979547, 266009968, 292784934, 328113931, 372457769, 400694502, 386060074, 357936165, 325752523, 291261171, 260932338, 233705950, 212217952, 193932691, 179526611, 169890192, 163664160, 159198330, 155702904, 153447819, 150206947, 146244263, 142096247, 138956107, 136660259, 134873938, 134496295, 134188969, 135284688, 137182971, 139743401, 144052883, 151021986, 159947468, 172517970, 188639632, 206485177, 214888577, 206355158, 191396160]
3388A91396160j7336004j7716357j5498075j3769658j1829804r944042p415816
3381I7886404o686244m965274l912866k771734k663855k718756k012441j646716
3373G0508518j646352j995244j143085j366313j017061j554247q71567p57604
3365F0157045j287187j197263j296909j477535r50639r22035p96441l93222n62622
3356E1273192m85586j083870j39637j80993m09901j105274l25189p83707L1014
3347D6790049L68142m55911p39225o93284k03460N46326l17060j178397r44594
3338D3172586j16819j40315p84709o1454k78567J53390J42634o56662k93470l70639
3328D0765975j82000k05957n21549o09798K33784j18075l66435o99905r28168
$$ y = [191396160, 174060156, 156343799, 140845724, 127076066, 115246262, 105302220, 97886404, 91200160, 86234886, 82322020, 79550286, 76886431, 74167675, 72155234, 70508518, 68862166, 66866922, 65723837, 64357524, 63340463, 61786216, 60914649, 60157045, 58869858, 57672595, 56375686, 54898151, 53947512, 53025477, 52229036, 51835814, 51273192, 50787606, 49703736, 49564099, 49383106, 48973205, 47867931, 47542742, 46759035, 46790049, 47158191, 46702280, 45963055, 45269771, 45066311, 45612637, 45295577, 44117180, 43172586, 43055767, 42915452, 42130743, 42069289, 41790722, 41944112, 42086746, 41430084, 41136614, 40765975, 40583975, 40378018, 39856469, 39246671, 39480455, 39362380, 38995945, 38296040, 37367872]
3319C7367872m6981m3428k11872N8388j80363n17810k33307K73244j24905q81023
3309C5459815M32766j81846j15128j24082n82802o3623j20610j63717m31364m184
3299C4105225J93660m12860j6443l76700R2677k45262k95827J53183j00468n71337
3289C2525848p47020m9161O42632J27820M9211l09359n56065M8628M94715j68718
3279C2058531l6587k20062k43451j56393n30204R6483K45295j62750o21672J6123
3269C0445313J74493Q7764J03291r946l35576L37850m6492m84513n4291n03283
3259B9714610J35607N04212M87196m74345j90879j83737k17506O6776O9582K99018
3249C0210534l12480J28510k86088k45510J07277l74871j93463J30364L18396
$$ y = [37367872, 37320891, 37277463, 37065591, 37123979, 36943616, 36425806, 36192499, 36465743, 36340838, 35459815, 35892581, 35710735, 35595607, 35471525, 34888723, 34825100, 34704490, 34540773, 34109409, 34105225, 34298885, 33886025, 33869582, 33492882, 33585559, 33340297, 33044470, 33197653, 33097185, 32525848, 31778828, 31729667, 32372299, 32500119, 32549330, 32239971, 31683906, 31732534, 32227249, 32058531, 32021944, 31801882, 31558431, 31402038, 30871834, 30968317, 31213612, 31050862, 30429190, 30445313, 30619806, 30707570, 30810861, 30800915, 30465339, 30803189, 30756697, 30272184, 30217893, 29714610, 29850217, 30354429, 30841625, 30367280, 30176401, 29992664, 29775158, 29841934, 29911516, 30210534, 29898054, 30026564, 29740476, 29494966, 29602243, 29227372, 29033909, 29164273, 29482669]
3240B9482669K87457j23213O7115o05262L21504R5305Q6777n4972m68623L76j05449
3229B8983684O52288j13603k77956J9354L08417M25193K20240q11999j1703N6886
3219B9450801k29938L21662l16486L40054N80186m3328k42842m91911J35798R6897
3209B9600893K56808k35999K18544P06818J13507n64740j5987j68254M57624N94763
3199C0963977q09979l29831P78551O36016l82160l70568J98068L84849L57080
3190C1426003l71788M61129P9623J11987K5059L70751M85959k52226L24182l16210
3180C2344469k68750Q157M85352O88749K73126m9157P15474m63074J13924R16336
3170C4764606K10641Q3072Q38592L86868n66613L98905J46541J06257M91285R4617
$$ y = [29482669, 29770126, 29646913, 29714028, 29108766, 29430270, 29525575, 29612352, 29557380, 29088757, 29089133, 28983684, 29635972, 29522369, 29244413, 29263767, 29572184, 29997377, 30217617, 29405618, 29393915, 29450801, 29220863, 29542525, 29226039, 29566093, 30146279, 30102951, 29860109, 29368198, 29503996, 29600893, 29857701, 29621702, 29840246, 30547064, 30660571, 30095831, 30079844, 29911590, 30369214, 30963977, 30153998, 29824167, 30602718, 31238734, 30856574, 30486006, 30684074, 31068923, 31426003, 31054215, 31515344, 31594967, 31706954, 31732013, 32102764, 32588723, 32336497, 32660679, 32344469, 32075719, 32083876, 32569228, 33257977, 33531103, 33481946, 34197420, 33734346, 33848270, 34764606, 34975247, 35058319, 35896911, 36283779, 35717166, 36116071, 36262612, 36368869, 36860154, 36954771]
3160C6954771l58707M12257L82240n44619L46573k72577K96822L74961M25922
3151C8017643j71286R7459r3126N008J95432N94088J68175M41284p18342K57886
3141C8794221R19185J10364N18014N78123K12646K50474M23458J83185k10531
3132D1779139j84308Q2115j27257K14396N2606m21461n65643O29753k84336l08183
3122D0866821k97541J60294l08164m848o23807K70253L57155j81307K33554l3900
3112D0438510L48030k50720l04324M3203L96721k11721j37122K17404O8236k93253
3102D0314964m14541J95175K44197j89474p7112k98824l99799l69058q9663m87461
3092C8428404K68382j80999O2812m8098m13586o81168j22479J33945k2514K8483
$$ y = [36954771, 36596064, 37008321, 37390561, 36845942, 37192515, 36919938, 37216760, 37591721, 38017643, 37846357, 37943816, 37850690, 37855698, 38051130, 38645218, 38813393, 39254677, 38536335, 38794221, 39713406, 39823770, 40341784, 40919907, 41132553, 41383027, 41806485, 41989670, 41779139, 41594831, 41676946, 41549689, 41764085, 41816691, 41395230, 40829587, 41459340, 41175004, 40866821, 40569280, 40729574, 40421410, 40416562, 39792755, 40063008, 40420163, 40238856, 40472410, 40438510, 40786540, 40535820, 40231496, 40274699, 40671420, 40459699, 40322577, 40539981, 40608217, 40314964, 39900423, 40095598, 40339795, 40150321, 40073209, 39774385, 39374586, 39005528, 38915865, 38428404, 38696786, 38515787, 38578599, 38530501, 38116915, 37435747, 37313268, 37447213, 37424699, 37453182]
3082C7453182m4793k07858k23981j57184l29617q3129l31537N2839J46176k87180
3072C5986918k99009L81289k59735n72368l46329K0902k23929n6735l65375l04649
3062C3960980K18540k02341l27036K86671l89830l79084l97295j32118J3843L356
3052C2655686o8871n4476j90683j20771L5177N1663k9534l56121n42708p71378
3042C0607984o60235K17521J99943j15435m75846k25655R1142M83149j38696o64239
3032B9319633K25934k87766k24843k39041m39697L26473O729l88711l70501j22834
3022B7805376J07955N97105l64410l90244m96263L27524n04124o6267L43503m52475
3012B6907680l68612N0131m21869J61049K75483m69618k22618k41946l14464K1515
$$ y = [37453182, 37408389, 37200531, 36976550, 36819366, 36489749, 36406620, 36075083, 36127922, 36274098, 35986918, 35687909, 36069198, 35809463, 35237095, 34890766, 34911668, 34687739, 34631004, 34265629, 33960980, 34179520, 33977179, 33650143, 33936814, 33546984, 33167900, 32770605, 32638487, 32652330, 32655686, 32586815, 32532339, 32341656, 32220885, 32256062, 32307725, 32278191, 31922070, 31379362, 30607984, 29947749, 30165270, 30365213, 30249778, 29773932, 29548277, 29639419, 30122568, 29983872, 29319633, 29545567, 29257801, 29032958, 28793917, 28354220, 28680693, 28687422, 28298711, 27928210, 27805376, 27913331, 28510436, 28146026, 27755782, 27259519, 27587043, 27082919, 27016652, 27360155, 26907680, 26539068, 26589199, 26167330, 26328379, 26603862, 26134244, 25911626, 25669680, 25355216, 25376731]
3002B5376731q4358j43173n65363m73493J2749k95185K09664M48564k99319k57730
2992B3929087K12876n86756j68386n87938k014J13565k20323j96061L55645k70310
2982B2579385l45513K93115k71790k38558J61796o0161k40780m3033k89316q25802
2972B0719343j62327j76946K21488j94701r2903n8046J82544k73373l92286M84688
2962B0257481J280l15649j67687l30523K34428l92821L57745l2119J4927m73257
2952A9153805n76741l7379K92893n3955o53051j38262J88074m9372k84982J0554
2942A7851584k28474J00972l634n49418J23007n27623l90591R0654K58215J82892
2932A6907584p92965K6794n87828l18865K29722O63790j66622m66584j51748p0440
$$ y = [25376731, 25292373, 25149200, 24583837, 24110344, 24123093, 23827908, 24037572, 24486136, 24186817, 23929087, 24141963, 23555207, 23386821, 22798883, 22796869, 22910434, 22690111, 22494050, 22849695, 22579385, 22233872, 22526987, 22255197, 22016639, 22178435, 22118274, 21877494, 21834461, 21545145, 20719343, 20557016, 20380070, 20601558, 20406857, 20313954, 20255908, 20438452, 20165079, 19772793, 20257481, 20258761, 19943112, 19775425, 19444902, 19679330, 19286509, 19644254, 19612135, 19627062, 19153805, 18577064, 18539685, 18832578, 18778623, 18125572, 17987310, 18175384, 18126012, 17841030, 17851584, 17623110, 17724082, 17720448, 17171030, 17294037, 16766414, 16375823, 16466477, 16724692, 16907584, 16114619, 16141413, 15553585, 15234720, 15464442, 16128232, 15961610, 15495026, 15343278, 15272838]
2922A5272838j66185O0666j65418J92490K56300n3968k44238r63778J97002M66548
2912A4852257J15136n25785n7715k76488j45301L23417L0185p94766m73458n4793
2902A2992689k41065M90351l60305l30742K10371J72950J02665N00964o42506
2893A2895372n81137k60958l01018R8912Q179j53374k15139P53068n80385l65468
2883A1298052J76495K6545m64738M68772l85406l4969K40245L9238m85068R9565
2873A0978731Q21486l33871n97903k28414O2273L10096j75869j92054j1477k65430
2863A0367568k82792j03907J70351j29365m5806o23436K26366J11703J79018p07722
2853I161978L63146j3227J38531k14034K27452m47972p5719O1809l2726l19408
$$ y = [15272838, 15106653, 15167319, 15001901, 15194391, 15450691, 15396723, 15152485, 14188707, 14385709, 14852257, 14967393, 14441608, 14383893, 14107405, 13962104, 14285521, 14315706, 13520940, 13047482, 12992689, 12751624, 13241975, 12881670, 12550928, 12761299, 12934249, 13036914, 13537878, 12895372, 12314235, 12053277, 11752259, 11851171, 11859350, 11705976, 11490837, 12243905, 11663520, 11298052, 11474547, 11501092, 11036354, 11505126, 11119720, 11084751, 11324996, 11364234, 10879166, 10978731, 11800217, 11466346, 10868443, 10640029, 10702302, 11012398, 10836529, 10644475, 10632998, 10367568, 10084776, 9980869, 10151220, 10021855, 9976049, 9352613, 9578979, 9690682, 9869700, 9161978, 9525124, 9511897, 9650428, 9436394, 9663846, 9215874, 9140155, 9201964, 9169238, 8849830]
2843H849830k44848J63244j97467l64934M14014J04130o17089j17804M91087L8544
2833H518707m21125O3509J93247m65924K31049L42930j25557m06144k0004j6030
2823G894658k35776K9368l08348O39872o6771n71285k60674j51973k72823Q2707
2813F778955m12736j49859M79965L01878j87906k73133P329r5569j57760N7923
2803F349087L94496L42797J02539n98295M5048m61018r45873O82683j33625L88454
2793F166293O12377p92799L64173m8659m03910J20208l50514k78482n38951M99031
2783E348767q7153L26490J35298k5223J55381l07282l74073o6120K12511l74269
2773D944327J83984J22775j56505j92834m70026J24516J62278K51937K18896L58834
$$ y = [8849830, 8604982, 8768226, 8570759, 8205825, 8619839, 8723969, 8106880, 7989076, 8480163, 8518707, 8097582, 8161091, 8354338, 7888414, 8119463, 8462393, 8336836, 7930692, 7910688, 7894658, 7658882, 7688250, 7379902, 8019774, 7953003, 7381718, 7121044, 6969071, 6696248, 6778955, 6366219, 6216360, 6696325, 6998203, 6810297, 6537164, 6544493, 6448924, 6291164, 6349087, 6743583, 7086380, 7188919, 6590624, 6635672, 6174654, 5228781, 5911464, 5777839, 6166293, 6778670, 5985871, 6350044, 6301385, 5897475, 6017683, 5667169, 5388687, 4849736, 5348767, 5261614, 5588104, 5723402, 5698179, 5853560, 5546278, 5172205, 5106085, 5318596, 4944327, 5128311, 5251086, 5094581, 4901747, 4431721, 4556237, 4718515, 4970452, 5189348, 5548182]
2763E548182j23379m24380k56581J61553N2385K40978o07493o11721j62923J63693
2753C980314M26306j97513K04422k64563K17623J46344j55812k23075j75863L12076
2743D270259m93612j51095N03255q0819j04429k61383K71741J78204j03378Q3399
2733D112142l11015o40321K17384P54376J6163j58029L05104K97195n68472k85391
2723C739136K57486j35256J37334n03757L06544K70619o77736M33804l42096n29931
2713B956147l58369P45327k50969k48887J61918M7699K87665l66194M542M03936
2703C382815m34224m99741K3687N06159J01306o3713p36586l55548N59651O64025
2693C147831k7163o89146j0886N37276j84958l89053L71445q9021J78451K10943
$$ y = [5548182, 5424803, 5000423, 4743842, 4905395, 4957780, 5198758, 4591265, 3979544, 3816621, 3980314, 4406620, 4209107, 4413529, 4148966, 4366589, 4512933, 4357121, 4134046, 3958183, 4270259, 3776647, 3625552, 4128807, 4047988, 3943559, 3682176, 3953917, 4132121, 4028743, 4112142, 3801127, 3160806, 3378190, 4132566, 4148729, 3990700, 4295804, 4592999, 4024527, 3739136, 3996622, 3861366, 3998700, 3494943, 3801487, 4072106, 3394370, 3828174, 3486078, 2956147, 2597778, 3343105, 3092136, 2843249, 3005167, 3052866, 3340531, 2974337, 2978879, 3382815, 2948591, 2448850, 2472537, 2978696, 3080002, 3016289, 2279703, 1924155, 2483806, 3147831, 3120668, 2431522, 2420636, 2957912, 2772954, 2383901, 2755346, 2666325, 2844776, 3055719]
2683C055719k13752j68309L94774J54919l62111k20514j98269k110N28547m27612
2673B541282j33439M4409K23180j56297L35251m60082J52244J97135L7595J00177
2663B881455l62156K49284K73721r233l51963l21564l10758M49751L81559l97543
2653B482553p95275j38068P96717l45959L90259P73593l66551n71867k94351L78107
2643B309158P07878k49248o73537L939m36690L21007K64458M64927k52173n82764
2633A876955M2208j20245K38970j09344o38269L81701L54702O6787L90114n11474
2623A972105j33362J222161J11562o29156o72099k94642R0369L57198j51352M06293
2613B279077J35651j05627j28728k17719J60103o0910J02272R9296L74376j419
$$ y = [3055719, 2841967, 2673658, 3068432, 3223351, 2861240, 2640726, 2442457, 2440347, 2968894, 2541282, 2407843, 2452252, 2675432, 2519135, 2854386, 2394304, 2546548, 2743683, 2781278, 2881455, 2519299, 2768583, 3042304, 3033071, 2681108, 2359544, 2048786, 2498537, 2880096, 2482553, 1687278, 1549210, 2345927, 1999968, 2390227, 3163820, 2797269, 2225402, 1931051, 2309158, 3017036, 2767788, 2094251, 2098190, 1661500, 1982507, 2246965, 2711892, 2459719, 1876955, 1919163, 1798918, 2037888, 1928544, 1290275, 1671976, 2026678, 2093465, 2483579, 1972105, 1838743, 3060904, 3172466, 2543310, 1871211, 1576569, 1666938, 2024136, 1872784, 2279077, 2414728, 2309101, 2180373, 1962654, 2122757, 2061847, 2164119, 2263415, 2637791, 2636372]
2603B636372j70875k0545k19589m82952N78514p3892k18711L7003J44375k04986
2593B004714r4127J65312p5477J56291J0311m12861L58700Q6559j37200j37658
2583A924564j23821J7752J2210J26359o02n57947O4699K13368J67912n55451K43510
2572A532553K82081l21934K54641l32229J60698K82161M48805r7225l10149j43499
2562A755903l07214j22966l17527L87830J76506M08398J97010q91022j65732q2967
2552A038219k84387L89477M16533j32752j15408r8807L15123J4440J64195n23977
2542A182656r8443M8262P55979n6679p28110o0725P16818P21662m08465k99927
2532A773028j33102j26086L9981k08739m9516j59717K19956J54725N0781M10275
$$ y = [2636372, 2465497, 2444952, 2225363, 1742411, 2320925, 2247033, 2028322, 2065325, 2209700, 2004714, 1910587, 2075899, 2000422, 2156713, 2167024, 1754163, 2112863, 2199422, 2062222, 1924564, 1800743, 1818495, 1830705, 1957064, 1956462, 1398515, 1463214, 1676582, 1844494, 1289043, 1532553, 1814634, 1492700, 1747341, 1415112, 1575810, 1857971, 2306776, 2209551, 1899402, 1755903, 1448689, 1325723, 1008196, 1396026, 1572532, 1980930, 2177940, 1286918, 1121186, 1038219, 753832, 1143309, 1559842, 1427090, 1311682, 1212875, 1527998, 1542438, 1706633, 1182656, 1084213, 1132475, 1888454, 1831775, 1103665, 1042940, 1759758, 2481420, 2072955, 1773028, 1639926, 1513840, 1553821, 1345082, 1295566, 1135849, 1355805, 1510530, 1561311, 1971586]
2522A971586J15012m74723M50069j720q57430J31974o59374N97460j32755k38744
2512I01355O32145K54526R0112m78486K59411K19476n80441K12309J09063m16091
2502A203379K2294K45115o5738O62360j91370n90119k6679k5974J15536R4250
2492A443054L19556M83419p1985J12287j13025l62153M10867l69472k91034n6826
2482A504688N38789j60439K36590L17645m46286Q9153j71974K75126k62255k2739
2472A898298K42442p02364j96582M55403J97915J8060L20018k54827J6390k29220
2462A765533k95059l5710K71444J64895J19190N54887l02580K94182K09519N08444
2452C254745L80055p25147j58393l18947L313j93094K26923j61872l63222J37652
$$ y = [1971586, 2086598, 1611875, 2061944, 2060224, 1202794, 1334768, 675394, 1272854, 1140099, 901355, 1533500, 1788026, 1878138, 1399652, 1659063, 1878539, 1298098, 1510407, 1619470, 1203379, 1225673, 1470788, 1405050, 2067410, 1876040, 1285921, 1259242, 1233268, 1348804, 1443054, 1762610, 2246029, 2174044, 2286331, 2173306, 1811153, 2222020, 1852548, 1561514, 1504688, 2043477, 1883038, 2119628, 2437273, 1990987, 2080140, 1908166, 2183292, 1921037, 1898298, 2140740, 1438376, 1241794, 1697197, 1895112, 1913172, 2233190, 1978363, 1994753, 1765533, 1470474, 1434764, 1706208, 1871103, 1990293, 2545180, 2242600, 2536782, 2746301, 3254745, 3634800, 2909653, 2751260, 2432313, 2435626, 2242532, 2469455, 2307583, 1944361, 2082013]
2442B082013L25769K35375M5300n10395J82333K08066M73861j34364k07855J58568
2432B858671K79613M9505Q88770P9757l77182p9035M05077J9902k41287l56285
2422C527506l18547N57242O53131O01712L40606l5216m14024n8931q7308m22551
2412D343620m4929J047764L12719k89133J71510K20516l33490M15590J58387p76720
2402E225834J59137N40115m1253M96149l50846K39487K37577k03373j3073J082732
2392G372486Q7712j85101J34891K51454N0317L73326L11953P61076R9356Q54830
2382A0112300K52166N17221R17721O45306J158913M90603O56035M50433N38997
2373A5739695K49299k50831K33915N10726K47566J55991M31560L46800P02177
$$ y = [2082013, 2407782, 2643157, 2688457, 2178062, 2360395, 2568461, 3042322, 2907958, 2700103, 2858671, 3138284, 3187789, 4076559, 4156316, 3779134, 3700099, 4105176, 4125078, 3883791, 3527506, 3208959, 3766201, 4419332, 5021044, 5361650, 5326434, 4912410, 4853479, 4766171, 4343620, 4298691, 5346455, 5659174, 5370041, 5541551, 5762067, 5428577, 5844167, 6002554, 5225834, 5384971, 5925086, 5883833, 6379982, 6029136, 6268623, 6506200, 6302827, 6289754, 7372486, 7460198, 7275097, 7409988, 7661442, 7711759, 8085085, 8397038, 9158114, 9257470, 10112300, 10364466, 10881687, 11799408, 12444714, 13603627, 14094230, 14750265, 15200698, 15739695, 15988994, 15738163, 15972078, 16482804, 16730370, 16886361, 17317921, 17664721, 18366898]
2364A8366898K94398R84055L67241J51314M40212J233382J070019K65029J688401
2355B4860949J927198J526911J908097J621129J864081J134032J656715K823382
2347C9322494L455948K987055L346109M578365L684502K594463J187737O89442
2339F1846115K386549L166998M553471O819666R621057J3206812J8041055J4306931
2331A33948654n921074j9233295j9133341j2810425j0773109j0208423p810947
2324D8058040o624553n535871l933493k943500k016082k020515j130315j101292
2316B2752419j547758k039147j236028q43816j340330j069944j130611n38771
2308A3006014j155107j304809l72760o24740k14780k68473j61905j47418o72500
$$ y = [18366898, 18661296, 19645351, 20012592, 20163906, 20604118, 21837500, 22907519, 23172548, 24860949, 26788147, 28315058, 30223155, 31844284, 33708365, 34842397, 36499112, 39322494, 42778442, 45765497, 49111606, 53689971, 57374473, 59968936, 61156673, 61846115, 64232664, 67399662, 71953133, 78772799, 88393856, 101600668, 119641723, 133948654, 128027580, 108794285, 89660944, 76850519, 66077410, 55868987, 48058040, 41433487, 35897616, 31964123, 29020623, 27004541, 24984026, 23853711, 22752419, 21204661, 19165514, 17929486, 17085670, 15745340, 14675396, 13544785, 13006014, 11850907, 10546098, 10173338, 9548598, 9333818, 9065345, 8903440, 8756022, 8083522]
2299H083522j212927l24583p2066L4371m20461k02743Q375P6362m27164l83697
2289E158989J06198J37941P450m06126n26694k80769j6867n15988o25346N19645
2279C558433k72038m36817L31556Q0156r8258Q9059L75861n21477J70335n45073
2269B731737n80998m1257l06503l29236K41147P40213J15166k31161n86203K39308
2259A992213J48038O2681o01883l08908O17528j32781o9961J80254k50900N43920
2249B180201k7402r4454n66879m52191K72425j12541J84008J2147K11056m9475
2239A556895J0933K9400k02855K96696j38552o1292K26091k22863k36204o36906
2229F21343R3959K37762j0369Q4742M5204Q8768l97069k42605L62145m02108j61705
$$ y = [8083522, 6870595, 6546012, 6473946, 6508317, 6087856, 5885113, 5893488, 5969850, 5542686, 5158989, 5265187, 5403128, 5410578, 5004452, 4477758, 4196989, 4180122, 3664134, 3038788, 3558433, 3286395, 2849578, 3181134, 3261290, 3163032, 3252091, 3627952, 3106475, 3276810, 2731737, 2150739, 2109482, 1802979, 1473743, 1714890, 2455103, 2570269, 2339108, 1752905, 1992213, 2140251, 2202932, 1601049, 1292141, 1909669, 1776888, 1706927, 1887181, 1636281, 2180201, 2152799, 2058345, 1491466, 1039275, 1311700, 1199159, 1383167, 1395314, 1606370, 1556895, 1567828, 1597228, 1394373, 1691069, 1552517, 1491225, 1717316, 1494453, 1258249, 621343, 715302, 953064, 942695, 1027437, 1072641, 1161409, 764340, 521735, 883880, 481772, 320067]
2218C20067m0603M02481k0503j95223J30227Q80372m76887R92l1302J08351N0415
2207A128387j11719l04062n36231j82031q4322N6052M95132j53039P9656J81399
2197E69222J2364j70836K33702J97208k13072K57021l10967J4723K65581r0692
2187G64254k87071J54442l19217q5852k7307l5985K49726m14284M5349K78156
2177C22211J48572l5318l44262r140K8277K91760O3486m16143M4546n73146J23508
2166c55649Q14399l41621j32456L27280N593n42926K31657L22134R4890L41820
2156G65121l76516m24440L45889K13325m4854m7765j70945j69115r4357K52654
2146B48997K637M89633J74029l07265j21982j03087L68982m91164m64135K85622
$$ y = [320067, 279464, 681945, 661442, 466219, 596446, 1476818, 999931, 1000923, 969621, 1077972, 1128387, 1016668, 712606, 176375, -5656, -89978, -33926, 461206, 308167, 387823, 569222, 581586, 410750, 644452, 841660, 628588, 885609, 574642, 589365, 854946, 764254, 477183, 631625, 312408, 226556, 199249, 163264, 412990, -1294, 44055, 322211, 470783, 435465, 91203, 82063, 110340, 402100, 465586, 49443, 93989, -479157, -355649, 458750, 117129, -15327, 311953, 317546, -225380, 6277, 328411, 423301, 765121, 388605, -35835, 310054, 523379, 478525, 430760, 259815, 90700, -3657, 248997, 251634, 741267, 915296, 608031, 486049, 382962, 751944, 260780, -203355, 82267]
2136H2267l40888j0755J48620k00423O55939K22740l79809j90765l76039L1630
2126c57483J58681j98333m6747Q28800M67721o93299j57649k08958J34582m3111
$$ y = [82267, -258621, -269376, -120756, -321179, 334760, 557500, 177691, -13074, -389113, -357483, -198802, -397135, -443882, 384918, 852639, 159340, 1691, -207267, -72685, -115796]
$$ [...]
##END NTUPLES=NMR SPECTRUM
##END=
