##TITLE=1H_DE-80H_X3
 200.13MHz, d2o
 8 sc
 
 19ns.26.2.2025
##JCAMPDX= 6.0         $$ Bruker NMR JCAMP-DX V2.0
##DATA TYPE= NMR SPECTRUM
##DATA CLASS= NTUPLES
##ORIGIN= UXNMR, Bruker Analytische Messtechnik GmbH
##OWNER= pz
$$ XWIN-NMR		Version 3.5
$$ Mon Jun 23 11:45:36 2025 Russian Standard Time (UT+4h)  Yarkov@DPX200
##.OBSERVE FREQUENCY= 200.1313
##.OBSERVE NUCLEUS= ^1H
##.ACQUISITION MODE= SIMULTANEOUS
##.ACQUISITION SCHEME= undefined
##.AVERAGES= 8
##.DIGITISER RES= 18
##SPECTROMETER/DATA SYSTEM= spect
##.PULSE SEQUENCE= zg30
##.SOLVENT NAME= CDCl3
##.SHIFT REFERENCE= (INTERNAL, CDCl3, 0, 15.4527)
##AUDIT TRAIL= $$ (NUMBER, WHEN, WHO, WHERE, WHAT)
$$ ##TITLE= Audit trail, XWIN-NMR		Version 3.5
$$ ##JCAMPDX= 5.01
$$ ##ORIGIN= Bruker BioSpin GmbH
$$ ##OWNER= Yarkov
$$ C:/Bruker/XWIN-NMR/data/yarkov2/nmr/H-C/1/pdata/1/auditp.txt
$$ ##AUDIT TRAIL=  $$ (NUMBER, WHEN, WHO, WHERE, WHAT)
(   1,<2025-06-23 11:44:48.81 +0400>,<Yarkov>,<DPX200>,
      <created by zg, POWCHK disabled, PULCHK disabled
       configuration hash MD5:
       00 E9 B6 7A A2 85 ED C7 34 08 36 98 17 FE 4E 26
       data hash MD5: 16K
       A5 10 56 F8 40 D4 80 C8 F7 07 B3 AE 73 7C 23 13>)
(   2,<2025-06-23 11:44:56.73 +0400>,<Yarkov>,<DPX200>,
      <Start of raw data processing
       efp BC_mod = 2 LB = 0.25 FT_mod = 6 PKNL = 1 PHC0 = -1713.766 PHC1 = 10.1666 SI = 16K 
       data hash MD5: 16K
       B2 10 F0 ED 7F E6 80 0F CA BB 5B 2D D4 89 98 CC>)
(   3,<2025-06-23 11:45:04.70 +0400>,<Yarkov>,<DPX200>,
      <abs ABSG = 5 
       data hash MD5: 16K
       D5 54 C2 94 E5 04 D8 20 AB E6 DC 92 33 23 90 A0>)
$$ ##END=
$$ 
$$ hash MD5
$$ B6 CD A1 F1 F4 99 65 0C 08 86 95 6E F6 7F A9 A1
##$RELAX= 
##$RELAX= 
##$RELAX= 
##$RELAX= 
##$RELAX= 
##$RELAX= 
$$ Bruker specific parameters
$$ --------------------------
##$DU= <C:/Bruker/XWIN-NMR>
##$EXPNO= 1
##$NAME= <H-C>
##$PROCNO= 1
##$TYPE= <nmr>
##$USER= <yarkov2>
##$AMP= (0..31)
100 100 100 100 100 100 100 100 100 100 100 100 100 100 100 100 100 100 
100 100 100 100 100 100 100 100 100 100 100 100 100 100 
##$AQSEQ= 0
##$AQ_mod= 1
##$AUNM= <au_zg>
##$AUTOPOS= <>
##$BF1= 200.13
##$BF2= 200.13
##$BF3= 200.13
##$BF4= 200.13
##$BF5= 200.13
##$BF6= 200.13
##$BF7= 200.13
##$BF8= 200.13
##$BYTORDA= 1
##$CFDGTYP= 0
##$CFRGTYP= 5
##$CHEMSTR= <none>
##$CNST= (0..31)
1 1 145 1 1 1 1 1 1 1 1 1 1 1 1 1 1 1 1 1 1 1 1 1 1 1 1 1 1 1 1 1 
##$CPDPRG= <>
##$CPDPRG1= <>
##$CPDPRG2= <>
##$CPDPRG3= <>
##$CPDPRG4= <mlev>
##$CPDPRG5= <mlev>
##$CPDPRG6= <mlev>
##$CPDPRG7= <mlev>
##$CPDPRG8= <mlev>
##$CPDPRGB= <>
##$CPDPRGT= <>
##$D= (0..31)
0 0.7 0 0 0 0 0 0 0 0 0 0.03 0 0 0 0 0 0 0 0 0 0 0 0 0 0 0 0 0 0 0 0 
##$DATE= 1750664688
##$DBL= (0..7)
120 120 120 120 120 120 120 120 
##$DBP= (0..7)
150 150 150 150 150 150 150 150 
##$DBP07= 0
##$DBPNAM0= <>
##$DBPNAM1= <>
##$DBPNAM2= <>
##$DBPNAM3= <>
##$DBPNAM4= <>
##$DBPNAM5= <>
##$DBPNAM6= <>
##$DBPNAM7= <>
##$DBPOAL= (0..7)
0.5 0.5 0.5 0.5 0.5 0.5 0.5 0.5 
##$DBPOFFS= (0..7)
0 0 0 0 0 0 0 0 
##$DE= 6
$$ [...]
##$SUBNAM3= <"">
##$SUBNAM4= <"">
##$SUBNAM5= <"">
##$SUBNAM6= <"">
##$SUBNAM7= <"">
##$SUBNAM8= <"">
##$SUBNAM9= <"">
##$SW= 18.0517328524113
##$SWIBOX= (0..15)
0 0 2 0 0 0 0 0 0 0 0 0 0 0 0 0 
##$SW_h= 3612.71676300578
##$TD= 16384
##$TD0= 1
##$TE= 0
##$TE2= 300
##$TE3= 300
##$TEG= 300
##$TL= (0..7)
0 120 120 120 120 120 120 120 
##$TP= (0..7)
150 150 150 150 150 150 150 150 
##$TP07= 0
##$TPNAME0= <>
##$TPNAME1= <>
##$TPNAME2= <>
##$TPNAME3= <>
##$TPNAME4= <>
##$TPNAME5= <>
##$TPNAME6= <>
##$TPNAME7= <>
##$TPOAL= (0..7)
0.5 0.5 0.5 0.5 0.5 0.5 0.5 0.5 
##$TPOFFS= (0..7)
0 0 0 0 0 0 0 0 
##$TUNHIN= 0
##$TUNHOUT= 0
##$TUNXOUT= 0
##$USERA1= <user>
##$USERA2= <user>
##$USERA3= <user>
##$USERA4= <user>
##$USERA5= <user>
##$V9= 5
##$VALIST= <valist>
##$VCLIST= <CCCCCCCCCCCCCCC>
##$VD= 0
##$VDLIST= <DDDDDDDDDDDDDDD>
##$VPLIST= <PPPPPPPPPPPPPPP>
##$VTLIST= <TTTTTTTTTTTTTTT>
##$WBST= 1024
##$WBSW= 4
##$XGAIN= (0..3)
0 0 0 0 
##$XL= 0
##$YL= 0
##$YMAX_a= 88311
##$YMIN_a= -52240
##$ZGOPTNS= <>
##$ZL1= 120
##$ZL2= 120
##$ZL3= 120
##$ZL4= 120
##$ABSF1= 15.42075
##$ABSF2= -2.631098
##$ABSG= 5
##$ABSL= 3
##$ALPHA= 0
##$AQORDER= 0
##$ASSFAC= 0
##$ASSFACI= 0
##$ASSFACX= 0
##$ASSWID= 0
##$AUNMP= <proc_1d>
##$AZFE= 0.1
##$AZFW= 0.1
##$BCFW= 0
##$BC_mod= 2
##$BYTORDP= 0
##$COROFFS= 0
##$CY= -3
##$DATMOD= 1
##$DC= 0
##$DFILT= <>
##$DTYPP= 0
##$F1P= 0
##$F2P= 0
##$FCOR= 1
##$FTSIZE= 16384
##$FT_mod= 6
##$GAMMA= 0
##$GB= 0
##$INTBC= 1
##$INTSCL= 3.241238e-09
##$ISEN= 128
##$LB= 0.25
##$LEV0= 0
##$LPBIN= 0
##$MAXI= 10000
##$MC2= 0
##$MEAN= 0
##$ME_mod= 0
##$MI= 1.114404
##$NCOEF= 0
##$NC_proc= -10
##$NLEV= 6
##$NOISF1= 3.799351
##$NOISF2= 2.8
##$NSP= 0
##$NTH_PI= 0
##$NZP= 0
##$OFFSET= 15.45271
##$PC= 1
##$PHC0= -1713.766
##$PHC1= 10.1666
##$PH_mod= 1
##$PKNL= yes
##$PPARMOD= 0
##$PSCAL= 0
##$PSIGN= 0
##$REVERSE= no
##$SF= 200.130013806941
##$SI= 16384
##$SIGF1= 3
##$SIGF2= 2
##$SINO= 0.751879
##$SIOLD= 32768
##$SREGLST= <19F.Aceton>
##$SSB= 0
##$STSI= 16384
##$STSR= 0
##$SW_p= 3612.71676300578
##$SYMM= 0
##$S_DEV= 0
##$TDeff= 16384
##$TDoff= 0
##$TI= <>
##$TILT= no
##$TM1= 0
##$TM2= 0
##$TOPLEV= 0
##$USERP1= <user>
##$USERP2= <user>
##$USERP3= <user>
##$USERP4= <user>
##$USERP5= <user>
##$WDW= 1
##$XDIM= 16384
##$YMAX_p= 298138398
##$YMIN_p= -2949586
$$ End of Bruker specific parameters
$$ ---------------------------------
##NTUPLES= NMR SPECTRUM
##VAR_NAME=  FREQUENCY,     SPECTRUM/REAL,   SPECTRUM/IMAG
##SYMBOL=    X,             R,               I
##VAR_TYPE=  INDEPENDENT,   DEPENDENT,       DEPENDENT
##VAR_FORM=  AFFN,          ASDF,            ASDF
##VAR_DIM=   16384,         16384,           16384
##UNITS=     HZ,            ARBITRARY UNITS, ARBITRARY UNITS
##FACTOR=    0.220516191357247, 1,           1
##FIRST=     3092.55109600885, 0,            0
##LAST=      -520.165666996932, 0,           0
##MIN=       -520.165666996932, -2949586,    0
##MAX=       3092.55109600885, 298138398,    0
$$ Real data points
##PAGE= N=1
##DATA TABLE= (X++(R..R)), XYDATA
$$ [...]
$$ plain form
11743 894717 1072237 1744741 1389972 542266 454708 931563 953031 844360 1127054 1007616
11733 1007616 1299267 1029655 1074656 807772 483487 1380438 1182634 885163 1228773 841789
11723 841789 193150 405746 656265 631367 1070892 671230 980887 871343 628123 716697
11713 716697 1106271 1145948 1059723 773106 870991 925807 942491 517517 348854 513083
11703 513083 96742 574099 476399 537528 331927 208550 -307796 -190021 165236 130500
11693 130500 490925 73478 -266476 244757 264369 282962 657770 362234 232107 -392632
11683 -392632 -117313 -103791 408382 525278 221915 598014 836228 654452 190918 323071
11673 323071 -98843 399123 154728 105140 778537 57657 -41253 -112374 119830 317112
$$ packed form
11743H94717J77520O72504l54769q47706q7558M76855K1468j08671K82694j19438
11733A007616K91651k69612M5001k66884l24285Q96951j97804k97471L43610l86984
11723H41789o48639K12596K50519k4898M39525l99662L09657j09544k43220Q8574
11713G16697L89574L9677q6225k86617R7885N4816J6684m24974j68663J64229
11703E13083m16341M77357r7700O1129k05601j23377n16346J17775L55257l4736
11693A30500L60425m17447l39954N11233J9612J8593L74808k95536j30127o24739
11683c92632K75319J3522N12173J16896l03363L76099K38214j81776m63534J32153
11673C23071m21914M97966k44395m9588O73397p20880r8910p1121K32204J97282
$$ plain form
11663 317112 271248 460986 289075 1034383 1038212 552144 231177 443191 495612 27039
11653 27039 -103760 254262 525344 751249 86289 300637 486811 381158 434155 20797
11643 20797 49833 -113291 -365061 -39468 89575 -113163 64238 142074 -378286 -339023
11633 -339023 55312 356379 315949 533506 202674 24795 96841 -70497 206184 251281
11623 251281 475248 347012 -441317 -653730 -168513 -188449 46520 -117418 -656539 -343936
11613 -343936 -138695 -70354 173294 225414 826808 645475 844121 1206655 650937 623090
11603 623090 538378 391879 412434 630314 92273 -507985 186947 76154 496579 514796
11593 514796 121148 -106528 60394 463336 485684 366556 264492 210412 204465 219386
$$ packed form
11663C17112m5864J89738j71911P45308L829m86068l20967K12014N2421m68573
11653B7039j30799L58022K71082K25905o64960K14348J86174j05653N2997m13358
11643B0797K9036j63124k51770L25593J29043k02738J77401P7836n20360L9263
11633c39023L94335L01067m0430K17557l30832j77879P2046j67338K76681M5097
11623B51281K23967j28236p88329k12413M85217j9936K34969j63938n39121L12603
11613c43936K05241O8341K43648N2120O01394j81333J98646L62534n55718k7847
11603F23090q4712j46499K0555K17880n38041o00258O94932j10793M20425J8217
11593E14796l93648k27676J66922M02942K2348j19128j02064n4080n947J4921
$$ plain form
11583 219386 124232 52836 105819 237906 200597 -194966 353356 -61629 -256710 531484
11573 531484 722091 411640 38962 -149491 88416 -11431 280113 786719 934604 1131212
11563 1131212 866546 112633 295258 -84399 242002 583669 870068 746203 980353
11554 980353 1270727 839689 1191536 710666 552966 376257 476920 295860 515821 762036
11544 762036 728841 455454 755383 871841 657212 241160 398475 316490 -122956 -16788
11534 -16788 700895 676453 507777 221032 600047 877918 962032 482092 259174 198827
11524 198827 160793 256068 284262 -205748 -340388 -22220 324004 76726 702448 1012077
11514 1012077 312552 294183 -44119 110729 -10968 268768 411554 14459 395493 400488
$$ packed form
11583B19386r5154p1396N2983J32087l7309l95563N48322m14985j95081P88194
11573E31484J90607l10451l72678j88453K37907r9847K91544N06606J47885J96608
11563A131212k64666p53913J82625l79657L26401L41667K86399j23865K34150
11554I80353K90374m31038L51847m80870j57700j76709J00663j81060K19961K46215
11544G62036l3195k73387K99929J16458k14629m16052J57315q1985m39446J06168
11534a6788P17683k4442j68676k86745L79015K77871Q4114m79940k22918o0347
11524A98827l8034R5275K8194m90010j34640L18168L46224k47278O25722L09629
11514A012077o99525j8369l38302J54848j21697K79736J42786l97095L81034M995
$$ plain form
11504 400488 -100946 102101 27835 -150752 157180 -118090 -84880 83734 18622 337059
11494 337059 400881 705190 682125 719022 599615 456383 207671 242760 488278 -180086
11484 -180086 94273 -20989 146968 477444 -21090 480583 567581 708495 690690 1087700
11474 1087700 810843 137824 58175 -268232 -73009 284152 17483 300488 -29284 -467788
11464 -467788 -295190 -131765 -20309 -51225 -157277 -124905 -124233 182134 47796 18969 654319
11453 654319 327934 -90592 128335 374134 79440 9066 -126458 -127488 -75846 -52218
11443 -52218 359262 560329 -175329 -266689 -20079 64739 -71707 122855 222058 -116606
11433 -116606 285027 381647 439098 666509 923013 215160 500809 471722 567635 454386
$$ packed form
11504D00488n01434K03047p4266j78587L07932k75270L3210J68614o5112L18437
11494C37059O3822L04309k3065L6897j19407j43232k48712L5089K45518o68364
11484a80086K74359j15262J67957L30476m98534N01673Q6998J40914j7805L97010
11474A087700k76857o73019p9649l26407J95223L57161k66669K83005l29772m38504
11464d67788J72598J63425J11456l0916j06052L2372O72L06367j34338k8827O35350
11453F54319l26385m18526K18927K45799k94694p0374j35524j030N1642K3628
11443e2218M11480K01067p35658r1360K46610Q4818j36446J94562R9203l38664
11433a16606M01633R6620N7451K27411K56504p07853K85649k9087R5913j13249
$$ plain form
11423 454386 664620 901597 782465 590118 353509 433382 389911 185405 338512 233026
11413 233026 -722134 -243273 48088 -179818 -170512 -47124 -640720 -643759 -94080 232861
11403 232861 -195691 -575397 -652080 -590928 -251469 -231584 -127653 -610166 -223861 114465
11393 114465 -106255 -30004 -104187 18046 437332 469818 -4988 -156121 -239757 -655590
11383 -655590 -712492 -49275 -241412 -357032 -362136 -375664 -550146 -50180 -149489 -444278
11373 -444278 272225 539490 260797 -481 233097 -149993 -8817 464501 118425 359134
11363 359134 368636 192416 289440 -300142 -285121 -431080 -543163 112453 -134314 -176345
11353 -176345 242520 -485960 -477362 -406367 -924020 -621013 -451345 -572083 -251968 -338739
$$ packed form
11423D54386K10234K36977j19132j92347k36609P9873m3471k04506J53107j05486
11413B33026r55160M78861K91361k27906R306J23388n93596l039N49679L26941
11403B32861m28552l79706p6683O1152L39459J9885J03931m82513L86305L38326
11393A14465k20720P6251p4183J22233M19286L2486m74806j51133q3636m15833
11383f55590n6902O63217j92137j15620n104j3528j74482M99966r9309k94789
11373d44278P16503K67265k78693k61278K33578l83090J41176M73318l46076K40709
11363C59134R502j76220R7024n89582J5021j45959j12083O55616k46767m2031
11353a76345M18865p28480Q598P0995n17653L03007J69668j20738L20115q6771
$$ plain form
11343 -338739 -375869 -683701 -1372316 -1044887 -315430 -398292 -1213396 -1007603 -498933 -361938
11333 -361938 -376026 -601192 -308377 -570413 -646615 -374715 -614390 -156730 -527277 -199170
11323 -199170 -150865 -325417 -372869 -489922 -244444 -735428 -893644 -590621 -825030 -558363
11313 -558363 -444465 126005 -33336 -918908 -908734 -927119 -1079625 -580005 -518021 -625184
11303 -625184 -453051 -722344 -265051 -207718 -402064 -366914 -394699 -230832 -578206 -974307
11293 -974307 -231190 -321441 -344053 -719654 -1055819 -830281 -274513 -102641 -544006 -383545
11283 -383545 -134833 -1021151 -996855 -244297 -272690 -362500 -1189462 -783687 -835586 -1032828
11273 -1032828 -337511 -379378 -269036 -573759 -794424 -1051290 -1416482 -846013 -592520 -926218
$$ packed form
11343c38739l7130l07832o88615L27429P29457q2862q15104K05793N08670J36995
11333c61938j4088k25166K92815k62036p6202K71900k39675M57660l70547L28107
11323a99170M8305j74552m7452j17053K45478m90984j58216L03023k34409K66667
11313e58363J13898N70470j59341q85572J0174j8385j52506M99620O1984j07163
11303f25184J72133k69293M57293N7333j94346L5150k7785J63867l47374l96101
11293i74307P43117r0251k2612l75601l36165K25538N55768J71872m41365J60461
11283c83545K48712q86318K4296P52558k8393q9810q26962M05775n1899j97242
11273a032828O95317m1867J10342l04723k20665k56866l65192N70469K53493l33698
$$ plain form
11263 -926218 -280581 -589993 -370279 -269795 -153597 -420311 -614986 -8631 -307036 -737893
11253 -737893 -890608 -962627 -1597685 -1274676 -888279 -592790 -830941 -996027 -952030 -376370
11243 -376370 -22414 -205651 -592241 -1118510 -1005870 -652503 -520632 -393603 -440508 -701663
11233 -701663 -587286 -303451 -224089 -543726 -217529 -146121 -540894 -760765 -356266 -463933
11223 -463933 -641156 -742531 -596433 -909109 -1081826 -827725 -755835 -337659 -594834 -765122
11213 -765122 -369882 -680466 -294150 -323863 -647781 -755061 -469098 -262148 -1079450 -927378
11203 -927378 -447072 -293433 -290840 -467405 -359401 -262363 -116621 -159048 -95086 -672148
11193 -672148 -738097 -500678 -313560 -563371 -521111 468714 504647 -140077 -952084 -1034345
$$ packed form
11263i26218O45637l09412K19714J00484J16198k66714j94675O06355k98405m30857
11253g37893j52715p2019o35058L23009L86397K95489k38151j65086M3997N75660
11243c76370L53956j83237l86590n26269J12640L53367J31871J27029m6905k61155
11233g01663J14377K83835P9362l19637L26197P1408l94773k19871M04499j07667
11223d63933j77223j01375J46098l12676j72717K54101P1890M18176k57175j70288
11213g65122L95240l10584L86316k9713l23918j07280K85963K06950q17302J52072
11203i27378M80306J53639K593j76565J08004R7038J45742m2427O3962n77062
11193f72148o5949K37419J87118k49811M2260R89825L5933o44724q12007q2261
$$ plain form
11183 -1034345 -905348 -137839 -399909 -695386 -1173404 -884337 -971770 -474212 -67344 -454173
11173 -454173 -631971 -472442 -779768 -816068 -1068110 -1133601 -757773 -1004531 -987984 -995675
11163 -995675 -1019781 -598301 -459430 -518740 -640695 -370201 -486510 -1028974 -675975 -258942
11153 -258942 -826117 -1223069 -1178331 -1023595 -910488 -918724 -711839 -732109 -461987 -295601
11143 -295601 -852574 -1083468 -936665 -911606 -1054232 -1213468 -778567 -317952 -469173 -515653
11133 -515653 -398173 -497376 -867512 -900380 -963823 -1482985 -1288310 -902629 -1108091 -903392
11123 -903392 -874256 -581330 -539366 -847717 -1204871 -1102023 -482555 -1002185 -752841 -1133624
11113 -1133624 -1012343 -642100 -687110 -983373 -541916 -220379 -525071 -1063192 -1089364 -1475982
$$ packed form
11183a034345J28997P67509k62070k95477m78018K89067q7433M97558M06868l86829
11173d54173j77798J59529l07326l6300k52042o5491L75828k46758J6547p691
11163i95675k4106M21480J38871n9310j21955K70494j16309n42464L52999M17033
11153b58942n67175l96952M4738J54736J13107q236K06885k0270K70122J66386
11143b95601n56973k30894J46803K5059j42626j59236M34901M60615j51221m6480
11133e15653J17480r9203l70136l2868o3443n19162J94675L85681k05462K04699
11123i03392K9136K92926M1964l08351l57154J02848O19468n19630K49344l80783
11113a133624J21281L70243m5010k96263M41457L21537l04692n38121k6172l86618
$$ plain form
11103 -1475982 -1182707 -953495 -817623 -572428 -911277 -1332424 -1184920 -1125242 -793028 -971114
11093 -971114 -1045919 -1224799 -1177101 -1325448 -1139098 -1728435 -1581934 -1198602 -921888 -578732
11083 -578732 -1084022 -1442871 -1472748 -1842571 -1776257 -1245894 -1113663 -1145693 -1473221 -1407732
11073 -1407732 -1620012 -1480145 -1403997 -1373371 -1375479 -804327 -960771 -498986 -232275 -42028
11063 -42028 -550756 -696618 -997229 -1040160 -763823 -1104795 -1005308 -1053587 -1037498 -673420
11053 -673420 -963546 -1662216 -1571410 -1127416 -1226632 -1168253 -1165834 -1110610 -1276446 -967197 -1023897
11042 -1023897 -995022 -902906 -1311697 -1107905 -349172 -704431 -397457 -163623 -613879 -583151
11032 -583151 -866293 -1280723 -946277 -1326739 -1427348 -1320895 -1135093 -848343 -885104 -764005
$$ packed form
11103a475982K93275K29212J35872K45195l38849m21147J47504N9678L32214j78086
11093i71114p4805j78880M7698j48347J86350n89337J46501L83332K76714L43156
11083e78732n05290l58849k9877l69823O6314N30363J32231l2030l27528O5489
11073a407732k12280J39867P6148L0626k108N71152j56444M61785K66711J90247
11063d2028n08728j45862l00611m2931K76337l40972R9487m8279J6089L64078
11053f73420k90126o98670R0806M43994r9216N8379K419N5224j65836L09249n6700
11042a023897K8875R2116m08791K03792P58733l55259L06974K33834m50256L0728
11032e83151k83142m14430L34446l80462j00609J06453J85802K86750l6761J21099
$$ plain form
11022 -764005 -1045523 -1171206 -1179023 -1092764 -908726 -1038599 -1284342 -1291268 -900652 -363132
11012 -363132 -489690 -214112 -339599 -809689 -840432 -1341662 -1085717 -1268058 -1273816 -578425
11002 -578425 -329351 -526143 -744067 -1351881 -1759399 -985734 -1500245 -1473995 -1410957 -1364440
10992 -1364440 -1461261 -1508850 -1662441 -1080819 -737917 -566829 -1206713 -1309076 -761951 -690018
10982 -690018 -589120 -363563 -970850 -1170043 -1201997 -1295818 -747438 -887111 -480112 -365303
10972 -365303 -487814 -801434 -563605 -942645 -1589491 -1691810 -1212670 -1174575 -1018451 -588872
10962 -588872 -675103 -1410125 -1559546 -1229562 -1165185 -490040 -698932 -986941 -1900455 -1707324
10952 -1707324 -1221790 -1410236 -1039739 -880221 -684379 -910146 -774092 -909623 -614032
$$ packed form
11022g64005k81518j25683p817Q6259J84038j29873k45743o926L90616N37520
11012c63132j26558K75578j25487m70090l0743n01230K55945j82341n758O95391
11002e78425K49074j96792k17924o07814m07518P73665n14511K6250O3038M6517
10992a364440r6821m7589j53591N81622L42902J71088o39884j02363N47125P1933
10982f90018J00898K25557o07287j99193l1954r3821N48380j39673M06999J14809
10972c65303j22511l13620K37829l79040o46846j02319M79140L8095J56124M29579
10962e88872q6231p35022j49421L29984O4377O75145k08892k88009r13514J93131
10952a707324M85534j88446L70497J59518J95842k25767J36054j35531K95591
$$ plain form
10943 -614032 -786257 -984383 -1167986 -1324400 -1260128 -1356657 -1632778 -1466867 -533238 -934711
10933 -934711 -1267535 -1656170 -1455739 -985122 -232961 -572469 -1337260 -862319 -1187083 -1109635
10923 -1109635 -1491818 -1628022 -1396543 -1426729 -811824 -768736 -836632 -938074 -725059 -761315
10913 -761315 -1258139 -1106376 -1342096 -1142007 -886692 -745689 -1160700 -1585050 -1185243 -1504348
10903 -1504348 -1293469 -578858 -124330 -170852 -391608 -900181 -1157724 -793163 -579692 189610
10893 189610 216163 -733479 -836676 -659703 -707731 -1433632 -1677605 -1590024 -1539381 -1226011
10883 -1226011 -765612 -561608 -510233 -926937 -950917 -1598455 -1817687 -1025685 -955622 -1371710
10873 -1371710 -1391047 -1092050 -1009518 -812388 -1142247 -1128412 -789312 -1164467 -1760042 -1726999
$$ packed form
10943f14032j72225j98126j83603j56414O4272r6529k76121J65911R33629m01473
10933i34711l32824l88635K00431M70617P52161l39508p64791M74941l24764P7448
10923a109635l82183j36204K31479l0186O14905M3088o7896j01442K13015l6256
10913g61315m96824J51763k35720K00089K55315J41003m15011m24350L99807l19105
10903a504348K10879P14611M54528m6522k20756n08573k57543L64561K13471P69302
10893A89610K6553r49642j03197J76973m8028p25901k43973Q7581N0643L13370
10883a226011M60399K04004N1375m16704k3980o47538k19232P92002P0063m16088
10873a371710j9337K98997Q2532J97130l29859J3835L39100l75155n95575L3043
$$ plain form
10863 -1726999 -1540058 -1647285 -827649 -552389 -1361708 -1360804 -710259 -916597 -1123943 -785864
10853 -785864 -1319843 -783861 -1250648 -1289390 -1007514 -1389525 -1076677 -1032327 -1411486 -1378326
10843 -1378326 -983987 -344351 -488995 -781335 -638287 -1047099 -951408 -972238 -989155 -1290576
10833 -1290576 -1405513 -1340720 -1067213 -384322 -407232 -1125378 -1013671 -943844 -789666 -584962
10823 -584962 -1042513 -1019239 -1207101 -1544923 -1183919 -856759 -1387897 -1161513 -813543 -1105619
10813 -1105619 -1240986 -1627598 -2046271 -1994263 -1815025 -995391 -926080 -1600990 -1539651 -1226791
10803 -1226791 -1047474 -853460 -1116044 -1298705 -1472625 -1019685 -1599578 -1744233 -1378140
10794 -1378140 -1016690 -1264730 -1565873 -1636242 -1911870 -2170939 -2093574 -1653594 -1672532 -1707070
$$ packed form
10863a726999J86941j07227Q19636K75260q09319R04O50545k06338k07346L38079
10853g85864n33979N35982m66787l8742K81876l82011L12848M4350l79159L3160
10843a378326L94339O39636j44644k92340J43048m08812R5691k0830j6917l01421
10833a290576j14937O4793K73507O82891k2910p18146J11707O9827J54178K04704
10823e84962m57551K3274j87862l37822L61004L27160n31138K26384L47970k92076
10813a105619j35367l86612m18673N2008J79238Q19634O9311o74910O1339L12860
10803a226791J79317J94014k62584j82661j73920M52940n79893j44655L66093
10794a378140L61450k48040l01143p0369k75628k59069P7365M39980j8938l4538
$$ plain form
10784 -1707070 -2008491 -2412195 -2083768 -1696831 -1613136 -1456127 -1599684 -1703575 -1945749 -1551369
10774 -1551369 -881723 -955987 -530797 -165692 -825822 -1152909 -1242490 -1471062 -1857716 -1690139
10764 -1690139 -1660447 -1392676 -1601994 -1884503 -1731196 -1596695 -1742702 -1608078 -1330138 -1455325
10754 -1455325 -1852879 -1246845 -1386229 -1731287 -1510460 -1158077 -1390434 -1464007 -971242 -1343975
10744 -1343975 -1394071 -1103648 -1045311 -696159 -1267878 -1544447 -1038290 -1149051 -1102966 -943069
10734 -943069 -1418188 -1507883 -1435068 -1444499 -966173 -1075918 -876159 -881143 -1282067 -1439986 -1326542
10723 -1326542 -1484965 -1536051 -1792111 -1802674 -1311997 -1638314 -1416936 -1284333 -1621465 -1716927
10713 -1716927 -2020935 -1296273 -869768 -1295362 -1367269 -1689620 -1710264 -1403918 -1100315 -1393847
$$ packed form
10784a707070l01421m03704L28427L86937Q3695J57009j43557j03891k42174L94380
10774a551369O69646p4264M25190L65105o60130l27087q9581k28572l86654J67577
10764a690139K9692K67771k09318k82509J53307J34501j46007J34624K77940j25187
10754a455325l97554O06034j39384l45058K20827L52383k32357p3573M92765l72733
10744a343975n0096K90423N8337L49152n71719k76569N06157j10761M6085J59897
10734i43069m75119q9695P2815r431M78326j09745J99759m984m00924j57919J13444
10723a326542j58423n1086k56060j0563M90677l26317K21378J32603l37132r5462
10713a716927l04008P24662M26505m25594p1907l22351k0644L06346L03603k93532
$$ plain form
10703 -1393847 -1419490 -1827334 -1645508 -1480785 -1497740 -1425726 -1535261 -1534104 -1376763 -1349280
10693 -1349280 -1759065 -1733469 -1174181 -997967 -901534 -742031 -1710093 -1842962 -1963405 -1233149
10683 -1233149 -1286621 -1303622 -413071 -676356 -1318753 -1619855 -1548150 -1549933 -1802233 -2088770
10673 -2088770 -1843563 -1636098 -2036421 -2251956 -1779917 -1550897 -897899 -916603 -814978 -687166
10663 -687166 -1088002 -585134 -938454 -1335656 -1243202 -1391057 -1404733 -1314449 -775324 -1044883
10653 -1044883 -1405618 -1423888 -1812247 -1582969 -1304550 -1351161 -1671925 -1369955 -1379315 -1306258
10643 -1306258 -1161023 -963549 -1005043 -1379536 -1676975 -1511245 -1597162 -1589872 -1517557 -1868728
10633 -1868728 -1615182 -1388875 -1117527 -1295643 -1438543 -1178318 -892660 -1653201 -1782489
$$ packed form
10703a393847k5643m07844J81826J64723j6955P2014j09535J157J57341K7483
10693a349280m09785K5596N59288J76214R6433J59503r68062j32869j20443P30256
10683a233149n3472j7001Q90551k63285o42397l01102P1705j783k52300k86537
10673b088770K45207K07465m00323k15535M72039K29020O52998j8704J01625J27812
10663f87166m00836N02868l53320l97202R2454j47855j3676R0284N39125k69559
10653a044883l60735j8270l88359K29278K78419m6611l20764L01970r360P3057
10643a306258J45235J97474m1494l74493k97439J65730q5917P290P2315l51171
10633a868728K53546K26307K71348j78116j42900K60225K85658p60541j29288
$$ plain form
10624 -1782489 -1445977 -1457562 -1304383 -1212328 -1455903 -1329130 -1427523 -1326382 -1337922 -1454299
10614 -1454299 -1814889 -1936137 -1264182 -995724 -1005173 -1117312 -958928 -855832 -1110511 -1519121
10604 -1519121 -1665748 -1503699 -1374686 -1831516 -1952587 -1371167 -1750757 -1948145 -2019181 -1918087
10594 -1918087 -1440697 -1788036 -1268352 -822321 -555981 -791109 -1306070 -1584167 -1327802
10585 -1327802 -1547932 -1297967 -1409207 -1783659 -2293282 -1654555 -1547434 -1111431 -1200880 -1614500
10575 -1614500 -1913853 -1839021 -1263133 -1266272 -1318712 -1843527 -1411906 -1505241 -1959159 -2155246
10565 -2155246 -1686698 -1543018 -1820091 -1575344 -1643727 -1783215 -1531550 -1869358 -1917149 -1616983
10555 -1616983 -1341558 -1631788 -1755735 -1716768 -1283457 -1310212 -1375335 -965524 -1569059 -1686243
$$ packed form
10624a782489L36512j1585J53179R2055k43575J26773r8393J01141j1540j16377
10614a454299l60590j21248O71955K68458r449j12139J58384J03096k54679m08610
10604a519121j46627J62049J29013m56830j21071N81420l79590j97388p1036J01094
10594a918087M77390l47339N19684M46031K66340k35128n14961k78097K56365
10585a327802k20130K49965j11240l74452n09623O38727J07121M36003q9449m13620
10575a614500k99353P4832N75888l139n2440n24815M31621r3335m53918j96087
10565b155246M68548J43680k77073K44747o8383j39488K51665l37808m7791L00166
10555a616983K75425k90230j23947L8967M33311k6755o5123M09811o03535j17184
$$ plain form
10545 -1686243 -1863635 -2028731 -1744478 -1223787 -1421300 -1669089 -838708 -1330642 -2118849
10536 -2118849 -1531859 -1130940 -1116350 -845434 -1207715 -1885469 -1672614 -1381309 -1293154 -634114
10526 -634114 -317106 -638256 -1203664 -1634508 -1440991 -931175 -1136855 -1001852 -971777 -886780
10516 -886780 -1173398 -1016981 -1307826 -1426636 -1128688 -979638 -920656 -926532 -1009208 -1123216
10506 -1123216 -1147783 -858489 -959722 -1149812 -1084334 -1509856 -1670024 -978971 -1026689 -1271865
10496 -1271865 -1126327 -1154079 -1151083 -1485273 -1806840 -1371002 -1093106 -1061264 -1001909 -1068003
10486 -1068003 -1512103 -1157166 -1087430 -897597 -1126718 -1559175 -1378471 -677532 -263071 -608923
10476 -608923 -1155359 -1014883 -418923 -644769 -1399331 -1153960 -1119721 -1461347 -1393975 -1941944
$$ packed form
10545a686243j77392j65096K84253N20691j97513k47789Q30381m91934p88207
10536b118849N86990M00919J4590K70916l62281o77754K12855K91305Q8155O59040
10526f34114L17008l21150n65408m30844J93517N09816k05680J35003L0075Q4997
10516h86780k86618J56417k90845j18810K97948J49050N8982n876q2676j14008
10506a123216k4567K89294j01233j90090O5478m25522j60168O91053m7718k45176
10496a271865J45538k7752K996l34190l21567M35838K77896L1842N9355o6094
10486a068003m44100L54937O9736J89833k29121m32457J80704P00939M14461l45852
10476f08923n46436J40476N95960k25846p54562K45371L4239l41626O7372n47969
$$ plain form
10466 -1941944 -1898795 -1896986 -1451601 -1154597 -964521 -526667 -595267 -1079433 -914541 -1195113
10456 -1195113 -864621 -1108237 -642980 -976895 -1140162 -1066144 -1350074 -1509508 -1076191 -597459
10446 -597459 207006 424298 144509 -196173 -464116 -350160 -192647 106199 -68208 -68150
10436 -68150 -39559 -499061 -562358 -238653 203678 369474 95701 141405 -181963 249256
10426 249256 422983 487646 651849 674570 1268121 1414043 1633276 1290577 1022804 1259413
10416 1259413 1602024 2015339 2436115 2654581 2337501 1858958 1490812 1026990 1185949
10407 1185949 1681674 1280308 1516291 1520251 1719599 2203024 2036408 1952928 2060863 1927178
10397 1927178 2134825 2301103 1821136 1730402 1324674 1661879 2098470 1435545 1740957 1929503
$$ packed form
10466a941944M3149J809M45385K97004J90076M37854o8600m84166J64892k80572
10456a195113L30492k43616M65257l33915j63267P4018k83930j59434M33317M78732
10446e97459Q04465K17292k79789l40682k67943J13956J57513K98846j74407N8
10436f8150K8591m59502o3297L23705M42331J65796k73773M5704l23368M31219
10426B49256J73727O4663J64203K2721N93551J45922K19233l42699k67773K36609
10416A259413L42611M13315M20776K18466l17080m78543l68146m63822J58959
10407A185949M95725m01366K35983L960J99348M83425j66616q3480J07935j33685
10397A927178K07647J66278m79967r0734m05728L37205M36591o62925L05412J88546
$$ plain form
10387 1929503 1896509 2058763 2119072 2478647 2695977 2664872 3296987 3696152 3971235 4001578
10377 4001578 3969628 4054177 4540749 5163761 5692243 6740838 7166643 7325197 8121740 8459906
10367 8459906 9092016 9088285 9961675 10632323 10028685 10242318 10433179 10672906 10875387 10549327
10357 10549327 9890355 9315419 9207055 8868760 8171288 7773787 7433413 6912023 7238374
10348 7238374 6238849 5259135 5523322 5469430 5238529 4889168 4421925 3896898 3204826 3220419
10338 3220419 3409853 2708777 2956488 2650042 2587082 2502255 2373739 1626693 1734864 1510721
10328 1510721 1776513 1879679 1131252 910307 1028873 809474 766365 979398 828799 678419
10318 678419 768070 525309 737769 866077 821801 572288 704461 920000 632988 1201792
$$ packed form
10387A929503l2994J62254O0309L59575K17330l1105O32115L99165K75083L0343
10377D001578l1950Q4549M86572O23012N28482J048595M25805J58554P96543L38166
10367H459906O32110l731Q73390O70648o03638K13633J90861K39727K02481l26060
10357A0549327o58972n74936j08364l38295o97472l97501l40374n21390L26351
10348G238374r99525r79714K64187n3892k30901l49361m67243n25027o92072J5593
10338C220419J89434p01076K47711l06446o2960q4827j28516p47046J08171k24143
10328A510721K65792J03166p48427k20945J18566k19399m3109K13033j50599j50380
10318F78419Q9651k42761K12460J28308m4276k49513J32173K15539k87012N68804
$$ plain form
10308 1201792 1215336 858659 643270 985888 639774 535537 278804 600318 302196 94355
10298 94355 -508775 -416288 -285482 97474 140941 424245 -9392 342217 582974 260161
10288 260161 452009 581434 547970 73539 248285 41440 485639 766144 1074830 597481
10278 597481 484471 363095 910138 565569 652702 242901 -107135 132220 418572 907779
10268 907779 643292 80779 -140278 -66477 23193 -76882 696478 838362 -19532 -116176
10258 -116176 115834 18633 -227807 -282365 -437572 -389281 3161 224832 -684760 -1133028
10248 -1133028 -1187353 -699162 -512321 -298564 -742584 -993098 -968263 -714936 -415960 -296025
10238 -296025 142619 190706 50863 -134975 -355800 -476861 -668081 -1079387 -998246 -219866
$$ packed form
10308A201792J3544l56677k15389L42618l46114j04237k56733L21514k98122k07841
10298I4355o03130R2487J30806L82956M3467K83304m33637L51609K40757l22813
10288B60161J91848J29425l3464m74431J74746k06845M44199K80505L08686m77349
10278E97481j13010j21376N47043l44569Q7133m09801l50036K39355K86352M89207
10268I07779k64487n62513k21057P3801Q9670j00075P73360J41884q57894r6644
10258a16176K32010r7201k46440n4558j55207M8291L92442K21671r09592m48268
10248a133028n4325M88191J86841K13757m44020k50514K4835K53327K98976J19935
10238b96025M38644M8087j39843j85838k20825j21061j91220m11306Q1141P78380
$$ plain form
10228 -219866 -264330 -563689 -375530 -248086 -280991 -869303 -1118307 -598754 -235709 -179152
10218 -179152 -66778 -125604 -208135 -166112 61501 614307 738555 557473 737224 1472689
10208 1472689 1415711 1533996 1557762 1488676 1745638 1178213 1575039 1376536 876478 1550252
10198 1550252 1671941 1441330 1076177 1573936 1791659 1311899 1981792 1747195 1196000
10189 1196000 1619679 1924666 1202343 471452 972230 1107321 714175 292825 131690
10180 131690 455950 -167585 276285 450274 233515 52432 -71798 383011 441251 300274
10170 300274 88673 -119388 -472534 -469781 27393 -224954 304968 78780 -159074 583569
10160 583569 610440 798286 424951 631333 80875 -210558 180003 58958 -293829 -62243
$$ packed form
10228b19866m4464k99359J88159J27444l2905n88312k49004N19553L63045N6557
10218a79152J12374n8826q2531M2023K27613N52806J24248j81082J79751P35465
10208A472689n6978J18285K3766o9086K56962n67425L96826j98503n00058O73774
10198A550252J21689k30611l65153M97759K17723m79760O69893k34597n51195
10189A196000M23679L04987p22323p30891N00778J35091l93146m21350j61135
10180A31690L24260o23535M43870J73989k16759j81083j24230M54809N8240j40977
10170C00274k11601k08061l53146K753M97174k52347N29922k26188k37854P42643
10160E83569K6871J87846l73335K06382n50458k91433L90561j21045l52787K31586
$$ plain form
10150 -62243 229284 450912 644822 543150 338585 452754 639478 404753 -8256 -311543
10140 -311543 -239102 -53419 51748 31636 115507 -192233 -98955 -165889 35874 205811
10130 205811 -28829 -173563 -194147 -149982 640052 805194 684160 504850 298726 39087
10120 39087 445631 364960 219117 623123 763944 920960 1007371 997138 204847 -63119
10110 -63119 421313 689138 630791 560447 233166 124235 132664 209983 -192917 -94121 213565
10099 213565 42952 -51569 -286501 -168433 -213831 -159872 -194408 -266441 -157751 73026
10089 73026 94332 312224 449419 169792 -122135 -580949 -181131 -15736 -49577 -148099
10079 -148099 -10436 -10746 -266863 -604724 -611060 -556778 -851414 -813054 -137865 -544962 -589065
$$ packed form
10150f2243K91527K21628J93910j01672k04565J14169J86724k34725m13009l03287
10140c11543P2441J85683J05167k0112Q3871l07740R3278o6934K01763J69937
10130B05811k34640j44734k0584M4165P90034J65142j21034j79310k06124k59639
10120C9087M06544q0671j45843M04006J40821J57016Q6411j0233p92291k67966
10110f3119M84432K67825n8347p0344l27281j08931Q429P7319m02900R8796L07686
10099B13565j70613r4521k34932J18068m5398N3959l4536p2033J08690K30777
10089G3026K1306K17892J37195k79627k91927m58814L99818J65395l3841r8522
10079a48099J37663l10k56117l37861o336N4282k94636L8360O75189m07097m4103
$$ plain form
10068 -589065 -185882 -197156 -301486 47767 83794 -243970 -754994 -848737 -588496 -848625
10058 -848625 -1028613 -831620 -1036160 -993518 -550738 -551623 -791321 -474058 -460964 -274329
10048 -274329 -608286 -456432 -385420 -516927 -124414 -251326 -487468 -809573 -870155 -1132899
10038 -1132899 -1099397 -605646 -716233 -868509 -1160122 -1412577 -568761 -282732 -415531 -553650
10028 -553650 -593337 -1058804 -452348 -576275 -991739 -715419 -525350 -1386586 -1565846 -1307788
10018 -1307788 -1415051 -952704 -858008 -828159 -730300 -775730 -1044370 -1079765 -1096848 -1028163 -1004207
10007 -1004207 -736870 -455782 -289889 -120651 -398983 -731481 -1272089 -1221173 -564421 -690267
9997 -690267 -730106 -580008 -850831 -727135 -740312 -993944 -1475429 -1417768 -1198715 -872685
$$ packed form
10068e89065M03183j1274j04330L49253L6027l27764n11024r3743K60241k60129
10058h48625j79988J96993k04540M2642M42780q85k39698L17263J3094J86635
10048b74329l33957J51854P1012j31507L92513j26912k36142l22105o0582k62744
10038a132899L3502M93751j10587j52276k91613k52455Q43816K86029j32799j38119
10028e53650l9687m65467O06456j23927m15464K76320J90069q61236j79260K58058
10018a307788j07263M62347R4696K9849R7859m5430k68640l5395j7083O8685K3956
10007a004207K67337K81088J65893J69238k78332l32498n40608N0916O56752j25846
9997f90267l9839J50098k70823J23696j3177k53632m81485N7661K19053L26030
$$ plain form
9987 -872685 -729945 -854733 -1854798 -1328699 -1244216 -1716502 -900704 -583369 -902463 -586246
9977 -586246 -358866 -1150445 -895275 -1370062 -1787697 -1037511 -630567 -449457 -1038197 -1334914
9967 -1334914 -957107 -616925 -24831 -172260 -581369 -1000135 -952375 -1021850 -1205458 -804106
9957 -804106 -616437 -396027 -583834 -905682 -496810 -413282 -465454 -937189 -852460 -607989
9947 -607989 -553568 -621537 -447485 -1045824 -1353702 -1763243 -1198147 -13828 286694 -35980
9937 -35980 -607536 -426118 -514451 -482605 -579285 -931926 -1307180 -911703 -267510 -6360
9927 -6360 -374817 -987520 -1082563 -908216 -1176245 -1028475 -938265 -1210994 -754909 -390597
9917 -390597 -219836 -493955 -772208 -741498 -650881 -226974 10880 -233722 -302997 -531144
$$ packed form
9987h72685J42740j24788j000065N26099Q4483m72286Q15798L17335l19094L16217
9977e86246K27380p91579K55170m74787m17635P50186M06944J81110n88740k96717
9967a334914L77807L40182N92094j47429m09109m18766M7760o9475j83608M01352
9957h04106J87669K20410j87807l21848M08872Q3528n2172m71735Q4729K44471
9947f07989N4421o7969J74052n98339l07878m09541N65096J184319L00522l22674
9937c5980n71556J81418q8333L1846r6680l52641l75254L95477O44193K61150
9927f360l68457o12703r5043J74347k68029J47770R0210k72729M56085L64312
9917c90597J70761k74119k78253L0710R0617M23907K37854k44602o9275k28147
$$ plain form
9907 -531144 -686687 -692264 -693645 -451818 -383237 -467224 -902866 -1364074 -1023855 -265535 -40544
9896 -40544 -10662 -297309 -589210 -399259 -534354 -819905 -381075 -691842 -646040 -325117
9886 -325117 -299853 -220467 -469533 -1092099 -1011524 -732191 -435261 -489695 -899280 -892841 -646181
9875 -646181 -457951 -450872 -683619 -1204835 -731823 -528585 -173489 13701 -42410 150262
9865 150262 -261964 129826 -1042 -257367 500485 495800 74095 386781 680846 647284
9855 647284 366166 638775 756977 542519 458601 704126 343922 531599 819324 1186441
9845 1186441 1101748 -135956 -51994 178638 678267 373176 249897 125131 -90818 -54562
9835 -54562 579012 160972 229464 133661 447672 567160 171572 324110 -16844 -85598
$$ packed form
9907e31144j55543n577j381K41827O8581q3987m35642m61208L40219P58320K24991
9896d0544K9882k86647k91901J89951j35095k85551M38830l10767M5802L20923
9886c25117K5264P9386k49066o22566Q0575K79333K96930n4434m09585O439K46660
9875f46181J88230P079k32747n21216M73012K03238L55096J87190n6111J92672
9865A50262m12226L91790j30868k56325P57852m685m21705L12686K94065l3562
9855F47284k81118K72609J18202k14458q3918K45525l60204J87677K87725L67117
9845A186441q4693j237704Q3962K30632M99629l05091j23279j24766k15949L6256
9835e4562O33574m18040O8492r5803L14011J19488l95588J52538l40954o8754
$$ plain form
9825 -85598 -100793 447159 347231 -93754 -439834 -317560 -160774 -460440 -111647 -66706
9815 -66706 -193811 348360 268093 -366173 -348438 -162181 51801 794147 285611 -115958
9805 -115958 -86862 -187932 -143149 205370 -393364 -509101 -64486 -180439 257608 144854
9795 144854 -405143 297068 593268 87113 72056 427377 215224 564742 403903 269711
9785 269711 239106 -342859 113390 236827 873766 1025588 646277 835903 626318 604727
9775 604727 198673 -347569 103493 343693 341204 -222180 -447748 -330720 -578265 -405223
9765 -405223 -41464 -63303 256760 14105 51919 444693 382536 426576 658847 283426
9755 283426 326734 468404 508388 283110 -101574 14716 -182115 9270 218935 64904
$$ packed form
9825h5598j5195N47952r9928m40985l46080J22274J56786k99666L48793M4941
9815f6706j27105N42171q0267o34266J7735J86257K13982P42346n08536m01569
9805a15958K9096j01070M4783L48519n98734j15737M44615j15953M38047j12754
9795A44854n49997P02211K96200n06155j5057L55321k12153L49518j60839j34192
9785B69711l0605n81965M56249J23437O36939J51822l79311J89626k09585k1591
9775F04727m06054n46242M51062K40200k489n63384k25568J17028k47545J73042
9765d05223L63759k1839L20063k42655L7814L92774o2157M4040K32271l75421
9755B83426M3308J41670L9984k25278l84684J16290j96831J91385K09665j54031
$$ plain form
9745 64904 119231 -92323 -363975 -449719 -232555 148330 -160392 -70668 89699 410607
9735 410607 420818 -43355 482113 549640 296922 452748 23611 -626160 -28832 475383
9725 475383 549455 180499 497475 751748 542651 673010 638970 764663 581450 683086
9715 683086 438460 -32316 608198 1058384 1216166 709509 325996 965447 1243061 1125306
9705 1125306 1370758 1222460 919036 293721 195940 206921 255752 733810 678771 729673
9695 729673 602854 634403 314080 455422 -11505 621931 1075286 1093396 1324431 700869
9685 700869 472685 949531 940493 1184589 665888 1291045 1255584 670812 617704 919222
9675 919222 604930 1005033 1271848 797162 358168 615440 873215 980495 1047732 945080
$$ packed form
9745F4904N4327k11554k71652q5744K17164L80885l08722Q9724J60367L20908
9735D10607J0211m64173N25468O7527k52718J55826m29137o49771N97328N04215
9725D75383P4072l68956L16976K54273k09097J30359l4040J25693j83213J01636
9715F83086k44626m70776O40514M50186J57782n06657l83513O39451K77614j17755
9705A125306K45452j48298l03424o25315r7781J0981M8831M78058n5039N0902
9695G29673j26819L1549l20323J41342m66927O33436M53355J8110K31035o23562
9685G00869k28184M76846r038K44096n18701O25157l5461n84772n3108L01518
9675I19222l14292M00103K66815m74686m38994K57272K57775J07280O7237j02652
$$ plain form
9665 945080 1187650 1223627 1335038 1252644 913930 -98018 251210 79778 273604 891508
9655 891508 1082577 1466804 1471286 1004795 1052898 941612 839121 1282874 1291524 1132015 1426313
9644 1426313 1261116 977925 709934 664378 1338798 1817427 1632662 1122157 1070817 880323
9634 880323 691858 877689 1841845 1692910 1038171 908729 823037 1259722 1665479 1299712
9624 1299712 1052948 1455180 1403058 1345795 1145724 755921 236752 487936 972124 993945
9614 993945 1375027 1334192 759866 1167323 1197792 1158113 1146665 1374310 1664914 1946009
9604 1946009 1242143 1487417 1487614 1911268 1848747 1996647 1374675 1123264 1428104 1484258
9594 1484258 1469673 1007434 1070375 1629595 1510481 1259550 1632262 1547901 1909553 1597341
$$ packed form
9665I45080K42570L5977J11411q2394l38714j011948L49228j71432J93826O17904
9655H91508J91069L84227M482m66491M8103j11286j02491M43753Q650j59509K94298
9644A426313j65197k83191k67991m5556O74420M78629j84765n10505n1340j90494
9634H80323j88465J85831R64156j48935o54739j29442q5692M36685M05757l65767
9624A299712k46764M02232n2122n7263k00071l89803n19169K51184M84188K1821
9614I93945L81082m0835n74326M07457L0469l9679j1448K27645K90604K81095
9604A946009p03866K45274J97M23654o2521J47900o21972k51411L04840N6154
9594A484258j4585m62239O2941N59220j19114k50931L72712q4361L61652l12212
$$ plain form
9584 1597341 1870676 1902786 2144258 2346191 2408946 2441710 1777161 2697558 3101224 2850399
9574 2850399 3317162 3275665 3190035 3258543 3133593 2951276 3141524 3708533 3253355 3443250
9564 3443250 3353293 2903397 2985001 2646110 2501222 2301814 1776970 1783246 2191840 2253898
9554 2253898 2466169 2200008 2620279 2288163 2133994 2154221 1825560 1415967 1737109 1511626
9544 1511626 1658779 1235802 1257652 1905912 1288375 1448039 1648375 1365069 1376480 698410
9534 698410 304340 665631 594273 800748 1387186 1631100 898802 1186712 1324440 1494413
9524 1494413 1511739 1107807 1733168 1489233 1368097 1000950 1029308 1394420 1314696 1471672
9514 1471672 1484724 1104326 875704 925547 1359747 1442377 1442871 1385789 1124158 950106 1638523
$$ packed form
9584A597341K73335L2110K41472K01933O2755L2764o64549R20397M03666k50825
9574B850399M66763m1497q5630O8508j24950j82317J90248N67009m55178J89895
9564C443250q9957m49896Q1604l38891j44888j99408n24844O276M08594O2058
9554B253898K12271k66161M20271l32116j54169K0227l28661m09593L21142k25483
9544A511626J47153m22977K1850O48260o17537J59664K00336k83306J1411o78070
9534F98410l94070L61291p1358K06475N86438K43914p32298K87910J37728J69973
9524A494413J7326m03932O25361k43935j21136l67147K8358L65112p9724J56976
9514A471672J3052l80398k28622M9843M34200Q2630M94n7082k61631j74052O88417
$$ plain form
9503 1638523 1988755 1350259 1547668 1190962 1097186 1127553 1071634 1448800 1799947 1962422
9493 1962422 1760820 1645194 2165547 2086576 1383111 1581667 1477305 1777823 2061914 1647161
9483 1647161 1323586 1665500 2021860 2508795 2647920 2823663 2043857 2131375 2476543 2360409
9473 2360409 2174626 2481237 2384367 1793645 2236868 2306238 2400732 2217442 2469832 2651180
9463 2651180 2542019 2857474 2799690 2785372 2538860 2661740 3062822 3088494 3416381 3466473
9453 3466473 3518420 3390316 3214421 3596917 3063134 3283247 3389046 3229980 3454761 3581430
9443 3581430 3685368 3454268 3401353 3201647 3744144 4311457 4507056 3970295 4072746 4418502
9433 4418502 5154630 4779974 4367249 4165110 4343916 4778836 5489325 5704822 4867598 4962185
$$ packed form
9503A638523L50232o38496J97409l56706r3776L0367n5919L77166L51147J62475
9493A962422k01602j15626N20353p8971p03465J98556j04362L00518K84091m14753
9483A647161l23575L41914L56360M86935J39125J75743p79806Q7518L45168j16134
9473B360409j85783L06611r6870n90722M43223O9370R4494j83290K52390J81348
9463B651180j09161L15455n7784j4318k46512J22880M01082K5672L27887N0092
9453C466473N1947j28104j75895L82496n33783K20113J05799j59066K24781J26669
9443C581430J03938k31100n2915j99706N42497N67313J95599n36761J02451L45756
9433D418502P36128l74656m12725k02139J78806M34920P10489K15497q37224R4587
$$ plain form
9423 4962185 5459314 5141236 5060445 5285457 5423913 5583350 5492162 5322794 5624780 5750401
9413 5750401 6195352 5906105 6045366 6087981 5892491 6502695 6875130 6695541 7279827 7309897
9403 7309897 7151799 7517016 7622738 7643753 7788643 8016631 8220508 8077727 7887598 7483411
9393 7483411 7825295 8165475 8033774 8289886 7977931 7548600 7955372 7994398 7877813 7833719
9383 7833719 8320105 8379659 8679533 8947834 8723258 9079429 9441307 9677735 9412079 10137763
9373 10137763 10093259 10125741 10200109 10014699 10328259 10929881 10964482 11329968 11231742 11551997
9363 11551997 11879087 11814029 12076939 12201423 12252651 12521463 13348517 13090208 12853045 12754673
9353 12754673 12835466 13124713 12814492 13031787 13440587 13315737 13230418 13806166 13742539 14465036
$$ packed form
9423D962185M97129l18078q0791K25012J38456J59437r1188j69368L01986J25621
9413E750401M44951k89247J39261M2615j95490O10204L72435j79589N84286L0070
9403G309897j58098L65217J05722K1015J44890K27988K03877j42781j90129m04187
9393G483411L41884L40180j31701K56112l11955m29331M06772L9026j16585m4094
9383G833719M86386N9554K99874K68301k24576L56171L61878K36428k65656P25684
9373A0137763m4504L2482P4368j85410L13560O01622L4601L65486r8226L20255
9363A1551997L27090o5058K62910J24484N1228K68812Q27054k58309k37163r8372
9353A2754673Q0793K89247l10221K17295M08800j24850q5319N75748o3627P22497
$$ plain form
9343 14465036 14237767 13637870 14043790 14212529 14813734 15087948 14501701 14728685 14942440
9334 14942440 15478959 15445864 15567620 15767374 15735005 15449243 15686727 15786660 15499161 16368293
9324 16368293 16051854 16031005 15325877 15061988 15835607 15257157 15695723 15654555 15319747 15746521
9314 15746521 15694724 15331385 15522694 15714514 15459959 15607502 15464412 15815846 15915124 15359324
9304 15359324 15110428 15417059 15857479 15354288 15268785 15432793 15364205 15610296 15882930 15381864
9294 15381864 15195712 15381363 16010689 15895475 15720414 16065981 15786250 16339637 16117096
9285 16117096 15877162 16183194 16053519 16126263 15826905 15980476 15940776 16178708 15943158 16047829
9275 16047829 15776993 15673754 15761892 15716886 15146131 15076026 15211065 15661623 15711086 15387006
$$ packed form
9343A4465036k27269n99897M05920J68739O01205K74214n86247K26984K13755
9334A4942440N36519l3095J21756J99754l2369k85762K37484R9933k87499Q69132
9324A6368293l16439k0849p05128k63889P73619n78450M38566m1168l34808M26774
9314A5746521n1797l63339J91309J91820k54555J47543j43090L51434R9278n55800
9304A5359324k48896L06631M40420n03191q5503J64008o8588K46091K72634n01066
9294A5381864j86152J85651O29326j15214j75061L45567k79731N53387k22541
9285A6117096k39934L06032j29675P2744k99358J53571l9700K37932k35550J04671
9275A6047829k70836j03239Q8138m5006n70755p0105J35039M50558M9463l24080
$$ plain form
9265 15387006 15623798 15395779 15534322 15891661 16338547 16203445 16463537 16152755 16055479 16396747
9255 16396747 16720303 17104655 17474767 17033938 17408648 17368131 17306943 17147940 17669011 17991234
9245 17991234 18049556 17850272 18378831 17824723 17271871 17286931 17846125 17480168 17011690 17168199
9235 17168199 16996043 16535113 17003284 17585269 17189557 17382686 17738143 18188407 18507410
9226 18507410 18598432 18819582 18669559 18501905 18548841 19218474 19219161 19110519 19355677 19186821
9216 19186821 19057548 19067893 19254767 19211963 19235415 19672575 19963677 20016548 20400733 20182149
9206 20182149 20510893 20436656 19690380 19492411 19406146 19934607 19889438 19846263 20399417 21433340
9196 21433340 21135608 20991108 21082183 21388027 21913085 21335494 21152925 21373699 21520879 21620701
$$ packed form
9265A5387006K36792k28019J38543L57339M46886j35102K60092l10782r7276L41268
9255A6396747L23556L84352L70112m40829L74710m0517o1188j59003N21071L22223
9245A7991234N8322j99284N28559n54108n52852J5060N59194l65957m68478J56509
9235A7168199j72156m60930M68171N81985l95712J93129L55457M50264L19003
9226A8507410R1022K21150j50023j67654M6936O69633O87j08642K45158j68856
9216A9186821j29273J0345J86874m2804K3452M37160K91102N2871L84185k18584
9206B0182149L28744p4237p46276j97969q6265N28461m5169m3175N53154J033923
9196B1433340k97732j44500R1075L05844N25058n77591j82569K20774J47180R9822
$$ plain form
9186 21620701 22278452 22088610 22534360 22760420 23070538 22690525 22337330 22268272 22461539 22439114
9176 22439114 22473924 22410712 22154422 21936492 22126516 22463221 22505831 21975943 21537912 21528581
9166 21528581 21754116 21752745 21959496 21863289 21892280 22042709 21928782 22582612 23739074 23015873
9156 23015873 22877101 23181297 23586598 24292187 24047296 23808998 23919345 23706337 23553715
9147 23553715 23856889 24046427 24016275 24083126 24606316 24715440 24534344 24508612 24277664 24245179
9137 24245179 24067858 24370100 24080381 23998986 23958029 23999843 24630277 24899110 24447055 24573899
9127 24573899 25126132 25072419 25510850 25390954 26143403 26347920 25970998 26086138 26145522 26530091
9117 26530091 27440014 27611749 27836025 28656941 28980926 29132617 29239190 29591685 30138258
$$ packed form
9186B1620701O57751j89842M45750K26060L10118l80013l53195o9058J93267k2425
9176B2439114L4810o3212k56290k17930J90024L36705M2610n29888m38031r331
9166B1528581K25535j371K06751r6207K8991J50429j13927O53830J156462p23201
9156B3015873j38772L04196M05301P05589k44891k38298J10347k13008j52622
9147B3553715L03174J89538l0152O6851N23190J09124j81096k5732k30948l2485
9137B4245179j77321L02242k89719q1395m0957M1814O30434K68833m52055J26844
9127B4573899N52233n3713M38431j19896P52449K04517l76922J15140N9384L84569
9117B6530091R09923J71735K24276Q20916L23985J51691J06573L52495N46573
$$ plain form
9108 30138258 30328912 30626256 31384946 32104288 33301558 34953138 36430913 37221092 38280266
9099 38280266 39941331 41619862 42973254 44955475 46781620 48415799 49867358 50898557
9091 50898557 52318518 53445048 54922435 56496854 57569523 58042604 58799129 59484735 60370326
9082 60370326 59944588 59507580 59570000 59339279 58567152 57575510 56984329 56579849 55690900 54799950
9072 54799950 53388867 53023576 53357935 53792822 54358614 55271339 56410980 57685706 59453707
9063 59453707 60990876 62747714 64235702 65326181 65629675 65978717 66879100 67067705 67947416
9054 67947416 69619246 71125847 72599548 73790355 74268422 73646661 71919155 69908344
9046 69908344 68311519 67321825 66267593 64345997 62177531 59736320 57467327 55804781
$$ packed form
9108C0138258J90654K97344P58690P19342J197270J651580J477775P90179J059174
9099C8280266J661065J678531J353392J982221J826145J634179J451559J031199
9091E0898557J419961J126530J477387J574419J072669M73081P56525O85606Q85591
9082F0370326m25738m37008O2420k30721p72127r91642n91181m04480q88949q90950
9072E4799950j411083l65291L34359M34887N65792R12725J139641J274726J768001
9063E9453707J537169J756838J487988J090479L03494L49042R00383J88605Q79711
9054F7947416J671830J506601J473701J190807M78067o21761j727506k010811
9046F9908344j596825r89694j054232j921596k168466k441211k268993j662546
$$ plain form
9038 55804781 53606915 51815038 50529440 49943584 48915731 48374267 48054857 48263522 47520196
9029 47520196 46661283 46575502 46720791 47709309 47824987 48186558 49162709 49581194 49555415 49472975
9019 49472975 49781460 49914343 49645464 48825439 48909616 49167598 49247850 49190184 48948602 48572794
9009 48572794 47985053 47436469 47016883 46186155 46037906 46866047 46441414 45958943 46917399
9000 46917399 47509208 48448621 48983622 48876008 50012196 51006986 52223726 53376995 55395636
8991 55395636 56274041 57735463 59109828 60447830 61258198 62687306 64172313 66435088
8983 66435088 68671546 70706843 72460167 74690195 77111812 78671503 79142200 79232709 79573786
8974 79573786 80681168 80884258 80021705 79724981 79271840 78849075 78486486 77528966 76316459
$$ packed form
9038E5804781k197866j791877j285598n85856j027853n41464l19410K08665p43326
9029D7520196q58913q5781J45289R88518J15678L61571R76151M18485k5779q2440
9019D9472975L08485J32883k68879q20025Q4177K57982Q0252n7666k41582l75808
9009D8572794n87741n48584m19586q30728j48249Q28141m24633m82471R58456
9000D6917399N91809R39413N35001j07614J136188R94790J216740J153269K018641
8991E5395636Q78405J461422J374365J338002Q10368J429108J485007K262775
8983F6435088K236458K035297J753324K230028K421617J559691M70697R0509L41077
8974G9573786J107382K03090q62553k96724m53141m22765l62589r57520j212507
$$ plain form
8965 76316459 74992662 74144967 74094891 74233174 74893981 75681736 76801018 78172497 78888739
8956 78888739 80455592 81348747 82610543 84430600 85552828 87557303 90094728 92134803
8948 92134803 94949533 98320401 101764608 105116905 108563122 113078383 118207712 121563904
8940 121563904 125254688 129344278 133364758 137064146 141145493 145467089 150846210 157999538
8932 157999538 169005839 184417678 203307655 226302186 257187424 284771869 298138398
8925 298138398 291974928 252892524 209848575 183166157 165795936 154550162 146351189
8918 146351189 139513286 133617242 128103053 123389473 119301704 114696628 110485925 106908764
8910 106908764 103073508 99974909 96523122 93886313 92277104 90908933 89481237 89034471
$$ packed form
8965G6316459j323797q47695n0076J38283O60807P87755J119282J371479P16242
8956G8888739J566853Q93155J261796J820057J122228K004475K537425K040075
8948I2134803K814730L370868L444207L352297L446217M515261N129329L356192
8940A21563904L690784M089590M020480L699388M081347M321596N379121P153328
8932A57999538J1006301J5411839J8889977K2994531L0885238K7584445J3366529
8925B98138398o163470l9082404m3043949k6682418j7370221j1245774q198973
8918A46351189o837903n896044n514189m713580m087769m605076m210703l577161
8910A06908764l835256l098599l451787k636809j609209j368171j427696m46766
$$ plain form
8902 89034471 87308861 86681365 86409857 86016455 85225612 84738765 84422755 84210750 83481541
8893 83481541 83377506 83016913 82668856 82198520 82258344 82401063 82643291 83241334 83800240 85001686
8883 85001686 85154674 85259396 86558357 87356553 88247648 89176176 90013240 90886028 92033424
8874 92033424 93241529 93161264 93341282 94337392 94981084 95033341 95403605 95136946 94004209
8865 94004209 93014105 92768853 91629278 91021440 90382767 90707067 90996983 91301685 91493824
8856 91493824 92254323 92275220 93107668 94429596 95832183 97885765 99483319 100847636 103460725
8847 103460725 105948814 108601225 110560490 111847403 114136443 115131691 115027308 115411539
8839 115411539 115884197 116672949 116226001 115953671 115244766 113998609 112448716 111150539 111319421
$$ packed form
8902H9034471j725610o27496k71508l93402p90843m86847l16010k12005p29209
8893H3481541j04035l60593l48057m70336N9824J42719K42228N98043N58906J201446
8883H5001686J52988J04722J298961P98196Q91095R28528Q37064Q72788J147396
8874I2033424J208105q0265J80018R96110O43692N2257L70264k66659j132737
8865I4004209r90104k45252j139575o07838o38673L24300K89916L04702J92139
8856I1493824P60499K0897Q32448J321928J402587K053582J597554J364317K613089
8847A03460725K488089K652411J959265J286913K289040R95248j04383L84231
8839A15411539M72658P88752m46948k72330p08905j246157j549893j298177J68882
$$ plain form
8830 111319421 111046918 111222962 111743370 112386022 112660997 112627717 112194756 112866767 113267115
8821 113267115 113174961 114046271 115076986 115752216 116405409 117445755 118946217 121038034 123341926
8812 123341926 126477674 130032029 133241048 135956305 138195524 140321290 141910955 143338889
8804 143338889 145328771 147298834 149681152 152215990 154361144 155580935 154687655 154175007
8796 154175007 153134046 152182800 152090812 150827446 148981774 146688578 143875770 141488043
8788 141488043 139748800 137364488 135606505 134058535 132661480 132660067 132461985 131907274 132239926
8779 132239926 132423154 132931659 135190921 137594826 140240381 143280332 146406475 149385560
8771 149385560 152469575 154907969 157441004 160603768 163610285 165787345 166612102 165762266
$$ packed form
8830A11319421k72503J76044N20408O42652K74975l3280m32961O72011M00348
8821A13267115r2154Q71310J030715O75230O53193J040346J500462K091817K303892
8812A23341926L135748L554355L209019K715257K239219K125766J589665J427934
8804A43338889J989882J970063K382318K534838K145154J219791q93280n12648
8796A54175007j040961r51246r1988j263366j845672k293196k812808k387727
8788A41488043j739243k384312j757983j547970j397055j413j98082n54711L32652
8779A32239926J83228N08505K259262K403905K645555L039951L126143K979085
8771A49385560L084015K438394K533035L162764L006517K177060Q24757q49836
$$ plain form
8763 165762266 163249507 159831169 155765097 151220684 147580334 144228824 140163134 136679732
8755 136679732 133537299 130626143 128299502 126084967 123909697 122057517 119845619 118294053
8747 118294053 117063339 115650226 114633057 114179137 114113757 113558569 112855681 112906269 112089786
8738 112089786 110999260 111256295 111636249 112763569 113478608 113227422 112519954 110726001 108924692
8729 108924692 107233555 105359204 103056424 101070315 99130441 96872550 94577973 92272393
8721 92272393 90457524 88984072 87443612 86769458 85260599 84817015 83725718 82574846
8713 82574846 82430885 81920346 81384860 80634153 79693708 78959497 78004099 77286144 76769784
8704 76769784 75775253 75839484 75040298 74156543 74322816 73971312 72860643 72198858 71617948
$$ packed form
8763A65762266k512759l418338m066072m544413l640350l351510m065690l483402
8755A36679732l142433k911156k326641k214535k175270j852180k211898j551566
8747A18294053j230714j413113j017169m53920o5380n55188p02888N0588q16483
8738A12089786j090526K57035L79954J127320P15039k51186p07468j793953j801309
8729A08924692j691137j874351k302780j986109j939874k257891k294577k305580
8721I2272393j814869j473452j540460o74154j508859m43584j091297j150872
8713H2574846j43961n10539n35486p50707r40445p34211r55398p17955n16360
8704G6769784r94531O4231p99186q83755J66273l51504j110669o61785n80910
$$ plain form
8695 71617948 70721575 69489241 69077254 68894737 68276130 67253572 66794983 66340575 65785118
8686 65785118 65082752 64703692 63785327 63170049 63562385 63145582 62489590 61731625 61533408
8677 61533408 60775923 60388550 60120918 59677104 59083345 58599683 58036009 57233939 57429573
8668 57429573 57543254 57595280 57069156 56942978 56928318 56294760 56292754 55650653 55556318 55861132
8658 55861132 55451400 55533309 55545349 55389671 55281104 54960724 54510828 54460778 54497370 53794357
8648 53794357 53267323 53201688 52777242 52548029 51910644 51935908 52109515 51934646 51391254 51213215
8638 51213215 51619413 51733214 51143203 51321328 51023721 51361692 51309815 50856367 50498030 51459684
8628 51459684 52090484 52317107 52666178 52579414 52681209 52552557 52940477 52955222 52865143 53169218
$$ packed form
8695G1617948q96373j232334m11987j82517o18607j022558m58589m54408n55457
8686F5785118p02366l79060r18365o15278L92336m16803o55992p57965j98217
8677F1533408p57485l87373k67632m43814n93759m83662n63674q02070J95634
8668E7429573J13681N2026n26124j26178j4660o33558k006o42101r4335L04814
8658E5861132m09732Q1909J2040j55678j08567l20380m49896n0050L6592p03013
8648E3794357n27034o5635m24446k29213o37385K5264J73607j74869n43392j78039
8638E1213215M06198J13801n90011J78125k97607L37971n1877m53448l58337R61654
8628E1459684O30800K26623L49071q6764J01795j28652L87920J4745r0079L04075
$$ plain form
8618 53169218 53859757 53803874 53665163 53077465 52681538 51656838 50975017 50024421 48919089
8609 48919089 48189597 46988538 46203630 45288440 44875037 44678575 44584204 44316743 44382987 44302633
8599 44302633 44344297 43330929 43505721 44043613 44569945 44584696 44225893 44803301 44860793 44891112
8589 44891112 45028902 45027825 45295921 45834327 46504363 47207270 48161360 47976728 47921678 49848653
8579 49848653 48038978 46948744 46027297 45504240 44586446 43433519 43131122 42302581 41241052
8570 41241052 41120786 40523820 40193869 40142308 39308071 39117357 39111698 38869377 39221844 39028246
8560 39028246 38588262 38391512 38785356 38653371 38607539 38288973 38252954 38463002 38128503 38374385
8550 38374385 38616396 38848120 38536574 38661031 38912397 38617299 37951286 36972773 36236424
$$ packed form
8618E3169218O90539n5883j38711n87698l95927j024700o81821r50596j105332
8609D8919089p29492j201059p84908r15190m13403j96462r4371k67461O6244q0354
8599D4302633M1664j013368J74792N37892N26332J4751l58803N77408N7492L0319
8589D4891112J37790j077K68096N38406O70036P02907R54090j84632n5050J926975
8579D9848653j809675j090234r21447n23057r17794j152927l02397q28541j061529
8570D1241052j20266n96966l29951n1561q34237j90714n659k42321L52467j93598
8560C9028246m39984j96750L93844j31985m5832l18566l6019K10048l34499K45882
8550C8374385K42011K31724l11546J24457K51366k95098o66013r78513p36349
$$ plain form
8541 36236424 35652820 35211108 34597108 34561567 34214477 32990986 32796168 32854659 32162781 31363794
8531 31363794 31210558 30971430 30699804 30750887 30740026 30556983 30582548 30333672 29929748 29785499
8521 29785499 29967171 29611394 30581961 30796883 30159154 30149611 29816987 29847341 29952751 29728482
8511 29728482 29875771 29440123 29236045 29034766 29135687 28740234 27963951 27735807 27581772
8502 27581772 27807077 27664947 27047644 26645542 26284705 25749648 25930566 25416263 24986436
8493 24986436 24899504 25308401 25143558 24577852 24756645 25239259 25443040 25552491 25553623 24812678
8483 24812678 24967998 25642179 25590787 25320518 25108678 25289005 25458273 25267348 25351955 25426089
8473 25426089 26053096 26630632 26789580 26741614 26352056 25665576 25151995 24351165 24023686 23663525
$$ packed form
8541C6236424n83604m41712o14000l5541l47090j223491j94818N8491o91878p98987
8531C1363794j53236k39128k71626N1083j0861j83043K5565k48876m03924j44249
8521B9785499J81672l55777R70567K14922o37729r543l32624L0354J05410k24269
8511B9728482J47289m35648k04078k01279J00921l95453p76283k28144j54035
8502B7581772K25305j42130o17303m02102l60837n35057J80918n14303m29827
8493B4986436q6932M08897j64843n65706J78793M82614K03781J09451J132p40945
8483B4812678J55320O74181n1392k70269k11840J80327J69268j90925Q4607P4134
8473B5426089O27007N77536J58948m7966l89558o86480n13581q00830l27479l60161
$$ plain form
8463 23663525 23327409 23016463 22403490 21918963 21788408 21708554 21355993 21218884 20902237 20762339
8453 20762339 20413731 20277932 19836717 19643675 19467374 19353783 19623100 19360762 19327183 18898466
8443 18898466 18176849 17699780 17658942 17825189 18020375 17767000 17663745 17346304 17671292 17714239
8433 17714239 17269436 17138947 16639935 17146275 17291860 17425398 17805066 17319945 18199705
8424 18199705 18144675 18636333 19476550 19881058 20310668 20002533 19658771 18796084 17751429
8415 17751429 17189545 16659088 15823943 15645322 15487176 15089152 14837954 15127434 15083297 14793503
8405 14793503 14731434 14433450 14618967 14980451 15332870 14596728 14929786 15466074 15840528 16367382
8395 16367382 16274844 16837685 17806463 18576742 18465470 18000044 17397272 16732990 15704070
$$ packed form
8463B3663525l36116l10946o12973m84527j30555p9854l52561j37109l16647j39898
8453B0762339l48608j35799m41215j93042j76301j13591K69317k62338l3579m28717
8443A8898466p21617m77069m0838J66247J95186k53375j03255l17441L24988M2947
8433A7714239m44803j30489m99012N06340J45585J33538L79668m85121Q79760
8424A8199705n5030M91658Q40217M04508M29610l08135l43762q62687j044655
8415A7751429n61884n30457q35145j78621j58146l98024k51198K89480m4137k89794
8405A4793503o2069k97984J85517L61484L52419p36142L33058N36288L74454N26854
8395A6367382r2538N62841R68778P70279j11272m65426o02772o64282j028920
$$ plain form
8386 15704070 15017335 13994293 13498761 12434279 11643139 12103206 12199856 12267978 12167723
8377 12167723 11825591 11699332 11137818 11104027 11105239 10858586 10833241 10983670 10193445 10259865
8367 10259865 9880952 9944510 10121355 9348156 8479140 8775618 9108770 9709370 9488457 8659418
8357 8659418 9312890 9479624 9576164 9818628 9994082 10339677 10568235 10496479 10453190 10618657
8347 10618657 10799059 10668276 11755332 12102677 12245061 13083278 13905123 13916235 13676456
8338 13676456 13736345 12820648 11602670 11192544 10637623 10075458 9882034 9472927 8865412
8329 8865412 9062185 8956621 8404573 7887400 7919351 7968379 8188130 7945854 7644956 7599523
8319 7599523 7519062 7085511 6503400 6467753 6532825 6879519 6960571 6744761 6324170 6340185
$$ packed form
8386A5704070o86735j023042m95532j064482p91140M60067R6650O8122j00255
8377A2167723l42132j26259n61514l3791J212k46653k5345J50429p90225O6420
8367A0259865l78913O3558J76845p73199q69016K96478L33152O00600k20913q29039
8357H659418O53472J66734R6540K42464J75454L45595K28558p1756m3289J65467
8347A0618657J80402j30783J087056L47345J42384Q38217Q21845J1112k39779
8338A3676456N9889r15697j217978m10126n54921n62165j93424m09107o07515
8329H865412J96773j05564n52048n17173L1951M9028K19751k42276l00898m5433
8319G599523q0461m33551n82111l5647O5072L46694Q1052k15810m20591J6015
$$ plain form
8309 6340185 5889576 5837945 5995173 6406319 5993854 6121379 6588581 5899437 5977080 5913277
8299 5913277 6072954 6382889 6217423 6473074 6284670 6165091 5614134 5119638 4939459 5357004
8289 5357004 5410752 4801421 4387599 4472712 4564220 4228522 4552409 4258989 3925768 3978655
8279 3978655 3799793 3515468 3590464 3583543 3915111 4201788 4172287 4065680 3913804 4087926
8269 4087926 4003566 4331875 3809933 3710613 4216646 4394635 3880323 3990161 4114679 4047233
8259 4047233 4139905 4166384 4147730 3793040 3248559 3622406 3756732 3945359 3984419 3355268
8249 3355268 3202556 3275385 3617611 3544412 4163887 4023596 3994370 3731945 3846237 3521905
8239 3521905 4263591 4208698 3705963 3350790 3181356 3261632 3470234 3460874 3015644 2751768
$$ packed form
8309F340185m50609n1631J57228M11146m12465J27525M67202o89144P7643o3803
8299E913277J59677L09935j65466K55651j88404j19579n50957m94496j80179M17545
8289E357004N3748o09331m13822Q5113R1508l35698L23887k93420l33221N2887
8279C978655j78862k84325P4996o921L31568K86677k9501j06607j51876J74122
8269D087926q4360L28309n21942r9320N06033J77989n14312J09838J24518o7446
8259D047233R2672K6479j8654l54690n44481L73847J34326J88627L9060o29151
8249C355268j52712P2829L42226p3199O19475j40291k9226k62425J14292l24332
8239C521905P41686n4893n02735l55173j69434Q0276K08602r360m45230k63876
$$ plain form
8229 2751768 2731284 2632705 2285910 2397832 2534367 2448058 2444778 2529813 2639785 2323754 2063749
8218 2063749 1700113 1602257 1266209 1384222 1797326 1971097 1923739 1627225 1368818 1881238
8208 1881238 2432462 1745246 1425897 1681655 1375334 1044325 1063439 1016563 865301 240853
8198 240853 412064 629374 29706 116814 948926 560399 4531861 3955165 1088925 1789855
8188 1789855 1780967 1571344 1259764 1690646 1631325 906224 814457 1985804 2058966 1530178
8178 1530178 1192621 585922 719580 900076 383882 434038 505383 780627 388539 -22779
8168 -22779 228983 62881 71784 -12627 -41977 147927 -670715 -170716 -234661 397472 352402
8157 352402 -286013 -510526 -296392 67642 -336369 357988 431732 -167927 -328769 -79895
$$ packed form
8229B751768k0484r8579l46795J11922J36535q6309l280Q5035J09972l16031k60005
8218B063749l63636r7856l36048J18013M13104J73771m7358k96514k58407N12420
8208A881238N51224o87216l19349K55758l06321l31009J9114m6876j51262o24448
8198B40853J71211K17310n99668Q7108Q32112l88527L971462n76696k866240P00930
8188A789855q888k09623l11580M30882n9321p25101r1767J171347P3162n28788
8178A530178l37557o06699J33658J80496n16194N0156P1345K75244l92088m11318
8168b2779K51762j66102Q903q4411k9350J89904q18642M99999o3945O32133m5070
8157C52402o38415k24513K14134L64034m04011O94357P3744n99659j60842K48874
$$ plain form
8147 -79895 -159690 -785687 -915310 -629313 -275523 -589630 -483609 133477 -179397 -107644
8137 -107644 -370482 -865240 -741389 -728805 -278315 -210081 -825727 -72434 -448069 -473206
8127 -473206 -759632 -916426 -845647 -694356 -42213 -275536 -356114 -622904 -383655 -473393
8117 -473393 -309236 -148812 -441664 -514117 -1166974 -1475976 -1228461 -995851 -932943 -588121
8107 -588121 -428999 -834895 -1485326 -1451908 -1141547 -1184529 -1421662 -856271 -1161572 -1279956
8097 -1279956 -1242173 -1741783 -1839590 -1218615 -902551 -1477532 -1496874 -1266276 -1038817 -1421085
8087 -1421085 -1754300 -1709944 -1399188 -1338129 -997857 -838760 -1618293 -1703994 -1132644 -943361
8077 -943361 -810176 -1045617 -1297815 -1416011 -1544416 -1215852 -1269123 -1008935 -1523547 -1051131
$$ packed form
8147g9895p9795o25997j29623K85997L53790l14107J06021O17086l12874P1753
8137a07644k62838m94758J23851J2584M50490O8234o15646P53293l75635k5137
8127d73206k86426j56794P0779J51291O52143k33323q0578k66790K39249q9738
8117d73393J64157J60424k92852p2453o52857l09002K47515K32610O2908L44822
8107e88121J59122m05896o50431L3418L10361m2982k37133N65391l05301j18384
8097a279956L7783m99610r7807O20975L16064n74981j9342K30598K27459l82268
8087a421085l33215M4356L10756O1059L40272J59097p79533q5701N71350J89283
8077i43361J33185k35441k52198j18196j28405L28564n3271K60188n14612M72416
$$ plain form
8067 -1051131 -847048 -1275537 -1218203 -693379 -660257 -885436 -1006744 -1238808 -1964736 -1521104
8057 -1521104 -1409185 -1889918 -1613338 -1713642 -1890869 -2448334 -2400464 -1908658 -1749830 -1679117
8047 -1679117 -1835499 -1409177 -1574266 -2189858 -2105083 -1649920 -1623064 -1295931 -1399327 -1411844
8037 -1411844 -1183764 -1629424 -1578926 -1414985 -1818842 -2524115 -2237619 -1928684 -1724574 -1657495
8027 -1657495 -1469826 -1526005 -1410302 -1818807 -2000772 -2097764 -1567279 -1658845 -1507207 -1452643
8017 -1452643 -1895909 -2310140 -1989060 -2109050 -2739019 -2703047 -1710319 -2288482 -2949586 -2513613
8007 -2513613 -1684121 -1568368 -1590511 -2050308 -1797442 -2064885 -1981560 -1746284 -1357019 -1719919
7997 -1719919 -1997167 -1669415 -1840691 -1982175 -2406458 -2292868 -2037945 -2126493 -2014240 -2003705
$$ packed form
8067a051131K04083m28489N7334N24824L3122k25179j21308k32064p25928M43632
8057a521104J11919m80733K76580j00304j77227n57465M7870M91806J58828P0713
8047a679117j56382M26322j65089o15592Q4775M55163K6856L27133j03396j2517
8037a411844K28080m45660N0498J63941m03857p05273K86496L08935K04110O7079
8027a657495J87669n6179J15703m08505j81965r6992N30485r1566J51638N4564
8017a452643m43266m14231L21080j19990o29969L5972R92728n78163o61104M35973
8007b513613Q29492J15753k2143m59797K52866k67443Q3325K35276L89265l62900
7997a719919k77248L27752j71276j41484m24283J13590K54923q8548J12253J0535
$$ plain form
7987 -2003705 -2121016 -1766484 -2343755 -2292420 -1897136 -2059220 -2469253 -2310616 -1875834 -2306559
7977 -2306559 -2710485 -2902149 -2753366 -2066170 -1950460 -2056841 -2138380 -1516893 -1637145 -2231923
7967 -2231923 -1775168 -1732047 -2117214 -1964054 -2194108 -2327512 -2150120 -1968885 -1888319 -1438013
7957 -1438013 -1513144 -1628043 -1934968 -2310500 -2504579 -2222961 -1843616 -1560946 -1365011 -1442679
7947 -1442679 -1742299 -1985252 -1847131 -1634043 -1668935 -2022953 -1755462 -1459537 -1966119 -2290214
7937 -2290214 -1868787 -2526668 -2676993 -1807543 -1623582 -1787211 -2156902 -2200218 -2323505 -2288640
7927 -2288640 -2000728 -2175085 -2231082 -2404026 -2446519 -1783026 -1927607 -2122777 -1992708 -1606848
7917 -1606848 -2356190 -2422273 -2311540 -2099494 -2066473 -2106802 -1743100 -1864660 -1943254 -2051093
$$ packed form
7987b003705j17311L54532n77271N1335L95284j62084m10033J58637M34782m30725
7977b306559m03926j91664J48783O87196J15710j06381q1539O21487j20252n94778
7967b231923M56755M3121l85167J53160k30054j33404J77392J81235Q0566M50306
7957a438013p5131j14899l06925l75532j94079K81618L79345K82670J95935p7668
7947a442679k99620k42953J38121K13088l4892l54018K67491K95925n06582l24095
7937b290214M21427o57881j50325Q69450J83961j63629l69691m3316j23287L4865
7927b288640K87912j74357n5997j72944m2493O63493j44581j95170J30069L85860
7917a606848p49342o6083J10733K12046L3021m0329L63702j21560p8594j07839
$$ plain form
7907 -2051093 -1682730 -1866560 -2018437 -1756964 -1825646 -1643081 -2363085 -2166550 -1892284 -1914554
7897 -1914554 -2053234 -1746224 -1506050 -1892025 -1662877 -1729667 -2027507 -2441953 -2645857 -2305814
7887 -2305814 -2241279 -1941066 -2148888 -2416703 -2394549 -2198497 -2021890 -2233338 -2046727 -2030491
7877 -2030491 -2402114 -2157296 -2737307 -2285062 -2146846 -2373709 -2577975 -2307619 -2100752 -2297556
7867 -2297556 -2247555 -1257160 -1806923 -2221487 -2321449 -2419586 -1820548 -1578074 -1304244 -2081841
7857 -2081841 -1408561 -1708455 -1860184 -2831885 -2849340 -2884124 -2269489 -1872872 -2309414 -2489673
7847 -2489673 -2199342 -2229057 -1688220 -1793900 -1661738 -1492443 -1363667 -1569323 -1687342 -1882420
7837 -1882420 -1967779 -1360231 -1321837 -1943397 -2029314 -1560996 -2035850 -2102582 -1771570 -1652500
$$ packed form
7907b051093L68363j83830j51877K61473o8682J82565p20004J96535K74266k2270
7897a914554j38680L07010K40174l85975K29148o6790k97840m14446k03904L40043
7887b305814O4535L00213k07822k67815K2154J96052J76607k11448J86611J6236
7877b030491l71623K44818n80011M52245J38216k26863k04266K70356K06867j96804
7867b297556N0001R90395n49763m14564r9962r8137N99038K42474K73830p77597
7857b081841O73280k99894j51729r71701j7455l4784O14635L96617m36542j80259
7847b489673K90331k9715N40837j05680J32162J69295J28776k05656j18019j95078
7837a882420q5359O07548L8394o21560q5917M68318m74854o6732L31012J19070
$$ plain form
7827 -1652500 -1971393 -1358226 -1262351 -1719518 -1653382 -1297675 -1694936 -1424367 -801849 -1082499
7817 -1082499 -1571255 -1551491 -1174966 -1328145 -1064712 -1283951 -1599809 -1486545 -1344788 -742910
7807 -742910 -676873 -968595 -784091 -2041434 -1638288 -1734189 -2573901 -1783169 -1715959 -1910482
7797 -1910482 -1135469 -1520612 -1496464 -1619776 -1570621 -1232844 -1381280 -912845 -620473 -905807
7787 -905807 -1077603 -549957 -340071 -271169 -142479 -302792 -479731 -624071 -880991 -409380
7777 -409380 -297934 -484054 -1022812 -1133663 -1355559 -938239 -750801 -662724 -527911 -3245
7767 -3245 -441219 -603772 -666926 -780551 -513404 -596766 -557816 -467130 -357150 -381652 -606397
7756 -606397 -233184 64341 -228786 -377683 -981740 -683523 -584063 -291994 -186208 -594800
$$ packed form
7827a652500l18893O13167R5875m57167O6136L55707l97261K70569O22518k80650
7817a082499m88756J9764L76525j53179K63433k19239l15858J13264J41757O01878
7807g42910O6037k91722J84504j257343M03146r5901q39712P90732O7210j94523
7797a910482P75013l85143K4148j23312M9155L37777j48436M68435K92372k85334
7787i05807j71796N27646K09886O8902J28690j60313j76939j44340k56920M71611
7777d09380J11446j86120n38758j10851k21896M17320J87438Q8077J34813N24666
7767c245m37974j62553o3154j13625K67147q3362L8950R0686J09980k4502k24745
7756f06397L73213K97525k93127j48897o04057K98217R9460K92069J05786m08592
$$ plain form
7746 -594800 -116543 120693 513483 107570 -397578 228597 210683 111528 -66648 277185
7736 277185 312760 671998 790552 1151025 628043 -171011 551290 381123 1042831 678217
7726 678217 225661 790561 744823 342891 -126835 50328 343794 370149 309138 220384
7716 220384 721193 761607 769814 735613 981587 717230 877151 1144497 995383 835266
7706 835266 851325 1104411 1061393 1542015 1160111 357580 372877 483083 589097 367775
7696 367775 281434 496236 963895 1422783 997098 916895 532300 941951 1185318 822782
7686 822782 791943 758649 955160 897432 1068291 1003951 595364 781418 1107008 1462308
7676 1462308 600023 163851 1193176 1330737 1246438 1324455 1508897 1224241 1059845 740518
$$ packed form
7746e94800M78257K37236L92790m05913n05148O26175j7914r9155j78176L43833
7736B77185L5575L59238J18554L60473n22982p99054P22301j70167O61708l64614
7726F78217m52556N64900m5738m01932m69726J77163K93466K6355o1011q8754
7716B20384N00809M0414Q207l4201K45974k64357J59921K67346j49114j60117
7706H35266J6059K53086m3018M80622l81904q02531J5297J10206J06014k21322
7696C67775q6341K14802M67659M58888m25685q0203l84595M09651K43367l62536
7686H22782l0839l3294J96511n7728J70859o4340m08587J86054L25590L55300
7676A462308q62285m36172J029325J37561q4299P8017J84442k84656j64396l19327
$$ plain form
7666 740518 909448 1093538 1475031 1097913 841476 920056 754267 1090509 1069882 1494628
7656 1494628 1681138 1366883 670059 1063113 672405 519328 1043290 638380 948111 662295
7646 662295 611373 566864 997110 1304003 1041665 1465845 1022233 1093462 1067217 1135930 1356790
7635 1356790 680528 753988 967806 1199388 857057 672237 1020455 1234734 1296896 1542830
7625 1542830 934742 862565 1411423 909065 435953 551518 797418 1017038 984720 441721
7615 441721 902666 746495 128300 314208 -45823 214591 1154592 985440 698166 676186
7605 676186 1034842 1109435 1282704 1043139 1674540 1353417 1159306 1224166 1341802 1415777
7595 1415777 1570340 1500491 937607 1022263 1388157 1556170 1373527 1289243 1077911 789977
$$ packed form
7666G40518J68930J84090L81493l77118k56437P8580j65789L36242k0627M24746
7656A494628J86510l14255o96824L93054l90708j53077N23962m04910L09731k85816
7646F62295n0922m4509M30246L06893k62338M24180m43612P1229k6245O8713K20860
7635A356790o76262P3460K13818K31582l42331j84820L48218K14279O2162K45934
7625A542830o08088p2177N48858n02358m73112J15565K45900K19620l2318n42999
7615D41721M60945j56171o18195J85908l60031K60414R40001j69152k87274k1980
7605F76186L58656P4593J73269k39565O31401l21123j94111O4860J17636P3975
7595A415777J54563o9849n62884Q4656L65894J68013j82643q4284k11332k87934
$$ plain form
7585 789977 1013279 1413952 1284935 719867 704793 1086789 1718613 1566379 1423330 1160355
7575 1160355 633348 668489 927969 1658193 1498015 1107552 636599 787936 1134479 888218
7565 888218 439757 191618 583862 781468 1337879 1692150 1270832 606535 576424 1405544
7555 1405544 1248635 1498323 1495624 1545911 1584853 1310554 1541939 1704923 1367919 1129603
7545 1129603 578431 1040549 938746 1248010 1404542 1766901 1663794 1544166 1300735 1389183
7535 1389183 1661459 1315067 1803279 1454464 1864619 2422129 2068025 2117938 2220053 2289621
7525 2289621 2607663 2697259 3405788 3268621 3846881 4180469 4016830 4046632 3618599 3909038
7515 3909038 3813529 3813965 3898342 4439448 4488982 4913881 5057573 4676942 4811932 4440938 4311082
$$ packed form
7585G89977K23302M00673j29017n65068j5074L81996O31824j52234j43049k62975
7575A160355n27007L5141K59480P30224j60178l90463m70953J51337L46543k46261
7565H88218m48461k48139L92244J97606N56411L54271m21318o64297l0111Q29120
7555A405544j56909K49688k699N0287L8942k74299K31385J62984l37004k38316
7545A129603n51172M62118j01803L09264J56532L62359j03107j19628k43431Q8448
7535A389183K72276l46392M88212l48815M10155N57510l54104M9913J02115O9568
7525B289621L18042Q9596P08529j37167N78260L33588j63639K9802m28033K90439
7515C909038r5509M36Q4377N41106M9534M24899J43692l80631J34990l70994j29856
$$ plain form
7504 4311082 4174408 3963365 4271682 4212793 4192772 4356863 3555984 3238438 3841360 4337068
7494 4337068 4031737 4424199 4728466 4984811 4906181 5204771 5049570 5063234 4865885 5194838
7484 5194838 5249581 4842492 5400420 5577083 5455883 5408035 5405444 5272585 5272526 5322285 5232596
7473 5232596 6311341 7048265 7348083 7313613 6842482 6978704 7591031 8849707 9128948
7464 9128948 9536510 10365277 11312627 11988173 12439203 12806943 13620702 14405250 14834606 15936450
7454 15936450 16877107 17646751 19456939 20656785 21319518 21781280 21787176 20512353 18982430
7445 18982430 18019547 17148846 16438228 15421305 14958050 15021113 14495276 13943157 13749451
7436 13749451 13699663 13799667 13889770 13967393 13933161 13766269 13886087 13972016 13765133 13393389
$$ packed form
7504D311082j36674k11043L08317n8889k0021J64091q00879l17546O02922M95708
7494D337068l05331L92462L04267K56345p8630K98590j55201J3664j97349L28953
7484E194838N4743m07089N57928J76663j21200m7848k591j32859n9M9759q9689
7473E232596J078745P36924K99818l4470m71131J36222O12327J258676K79241
7464I128948M07562Q28767R47350O75546M51030L67740Q13759P84548M29356J101844
7454A5936450R40657P69644J810188J199846O62733M61762N896j274823j529923
7445A8982430r62883q70701p10618j016923m63255O3063n25837n52119j93706
7436A3749451m9788J00004R0103P7623l4232j66892J19818Q5929k06883l71744
$$ plain form
7426 13393389 13778680 13797532 13613910 13881623 13906261 13741414 14295743 15229017 15716043 15682223
7416 15682223 15942117 16491768 16354517 16515873 16858500 17691081 17488954 17093069 17183429 17297363
7406 17297363 17294616 17119765 16969325 16219869 16669724 17046205 16718238 16408731 16011442 16274192
7396 16274192 16235484 16978009 17582744 17521293 18078466 18661162 18961124 19571163 20090831 20190402
7386 20190402 20820431 21283766 22393160 22878363 23375116 24328446 24255811 24218756 24932759 25789194
7376 25789194 26586723 27691417 28559745 30031549 31495066 32168883 33401510 34033654 34065158
7367 34065158 34747101 34083702 32966107 32595095 31899611 31458187 31186986 30724198 30150184
7358 30150184 29530789 28466976 27603699 26682147 26248005 25856436 24981423 23789162 23561100
$$ packed form
7426A3393389L85291J8852j83622K67713K4638j64847N54329R33274M87026l3820
7416A5682223K59894N49651j37251J61356L42627Q32581k02127l95885R0360J13934
7406A7297363k747j74851j50440p49456M49855L76481l27967l09507l97289K62750
7396A6274192l8708P42525O04735o1451N57173N82696K99962O10039N19668R9571
7386B0190402O30029M63335J109394M85203M96753R53330p2635l7055P14003Q56435
7376B5789194P97529J104694Q68328J471804J463517O73817J232627O32144L1504
7367C4065158O81943o63399j117595l71012o95484m41424k71201m62788n74014
7358C0150184o19395j063813q63277r21552m34142l91569q75013j192261k28062
$$ plain form
7349 23561100 23587123 23197991 23237770 22925921 22854633 23207945 23425724 23223798 23332046 23453702
7339 23453702 23748190 23383893 23117308 23309166 23212882 22948158 22893890 22986084 22619736 22518788
7329 22518788 23134169 22572085 22768256 22679207 22596416 22399768 21224612 21199452 20587769 20114992
7319 20114992 20597495 20778339 20651824 20285374 20407043 20532505 20792471 21316346 21611678
7310 21611678 21367399 20883982 21421039 22127798 22688241 22588398 22860435 23713584 24101053 24817222
7300 24817222 25128242 25674222 26274601 26456069 26839664 27249557 27319612 26847766 25908441 25241029
7290 25241029 25419653 24479543 23152881 23137684 22915566 22608752 22840157 22399089 22550791
7281 22550791 22600526 22599265 22597414 22549301 22951610 22504990 22017851 21261467 20072690 19884441
$$ packed form
7349B3561100K6023l89132L9779l11849p1288L53312K17779k01926J08248J21656
7339B3453702K94488l64297k66585J91858r6284k64724n4268R2194l66348j00948
7329B2518788O15381n62084J96171q9049q2791j96648j175156k5160o11683m72777
7319B0114992M82503J80844j26515l66450J21669J25462K59966N23875K95332
7310B1611678k44279m83417N37057P06759N60443r9843K72037Q53149L87469P16169
7300B4817222L11020N45980O00379J81468L83595M09893P0055m71846r39325o67412
7290B5241029J78624r40110j326662j5197k22118l06814K31405m41068J51702
7281B2550791M9735j261j851m8113M02309m46620m87139p56384j188777j88249
$$ plain form
7271 19884441 19821871 19144152 19023426 18426238 18284139 18081943 17677195 17778564 18006010 17769939
7261 17769939 17099936 17071923 17103519 17050267 17378313 17088017 17351591 16733182 16062091 15276951
7251 15276951 14816556 15017906 14470323 14285636 14804093 14814631 14341219 13698764 13727559 13977629
7241 13977629 14042025 14709128 15159768 15591248 15766598 16579828 16153469 16397851 16967540 16957979
7231 16957979 17601777 18759478 19364229 20061787 21082198 22342724 23225951 24495128 25923192
7222 25923192 27294410 28958257 31171100 34129086 36762708 39786486 43060749 45685592
7214 45685592 48050197 49779782 50209672 48470546 45250105 42227395 39069070 35322317
7206 35322317 32421341 29823349 27301405 25869234 24002684 22305335 21942018 20611664
$$ packed form
7271A9884441o2570o77719j20726n97188j42099k02196m04748J01369K27446k36071
7261A7769939o70003k8013L1596n3252L28046k90296K63574o18409o71091p85140
7251A5276951m60395K01350n47583j84687N18457J0538m73412o42455K8795K50070
7241A3977629O4396O67103M50640M31480J75350Q13230m26359K44382N69689r561
7231A6957979O43798J157701O04751O97558J020411J260526Q83227J269177J428064
7222B5923192J371218J663847K212843K957986K633622L023778L274263K624843
7214D5685592K364605J729585M29890j739126l220441l022710l158325l746753
7206C5322317k900976k597992k521944j432171j866550j697349l63317j330354
$$ plain form
7198 20611664 19421277 18512631 17818317 17524949 16678682 16592617 15557678 14679158 14604633
7189 14604633 14115257 13435435 12645378 12239261 11722093 11508563 11116916 11260553 10900118
7180 10900118 10953007 10998630 11235767 11431139 11095285 10363377 9832111 9712258 9654625 9935203
7170 9935203 9952550 9136841 8979784 8960186 8662930 8903483 8916174 9275566 9393748 9046152
7160 9046152 8928257 9245590 9190502 9505789 9798866 9513088 9739954 10226361 10533198 11287666
7150 11287666 12052111 12337276 12178999 12622451 13166132 13993461 15216771 16372610 16605356
7141 16605356 17645828 18592755 19592707 19766354 19137625 17625037 16697835 15627430 13932972
7132 13932972 13810638 13075615 12629260 12632856 12327612 12744644 12602533 11974735 11525538 11336556
$$ packed form
7198B0611664j190387r08646o94314k93368q46267q6065j034939q78520p4525
7189A4604633m89376o79822p90057m06117n17168k13530l91647J43637l60435
7180A0900118N2889M5623K37137J95372l35854p31908n31266j19853n7633K80578
7170I935203J7347q15709j57057j9598k97256K40553J2691L59392J18182l47596
7160I046152j17895L17333n5088L15287K93077k85778K26866M86407L06837P54468
7150A1287666P64445K85165j58277M43452N43681Q27329J223310J155839K32746
7141A6605356J040472R46927R99952J73647o28729j512588r27202j070405j694458
7132A3932972j22334p35023m46355L596l05244M17032j42111o27798m49197j88982
$$ plain form
7122 11336556 11138634 10428070 10053455 10209230 10766548 10432159 9797439 9756782 9423853 9827356
7112 9827356 9567820 10104597 10276052 10954956 10889290 10315285 10776737 11345885 11537153 11912213
7102 11912213 12427848 12397054 12853377 13024226 13298476 13941294 14312982 14685524 14962532 16100682
7092 16100682 16991357 17472752 18636845 19328800 20051001 20408810 20180440 19443550 17926032
7083 17926032 16855639 15987045 14567675 14094785 13738227 13096980 12301053 12965924 12248326
7074 12248326 11972012 11297183 10739893 10862862 10622400 10262883 9841073 9536625 9130246
7065 9130246 8935618 8986593 8913982 8837946 8767236 8828667 8176191 7668350 8216397 8410639
7055 8410639 8634945 9043320 9060263 8679896 8354795 8427788 8621095 8351038 8908271 8664891
$$ packed form
7122A1336556j97922p10564l74615J55775N57318l34389o34720m0657l32929M03503
7112I827356k59536N36777J71455O78904o5666n74005M61452N69148J91268L75060
7102A1912213N15635l0794M56323J70849K74250O42818L71688L72542K77008J138150
7092A6100682Q90675M81395J164093O91955P22201L57809k28370p36890j517518
7083A7926032j070393q68594j419370m72890l56558o41247p95927O64871p17598
7074A2248326k76314o74829n57290J22969k40462l59517m21810l04448m06379
7065I130246j94628N0975p2611p6036p0710O1431o52476n07841N48047J94242
7055H410639K24306M08375J6943l80367l25101P2993J93307k70057N57233k43380
$$ plain form
7045 8664891 8348154 7741553 7127193 7564256 7585120 7405233 7580093 7055540 7009213 6429197
7035 6429197 6076311 6458839 6267258 6122138 5410958 4885345 4624923 4846381 5345419 4627700
7025 4627700 4939101 5393830 4907900 4570727 4403700 4366870 4028443 4395162 4545264 4897977
7015 4897977 4315246 4085827 4867119 4712078 4973504 4591612 4219007 4666379 4908031 4548742
7005 4548742 3898574 3839325 3686239 3554449 3126007 3065004 2684554 2600768 2669802 2479081
6995 2479081 2353717 2028115 2234510 2318159 2231762 2016655 1984570 1961485 1858838 2045350
6985 2045350 2200443 2176743 2183119 2761799 2422906 2142483 2086833 1713597 1359513 1700647
6975 1700647 1535852 1136485 1360587 1212714 788104 1602132 1882284 1502806 1786267 1654528
$$ packed form
7045H664891l16737o06601o14360M37063K0864j79887J74860n24553m6327n80016
7035F429197l52886L82528j91581j45120p11180n25613k60422K21458M99038p17719
7025D627700L11401M54729m85930l37173j67027l6830l38427L66719J50102L52713
7015D897977n82731k29419P81292j55041K61426l81892l72605M47372K41652l59289
7005D548742o50168n9249j53086j31790m28442o1003l80450q3786O9034j90721
6995B479081j25364l25602K06395Q3649q6397k15107l2085k3085j02647J86512
6985B045350J55093k3700O376N78680l38893k80423n5650l73236l54084L41134
6975A700647j64795l99367K24102j47873m24610Q14028K80152l79478K83461j31739
$$ plain form
6965 1654528 1307078 1626461 1477702 1050519 1168689 1530759 1507014 1573237 1731714 1802334
6955 1802334 1482965 1099697 1164819 1332370 929099 309265 988918 1651718 1316439 1316906
6945 1316906 1216516 706669 826245 495495 809562 1135756 1401303 1214205 1532892 990741
6935 990741 602899 657143 546052 287127 -288881 -43330 483017 1301037 1421512 969677
6925 969677 806515 164262 531239 891803 617663 1119218 1525375 1177490 1074962 1064571
6915 1064571 709723 717604 1152271 1479520 977968 1120903 1309109 1059869 905483 499509
6905 499509 868417 607176 848778 1282748 972746 1045400 894630 659815 521050 749617
6895 749617 1140836 685466 614592 861139 668889 778941 1213208 1010679 692422 468470
$$ packed form
6965A654528l47450L19383j48759m27183J18170L62070k3745O6223J58477P0620
6955A802334l19369l83268O5122J67551m03271o19834O79653O62800l35279M67
6945A316906j00390n09847J19576l30750L14067L26194K65547j87098L18687n42151
6935I90741l87842N4244j11091k58925n76008K45551N26347Q18020J20475m51835
6925I69677j63162o42253L66977L60564k74140N01555M06157l47885j02528j0391
6915A064571l54848P881M34667L27249n01552J42935J88206k49240j54386m05974
6905D99509L68908k61241K41602M33970l10002P2654j50770k34815j38765K28567
6895G49617L91219m55370p0874K46547j92250J10052M34267k02529l18257k23952
$$ plain form
6885 468470 416845 179624 449966 369311 574570 901705 935600 396419 469122 609910
6875 609910 402004 551699 259000 189179 -129721 -329293 -248830 56091 -480163 -417978
6865 -417978 149789 -278042 47383 231781 167129 129805 -183036 -233164 -148669 -43281
6855 -43281 131370 610013 447285 615939 170581 -315694 -436495 253582 -54533 -250774
6845 -250774 133610 -120622 367494 419427 -343843 -216455 -224204 -232542 -49659 -63638 -100712
6834 -100712 -161165 -283282 -319815 -537511 -347931 -286502 -147314 930895 1264180 458719
6824 458719 -74481 59511 -357672 -998131 -996466 -1017022 -742606 -213932 -651488 -1208368
6814 -1208368 -710140 -855950 -620129 382978 -247503 -311483 -382936 -942699 -774201 -801918
$$ packed form
6885D68470n1625k37221K70342q0655K05259L27135L3895n39181P2703J40788
6875F09910k07906J49695k92699o9821l18900j99572Q0463L04921n36254O2185
6865d17978N67767m27831L25425J84398o4652l7324l12841n0128Q4495J05388
6855d3281J74651M78643j62728J68654m45358m86275j20801O90077l08115j96241
6845b50774L84384k54232M88116N1933p63270J27388p749q338J82883j3979l7074
6834a00712o0453j22117l6533k17696J89580O1429J39188J078209L33285q05461
6824D58719n33200J33992m17183o40459J665k0556K74416N28674m37556n56880
6814a208368M98228j45810K35821J003107o30481o3980p1453n59763J68498k7717
$$ plain form
6804 -801918 -638285 -620504 -635993 -534329 -904460 -927665 -855236 -937405 -557181 -361039 -212090
6793 -212090 -325272 -245745 -415530 -803009 -802253 -673831 -608239 -619629 -239462 -136308 -627403
6782 -627403 -546011 -193221 -472729 -99035 -139374 -478141 -135732 -651003 -565269 -353160
6772 -353160 -27683 -375275 -1008039 -650900 -305248 -353293 -191882 -69047 -281002 -229557
6762 -229557 85406 154323 -86997 -143620 -507047 -352152 -733319 -741907 -143063 92649
6752 92649 -564648 -564651 -535773 -438469 -924314 -863655 -122580 -324481 -659447 -595493 -579630 -576216
6740 -576216 -314380 -471280 -246075 -564370 -735685 -497820 -524887 -276313 -593686 -791325
6730 -791325 -563028 -136861 8725 -105350 -349697 -493401 -42790 -362848 -417524 -133099
$$ packed form
6804h01918J63633J7781j5489J01664l70131k3205P2429q2169L80224J96142J48949
6793b12090j13182P9527j69785l87479P56J28422O5592j1390L80167J03154m91095
6782f27403Q1392L52790k79508L73694m0339l38767L42409n15271Q5734K12109
6772c53160L25477l47592o32764L57139L45652m8045J61411J22835k11955N1445
6762b29557L14963O8917k41320n6623l63427J54895l81167q588N98844K35712
6752I2649o57297lK8878R7304m85845O0659P41075k01901l34966O3954J5863L414
6740e76216K61836j56900K25205l18295j71315K37865k7067K48574l17373j97639
6730g91325K28297M26167J45586j14075k44347j43704M50611l20058n4676K84425
$$ plain form
6720 -133099 -569086 -476317 -64635 -20204 -49794 -388611 -391005 -1032098 -813357 -764627 -786121
6709 -786121 -737621 -163886 186460 -281226 -302141 -126738 -360860 -39013 18146 -355294
6699 -355294 19580 -229498 -489145 -679357 -612116 -513933 253903 315856 21613 -450306
6689 -450306 -304023 -255813 -299501 392527 557877 487485 260503 17264 144373 -5294
6679 -5294 -173813 -17840 -213324 -849339 -37900 156451 79581 -179819 -297718 186911
6669 186911 376294 -332089 -168761 541514 -24054 -63660 -112252 452644 83332 886
6659 886 -57319 11516 602972 552221 472476 280645 375304 86643 319374 366075 -135759
6648 -135759 117910 455815 721443 591264 655340 630622 784463 1141727 736900 893980
$$ packed form
6720a33099m35987R2769M11682M4431k9590l38817k394o41093K18741M8730k1494
6709g86121M8500N73735L50346m67686k0915J75403k34122L21847N7159l73440
6699c55294L74874k49078k59647j90212O7241R8183P67836O1953k94243m71919
6689d50306J46283M8210m3688O92028J65350p0392k26982k43239J27109j49667
6679e294j68519J55973j95484o36015Q11439J94351p6870k59400j17899M84629
6669A86911J89383p08383J63328P10275n65568l9606m8592N64896l69312q2446
6659H86n8205O8835N91456n0751p9745j91831R4659k88661K32731M6701n01834
6648a35759K53669L37905K65628j30179O4076k4718J53841L57264m04827J57080
$$ plain form
6638 893980 478420 1084494 1653946 791060 719059 1191526 1015521 962098 1220087 1751360
6628 1751360 1380493 1595432 2049351 1915399 2620197 2528648 2379865 2381999 2913262 2951730
6618 2951730 3180153 3217034 3848304 4360326 4049246 4567382 5214883 5937669 6135166 6523832
6608 6523832 7394644 8018740 9003858 9755656 11425857 13510054 15102488 16876530 19210915
6599 19210915 20785362 21990542 22749629 22644362 21422423 19756261 18436817 17406824
6591 17406824 16154883 15590012 14952607 14543960 14561247 13952530 14561648 14734995 14849094
6582 14849094 15597625 15476521 15989656 17282366 17107267 17331528 17406843 17290465 16400560
6573 16400560 15720615 15424406 14503629 14433276 14423495 14059552 13704089 13998764 13640634 14017149
$$ packed form
6638H93980m15560O06074N69452q62886p2001M72467j76005n3423K57989N31273
6628A751360l70867K14939M53919j33952P04798r1549j48783K134N31263L8468
6618B951730K28423L6881O31270N12022l11080N18136O47501P22786J97497L88666
6608F523832Q70812O24096R85118P51798J670201K084197J592434J774042K334385
6599A9210915J574447J205180P59087j05267j221939j666162j319444j029993
6591A7406824j251941n64871o37405m08647J7287o08717O09118J73347J14099
6582A4849094P48531j21104N13135J292710j75099K24261P5315j16378q89905
6573A6400560o79945k96209r20777p0353r781l63943l55463K94675l58130L76515
$$ plain form
6563 14017149 14180234 13647122 13069786 13498030 13560154 13309119 12756020 11913317 12274740 12258205
6553 12258205 12260497 12513798 12368100 12026252 12163893 12468527 12411949 11799251 11813539 12362270
6543 12362270 12276438 11798340 11652666 12024910 12041874 11735526 11331891 10934463 10690024 10729732
6533 10729732 11209622 10939513 10638065 10221645 9523202 9470334 9215695 9179085 8812666 8266021
6523 8266021 8213175 7366890 7109301 7345163 7318274 7250058 6679297 6427757 6219382 6304393
6513 6304393 5847770 5331489 5582482 5758335 5014232 4322984 4816366 4154775 4580092 4477517
6503 4477517 3869970 4109823 4072059 4308127 4439003 4362582 4059905 4116404 4159522 4092520
6493 4092520 4274930 3944107 3827424 3753059 4249079 4149715 4286444 4404964 4058110 3498721
$$ packed form
6563A4017149J63085n33112n77336M28244O2124k51035n53099q42703L61423j6535
6553A2258205K292K53301j45698l41848J37641L04634n6578o12698J4288N48731
6543A2362270q5832m78098j45674L72244J6964l06348m03635l97428k44439L9708
6533A0729732M79890k70109l01448m16420o98443n2868k54639l6610l66419n46645
6523H266021n2846q46285k57589K35862k6889o8216n70761k51540k08375Q5011
6513F304393m56623n16281K50993J75853p44103o91248M93382o61591M25317j02575
6503D477517o07547K39853l7764K36068J30876p6421l02677N6499M3118o7002
6493D092520J82410l30823j16683p4365M96020r9364J36729J18520l46854n59389
$$ plain form
6483 3498721 3587195 3857840 3534456 3265827 2920527 2984590 3162496 3406762 3517800 3737669
6473 3737669 3542787 3583355 3713612 3864944 3370376 3142285 2914181 3003247 2901705 3030789
6463 3030789 3667261 3885572 3616052 3125823 2734785 2702564 2872096 2148454 2136670 2327374
6453 2327374 2592459 2919033 2992515 2617892 2752548 2501191 2682831 2662492 2719311 2798802
6443 2798802 2476524 2607506 2598196 2868354 2679368 3053741 2888261 2864123 2684619 2350834
6433 2350834 2509731 1652461 1956701 2194152 2236704 2345899 2411111 2765043 2566510 2609011
6423 2609011 2577322 2372454 2136996 2163630 2390152 2647714 2627700 3043960 3381809 3202373
6413 3202373 2956913 2915085 3159211 2452959 2419864 3332388 2830784 3134780 3091058 2678541
$$ packed form
6483C498721Q8474K70645l23384k68629l45300O4063J77906K44266J11038K19869
6473C737669j94882M0568J30257J51332m94568k28091k28104Q9066j01542J29084
6463C030789O36472K18311k69520m90229l91038l2221J69532p23642j1784J90704
6453B327374K65085L26574P3482l74623J34656k51357J81640k0339N6819P9491
6443B798802l22278J30982r310K70158j88986L74373j65480k4138j79504l33785
6433B350834J58897q57270L04240K37451M2552J09195O5212L53932j98533M2501
6423B609011l1689k04868k35458K6634K26522K57562k0014M16260L37849j79436
6413C202373k45460m1828K44126p06252l3095R12524n01604L03996m3722m12517
$$ plain form
6403 2678541 2982142 3366118 3170701 2816354 2374543 2956741 3130297 3550131 3499626 3356576
6393 3356576 3314173 3331142 3587938 3407982 3704283 3398002 3333999 3075997 3208345 3094227
6383 3094227 3625508 3637122 3749334 4086101 3692158 3741949 3772812 3551548 3719962 3893068
6373 3893068 3778969 3904759 3634868 3708307 3787972 3976842 3878029 4096775 4374145 4302283
6363 4302283 4648679 4882536 4815834 4349700 4306843 4751434 4976225 4936655 4939188 5140776
6353 5140776 5471583 5414546 5938288 5847321 5916052 5664888 5398715 5601503 5891573 5854985
6343 5854985 5572414 6176984 6409207 6769651 6377730 6401177 6178288 6223667 6788931 6974859
6333 6974859 6796072 7024522 7469400 7554085 8121160 8982626 8927644 9014275 9446243 9866863
$$ packed form
6403B678541L03601L83976j95417l54347m41811N82198J73556M19834n0505j43050
6393C356576m2403J6969K56796j79956K96301l06281o4003k58002J32348j14118
6383C094227N31281J1614J12212L36767l93943M9791L0863k21264J68414J73106
6373C893068j14099J25790k69891P3439P9665J88870r8813K18746K77370p1862
6363D302283L46396K33857o6702m66134m2857M44591K24791l9570K533K01588
6353E140776L30807n7037N23742r0967O8731k51164k66173K02788K90070l6588
6343E854985k82571O04570K32223L60444l91921K3447k22889M5379N65264J85928
6333F974859j78787K28450M44878Q4685N67075Q61466n4982Q6631M31968M20620
$$ plain form
6323 9866863 10863024 10774533 11759061 12515934 13081383 13795750 14364996 14340467 14973463 15693557
6313 15693557 16606165 18424607 20474888 22713757 24711285 27561768 29970968 31696737
6305 31696737 32711026 32628368 31322196 30676723 29914424 29191096 29710386 30807555 32201652
6296 32201652 34356828 35985481 37256358 38968955 39796826 39707632 39883112 40929259 42211233
6287 42211233 43454426 44253467 44600779 43706990 42669464 41461009 41005078 41088856 41930797
6278 41930797 42951406 43282843 43493628 42462781 41434557 40495481 40783812 40749725 41652449
6269 41652449 42688539 44076668 45274781 46090371 46009926 44600463 41508711 37877291 35297855
6260 35297855 33091214 32060320 30949393 30130988 29564584 29292154 28217332 28329457 27594103
$$ packed form
6323I866863R96161q8491R84528P56873N65449P14367N69246k4529O32996P20094
6313A5693557R12608J818442K050281K238869J997528K850483K409200J725769
6305C1696737J014289q2658j306172o45473p62299p23328N19290J097169J394097
6296C2201652K155176J628653J270877J712597Q27871q9194J75480J046147J281974
6287D2211233J243193P99041L47312q93789j037526j208455m55931Q3778Q41941
6278D1930797J020609L31437K10785j030847j028224r39076K88331l4087R02724
6269D1652449J036090J388129J198113Q15590q0445j409463l091752l631420k579436
6260C5297855k206641j030894j110927q18405n66404k72430j074822J12125p35354
$$ plain form
6251 27594103 26754451 26776897 26569211 26018958 25714645 24845183 24252606 23681355 23190045 22802244
6241 22802244 22175580 21737131 21635403 21431162 21359596 21064289 20589113 20247078 19780393 19836855
6231 19836855 19946726 20346530 20818759 20944946 20821139 20515425 19704111 19519062 19401734
6222 19401734 19923572 20145984 19559149 19010066 18736546 18942160 18931398 18745927 18892190 19077524
6212 19077524 19418827 19862535 19960062 19646746 20010772 20473717 20254554 19993525 20729060 21069136
6202 21069136 20865173 21090551 22007087 22461544 22580598 23106099 24114549 24796353 25488754
6193 25488754 26115245 26330615 28160762 29122579 29838769 30648613 31410034 32191370 33755124
6184 33755124 35452955 37131629 39257801 41157462 43482515 45539419 47438152 49289917
$$ packed form
6251B7594103q39652K2446k07686n50253l04313q69462n92577n71251m91310l87801
6241B2802244o26664m38449j01728k04241p1566k95307m75176l42035m66685N6462
6231A9836855J09871L99804M72229J26187j23807l05714q11314j85049j17328
6222A9401734N21838K22412n86835n49083k73520K05614j0762j85471J46263J85334
6212A9077524L41303M43708R7527l13316L64026M62945k19163k61029P35535L40076
6202B1069136k03963K25378R16536M54457J19054N25501J008450O81804O92401
6193B5488754O26491K15370J830147R61817P16190Q09844P61421P81336J563754
6184C3755124J697831J678674K126172J899661K325053K056904J898733J851765
$$ plain form
6176 49289917 50875236 52128049 53408415 55086105 57129761 59147910 62044757 65386890
6168 65386890 68520219 70473291 70981405 71065998 70641434 70630169 71078080 72079095 74334942
6159 74334942 76661878 80024559 84156102 88889758 92717846 96244924 99227400 100343241
6151 100343241 100522573 99916404 98694085 96436961 93624924 89575744 86016170 83160828
$$ packed form
6176D9289917J585319J252813J280366J677690K043656K018149K896847L342133
6168F5386890L133329J953072N08114Q4593m24564j1265M47911J001015K255847
6159G4334942K326936L362681M131543M733656L828088L527078K982476J115841
6151A00343241J79332o06169j222319k257124k812037m049180l559574k855342
$$ [...]
##END NTUPLES=NMR SPECTRUM
##END=
